##TITLE=1H_CG-1141-2
 CDCl3, 8 sc, 
 9.04.2021
##JCAMPDX= 6.0         $$ Bruker NMR JCAMP-DX V2.0
##DATA TYPE= NMR SPECTRUM
##DATA CLASS= NTUPLES
##ORIGIN= UXNMR, Bruker Analytische Messtechnik GmbH
##OWNER= root
$$ XWIN-NMR		Version 3.5
$$ Fri Apr  9 10:33:25 2021 Russian Standard Time (UT+4h)  she@DPX200
##.OBSERVE FREQUENCY= 200.131506
##.OBSERVE NUCLEUS= ^1H
##.ACQUISITION MODE= SIMULTANEOUS
##.ACQUISITION SCHEME= undefined
##.AVERAGES= 8
##.DIGITISER RES= 18
##SPECTROMETER/DATA SYSTEM= spect
##.PULSE SEQUENCE= zg30
##.SOLVENT NAME= CDCl3
##.SHIFT REFERENCE= (INTERNAL, CDCl3, 0, 15.9823)
##AUDIT TRAIL= $$ (NUMBER, WHEN, WHO, WHERE, WHAT)
$$ ##TITLE= Audit trail, XWIN-NMR		Version 3.5
$$ ##JCAMPDX= 5.01
$$ ##ORIGIN= Bruker BioSpin GmbH
$$ ##OWNER= she
$$ F:/spectra/data/she/nmr/H-F/1/pdata/1/auditp.txt
$$ ##AUDIT TRAIL=  $$ (NUMBER, WHEN, WHO, WHERE, WHAT)
(   1,<2021-04-09 10:31:43.57 +0400>,<she>,<DPX200>,
      <created by zg, POWCHK disabled, PULCHK disabled
       configuration hash MD5:
       00 E9 B6 7A A2 85 ED C7 34 08 36 98 17 FE 4E 26
       data hash MD5: 16K
       5F D1 28 66 DE 1B 8F 40 3A AC FD DC 07 1C 3D 8F>)
(   2,<2021-04-09 10:31:46.04 +0400>,<she>,<DPX200>,
      <Start of raw data processing
       efp BC_mod = 2 LB = 0.24 FT_mod = 6 PKNL = 1 PHC0 = -11277.81 PHC1 = 9.600918 SI = 16K 
       data hash MD5: 16K
       AB 71 3A CB 31 0C A9 9D 5A 6E E9 B0 9E 57 CD C8>)
(   3,<2021-04-09 10:32:09.65 +0400>,<she>,<DPX200>,
      <pk PHC0 = 159.0999 PHC1 = 3.000001 
       data hash MD5: 16K
       F8 C4 5E 54 24 AA 75 4C 91 CF 79 3F D0 0C 1B 63>)
(   4,<2021-04-09 10:32:12.79 +0400>,<she>,<DPX200>,
      <abs ABSG = 5 
       data hash MD5: 16K
       B1 21 72 D5 28 6C 37 97 1B EE 8A 97 F4 AC 50 7C>)
$$ ##END=
$$ 
$$ hash MD5
$$ F3 69 D5 2E 4C 8D E2 D8 CB F7 14 AA BA F1 53 D1
##$RELAX= 
##$RELAX= 
##$RELAX= 
##$RELAX= 
##$RELAX= 
##$RELAX= 
$$ Bruker specific parameters
$$ --------------------------
##$DU= <F:/spectra>
##$EXPNO= 1
##$NAME= <H-F>
##$PROCNO= 1
##$TYPE= <nmr>
##$USER= <she>
##$AMP= (0..31)
100 100 100 100 100 100 100 100 100 100 100 100 100 100 100 100 100 100 
100 100 100 100 100 100 100 100 100 100 100 100 100 100 
##$AQSEQ= 0
##$AQ_mod= 1
##$AUNM= <au_zg>
##$AUTOPOS= <>
##$BF1= 200.13
##$BF2= 200.13
##$BF3= 200.13
##$BF4= 200.13
##$BF5= 200.13
##$BF6= 200.13
##$BF7= 200.13
##$BF8= 200.13
##$BYTORDA= 1
##$CFDGTYP= 0
##$CFRGTYP= 5
##$CHEMSTR= <none>
##$CNST= (0..31)
1 1 145 1 1 1 1 1 1 1 1 1 1 1 1 1 1 1 1 1 1 1 1 1 1 1 1 1 1 1 1 1 
##$CPDPRG= <>
##$CPDPRG1= <>
##$CPDPRG2= <>
##$CPDPRG3= <>
##$CPDPRG4= <mlev>
##$CPDPRG5= <mlev>
##$CPDPRG6= <mlev>
##$CPDPRG7= <mlev>
##$CPDPRG8= <mlev>
##$CPDPRGB= <>
##$CPDPRGT= <>
##$D= (0..31)
0 1.2 0 0 0 0 0 0 0 0.06 0 0.03 0 0 0 0 0.0002 0 0 0 0 0 0 0 0 0 0 0 0 
0 0 0 
##$DATE= 1617949903
##$DBL= (0..7)
120 120 120 120 120 120 120 120 
##$DBP= (0..7)
150 150 150 150 150 150 150 150 
##$DBP07= 0
##$DBPNAM0= <>
##$DBPNAM1= <>
##$DBPNAM2= <>
##$DBPNAM3= <>
##$DBPNAM4= <>
$$ [...]
##$SUBNAM3= <"">
##$SUBNAM4= <"">
##$SUBNAM5= <"">
##$SUBNAM6= <"">
##$SUBNAM7= <"">
##$SUBNAM8= <"">
##$SUBNAM9= <"">
##$SW= 16.9725357007746
##$SWIBOX= (0..15)
0 0 2 0 0 0 0 0 0 0 0 0 0 0 0 0 
##$SW_h= 3396.73913043478
##$TD= 16384
##$TD0= 1
##$TE= 0
##$TE2= 300
##$TE3= 300
##$TEG= 300
##$TL= (0..7)
0 120 120 120 120 120 120 120 
##$TP= (0..7)
150 150 150 150 150 150 150 150 
##$TP07= 0
##$TPNAME0= <>
##$TPNAME1= <>
##$TPNAME2= <>
##$TPNAME3= <>
##$TPNAME4= <>
##$TPNAME5= <>
##$TPNAME6= <>
##$TPNAME7= <>
##$TPOAL= (0..7)
0.5 0.5 0.5 0.5 0.5 0.5 0.5 0.5 
##$TPOFFS= (0..7)
0 0 0 0 0 0 0 0 
##$TUNHIN= 0
##$TUNHOUT= 0
##$TUNXOUT= 0
##$USERA1= <user>
##$USERA2= <user>
##$USERA3= <user>
##$USERA4= <user>
##$USERA5= <user>
##$V9= 5
##$VALIST= <valist>
##$VCLIST= <CCCCCCCCCCCCCCC>
##$VD= 0
##$VDLIST= <DDDDDDDDDDDDDDD>
##$VPLIST= <PPPPPPPPPPPPPPP>
##$VTLIST= <TTTTTTTTTTTTTTT>
##$WBST= 1024
##$WBSW= 4
##$XGAIN= (0..3)
0 0 0 0 
##$XL= 0
##$YL= 0
##$YMAX_a= 196997
##$YMIN_a= -204579
##$ZGOPTNS= <>
##$ZL1= 120
##$ZL2= 120
##$ZL3= 120
##$ZL4= 120
##$ABSF1= 15.91808
##$ABSF2= -1.054582
##$ABSG= 5
##$ABSL= 3
##$ALPHA= 0
##$AQORDER= 0
##$ASSFAC= 0
##$ASSFACI= 0
##$ASSFACX= 0
##$ASSWID= 0
##$AUNMP= <proc_1d>
##$AZFE= 0.1
##$AZFW= 0.1
##$BCFW= 0
##$BC_mod= 2
##$BYTORDP= 0
##$COROFFS= 0
##$CY= -3
##$DATMOD= 1
##$DC= 0
##$DFILT= <>
##$DTYPP= 0
##$F1P= 0
##$F2P= 0
##$FCOR= 1
##$FTSIZE= 16384
##$FT_mod= 6
##$GAMMA= 0
##$GB= 0
##$INTBC= 1
##$INTSCL= 3.559346e-10
##$ISEN= 128
##$LB= 0.24
##$LEV0= 0
##$LPBIN= 0
##$MAXI= 10000
##$MC2= 0
##$MEAN= 0
##$ME_mod= 0
##$MI= 1.114404
##$NCOEF= 0
##$NC_proc= -6
##$NLEV= 6
##$NOISF1= 3.799351
##$NOISF2= 2.8
##$NSP= 0
##$NTH_PI= 0
##$NZP= 0
##$OFFSET= 15.98232
##$PC= 1
##$PHC0= -11118.71
##$PHC1= 12.60092
##$PH_mod= 1
##$PKNL= yes
##$PPARMOD= 0
##$PSCAL= 0
##$PSIGN= 0
##$REVERSE= no
##$SF= 200.130005828019
##$SI= 16384
##$SIGF1= 3
##$SIGF2= 2
##$SINO= 5.538805
##$SIOLD= 16384
##$SREGLST= <1H.CDCl3>
##$SSB= 0
##$STSI= 16384
##$STSR= 0
##$SW_p= 3396.73913043479
##$SYMM= 0
##$S_DEV= 0
##$TDeff= 16384
##$TDoff= 0
##$TI= <>
##$TILT= no
##$TM1= 0
##$TM2= 0
##$TOPLEV= 0
##$USERP1= <user>
##$USERP2= <user>
##$USERP3= <user>
##$USERP4= <user>
##$USERP5= <user>
##$WDW= 1
##$XDIM= 16384
##$YMAX_p= 334926911
##$YMIN_p= -788938
$$ End of Bruker specific parameters
$$ ---------------------------------
##NTUPLES= NMR SPECTRUM
##VAR_NAME=  FREQUENCY,     SPECTRUM/REAL,   SPECTRUM/IMAG
##SYMBOL=    X,             R,               I
##VAR_TYPE=  INDEPENDENT,   DEPENDENT,       DEPENDENT
##VAR_FORM=  AFFN,          ASDF,            ASDF
##VAR_DIM=   16384,         16384,           16384
##UNITS=     HZ,            ARBITRARY UNITS, ARBITRARY UNITS
##FACTOR=    0.207333158178282, 1,           1
##FIRST=     3198.54176109303, 0,            0
##LAST=      -198.197369341757, 0,           0
##MIN=       -198.197369341757, -788938,     0
##MAX=       3198.54176109303, 334926911,    0
$$ Real data points
##PAGE= N=1
##DATA TABLE= (X++(R..R)), XYDATA
$$ [...]
$$ plain form
4911 -8749 -107440 -199947 -127537 -131630 -146744 -181279 -130012 -140479 -172497 -104669 -6417 -98651
4899 -98651 -105134 -14120 -99433 -114320 -146461 -160281 -63911 -57428 -35625 -76194 -13516 33592
4887 33592 -31471 -135158 -38564 -60253 82951 98983 -15068 -24684 -95798 -54363 81633
4876 81633 14582 -67114 34713 106334 199901 107521 5598 23843 32789 32758 84186 115530
4864 115530 160817 29976 93249 28695 -22623 37871 81618 43977 47325 -105386 -101200 -36378
4852 -36378 -45032 63908 44168 -15947 -53993 -2177 -45405 18792 13253 62553 27220 -71077
4840 -71077 -76710 -66199 847 64013 32748 -98755 -21048 -7652 -42296 2985 43256 -36539
4828 -36539 -151023 -221417 -248403 -217261 -51111 21786 -55763 -33067 21740 -18089 -66527
$$ packed form
4911h749r8691r2507P2410m093j5114l4535N1267j0467l2018O7828R8252r2234
4899i8651o483R1014q5313j4887l2141j3820R6370O483K1803m0569O2678M7108
4887C3592o5063j03687R6594k1689J43204J6032j14051r616p1114M1435J35996
4876H1633o7051q1696J01827P1621R3567r2380j01923J8245Q946l1N1428L1344
4864A15530M5287j30841O3273o4554n1318O0494M3747l7641L348j52711M186O4822
4852c6378q654J08940j9740o0115l8046N1816m3228O4197n539M9300l5333r8297
4840g1077n633J0511O7046O3166l1265j31503P7707J3396l4644M5281M0271p9795
4828c6539j14484p0394k6986L1142J66150P2897p7549K2696N4807l9829m8438
$$ plain form
4817 -66527 -114067 -6411 -40854 -217140 -103003 -22944 -79620 -37099 -30591 -105020 -97139 -111654
4805 -111654 -145602 -27937 2359 -32745 -134639 -120487 43902 22220 83598 52236 -62277
4794 -62277 24436 94684 20179 133420 215799 112868 89695 35696 63337 119994 23963
4783 23963 26274 68548 191672 102523 -7963 95063 165490 60718 -65452 -26437 10907
4772 10907 5946 63259 36395 54854 38518 44317 -18443 16765 68401 55041 -55115 -73545
4760 -73545 -48396 -31690 -27261 57156 17767 55520 130663 29319 -3360 27432 106554 -31296
4748 -31296 -60862 18701 -117001 -132835 -62900 -212318 -197305 -11525 10347 -89372 -45379
4737 -45379 -115466 -122658 -93332 7863 -88243 -234670 -206986 -135867 -138806 -56696 8655 -59238
$$ packed form
4817f6527m7540J07656l4443j76286J14137Q0059n6676M2521O508p4429P881j4515
4805a11654l3948J17665L0296l5104j01894J4152J64389k1682O1378l1362j14513
4794f2277Q6713P0248p4505J13241Q2379j02931k3173n3999K7641N6657r6031
4783B3963K311M2274J23124q9149j10486J03026P0427j04772j26170L9015L7344
4772A0907m961N7313k6864J8459j6336N799o2760L5208N1636j3360j10156j8430
4760g3545K5149J6706M429Q4417l9389L7753P5143j01344l2679L0792P9122j37850
4748c1296k9566P9563j35702j5834O9935j49418J5013J85780K1872r9719M3993
4737d5379p0087p192K9326J01195r6106j46427K7684P1119k939Q2110O5351o7893
$$ plain form
4725 -59238 -48683 75947 -7463 -96531 -96033 33959 -15518 -67433 -75888 -132620 -35745 247284
4713 247284 63574 -123770 -119440 -161133 -71604 92083 123821 -119832 -87342 49754 18053
4702 18053 -23047 33983 -26257 -9643 115692 -34220 -162217 -85495 24643 3949 -75336
4691 -75336 -97844 -24984 -130558 -86240 18175 -124802 -106437 34803 -5511 21780 39267
4680 39267 -44117 -47114 8629 65087 -117793 -154158 -66959 -31754 37689 135176 -76277 -105394
4668 -105394 -70077 27155 -21060 -12158 -2276 -78808 -129098 -290 -13737 -71178 14749 -6345
4656 -6345 -160134 -52414 -23047 -186777 -84424 -26956 -12531 -136791 41211 139743 -24913
4645 -24913 -70881 -127897 -165385 -91514 -7788 -69061 32653 -8745 -61375 -100508 -35789 69651
$$ packed form
4725e9238J0555J24630q3410q9068M98J29992m9477n1915q455n6732R6875K83029
4713B47284j83710j87344M330m1693Q9529J63687L1738k43653L2490J37096l1701
4702A8053m1100N7030o0240J6614J25335j49912j27997P6722J10138k0694p9285
4691g5336k2508P2860j05574M4318J04415j42977J8365J41240m0314K7291J7487
4680C9267q3384k997N5743N6458j82880l6365Q7199L5205O9443R7487k11453k9117
4668a05394L5317R7232m8215Q902R882p6532n0290J28808j3447n7441Q5927k1094
4656f345j53789J07720K9367j63730J02353N7468J4425j24260J78002R8532j64656
4645b4913m5968n7016l7488P3871Q3726o1273J01714m1398n2630l9133O4719J05440
$$ plain form
4633 69651 -103 3215 70393 -58202 -158610 -65238 -25551 12278 38585 -48694 -119120 -64685
4621 -64685 -42740 -34999 -50968 -22526 -29887 -6457 165463 171435 75050 43407 49930 31215
4609 31215 66064 127097 70265 54821 108209 142172 35827 57100 34226 138363 228284
4598 228284 196314 145223 120568 89082 140091 159168 103189 181730 96500 87070 199485 75821
4586 75821 20747 87740 59290 108621 80215 83293 50737 12544 55127 61102 -21617 33340
4574 33340 80242 53952 48595 -87771 -56151 -6892 105918 73453 72484 117303 136836 108047
4562 108047 126397 95546 87654 60753 -29405 32700 126987 22985 79249 68018 -68242
4551 -68242 -34436 87596 156759 102264 69659 103221 131863 133952 163042 179198 120956 88090
$$ packed form
4633F9651o9754L318O7178j28595j00408R3372L9687L7829K6307q7279p0426N4435
4621f4685K1945P741j5969K8442p361K3430J71920N972r6385l1643O523j8715
4609C1215L4849O1033n6832j5444N3388L3963j06345K1273k2874J04137Q9921
4598B28284l1970n1091k4655l1486N1009J9077n5979P8541q5230r430J12415j23664
4586G5821n5074O6993k8450M9331k8406L078l2556l8193M2583N975q2719N4957
4574C3340M6902k6290n357j36366L1620M9259J12810l2465r69M4819J9533k8789
4562A08047J8350l0851p892k6901r0158O2105R4287j04002N6264j1231j36260
4551f8242L3806J22032O9163n4495l2605L3562K8642K089K9090J6156n8242l2866
$$ plain form
4539 88090 64502 138104 175557 90621 112768 68943 72792 84811 66659 103146 115650 36719
4527 36719 20105 79351 164785 42584 161654 158757 102779 71170 45266 8459 6543 121028
4515 121028 -45595 -46430 -43445 -57493 62028 86640 52328 38157 140432 127643 51202 128800
4503 128800 192588 81639 51108 125680 70149 143714 16636 -76615 -23280 35042 57794
4492 57794 68075 58389 188825 214408 -20264 10548 4335 62401 182216 217531 114662
4481 114662 -31547 -116264 97504 156247 159076 203290 28038 19050 157666 1325 23959
4470 23959 48135 160634 190834 115117 129486 15601 -76521 -3463 57141 -28624 52369
4459 52369 67218 110819 76391 -3228 -10640 59570 38150 177669 69945 84691 85153 82796
$$ packed form
4539H8090k3588P3602L7453q4936K2147m3825L849J2019j8152L6487J2504p8931
4527C6719j6614N9246Q5434j22201J19070k897n5978l1609k5904l6807j916J14485
4515A21028j66623q35K985j4048J19521K4612l4312j4171J02275j2789p6441P7598
4503A28800O3788j10949l0531P4572n5531P3565j27078r3251N3335N8322K2752
4492E7794J0281r686J30436K5583k34672L0812o213N8066J19815L5315j02869
4481A14662j46209q4717K13768N8743K829M4214j75252q988J38616j56341K2634
4470B3959K4176J12499L0200p5717J4369j13885r2122P3058O0604q5765Q0993
4459E2369J4849M3601l4428p9619p412P0210k1420J39519j07724J4746M62k357
$$ plain form
4447 82796 114886 75171 -7992 -23017 -2523 38157 -18513 -138567 30055 23108 -49376 29550
4435 29550 -59092 -71916 34027 -106583 -85335 -17568 3913 86519 93836 83106 92258 53504
4423 53504 123362 103680 107063 58256 42071 81227 78304 -62456 -89882 49435 61094 104062
4411 104062 -4338 -41568 82171 124096 51512 -3982 43250 82505 47499 79090 10997
4400 10997 -31625 144101 161557 66496 158705 185987 117714 134130 -32861 -69191 -113089
4389 -113089 33301 80471 -4358 -62336 -14685 100569 96837 150418 149238 44491 13562
4378 13562 106232 146753 69159 144038 218638 84165 56505 107918 113838 46141 53898 66390
4366 66390 48955 46175 17891 -13287 94117 32633 5539 34609 17709 -56133 -110548 -62357
$$ packed form
4447H2796L2090l9715q3163j5025K0494M0680n6670j20054J68622o947p2484P8926
4435B9550q8642j2824J05943j40610K1248O7767K1481Q2606P317j0730R152l8754
4423E3504O9858j9682L383m8807j6185L9156k923j40760k7426J39317J1659M2968
4411A04062j08400l7230J23739M1925p2584n5494M7232L9255l5006L1591o8093
4400A0997m2622J75726J7456r5061R2209K7282o8273J6416j66991l6330m3898
4389a13089J46390M7170q4829n7978M7651J15254l732N3581j180j04747l0929
4378A3562R2670M0521p7594P4879P4600j34473k7660N1413N920o7697P757J2492
4366F6390j7435k780k8284l1178J07404o1484k7094K9070j6900p3842n4415M8191
$$ plain form
4354 -62357 -8480 6971 12314 110060 39138 39771 62729 168458 73352 10942 48234 177389
4342 177389 173904 171081 110962 -90558 743 181962 273239 199160 161795 159815 154961 81620
4330 81620 95112 105145 287144 293351 167813 188302 321638 143639 340137 289543 79584
4319 79584 97638 45483 181074 242709 139328 239184 250908 178768 251539 199397 155953
4308 155953 182464 153238 192432 148372 136450 241745 87962 180566 193571 108135 223160
4297 223160 87263 29064 122037 71862 128808 43943 28842 68269 -22452 60230 125003
4286 125003 323 -79138 -6671 -62352 71030 71161 -36724 30374 -103305 60157 111778
4275 111778 -41690 -75855 -165137 -107729 23826 -34467 -5187 -56396 -114632 43259 -27031
$$ packed form
4354f2357N3877J5451N343R7746p0922O33K2958J05729r5106o2410L7292J29155
4342A77389l485k823o0119k01520R1301J81219R1277p4079l7365j980m854p3341
4330H1620J3492J0033J81999O207j25538K0489J33336j77999J96498n0594k09959
4319G9584J8054n2155J35591O1635j03381R9856J1724p2140P2771n2142m3444
4308A55953K6511k9226L9194m4060j1922J05295j53783R2604J3005q5436J15025
4297B23160j35897n8199R2973n0175N6946q4865j5101L9427r0721Q2682O4773
4286A25003j24680p9461P2467n5681J33382J31j07885O7098j33679J63462N1621
4275A11778j53468l4165q9282N7408J31555n8293K9280n1209n8236J57891p0290
$$ plain form
4264 -27031 -67552 1896 -83806 88034 174406 28439 53904 33844 14315 188445 130203
4253 130203 -8750 73334 56350 221239 188189 95879 222908 177166 153975 235997 141526
4242 141526 184549 125030 105088 289991 235221 225601 264612 227225 217584 276651 306496 274029
4230 274029 109807 129348 92879 76024 50157 107051 -4424 41670 86242 -21505 -11382
4219 -11382 -22134 -11368 -1099 2903 64887 -135921 -149423 53661 135082 -1450 -1380 -65029
4207 -65029 30107 -9999 -103297 -289746 -313125 -85703 -55852 -90450 -152602 24422 -86852
4196 -86852 -79682 -91981 -138097 -245775 -189665 -44405 -34661 -109499 -118961 -98021 -104546 -75411
4184 -75411 -11250 34272 32708 -34058 11583 78654 47397 23975 68160 139407 32547 -35463
$$ packed form
4264b7031m0521O9448q5702J71840Q6372j45967K5465k0060j9529J74130n8242
4253A30203j38953Q2084j6984J64889l3050r2310J27029m5742k3191Q2022r4471
4242A41526M3023n9519j9942J84903n4770r620L9011l7387r641N9067K9845l2467
4230B74029j64222J9541l6469j6855k5867N6894j11475M6094M4572j07747J0123
4219a1382j0752J0766J0269M002O1984k00808j3502K03084Q1421j36532P0o3649
4207f5029R5136m0106r3298j86449k3379K27422K9851l4598o2152J77024j11274
4196h6852P170j2299m6116j07678N6110J45260R744p4838r462K0940o525K9135
4184g5411O4161M5522j564o6766M5641O7071l1257k3422M4185P1247j06860o8010
$$ plain form
4172 -35463 86602 48798 -21866 -13083 -37620 -10232 89976 18084 -50940 -80928 -79099 9715
4160 9715 63053 29595 -36849 32796 66831 31499 -12046 -26617 29040 75179 195839 35764
4148 35764 -113773 -67030 -20518 82178 156488 47732 -5620 -100996 -73743 52917 -18201
4137 -18201 -152000 -385 4657 -51279 -2508 -134167 -92391 25304 14110 -60623 -148428
4126 -148428 -22173 120865 102643 126012 118316 2245 78227 160616 100975 48823 -34156
4115 -34156 12762 78258 191154 150408 78883 48382 154948 108958 34086 41809 -13626 91085
4103 91085 84586 81608 68366 -13597 38 79797 43247 138846 59004 -29248 121115 118040
4091 118040 24735 80490 84638 -38211 18926 138540 106239 -48767 -23028 43827 35289
$$ packed form
4172c5463J22065l7804p0664Q783k4537K7388J00208p1892o9024k9988J829Q8814
4160I715N3338l3458o6444O9645L4035l5332m3545j4571N5657M6139J20660j60075
4148C5764j49537M6743M6512J02696P4310j08756n3352r5376K7253J26660p1118
4137a8201j33799J51615N042n5936M8771j31659M1776J17695j1194p4733q7805
4126a48428J26255J43038j8222K3369p696j16071P5982Q2389n9641n2152q2979
4115c4156M6918O5496J12896m0746p1525l0501J06566m5990p4872P723n5435J04711
4103I1085o499k978j3242q1963J3635P9759l6550R5599p9842q8252J50363l075
4091A18040r3305N5755M148j22849N7137J19614l2301j55006K5739O6855q538
$$ plain form
4080 35289 -79181 -158298 -178367 -86933 -47441 -43457 -54987 -134223 -36578 53096 -42116 -50590
4068 -50590 -80081 -148094 -31365 45255 4208 -5577 26649 153853 74869 -32674 -76352
4057 -76352 -81179 64146 59865 -41234 -78962 -79403 30900 160948 207604 189573 84928 128269
4045 128269 241701 174940 20874 71147 10270 60333 146981 100471 91998 92211 159719 191224
4033 191224 124949 106109 189294 197998 272239 203472 118608 -9211 78741 113333 181228 60975
4021 60975 -25256 -73189 -55971 118318 -4916 -83462 116917 94955 -55456 10962 83327
4010 83327 139174 176593 128790 7368 10583 53070 85654 -53645 -143338 -135887 2933 5878
3998 5878 -69087 -52419 -64120 -27878 91806 -9047 -98152 13400 7131 -24851 101674
$$ packed form
4080C5289j14470p9117k0069R1434L9492L984j1530p9236R7645Q9674r5212q474
4068e0590k9491o8013J16729P6620m1047r785L2226J27204p8984j07543m3678
4057g6352m827J45325m281j01099l7728m41J10303J30048M6656j8031j04645M3341
4045A28269J13432o6761j54066N0273o0877N0063Q6648m6510q473K13O7508L1505
4033A91224o6275j8840Q3185Q704P4241o8767q4864j27819Q7952L4592O7895j20253
4021F0975q6231m7933J7218J74289j23234p8546K00379k1962j50411O6418P2365
4010H3327N5847L7419m7803j21422L215M2487L2584j39299q9693P451J38820K945
3998E878p4965J6668j1701L6242J19684j00853q9105J11552o269l1982J26525
$$ plain form
3987 101674 35268 -51095 1428 132165 170117 156068 188300 74855 134335 124256 75182
3976 75182 91841 39069 -26503 1477 -108935 -89770 -87224 -66004 -54850 2329 -50794 -54652
3964 -54652 -23704 -5791 -13918 -54151 -44382 -25872 -1242 -49124 -11940 6103 80938 27533
3952 27533 -3202 58385 -34771 20467 58193 68492 62674 -29293 155723 -35462 -89278 42087
3940 42087 -24244 -63819 -40124 -105991 -4766 59419 60341 119580 98100 -48626 51716 112730
3928 112730 89051 87316 16271 122599 59728 24655 60926 -2135 118530 82171 3410
3917 3410 92449 23467 -79787 115277 200987 166177 96598 2340 58852 38130 115296 110178
3905 110178 -87816 -61986 25960 -11098 -48939 -42752 -37906 5729 13497 29397 -83815 -99509
$$ packed form
3987A01674o6406q6363N2523J30737L7952j4049L2232j13445N9480j0079m9074
3976G5182J6659n2772o5572K7980j10412J9165K546K1220J1154N7179n3123l858
3964e4652L0948J7913q127m0233R769J8510K4630m7882L7184J8043P4835n3405
3952B7533l0735O1587r3156N5238L7726J0299n818r1967J85016j91185n3816J31365
3940D2087o6331l9575K3695o5867J01225O4185R22N9239k1480j46726J00342O1014
3928A12730k3679j735p1045J06328o2871l5073L6271o3061J20665l6359p8761
3917C410Q9039o8982j03254J95064Q5710l4810o9579r4258N6512k0722P7166n118
3905A10178j97994K5830Q7946l7058l7841O187M846M3635P768J5900j13212j5694
$$ plain form
3893 -99509 -12178 -47593 -184124 -159168 -212154 -306064 -276620 -215794 -146700 -120906 -109871 3243
3881 3243 -106741 -186283 -237301 -282527 -170134 -167095 -159620 -84722 -2173 63386 7740 12983
3869 12983 125727 17818 40639 104972 32734 79752 145853 25248 -8453 37481 90315
3858 90315 50841 -15888 -10507 75162 50278 124154 89875 56514 1599 2784 118187 231681
3846 231681 109728 79576 97799 96647 78630 35455 39667 83440 142183 294784 196683 162021
3834 162021 105577 5292 115764 95034 5942 12351 25629 43476 114286 11778 -66031
3823 -66031 -124808 -80384 -11156 92989 71803 42601 -68205 -37414 80640 -34804 -39340
3812 -39340 -67375 573 2564 -15733 14137 65549 -60 48240 -3353 -61611 10952 11782
$$ packed form
3893i9509Q7331l5415j36531K4956n2986r3910K9444O0826O9094K5794J1035J13114
3881C243j09984p9542n1018m5226J12393L039P475P4898Q2549O5559n5646N243
3869A2983J12744j07909K2821O4333p2238M7018O6101j20605l3701M5934N2834
3858I0315l9474o6729N381Q5669k4884P3876l4279l3361n4915J185J15403J13494
3846B31681j21953l0152J8223j152j8017m3175M212M3773N8743J52601r8101l4662
3834A62021n6444j00285J10472k0730q9092O409J3278J7847P0810j02508p7809
3823f6031n8777M4424O9228J04145k1186k9202j10806L0791J18054j15444m536
3812c9340k8035O7948J991j8297K9870N1412o5609M8300n1593n8258P2563Q30
$$ plain form
3800 11782 20359 86042 -8651 10833 -72424 -89296 28759 -11589 -81066 -191108 -241760 -198548
3788 -198548 -120551 35085 33986 -137741 -31256 47713 -21638 -59462 4087 -4663 96292
3777 96292 9980 18725 -28097 16852 97889 83040 44415 36095 -93039 -87168 -32273 10808
3765 10808 124021 58451 49854 2301 56717 70320 114844 27677 24292 -62584 44450 66444
3753 66444 -45202 -22451 -28776 -59211 -91350 -27423 -58909 -58903 -110535 -42544 -70957 -42019 37563
3740 37563 72197 27845 62013 -4853 30047 42888 -4679 13886 15615 23674 -35550 -10863
3728 -10863 -15385 -83619 -53181 11497 128874 49347 50112 15970 7332 -64155 -74948 87217
3716 87217 -42736 -35057 -65558 -114370 -161488 -112995 -23526 -26199 -62355 -20853 7638 -49636
$$ packed form
3800A1782Q577O5683r4693J9484q3257j6872J18055m0348o9477j10042n0652M3212
3788a98548P7997J55636j099j71727J06485P8969o9351l7824O3549q750J00955
3777I6292q6312Q745m6822M4949Q1037j4849l8625q320j29134N871N4895M3081
3765A0808J13213o5570q597m7553N4416J3603M4524q7167l385q6876J07034K1994
3753F6444j11646K2751o325l0435l2139O3927l1486On1632O7991k8413K8938P9582
3740C7563L4634m4352L4168o6866L4900J2841m7567J8565J729Q059n9224K4687
3728a0863m522o8234L0438O4678J17377p9527P65l4142q638p1487j0793J62165
3716H7217j29953P679l0501m8812m7118M8493Q9469k673l6156M1502K8491n7274
$$ plain form
3704 -49636 -21327 -58369 -11726 32153 44843 28027 25156 -28097 137671 158985 226084 138574
3692 138574 35741 -11204 11753 -20072 25929 -32230 23487 16156 -110598 70646 19841
3681 19841 -20431 -29506 -104519 -227256 -178205 -146361 -31891 51715 54159 -49341 -118129 -39520
3669 -39520 13839 -25398 45924 -29122 -88002 -73657 -28851 -55903 -56972 -182641 -180195 -54189
3657 -54189 -33999 -36145 -47536 -94480 -129469 -231512 -32008 -6029 -107245 -86301 -85378 213
3645 213 -100941 -137235 -47847 -88811 -118717 -54059 -84871 -53669 -103378 -29269 -12847 -147304
3633 -147304 -42624 -76819 -36548 34248 51131 109838 194218 133749 34239 -33088 -19143
3622 -19143 25641 -8698 -42199 99424 106037 42301 90067 92480 129816 20395 22561 131615
$$ packed form
3704d9636K8309l7042M6643M3879J2690j6816k871n3253J65768K1314O7099q7510
3692A38574j02833m6945K2957l1825M6001n8159N5717p331j26754J81244n0805
3681A9841m0272r075p5013j22737M9051L1844J14470Q3606K444j03500o8788P8609
3669c9520N3359l9237P1322p5046n8880J4345M4806k7052j069j25669K446J26006
3657e4189K0190k146j1391m6944l4989j02043J99504K5979j01216K0944R23Q5591
3645B13j01154l6294Q9388m0964k9906O4658l0812L1202m9709P4109J6422j34457
3633a47304J04680l4195M0271P0796J6883N8707Q4380o0469r9510o7327J3945
3622a9143M4784l4339l3501J41623O613o3736M7766K413L7336j09421K166J09054
$$ plain form
3610 131615 118550 188008 261038 117282 142312 39200 16581 129531 152701 147051 104552
3599 104552 95536 122341 94924 115772 235802 149234 56143 40053 1631 110185 19378
3588 19378 -92671 13287 -67468 -4320 18513 -66692 -162151 -152854 -197921 -78935 -106360
3577 -106360 -64248 -34499 -125992 -46920 -34749 -66602 -50526 -3161 -70045 -51513 -151832
3566 -151832 -124027 -83180 -97345 -180508 -219402 -299504 -303040 -302786 -241683 -198692 -137899 -93970
3554 -93970 -137217 -125275 -159478 -74603 -75495 -100989 3890 -3912 18755 278 1535 82200
3542 82200 15958 45668 63370 74459 127417 114792 -8959 8353 139646 124931 -8299
3531 -8299 -9489 25158 59692 15335 36916 7153 -83661 -29063 72300 220570 139438 85497
$$ packed form
3610A31615j3065O9458P3030j43756K5030j03112k2619J12950K3170n650m2499
3599A04552r016K6805k7417K0848J20030q6568r3091j6090l8422J08554r0807
3588A9378j12049J05958q0755O3148K2833q5205r5459R297m5067J18986k7425
3577a06360M2112K9749r1493P9072J2171l1853J6076M7365o6884J8532j00319
3566a51832K7805M0847j4165q3163l8894q0102l536K54O1103M2991O0793M3929
3554i3970m3247J1942l4203Q4875q92k5494J04879p802K2667j8477J257Q0665
3542H2200o6242K9710J7702J1089N2958j2625j23751J7312J31293j4715j33230
3531h299j190L4647L4534m4357K1581k9763r0814N4598J01363J48270q1132n3941
$$ plain form
3519 85497 106492 78544 28446 76364 30178 -70327 -97800 -36569 16116 -1563 -17544 -20587
3507 -20587 10978 -29569 -139882 -31387 -34861 -90651 -88358 -191388 -233620 -148201 -51857 -42935
3495 -42935 43833 -84671 -124288 1355 -51636 -1647 -54828 -101019 -134004 -64054 -75918
3484 -75918 -27715 -437 47017 9639 -100766 -67159 39184 14468 86102 74045 63119
3473 63119 -33331 13860 22526 -50702 -52683 99136 139439 53290 77161 -11829 65104 92422
3461 92422 169265 97192 -22248 1939 125194 116693 194110 104710 32778 63549 92026 49831
3449 49831 -40922 -86560 -126992 -31922 -37478 -117537 -180558 -71374 126287 62740 -78215
3438 -78215 -180197 -155889 -10404 146355 65584 -48963 -99035 -48905 -90954 -176233 -196349
$$ packed form
3519H5497K0995k7948n0098M7918m6186j00505k7473O1231N2685j7679j5981l043
3507b0587L1565m0547j10313J08495l474n5790K293j03030m2232Q5419R6344Q922
3495d2935Q6768j28504l9617J25643n2991M9989n3181m6191l2985O9950j1864
3484g5918M8203K7278M7454l7378j10405L3607J06343k4716P1634j2057j0926
3473F3119r6450M7191Q666p3228j981J51819M0303q6149K3871q8990P6933K7318
3461I2422P6843p2073j19440K4187J23255q501P7417q9400p1932L0771K8477m2195
3449D9831r0753m5638m0432R5070n556q0059o3021J09184J97661o3547j40955
3438g8215j01982K4308J45485J56759q0771j14547n0072N0130m2049q5279k0116
$$ plain form
3427 -196349 -75963 -15480 95799 38635 -129884 -181490 -98346 -31278 -111460 -168770 -169419
3416 -169419 -142590 84149 71441 -25057 -120347 4517 88964 85808 73420 -65850 -74436
3405 -74436 19033 151874 104391 158763 207704 346474 317402 123555 81341 65619 67590
3394 67590 121957 98822 53132 43637 182668 213219 144376 64867 36988 78250 204366 281035
3382 281035 161037 69477 94468 145099 89933 133506 170440 157471 194655 296463 169676
3371 169676 74702 112258 76909 41713 72341 34011 -1488 38153 37059 42596 -30947 33410
3359 33410 24134 58426 167534 161554 30219 86097 179769 127640 135143 179414 110944 75559
3347 75559 69293 19982 26855 48370 174702 104196 205049 169316 81778 133999 205333 241391
$$ packed form
3427a96349J20386O0483J11279n7164j68519n1606Q3144O7068q0182n7310o49
3416a69419K6829K26739j2708r6498r5290J24864Q4447l156j2388j39270q586
3405g4436R3469J32841m7483N4372M8941J38770k9072j93847m2214j5722J971
3394F7590N4367k3135m5690r495J39031L0551o8843p9509k7879M1262J26116P6669
3382B81035j19998r1560K4991N0631n5166M3573L6934j2969L7184J01808j26787
3371A69676r4974L7556l5349l5196L0628l8330l5499L9641j094N537p3543O4357
3359C3410r276L4292J09108n980j31335N5878R3672n2129P503M4271o8470l5385
3347G5559o266m9311O873K1515J26332p0506J00853l5733q7538N2221P1334L6058
$$ plain form
3335 241391 163025 -7730 50379 111193 73070 81364 100108 178418 270734 229277 122027
3324 122027 77261 93051 160222 138413 95608 8307 36725 141308 244102 33714 -10310
3313 -10310 -84019 136095 172815 107543 73132 137182 102386 173486 114919 -54453 -70394
3302 -70394 43857 152464 193036 105742 60765 48390 100948 275663 156654 94804 -1924
3291 -1924 90723 152927 105437 58007 72320 58957 161787 94502 36628 73657 9759 21781
3279 21781 112621 42249 -45189 -15620 2245 41993 -8135 32791 41597 90163 160985 211894
3267 211894 -5199 40545 236162 249225 113096 -3793 47897 100745 58201 121644 103724
3256 103724 19594 152287 132242 165346 150024 221558 239405 196774 227200 284594 160753
$$ packed form
3335B41391p8366j70755N8109O0814l8123Q294J8744P8310R2316m1457j07250
3324A22027m4766J5790O7171k1809m2805q7301K8418J04583J02794k10388m4024
3313a0310p3709K20114L6720o5272l4411O4050l4796P1100n8567j69372j5941
3302g0394J14251J08607M0572q7294m4977j2375N2558J74715j19009o1850r6728
3291a924R2647O2204m7490m7430J4313j3363J02830o7285n7874L7029o3898J2022
3279B1781R0840p0372q7438K9569J7865L9748n0128M0926Q806M8566P0822N0909
3267B11894k17093M5744J95617J3063j36129j16889N1690N2848m2544O3443j7920
3256A03724q4130J32693k0045L3104j5322P1534J7847m2631L0426N7394j23841
$$ plain form
3245 160753 279315 273854 234129 219209 268113 225698 178945 196986 191953 45997 45174 269881
3233 269881 331846 282866 202222 150601 158646 276866 304342 250030 147881 246315 323222
3222 323222 329208 261346 232777 251973 393962 312401 130683 150448 217381 307753 407233
3211 407233 405251 309325 320862 408347 505363 359765 367924 255248 227343 401103 388744
3200 388744 261054 202866 316153 414812 327212 297183 310030 250806 302544 375720 311943
3189 311943 245403 244521 293091 445005 351136 361482 415993 415774 401025 391000 266808 307636
3177 307636 382446 499797 598479 467740 393674 394540 520904 608554 565383 526631 528484 533374
3165 533374 473330 479747 538658 544073 508693 422779 526722 589658 679177 682842 725737 717641
$$ packed form
3245A60753J18562n461l9725j4920M8904m2415m6753J8041n033j45956q23K24707
3233B69881O1965m8980q0644n1621Q045J18220K7476n4312j02149R8434P6907
3222C23222N986o7862k8569J9196J41989q1561j81718J9765O6933R0372R9480
3211D07233j982r5926J1537Q7485R7016j45598Q159j12676k7905J73760j2359
3200C88744j27690n8188J13287R8659q7600l0029J2847n9224N1738P3176o3777
3189C11943o6540q82M8570J51914r3869J0346N4511k19j4749j0025j24192M0828
3177C07636P4810J17351R8682j30739p4066Q66J26364Q7650m3171l8752J853M890
3165E33374o0044O417N8911N415l5380q5914J03943O2936Q9519L665M2895q096
$$ plain form
3153 717641 633818 499534 573185 679198 696381 751373 698148 775572 750537 736944 801093
3142 801093 753565 698462 796653 969288 996479 874990 901835 1043246 1073143 962088 907612
3131 907612 967283 1041015 1135587 1120616 1054891 988361 1109548 1192074 1256092 1233689 1184276
3120 1184276 1253434 1476014 1452635 1446278 1486251 1472368 1495284 1543066 1553176 1554251 1716078
3109 1716078 1818157 1859068 1923686 1844855 1891122 1966110 2105587 2282527 2282561 2409459 2372956
3098 2372956 2544345 2745064 2868337 2818703 2948014 3174466 3336970 3335821 3569758 3821782
3088 3821782 3982402 4237703 4426381 4537344 4702162 4884193 5138829 5363703 5538169 5863819
3078 5863819 6101119 6469211 6946903 7356844 7863224 8539852 9083242 9506193 9681372 9891583
$$ packed form
3153G17641q3823j34284P3651J06013J7183N4992n3225P7424k5035j3593O4149
3142H01093m7528n5103R8191J72635K7191j21489K6845J41411K9897j11055n4476
3131I07612N9671P3732R4572j4971o5725o6530J21187Q2526O4018k2403m9413
3120A184276O9158K22580k3379o357L9973j3883K2916M7782J0110J075J61827
3109A716078J02079M0911O4618p8831M6267P4988J39477J76940L4J26898l6503
3098B372956J71389K00719J23273m9634J29311K26452J62504j149K33937K52024
3088C821782J60620K55301J88678J10963J64818J82031K54636K24874J74466L25650
3078E863819K37300L68092M77692M09941N06380O76628N43390M22951J75179K10211
$$ plain form
3068 9891583 10205558 10299458 10454516 10470750 10546428 10937436 11527189 12190625 13179572 14079669
3058 14079669 14939260 15923987 16793847 17250946 17295479 17117574 16773404 16265097 15882457 15527280
3048 15527280 15462779 15875057 16396296 17141052 17971323 19089131 20163262 21069052 21583497
3039 21583497 21641215 21066233 20077541 18897655 17663875 16730210 16040641 15706150 15542276
3030 15542276 15697616 16062037 16632979 17214561 17749692 17966138 17641669 17227804 16340440
3021 16340440 15106949 13978674 12781099 11773219 11042777 10567984 10398387 10229468 10193489
3012 10193489 10195310 10112064 10128412 9974557 9741808 9185509 8440262 7731766 7078747 6539452
3002 6539452 6083836 5738971 5390458 5228193 5022860 4849020 4677347 4571570 4451090 4253275
$$ packed form
3068I891583L13975R3900J55058J6234P5678L91008N89753O63436R88947R00097
3058A4079669Q59591R84727Q69860M57099M4533j77905l44170n08307l82640l55177
3048A5527280o4501M12278N21239P44756Q30271J117808J074131R05790N14445
3039B1583497N7718n74982r88692j179886j233780r33665o89569l34491j63874
3030A5542276J55340L64421N70942N81582N35131K16446l24469m13865q87364
3021A6340440j233491j128275j197575j007880p30442m74793j69597j68919l5979
3012A0193489J821q3246J6348j53855k32749n56299p45247p08496o53019n39295
3002F539452m55616l44865l48513j62265k05333j73840j71673j05777j20480j97815
$$ plain form
2992 4253275 4131575 3989427 3701951 3590035 3459420 3242686 3110370 2944264 2799352 2687178
2982 2687178 2621964 2567730 2373453 2259078 2270003 2259101 2168353 2146418 2113248 2021204 1944523
2971 1944523 1903980 1876715 1895535 1889284 1935459 1743310 1760368 1738549 1653291 1623080 1613531 1586586
2959 1586586 1549497 1633093 1611124 1543162 1492984 1523736 1431903 1394561 1522684 1458590 1365605
2948 1365605 1448230 1392017 1360734 1379005 1364059 1448100 1408392 1461764 1476986 1403492 1477623
2937 1477623 1543439 1480159 1461770 1407800 1344159 1423931 1543144 1515218 1401828 1396337 1441606
2926 1441606 1370931 1267136 1324472 1236378 1280961 1320140 1287821 1265013 1347259 1373464 1385993
2915 1385993 1447555 1456281 1401382 1413197 1510560 1485611 1557157 1575410 1706354 1742167 1811440
$$ packed form
2992D253275j21700j42148k87476j11916j30615k16734j32316j66106j44912j12174
2982B687178o5214n4234j94277j14375J0925j0902r0748k1935l3170r2044p6681
2971A944523m0543k7265J8820o251M6175j92149J7058k1819q5258l0211r549k6945
2959A586586l7089Q3596k1969o7962n0178L0752r1833l7342J28123o4094r2985
2948A365605Q2625n6213l1283J8271j4946Q4041l9708N3372J5222p3494P4131
2937A477623O5816o3280j8389n3970o3641P9772J19213k7926j13390n491M5269
2926A441606p0675j03795N7336q8094M4583L9179l2319k2808Q2246K6205J2529
2915A385993O1562Q726n4899J1815R7363k4949P1546J8253J30944L5813O9273
$$ plain form
2904 1811440 1903108 1977070 2085707 1971836 1962024 1983907 2027971 2167822 2106535 1994675 2054591
2893 2054591 2104556 2141546 2124276 2049875 1929228 1939277 1931587 1921883 1937969 1942090 2032481 2101162
2881 2101162 2150651 2061006 1926283 2024117 2102875 2125700 2032770 2034633 2022872 2089717 2158376
2870 2158376 2216904 2280428 2269644 2324621 2488941 2407721 2349369 2307905 2452311 2523378 2634885
2859 2634885 2733282 2663239 2598613 2698045 2760726 2716813 2751961 2890611 2945802 2982369 2948127
2848 2948127 3059485 3120094 3130989 3213019 3212925 3272842 3310006 3348536 3430502 3568637 3541993 3655650
2836 3655650 3834144 3969891 4040970 4137254 4220626 4340456 4457945 4626480 4668621 4715875
2826 4715875 4962733 5035947 5041737 5124335 5213229 5282818 5446505 5737453 5908676 6010683 6187773
$$ packed form
2904A811440R1668P3962J08637j13871r812K1883M4064J39851o1287j11860N9916
2893B054591M9965L6990j7270p4401j20647J0049p690r704J6086M121R0391O8681
2881B101162M9489q9645j34723R7834P8758K2825r2930J863j1761O6845O8659
2870B158376N8528O3524j0784N4977J64320q1220n8352m1464J44406P1067J11507
2859B634885R8397p0043o4626R9432O2681m3913L5148J38650N5191L6567l4242
2848B948127J11358O0609J0895Q2030r4N9917L7164L8530Q1966J38135k6644J13657
2836C655650J78494J35747P1079R6284Q3372J19830J17489J68535M2141M7254
2826D715875K46858P3214N790Q2598Q8894O9589J63687K90948J71223J02007J77090
$$ plain form
2815 6187773 6380338 6474102 6695159 6883069 6998902 7314661 7679596 7818942 8047397 8404156
2805 8404156 8894195 9274557 9619083 9924984 10384759 10932915 11524690 12086213 12591472 13249026
2795 13249026 14099178 14952541 15979496 16936342 17917506 19130638 20739157 22404232 24165542
2786 24165542 26269015 28553204 31144587 34034080 37065306 40158938 43467726 46654470
2778 46654470 49614653 52041996 53968479 55484788 56328713 56700228 56581671 56001410 55125771
2769 55125771 54306031 53544093 52892173 52532136 52254422 52273957 52512299 52495550 52384416 51983135
2759 51983135 51137537 49762768 47897356 45723694 43104050 40255834 37331833 34427252
2751 34427252 31564606 28837687 26430363 24277656 22437442 20862439 19375504 18204241
$$ packed form
2815F187773J92565R3764K21057J87910J15833L15759L64935J39346K28455L56759
2805H404156M90039L80362L44526L05901M59775N48156N91775N61523N05259O57554
2795A3249026Q50152Q53363J026955R56846R81164J213132J608519J665075J761310
2786B4165542K103473K284189K591383K889493L031226L093632L308788L186744
2778D6654470K960183K427343J926483J516309Q43925L71515j18557n80261q75639
2769E5125771q19740p61938o51920l60037k77714J9535K38342j6749j11134m01281
2759E1983135q45598j374769j865412k173662k619644k848216k924001k904581
2751C4427252k862646k726919k407324k152707j840214j575003j486935j171263
$$ plain form
2743 18204241 17139356 16289788 15407120 14653907 14142194 13592003 13171772 12807935 12358228
2734 12358228 11981229 11801112 11560438 11287451 11009688 10772842 10684408 10700365 10606839 10332867
2724 10332867 10203813 10248398 10088035 9917430 9835414 9658618 9720054 9720470 9566037 9355616
2714 9355616 9175744 9092403 9086615 8949909 8743145 8569935 8439057 8421253 8335415 8172100
2704 8172100 8059988 7968139 7844052 7837870 7871677 7779975 7625666 7529834 7515783 7475662 7365504
2693 7365504 7187061 7014561 7027703 7136416 7128971 7048994 6971859 6979858 6964728 6917362 7131378
2682 7131378 7054745 6967494 7093078 7114224 7080073 7058209 7053610 7151160 7049890 7061859 7210793
2671 7210793 7258883 7330371 7384055 7456259 7519170 7642378 7731134 8017318 8163626 8306197 8461211
$$ packed form
2743A8204241j064885q49568q82668p53213n11713n50191m20231l63837m49707
2734A2358228l76999j80117k40674k72987k77763k36846q8434J5957r3526k73972
2724A0332867j29054M4585j60363j70605q2016j76796O1436M16j54433k10421
2714I355616j79872q3341n788j36706k06764j73210j30878j7804q5838j63315
2704H172100j12112r1849j24087o182L3807r1702j54309r5832j4051m0121j10158
2693G365504j78443j72500J3142J08713p445p9977p7135P999j5130m7366K14016
2682G131378p6633q7251J25584K1146l4151k1864m599R7550j01270J1969J48934
2671G210793M8090P1488N3684P2204O2911J23208Q8756K86184J46308J42571J55014
$$ plain form
2660 8461211 8585991 8717759 8998075 9233886 9464992 9588232 9779607 10138649 10481186 10775443
2650 10775443 10899435 11106376 11370280 11505182 11702823 11857678 12090194 12267187 12335794 12369314
2640 12369314 12424198 12493396 12675357 12781936 12924813 13217384 13419087 13625871 13977611 14477921
2630 14477921 14940742 15395775 15805138 16289843 16892620 17535289 18301090 19084017 19876989
2621 19876989 20840057 21812107 22919566 24038233 25257084 26571667 27967064 29456669
2613 29456669 31167457 33093774 35204010 37526519 40273366 43306249 46585691 50312172
2605 50312172 54661507 59488517 65064164 71442097 78616079 86502216 95410613 105187515
2597 105187515 115344590 125564986 135094103 143521309 150364575 155197394 157571275 157291405
$$ packed form
2660H461211J24780J31768K80316K35811K31106J23240J91375L59042L42537K94257
2650A0775443J23992K06941K63904J34902J97641J54855K32516J76993O8607L3520
2640A2369314N4884O9198J81961J06579J42877K92571K01703K06784L51740N00310
2630A4477921M62821M55033M09363M84705O02777O42669P65801P82927P92972
2621A9876989R63068R72050J107459J118667J218851J314583J395397J489605
2613B9456669J710788J926317K110236K322509K746847L032883L279442L726481
2605E0312172M349335M827010N575647O377933P173982P886137Q908397R776902
2597A05187515J0157075J0220396R529117Q427206O843266M832819K373881k79870
$$ plain form
2589 157291405 154340402 148836779 141228562 132080992 121725811 111110175 100626134 90765645
2581 90765645 81687201 73420198 65993928 59525944 53728380 48831351 44638531 40801928
2573 40801928 37540306 34648426 32230926 30093340 28226872 26480708 25060280 23803888
2565 23803888 22687169 21627379 20590288 19670172 18882764 18302729 17657810 17023354 16476734
2556 16476734 15931080 15395836 14892421 14536688 14094077 13638802 13212859 12907692 12589937
2547 12589937 12217394 11857291 11523017 11180621 11047743 10864003 10587068 10321645 10076564
2538 10076564 9880215 9724428 9679537 9532832 9318702 9256013 9129398 8981034 8733360 8481859
2528 8481859 8223810 8056044 7775233 7468595 7169556 6850039 6619845 6332733 6064177 5886358
$$ packed form
2589A57291405k951003n503623p608217r147570j0355181j0615636j0484041r860489
2581I0765645r078444q267003p426270o467984n797564m897029m192820l836603
2573D0801928l261622k891880k417500k137586j866468j746164j420428j256392
2565B3803888j116719j059790j037091r20116p87408n80035o44919o34456n46620
2556A6476734n45654n35244n03415l55733m42611m55275m25943l05167l17755
2547A2589937l72543l60103l34274l42396j32878j83740k76935k65423k45081
2538A0076564j96349j55787m4891j46705k14130o2689j26615j48364k47674k51501
2528H481859k58049j67766k80811l06638k99039l19517k30194k87112k68556j77819
$$ plain form
2518 5886358 5758129 5528238 5381171 5283698 5143832 5001168 5002787 4925397 4826884 4793851 4703614
2507 4703614 4552169 4502474 4345673 4300109 4211388 4157247 4142688 4162825 4097563 4051925 3984467
2496 3984467 3897943 3835973 3836203 3836130 3815216 3607834 3540291 3524696 3479550 3393028 3244635 3366045
2484 3366045 3320220 3103499 3117880 3165585 3072791 3024442 2950337 2947848 2817836 2802975 2744932
2473 2744932 2736882 2805478 2780000 2723589 2683084 2684925 2705781 2591171 2552571 2711789 2605243
2462 2605243 2584913 2476414 2436901 2387608 2390417 2349347 2242076 2267030 2298650 2257480 2288998
2451 2288998 2320423 2242897 2232331 2222837 2324103 2321089 2372769 2364423 2421652 2440642 2419289 2431491
2439 2431491 2461388 2442891 2595203 2531547 2454329 2463747 2457348 2484488 2502340 2521075 2526373 2567532
$$ packed form
2518E886358j28229k29891j47067r7473j39866j42664J619p7390r8513l3033r0237
2507D703614j51445m9695j56801m5564q8721n4141j4559K0137o5262m5638o7458
2496C984467q6524o1970K30p3k0914k07382o7543j5595m5146q6522j48393J21410
2484C366045m5825k16721J4381M7705r2794m8349p4105k489j30012j4861n8043
2473B744932q050O8596k5478n6411m0505J841K0856j14610l8600J59218j06546
2462B605243k0330j08499l9513m9293K809m1070j07271K4954L1620m1170L1518
2451B288998L1425p7526j0566r494J01266l014N1680q346N7229J8990k1353J2202
2439B431491K9897j8497J52312o3656p7218R418o399K7140J7852J8735N298M1159
$$ plain form
2427 2567532 2498523 2469458 2501758 2562464 2557247 2521980 2489972 2484226 2537711 2676605 2626639 2652413
2415 2652413 2607524 2542054 2666565 2791646 2749571 2751370 2774534 2802271 2909545 2895433 2867114
2404 2867114 2783187 2800603 2986419 3040311 3019172 2884520 2845822 2916741 3165127 3256159 3162500
2393 3162500 3087865 3167587 3318788 3360666 3416601 3410853 3502261 3586326 3589121 3729402 3816113
2382 3816113 3970112 4095348 4054643 4118416 4203449 4344931 4499841 4640578 4773321 4921603
2372 4921603 5122895 5210713 5328042 5621236 5924154 6177451 6432428 6808380 7218338 7660517
2362 7660517 8069781 8581613 9043845 9754207 10343534 10939166 11598289 12276395 12931872 13519404
2352 13519404 14038168 14493824 14972428 15342758 15614616 15796103 16067104 16324106 16514802
$$ packed form
2427B567532o9009k9065L2300O0706n217l5267l2008n746N3485J38894m9966K5774
2415B652413m4889o5470J24511J25081m2075J799K3164K7737J07274j4112k8319
2404B867114q3927J7416J85816N3892k1139j34652l8698P0919K48386R1032r3659
2393C162500p4635P9722J51201M1878N5935n748R1408Q4065K795J40281Q6711
2382C816113J53999J25236m0705O3773Q5033J41482J54910J40737J32743J48282
2372D921603K01292Q7818J17329K93194L02918K53297K54977L75952M09958M42179
2362G660517M09264N11832M62232P10362N89327N95632O59123O78106O55477N87532
2352A3519404N18764M55656M78604L70330K71858J81487K71001K57002J90696
$$ plain form
2343 16514802 16729390 16826619 16797517 16659346 16682138 16613316 16533537 16479275 16396690 16251168 16019851
2332 16019851 15979566 15630476 15376671 15184205 14922175 14560908 14278362 13800622 13256172 12936670
2322 12936670 12779254 12560323 12400393 12406992 12424905 12519422 12752318 12985791 13304215 13666464
2312 13666464 13972993 14411545 14899615 15455488 16102278 16945578 17773748 18769124 19892711
2303 19892711 21129341 22575201 24194827 25982180 28027624 30213033 32389712 34433458
2295 34433458 36390107 38222717 39870263 41273688 42446485 43574915 44948397 46256117
2287 46256117 47384919 48488247 49201472 49509176 49649722 49636860 49505139 49291249 48858393
2278 48858393 48360031 47744339 47009522 46158499 45497179 45035386 44442054 43769832 42569089
$$ packed form
2343A6514802K14588R7229k9102j38171K2792o8822p9779n4262q2585j45522k31317
2332A6019851m0285l49090k53805j92466k62030l61267k82546m77740n44450l19502
2322A2936670j57416k18931j59930O599J7913R4517K32896K33473L18424L62249
2312A3666464L06529M38552M88070N55873O46790Q43300Q28170R95376J123587
2303A9892711J236630J445860J619626J787353K045444K185409K176679K043746
2295C4433458J956649J832610J647546J403425J172797J128430J373482J307720
2287D6256117J128802J103328P13225L07704J40546j2862j31721k13890m32856
2278D8858393m98362o15692p34817q51023o61320m61793n93332o72222j200743
$$ plain form
2269 42569089 41045099 39377315 37784294 35981941 34239670 32718360 31489784 30509462
2261 30509462 29536959 28998679 28778455 28803163 29088601 29659633 30403650 31379042 32566612
2252 32566612 33956766 35448331 37199482 38818251 40301974 41782096 43401361 44854794
2244 44854794 46004170 46933116 47615155 48026010 48328503 48305523 48205019 48070573 47829435
2235 47829435 47507080 47322575 47136757 46690274 46177852 45713458 45003093 44078055 43002683
2226 43002683 41693757 40205069 38490698 36636062 34503933 32324500 30194458 28268941
2218 28268941 26366174 24635300 22993947 21409213 20074343 19002946 18020893 17088716
2210 17088716 16246408 15658623 15089643 14679272 14428219 14027843 13687777 13429823 13255389
$$ packed form
2269D2569089j523990j667784j593021j802353j742271j521310j228576r80322
2261C0509462r72503n38280k20224K4708K85438N71032P44017R75392J187570
2252C2566612J390154J491565J751151J618769J483723J480122J619265J453433
2244D4854794J149376R28946O82039M10855L02493k2980j00504j34446k41138
2235D7829435l22355j84505j85818m46483n12422m64394p10365r25038j075372
2226D3002683j308926j488688j714371j854636k132129k179433k130042j925517
2218B8268941j902767j730874j641353j584734j334870j071397r82053r32177
2210A7088716q42308n87785n68980m10371k51053m00376l40066k57954j74434
$$ plain form
2201 13255389 13112764 13146215 13135079 13231818 13426332 13579168 13686148 13947136 14276470 14644057
2191 14644057 15182347 15639746 16019895 16515981 16974849 17425583 17813148 18073740 18360551
2182 18360551 18513531 18656552 18617224 18437639 18419368 18579733 18505595 18448810 18376518 18389400
2172 18389400 18438835 18389770 18230698 18057328 17970609 17892585 17591185 17276447 17037058 16663645
2162 16663645 16247200 15912480 15454196 14864817 14180489 13666411 13248542 12853163 12570191
2153 12570191 12240108 11958508 11796261 11502314 10997908 10621953 10353811 10165168 9936483
2144 9936483 9738899 9494970 9399084 9245229 9204982 9027064 8956025 9059051 9081357 9158450
2134 9158450 9106331 9181659 9244307 9380432 9459346 9544596 9672967 9829727 10004425 10156206
$$ packed form
2201A3255389j42625L3451j1136R6739J94514J52836J06980K60988L29334L67587
2191A4644057N38290M57399L80149M96086M58868M50734L87565K60592K86811
2182A8360551J52980J43021l9328j79585j8271J60365p4138n6785p2292J2882
2172A8389400M9435m9065j59072j73370q6719p8024l01400l14738k39389l73413
2162A6663645m16445l34720m58284n89379o84328n14078m17869l95379k82972
2153A2570191l30083k81600j62247k93947n04406l75955k68142j88643k28685
2144I936483j97584k43929r5886j53855m0247j77918p1039J03026K2306P7093
2134I158450n2119P5328O2648J36125P8914Q5250J28371J56760J74698J51781
$$ plain form
2124 10156206 10441887 10561716 10720455 11036246 11362247 11796007 12250619 12709805 13235291
2115 13235291 13786915 14411517 15179157 15971101 16910260 18056347 19171563 20568673 22220858
2106 22220858 24015236 25979033 28119200 30176506 32236405 34001998 35407608 36608997
2098 36608997 37878359 39469561 41183285 43300260 45519128 47490520 49089879 50065698
2090 50065698 50340529 50527491 50710460 51144578 51952325 52944755 53819937 54367264 54438698 53957356
2080 53957356 52939833 51548659 49923270 47845379 45482840 42785251 39851126 36913250
2072 36913250 33939493 30936708 28174452 25532126 23247683 21147733 19229722 17732696
2064 17732696 16463385 15258122 14327450 13563889 12687704 11907783 11317677 10873897 10407275
$$ packed form
2124A0156206K85681J19829J58739L15791L26001M33760M54612M59186N25486
2115A3235291N51624O24602P67640P91944R39159J146087J115216J397110J652185
2106B2220858J794378J963797K140167K057306K059899J765593J405610J201389
2098C6608997J269362J591202J713724K116975K218868J971392J599359R75819
2090E0065698K74831J86962J82969M34118Q07747R92430Q75182N47327P1434m81342
2080E3957356j017523j391174j625389k077891k362539k697589k934125k937876
2072C6913250k973757l002785k762256k642326k284443k099950j918011j497026
2064A7732696j269311j205263r30672p63561q76185p79921n90106m43780m66622
$$ plain form
2055 10407275 10040533 9625660 9235642 9103517 8885264 8505669 8257262 7999135 7814028
2046 7814028 7722889 7468936 7267665 7069072 6983720 6867313 6545533 6446596 6408056 6320395
2036 6320395 6285891 6170914 6070567 6008492 5960103 6143172 6248413 6287086 6375983 6469788 6513481
2025 6513481 6802783 6942846 6885008 7009665 7196555 7221787 7157736 7171695 7006693 6806045
2015 6806045 6631209 6330766 5976726 5704523 5389963 5027573 4813438 4621573 4314748 4159474
2005 4159474 4057149 3907599 3673713 3523457 3524759 3385861 3268853 3268228 3247028 3147710 3190611
1994 3190611 3137898 3031594 2957399 2944627 2871843 2879473 2848584 2784399 2747620 2670182 2698156
1983 2698156 2776540 2800909 2807187 2776444 2648835 2597240 2604496 2638232 2600061 2604345 2573197 2622231
$$ packed form
2055A0407275l66742m14873l90018j32125k18253l79595k48407k58127j85107
2046G814028r1139k53953k01271j98593q5352j16407l21780r8937l8540q7661
2036F320395l4504j14977j00347o2075m8389J83069J05241L8673Q8897R3805M3693
2025F513481K89302J40063n7838J24657J86890K5232o4051J3959j65002k00648
2015F806045j74836l00443l54040k72203l14560l62390k14135j91865l06825j55274
2005D159474j02325j49550k33886j50256J302j38898j17008o25k1200r9318M2901
1994C190611n2713j06304p4195j2772p2784P630l0889o4185l6779p7438K7974
1983B698156P8384K4369O278l0743j27609n1595P256L3736l8171M284l1148M9034
$$ plain form
1971 2622231 2634546 2754745 2703395 2677918 2650043 2666816 2673474 2659255 2622304 2474404 2456793
1960 2456793 2477267 2493778 2558244 2527702 2542898 2653534 2627552 2577761 2657922 2725895 2718510
1949 2718510 2760967 2753628 2584366 2514738 2673493 2610416 2560424 2672208 2670337 2589964 2601702
1938 2601702 2739228 2646236 2495727 2544160 2542716 2532310 2598144 2568534 2526295 2562331 2628672
1927 2628672 2614636 2624740 2718812 2664457 2639576 2809028 2920704 2898640 2927333 2924503 2950487
1916 2950487 3027447 3061613 2989796 2967685 3122256 3132580 3142768 3230329 3283549 3314763 3485421
1905 3485421 3659483 3517876 3500026 3567990 3684854 3793618 3895648 3917003 3938236 3920722
1895 3920722 4019267 4127253 4116940 4230151 4241390 4314587 4477641 4548591 4643507 4701875 4647020
$$ packed form
1971B622231J2315J20199n1350k5477k7875J6773O658j4219l6951j47900j7611
1960B456793K0474J6511O4466l0542J5196J10636k5982m9791Q0161O7973p385
1949B718510M2457p339j69262o9628J58755o3077m9992J11784j871q0373J1738
1938B601702J37526r2992j50509M8433j444j0406O5834k9610m2239L6036O6341
1927B628672j4036J0104R4072n4355k4881J69452J11676k2064K8693k830K5984
1916B950487P6960L4166p1817k2111J54571J0324J0188Q7561N3220L1214J70658
1905C485421J74062j41607j7850O7964J16864J08764J02030K1355K1233j7514
1895C920722R8545J07986j0313J13211J1239P3197J63054P0950R4916N8368n4855
$$ plain form
1884 4647020 4740139 4897812 5133902 5376523 5384391 5536116 5680561 5751829 5988921 6019784
1874 6019784 6005739 6199626 6239159 6299785 6300833 6345615 6468957 6595554 6583676 6706190 6734956
1863 6734956 6867840 7146602 7291101 7549859 7670892 7874179 8034438 8161162 8346273 8578633
1853 8578633 8715723 9103252 9306253 9541082 9799943 9886107 10238195 10616117 10868390 11124123
1843 11124123 11351583 11648361 11961785 12372714 12755628 13136745 13520451 13919488 14321789
1834 14321789 14682632 15084024 15382202 15775119 16265843 16468705 16809697 17282131 17795828
1825 17795828 18476785 19092506 19956949 20749012 21549361 22609241 23762762 24736196 25942424
1816 25942424 27101054 28435004 30001615 31675824 33359146 35073828 36898303 38710038
$$ packed form
1884D647020R3119J57673K36090K42621P868J51725J44445P1268K37092L0863
1874F019784j4045J93887L9533O0626J048M4782J23342J26597j1878J22514K8766
1863F734956J32884K78762J44499K58758J21033K03287J60259J26724J85111K32360
1853H578633J37090L87529K03001K34829K58861Q6164L52088L77922K52273K55733
1843A1124123K27460K96778L13424M10929L82914L81117L83706L99037M02301
1834A4321789L60843M01392K98178L92917M90724K02862L40992M72434N13697
1825A7795828O80957O15721Q64443P92063Q00349J059880J153521R73434J206228
1816B5942424J158630J333950J566611J674209J683322J714682J824475J811735
$$ plain form
1808 38710038 40544465 42372545 44615035 47011228 49732325 52853300 56296511 60425099
1800 60425099 65178622 70565660 76491200 82993664 89980786 97619687 106208386 116071370
1792 116071370 127604530 141550870 158863053 180295755 206133828 236059520 268050851
1785 268050851 298992065 323892499 334926911 325168653 294691749 252273274 209525883
1778 209525883 173783861 146731195 126642683 111434206 99714145 90403940 82444233
1771 82444233 75299211 69019088 63293114 58198988 53705606 49906898 46449103 43583676
1763 43583676 41084493 38728844 36503400 34774026 33146776 31821973 30519515 29257044
1755 29257044 28166623 27169805 26345734 25412933 24426247 23560013 22839586 21936426 21244926
$$ packed form
1808C8710038J834427J828080K242490K396193K721097L120975L443211M128588
1800F0425099M753523N387038N925540O502464O987122P638901Q588699R862984
1792A16071370J1533160J3946340J7312183K1432702K5838073K9925692L1991331
1785B68050851L0941214K4900434J1034412r758258l0476904m2418475m2747391
1778B09525883l5742022k7052666k0088512j5208477j1720061r310205p959707
1771H2444233p145022o280123n725974n094126m493382l798708l457795k865427
1763D3583676k499183k355649k225444j729374j627250j324803j302458j262471
1755B9257044j090421r96818q24071r32801r86686q66234p20427r03160o91500
$$ plain form
1746 21244926 20578886 19792599 18985869 18271375 17627075 16993658 16387506 15838392 15245993
1737 15245993 14752261 14308152 13768401 13140881 12713087 12368383 11953553 11528251 11188418
1728 11188418 10879195 10516025 10269071 9888462 9410947 9047334 8826479 8587097 8262822
1719 8262822 7880715 7619643 7467042 7196678 7005331 6770460 6507079 6449157 6340463 6288683
1709 6288683 6174392 6141040 6119875 6031917 5950827 5922910 5902952 5851918 5795302 5807825 5764985
1698 5764985 5622529 5436844 5413845 5361198 5100294 4952640 4890393 4819548 4757969 4735672 4651220
1687 4651220 4459829 4267698 4235893 4125828 4065883 4011712 3921023 3828511 3734448 3604548 3520793
1676 3520793 3414675 3433527 3501206 3331729 3144315 3160667 3181086 3175974 3155980 3018832 2768616
$$ packed form
1746B1244926o66040p86287q06730p14494o44300o33417o06152n49114n92399
1737A5245993m93732m44109n39751o27520m27794l44704m14830m25302l39833
1728A1188418l09223l63170k46954l80609m77515l63613k20855k39382l24275
1719H262822l82107k61072j52601k70364j91347k34871k63381n7922j08694n1780
1709F288683j14291l3352k1165q7958q1090k7917j9958n1034n6616J2523m2840
1698E764985j42456j85685k2999n2647k60904j47654o2247p0845o1579k2297q4452
1687D651220j91391j92131l1805j10065n9945n4171r0689r2512r4063j29900q3755
1676C520793j06118J8852O7679j69477j87414J6352K0419n112j9994j37148k50216
$$ plain form
1665 2768616 2668483 2690515 2636403 2544933 2431626 2361476 2337182 2154825 2032959 1979399 1975658
1654 1975658 1951670 1966160 1737914 1683773 1659471 1556092 1634504 1630075 1423582 1387927 1481156
1643 1481156 1451906 1435756 1422542 1506701 1514762 1534836 1610535 1632487 1617112 1688564 1805416
1632 1805416 1838042 1739931 1791210 1798208 1874645 1900819 1923221 1785460 1714554 1705275 1756917 1721703
1620 1721703 1648546 1626969 1497148 1506113 1594990 1509983 1393886 1545193 1487185 1444140 1395460
1609 1395460 1426670 1469446 1516981 1448451 1471042 1409530 1313474 1211627 1166367 1140981 1152094
1598 1152094 1204247 1154568 1098457 974013 1038993 1004749 1003582 870899 774082 764520 802564
1587 802564 791517 732061 604289 500570 445004 552168 506671 425656 365277 251257 288796
$$ packed form
1665B768616j00133K2032n4112r1470j13307p0150k4294j82357j21866n3560l741
1654A975658k3988J4490k28246n4141k4302j03379P8412m429k06493l5655R3229
1643A481156k9250j6150j3214Q4159Q061K0074P5699K1952j5375P1452J16852
1632A805416L2626r8111N1279O998P6437K6174K2402j37761p0906r279N1642l5214
1620A721703p3157k1577j29821Q965Q8877q5007j16097J51307n8008m3045m8680
1609A395460L1210M2776M7535o8530K2591o1512r6056j01847m5260k5386J1113
1598A152094N2153m9679n6111j24444O4980l4244j167j32683r6817r562L8044
1587H02564j1047n9456j27772j03719n5566J07164m5497q1015o0379j14020L7539
$$ plain form
1576 288796 471500 376454 315339 312937 261750 272138 237930 256266 216975 348909 421361
1565 421361 432012 445028 451560 392820 354497 477986 534085 477567 554307 461524 633519
1554 633519 689752 558807 528816 534683 549627 553462 449132 304052 426406 418226 428604
1543 428604 486080 417212 350035 306926 292388 427855 444155 485933 485265 495877 555268 459110
1531 459110 471898 549343 551312 537959 551377 517809 552899 522510 554442 602822 609103 579659
1519 579659 589201 547689 498833 480125 495735 541588 425452 471152 518510 473147 558586 619852
1507 619852 555203 629832 636211 631430 563032 564675 533860 590283 651361 719172 754228 789321
1495 789321 730834 737382 822854 906796 955791 993627 1053500 1180628 1288592 1312343 1456232
$$ packed form
1576B88796J82704r5046o1115k402n1187J0388l4208J8336l9291J31934P2452
1565D21361J0651J3016O532n8740l8323J23489N6099n6518P6740r2783J71995
1554F33519N6233j30945k9991N867J4944L835j04330j45080J22354q180J0378
1543D28604N7476o8868o7177m3109j4538J35467J6300M1778o68J0612N9391r6158
1531D59110J2788P7445J969j3353J3418l3568L5090l0389L1932M8380O281k9444
1519E79659R542m1512m8856j8708J5610M5853j16136M5700M7358m5363Q5439O1266
1507F19852o4649P4629O379m781o8398J643l0815N6423O1078O7811L5056L5093
1495G89321n8487O548Q5472Q3942M8995L7836N9873J27128J07964K3751J43889
$$ plain form
1484 1456232 1653237 1870655 1908432 2023884 1988935 1634112 1357794 1220706 1014477 832981
1474 832981 696022 634459 571166 650342 641934 574238 499437 441669 393747 364836 292464 455774
1462 455774 372862 294857 327699 378246 285653 290368 401726 329672 381948 390076 318037 245440
1450 245440 345315 366363 436016 363385 307687 220946 327040 381103 301482 196883 243547
1439 243547 186097 148265 225431 157634 248038 258175 292981 147907 52392 155573 191800
1428 191800 247881 183377 36527 158664 151733 240307 260450 180083 209839 258195 216235
1417 216235 244934 207568 104932 115544 194158 196241 113741 150506 130524 223333 119659
1406 119659 118206 7884 23460 212599 97206 50231 200747 122662 271 -6086 19185
$$ packed form
1484A456232J97005K17418L7777J15452l4949l54823k76318j37088k06229j81496
1474H32981j36959o1563o3293P9176q408o7696p4801n7768m7922k8911p2372J63310
1462D55774q2912p8005L2842N0547r2593M715J11358p2054N2276Q128p2039p2597
1450B45440R9875K1048O9653p2631n5698q6741J06094N4063p9621j04599M6664
1439B43547n7450l7832P7166o7797R0404J0137L4806j45074r5515J03181L6227
1428A91800N6081o4504j46850J22137o931Q8574K0143q0367K9756M8356m1960
1417B16235K8699l7366j02636J0612P8614K083q2500L6765j9982R2809j03674
1406A19659j453j10322J5576J89139j15393m6975J50516p8085j22391o357K5271
$$ plain form
1395 19185 120029 145581 241452 198795 157830 92000 148359 171776 294993 160621 147456
1384 147456 254232 240763 243180 229435 169112 212278 197026 89921 117638 56230 72723
1373 72723 23322 -3657 -84379 -15817 -24975 -9328 -71908 -72896 19836 75265 99015 73225
1361 73225 -69999 -71389 -82639 11754 -41774 -154246 -68948 -79277 -10382 -28205 -70154 -154036
1349 -154036 -147454 -133352 -7854 -105618 -177738 -73957 534 -9570 -37222 -41919 54634 33420
1337 33420 23420 124010 201553 116804 194418 227149 142412 190395 86096 145218 180510
1326 180510 207272 157777 149468 199940 260722 189953 136155 84881 14356 126029 161697 9007
1314 9007 161103 201801 190248 129700 157997 232665 212752 57393 127511 112707 99283 162730
$$ packed form
1395A9185J00844K5552R5871m2657m0965o5830N6359K3417J23217j34372j3165
1384A47456J06776j3469K417j3745o0323M3166j5252j07105K7717o1408J6493
1373G2723m9401k6979q0722O8562r158J5647o2580r88R2732N5429K3750k5790
1361G3225j43224j390j1250R4393n3528j12472Q5298j0329O8895j7823m1949q3882
1349a54036O582J4102J25498r7764p2120J03781P4491j0104k7652m697R6553k1214
1337C3420j0000J00590P7543q4749P7614L2731q4737M7983j04299N9122L5292
1326A80510K6762m9495q309N0472O0782p0769n3798n1274p0525J11673L5668j52690
1314I007J52096M0698j1553o0548K8297P4668j9913j55359P0118j4804j3424O3447
$$ plain form
1302 162730 82260 -29854 45109 80807 12581 72399 -34120 -104735 -151504 -37528 -30778
1291 -30778 -166153 -243605 -196077 -177777 -135527 -153971 -197133 -25665 -54022 -170192 -209161
1280 -209161 -240838 -147068 -24886 23974 -4997 -122715 -121527 -90255 -51120 -16152 -70483
1269 -70483 -147608 -19638 7287 36503 102683 2601 -72010 -79331 -27378 31245 214984
1258 214984 126813 99949 24023 85841 167233 205604 103880 70532 56195 145695 278378
1247 278378 339941 263028 182066 256490 313744 305441 340304 405745 347568 305746 351080 280714
1235 280714 233931 272969 255675 221816 104530 74368 -39793 17770 143572 171138 83852
1224 83852 88031 81144 21842 103197 -1779 29926 -111779 -21254 52976 -24916 -56292 38744
$$ packed form
1302A62730q0470j12114P4963L5698o8226N9818j06519p0615m6769J13976O750
1291c0778j35375p7452M7528J8300M2250j8444m3162J71468k8357j16170l8969
1280b09161l1677R3770J22182M8860k8971j17718J188L1272L9135L4968n4331
1269g0483p7125J27970K6925K9216O6180j00082p4611p321N1953N8623J83739
1258B14984q8171k6864p5926O1818Q1392L8371j01724l3348j4337Q9500J32683
1247B78378O1563p6913q0962P4424N7254q303L4863O5441n8177m1822M5334p0366
1235B80714m6783L9038j7294l3859j17286l0162j14161N7563J25802K7566q7286
1224H3852M179o887n9302Q1355j04976L1705j41705R0525P4230p7892l1376R5036
$$ plain form
1212 38744 -9208 52646 130644 11085 -1411 18578 -8400 32275 105895 153583 64799 43709
1200 43709 120960 20205 7642 67860 38899 59367 54574 37261 102195 90208 134828 121477
1188 121477 87799 78686 123838 77647 152993 179806 256382 161316 124821 83508 66983 204313
1176 204313 210632 74230 34027 152843 98023 193885 210428 37901 8995 -33160 8682
1165 8682 -4207 -13621 -60517 -104020 -25184 33060 -33265 -44529 31985 12992 23105 11888
1153 11888 -70963 39669 100770 55084 -53479 -85345 -87704 27193 -67400 31153 141723
1142 141723 154134 128938 95758 97921 44425 -22822 131671 102401 -39108 18472 8203
1131 8203 28202 91799 78147 70990 206726 217831 222769 149915 205089 275572 302873 336921
$$ packed form
1212C8744m7952O1854P7998j19559j2496J9989k6978M0675P3620M7688q8784k1090
1200D3709P7251j00755j2563O0218k8961K0468m793j7313O4934j1987M4620j3351
1188A21477l3678r113M5152m6191P5346K6813P6576r5066l6495m1313j6525J37330
1176B04313O319j36402m0203J18816n4820R5862J6543j72527k8906m2155M1842
1165H682j2889r414m6896m3503P8836N8244o6325j1264P6514j8993J0113j1217
1153A1888q2851J10632O1101m5686j08563l1866k359J14897r4593R8553J10570
1142A41723J2411k5196l3180K163n3496o7247J54493k9270j41509N7580j0269
1131H203J9999O3597j3652p157J35736J1105M938p2854N5174P0483K7301L4048
$$ plain form
1119 336921 327093 247985 284558 335269 340982 260340 242292 328406 403386 382764 387789 434766
1107 434766 385653 478161 378359 280510 175220 135150 257119 284224 157136 120390 248069
1096 248069 379401 459005 373460 294030 223652 230722 408696 294216 183846 246613 265819
1085 265819 330855 282750 390391 334061 315825 301387 331245 286284 288745 375490 423740 321992
1073 321992 289045 242897 316840 296184 363712 349130 315426 356087 312517 406912 300100
1062 300100 293312 428793 384703 312021 217089 238938 301511 378461 449706 468345 494387 468937
1050 468937 503862 485548 511544 487848 503335 653844 734876 608439 579157 611102 708241
1039 708241 755558 655184 645014 715795 775052 712175 706503 754287 811140 806857 845077 826879
$$ packed form
1119C36921r828p9108L6573N0711N713q0642j8048Q6114P4980k0622N025M6977
1107D34766m9113R2508r9802r7849j05290m0070J21969K7105j27088l6746J27679
1096B48069J31332P9604q5545p9430p0378P070J77974j14480j10370O2767J9206
1085B65819O5036m8105J07641n6330j8236j4438K9858m4961K461Q6745M8250j01748
1073C21992l2947m6148P3943k0656O7528j4582l3704M0661m3570R4395j06812
1062C00100o788J35481m4090p2682r4932K1849O2573P6950P1245J8639K6042k5450
1050D68937L4925j8314K5996k3696J5487J50509Q1032j26437k9282L1945R7139
1039G08241M7317j00374j0170P0781N9257o2877n672M7784N6853m283L8220j8198
$$ plain form
1027 826879 853495 977608 1015098 1005033 957477 973287 959833 1033062 1000045 1054329 1059774 1130794
1015 1130794 1113076 1130943 1136383 1147055 1231301 1330259 1298263 1401636 1424064 1482686 1605860
1004 1605860 1568753 1632266 1778049 1791521 1772384 1798267 1857966 1919877 1932697 2082840 2125213
993 2125213 2311135 2423111 2581908 2613983 2752784 3008240 3251286 3408523 3593964 3810717
983 3810717 3970678 4127560 4346086 4599067 4983182 5247930 5530298 5985213 6428654 6955763
973 6955763 7511117 8183084 8743935 9130066 9506901 10144464 11084454 12250679 13657207
964 13657207 15307730 17455727 20518774 24317036 28418155 32693091 37160143 40745587
956 40745587 41180229 36909261 29524212 22404893 17753765 14902134 12718787 11124990
$$ packed form
1027H26879K6616J24113L7490j0065m7556J5810j3454P3229l3017N4284N445P1020
1015A130794j7718J7867N440J0672Q4246R8958l1996J03373K2428N8622J23174
1004A605860l7107O3513J45783J3472j9137K5883N9699O1911J2820J50143M2373
993B125213J85922J11976J58797L2075J38801K55456K43046J57237J85441K16753
983C810717J59961J56882K18526K52981L84115K64748K82368M54915M43441N27109
973F955763N55354O71967N60851L86131L76835O37563R39990J166225J406528
964A3657207J650523K147997L063047L798262M101119M274936M467052L585444
956D0745587M34642m270968p385049p119319m651128k851631k183347j593797
$$ plain form
948 11124990 9810434 8797102 8159918 7624445 7008309 6478721 6152273 6020276 5703656
939 5703656 5348061 4693081 4211155 4112746 4020678 3730609 3405779 3238181 3167565 2988107
929 2988107 2883909 2821399 2574108 2647113 2536149 2402766 2242922 2198711 2208049 2244524 2105362
918 2105362 1997382 1868886 1830630 1854199 1810861 1732002 1666286 1528568 1523124 1521913 1408070
907 1408070 1370698 1260606 1424870 1290393 1118278 1148640 1197199 1140086 1141292 1102067 986936
896 986936 1022254 936190 875043 850651 764061 816669 801622 794942 800335 631569 676923 668039
884 668039 658852 742422 656510 537818 646328 612932 525192 518919 481476 489781 589832 562879
872 562879 445074 351577 335377 343364 475989 567561 437191 484622 534632 510883 486939
$$ packed form
948A1124990j314556j013332o37184n35473o16136n29588l26448j31997l16620
939E703656l55595o54980m81926r8409r2068k90069l24830j67598p0616j79458
929B988107j04198o2510k47291P3005j10964j33383j59844m4211R338L6475j39162
918B105362j07980j28496l8256K3569m3338p8859o5716j37718n444j211j13843
907A408070l7372j10092J64264j34477j72115L0362M8559n7113J206l9225j15131
896I86936L5318q6064o1147k4392q6590N2608j5047o680N393j68766M5354q884
884F68039r187Q3570q5912j18692J08510l3396q7740o273l7443Q305J00051k6953
872E62879j17805r3497j6200P987J32625R1572j30370M7431N0010k3749k3944
$$ plain form
861 486939 456647 374549 376977 355608 350251 320901 315047 305681 373630 311928 250326 238642 251458
848 251458 302696 206530 70143 59891 142891 288890 258367 255876 348895 294257 332221 322672
836 322672 309796 296160 289681 312293 339842 293815 182670 160798 221767 226127 215036 234470
824 234470 134761 107510 124999 128738 137522 190203 100590 129781 167250 103637 128767 114849
812 114849 76878 69474 188477 171627 80402 154552 210238 169019 145981 78275 17075 125537
800 125537 92801 66541 156519 88751 79875 98559 152028 121640 28003 94657 141068 89933
788 89933 140948 93787 90919 278809 283681 130413 90323 164556 194707 135150 143136 102504
776 102504 -10917 65481 92151 82479 51439 97630 112129 258781 45623 55077 143213 93319
$$ packed form
861D86939l0292q2098K428k1369n357k9350n854r366O7949o1702o1602j1684J2816
848B51458N1238r6166j36387j0252Q3000J45999l0523k491R3019n4638L7964r549
836C22672j2876j3636o479K2612K7549m6027j11145k1872O0969M360j1091J9434
824B34470r9709k7251J7489L739Q784N2681q9613K9191L7469o3613K5130j3918
812A14849l7971p404J19003j6850r1225P4150N5686m1219k3038o7706o1200J08462
800A25537l2736k6260Q9978o7768q876J8684N3469l0388r3637O6654M6411n1135
788H9933N1015m7161k868J87890M872j53268m0090P4233L0151n9557P986m0632
776A02504j13421P6398K6670r672l1040M6191J4499J46652k13158R454Q8136m9894
$$ plain form
764 93319 214153 67567 41173 117527 153905 209423 166442 2804 -8925 38367 27145
753 27145 -66114 -178494 -136291 -111376 -142393 -2150 -22793 -102997 -77311 -64636 -76088 25349
741 25349 -20849 -50684 -19967 40877 -15213 -137988 -116064 18560 136854 104516 43257
730 43257 37858 144024 168535 140563 96734 -34437 60665 125537 15150 73915 28398 -30841
718 -30841 86066 29856 39579 37766 80045 56367 79095 99043 40891 67566 29675 21187
706 21187 39249 6850 8998 70754 172454 161161 105613 72783 196037 174213 87086 149983
694 149983 97490 86943 216801 223886 48230 54479 98693 139134 162729 136007 90817 -78416
682 -78416 -9222 128603 39334 62678 130465 87862 -8219 -29212 103516 111578 80778 142315
$$ packed form
764I3319J20834j46586k6394P6354L6378N5518m2981j63638j1729M7292j1222
753B7145r3259j12380M2203K4915l1017J40243k0643q0204K5686J2675j1452J01437
741B5349m6198k9835L0717O0844n6090j22775K1924J34624J18294l2338o1259
730D3257n399J06166K4511k7972m3829j31171R5102O4872j10387N8765m5517n9239
718c0841J16907n6210R723j813M2279k3678K2728J9948n8152K6675l7891q488
706B1187J8062l2399K148O1756J01700j1293n5548l2830J23254k1824q7127O2897
694A49983n2493j0547J29858P085j75656O249M4214M0441K3595k6722m5190j69233
682g8416O9194J37825q9269K3344O7787m2603r6081k0993J32728Q062l0800O1537
$$ plain form
670 142315 95762 38932 96370 41013 -16269 53424 74074 102345 87877 85522 54603 -666
658 -666 -51941 -77256 47285 110524 -45226 -95888 -32231 68371 69418 -66553 -134353 -81616
646 -81616 -101781 -92608 11163 -41981 -85596 -89568 -102410 -130658 -134149 -57548 -47311 -115361
634 -115361 -116535 -129551 -132970 27765 91091 46351 58911 22004 30785 69915 1737 4650
622 4650 3187 89903 666 -14076 91748 93790 26129 -27898 -89293 -30925 -15545 -14838 2215
609 2215 -47739 -56609 -30777 47204 -27739 21878 -30954 -50154 -13151 -39546 65215 -56926
597 -56926 13490 70122 49206 -6796 -12728 5578 -59283 53501 80360 87504 47777 -15359
585 -15359 -43437 -68334 79446 12865 -50732 -33608 -44953 -54540 -134885 -106848 6726 -142664
$$ packed form
670A42315m6553n6830N7438n5357n7282O9693K0650K8271j4468k355l0919n5269
658f66n1275k5315J24541O3239j55750n0662O3657J00602J047j35971o7800N2737
646h1616k0165R173J03771n3144m3615l972j2842k8248l491P6601J0237o8050
634a15361j174j3016l419J60735O3326m4740J2560l6907Q781L9130o8178K913
622D650j463Q6716q9237j4742J05824K042o7661n4027o1395N8368J5380P07J7053
609B215m9954q870K5832P7981p4943M9617n2832j9200L7003k6395J04761j22141
597e6926P0416N6632k0916n6002n932J8306o4861J12784K6859P144l9727o3136
585a5359k8078k4897J47780o6581o3597J7124j1345r587q0345K8037J13574j49390
$$ plain form
573 -142664 -82496 -32225 -168607 -62305 87020 -14928 85771 108164 5581 54705 47715
562 47715 68663 -89882 -23338 143105 168527 40639 71534 -39517 -92519 14089 -46575
551 -46575 -116488 -236717 -210109 -132895 -151803 -83057 -170324 -194274 -151249 -175811 -237303 -183538
539 -183538 -158323 -146440 -160276 -177137 -40208 -83313 -168421 -155754 -68753 16725 1138 -11153
527 -11153 -85153 -58286 -37184 65559 91671 38299 -43774 -67357 -82336 -84176 -47737 48506
515 48506 -41616 -82298 -58632 -27755 -133322 -113977 -121128 -72914 -87995 -50420 -105900 -150862
503 -150862 -118000 -105537 -39158 -26861 -54531 -202671 -109819 -150195 -27312 -3814 -40441
492 -40441 1509 96540 63924 -28025 -31760 64447 11424 -13214 -70437 65504 29495 -21965
$$ packed form
573a42664O0168N0271j36382J06302J49325j01948J00699K2393j02583M9124o990
562D7715K0948j58545O6544J66443K5422j27888L0895j11051n3002J06608o0664
551d6575o9913j20229K6608P7214j8908O8746q7267k3950M3025k4562o1492N3765
539a83538K5215J1883j3836j6861J36929m3105q5108J2667Q7001Q5478j5587j2291
527a1153p4000K6867K1102J02743K6112n3372q2073k3583j4979j840L6439R6243
515D8506r0122m0682K3666L0877j05567J9345p151M8214j5081L7575n5480m4962
503a50862L2862J2463O6379J2297k7670j48140R2852m0376J22883K3498l6627
492d0441M1950R5031l2616r1949l735R6207n3023k4638n7223J35941l6009n1460
$$ plain form
480 -21965 -84991 -127795 -107345 -113378 -15451 -113650 -179610 -131080 -16629 64991 53606 -24113
468 -24113 -78239 -148595 -47836 -10877 -19269 -37117 -37896 27033 174751 103777 124768 100091
456 100091 17183 116055 179711 276874 217615 114143 52566 106310 91111 108725 128055 -39541
444 -39541 -34230 -48358 -105678 -77052 -109691 -83521 -105190 -143412 -150810 -205270 -188306 -161018
432 -161018 -162829 -122745 -156812 -181523 -143325 -171012 -85766 9723 -10023 -74156 -44605 -71013
420 -71013 -143926 -97035 -176313 -119762 -170970 -122534 4880 3137 -11695 -23327 -148313 -106424
408 -106424 -59478 -59661 -57892 -28577 -11152 -116324 -98851 -64744 -95304 29733 10713 -13409
396 -13409 -78618 -53768 10057 251 48028 30302 -133554 -73076 88387 -19692 3319 78457
$$ packed form
480b1965o3026m2804K0450o033R7927r8199o5960M8530J14451Q1620j1385p7719
468b4113n4126p0356J00759L6959q392j7848p79O4929J47718p0974K0991k4677
456A00091q2908R8872O3656R7163n9259j03472o1577N3744j5199J7614J9330j67596
444c9541N311j4128n7320K8626l2639K6170k1669l8222p398n4460J6964K7288
432a61018j811M0084l4067k4711L8198k7687Q5246R5489j9746o4133K9551k6408
420g1013p2913M6891p9278N6551n1208M8436J27414j743j4832j1632j24986M1889
408a06424M6946j83J769K9315J7425j05172J7473L4107l0560J25037j9020k4122
396a3409o5209K4850O3825r806M7777j7726j63856O0478J61463j08079K3011P5138
$$ plain form
384 78457 70666 53503 68033 75044 -44474 -28384 -43030 -63200 -17104 -162349 -124802 -87272
372 -87272 7693 35530 265 -119940 -164150 -21198 -14122 -172049 -105305 -75878 -147242 -137731
360 -137731 -126999 -158532 -149175 -118291 -75743 -30812 -65221 -126364 -66276 42312 46840 6486
348 6486 29892 -35524 12806 -24770 -179260 -198734 -208041 -178188 -94126 -162260 -155336 7585
336 7585 -26250 -28660 2669 -137289 -121326 -120511 18806 -36496 -103973 -16716 17791 14557 101569
323 101569 95993 30638 62768 106086 130925 -10336 54355 40165 -72514 -66712 -5391 -2407
311 -2407 33029 -70599 -124059 -137262 -62090 6453 31144 -193893 -250135 -188622 -208678 -152151
299 -152151 -224427 -164317 -30458 -159123 -207432 -162579 -192679 -241798 -97641 -83442 -27420
$$ packed form
384G8457p791j7163J4530P011j19518J6090j4646k0170M6096j45245L7547L7530
372h7272R4965K7837l5265j20205m4210J42952P076j57927O6744K9427p1364R511
360a37731J0732l1533R357L0884M2548M4931l4409o1143O0088J08588M528m0354
348F486K3406o5416M8330l7576j54490j9474r307K9853Q4062o8134O924J62921
336G585l3835k410L1329j39958J5963Q15J39317n5302o7477Q7257L4507l234Q7012
323A01569n576o5355L2130M3318K4839j41261O4691j4190j12679N802O1321K984
311b407L5436j03628n3460j3203P5172O8543K4691k25037n6242O1513k0056N6527
299a52151p2276O0110J33859j28665m8309M4853l0100m9119J44157J4199N6022
$$ plain form
288 -27420 20580 -112334 -61422 -120137 -60205 -12797 -162964 -144034 -130110 -151351 -75566 -131189
276 -131189 -158173 -126700 -168796 -165005 -103164 -139550 -75360 -62209 -12005 -52236 -186497 -164538
264 -164538 -57192 -213606 -165596 -123034 -8252 68038 49052 -44913 -62341 -72164 -36535
253 -36535 -19174 -143957 -115213 -102384 -72433 -57176 -35123 -70515 -144658 -72076 39130 40978
241 40978 67460 57425 -43126 -33940 -39041 -88854 -96718 -67884 -48322 -119969 -95199 -51617
229 -51617 -66036 -99216 -14092 -93272 -151354 -125941 -125224 -188080 -108808 -195060 -245352 -178128
217 -178128 -75229 -157473 -37776 72292 -24078 -89900 -102283 -94733 -80932 -13121 4631
206 4631 -34596 -13877 -4422 -61746 -114631 -133981 -203693 -118994 -138412 -104222 -127152 -203882
$$ packed form
288b7420M8000j32914N0912n8715N9932M7408j50167J8930J3924k1241P5785n5623
276a31189k6984L1473m2096L791O1841l6386O4190J3151N0204m0231j34261K1959
264a64538J07346j56414M8010M2562J14782P6290j8986r3965j7428r823L5629
253c6535J7361j24783K8744J2829K9951J5257K2053l5392p4143P2582J11206J848
241D0978K6482j0035j00551R186n101m9813p864K8834J9562p1647K4770M3582
229e1617j4419l3180Q5124p9180n8082K5413P17o2856P9272q6252n0292O7224
217a78128J02899q2244J19697J10068r6370o5822j2383P550J3801O7811J7752
206D631l9227K0719R455n7324n2885j9350o9712Q4699j9418L4190k2930p6730
$$ plain form
194 -203882 -141146 -182579 -163199 -187181 -201548 -225968 -174900 -61769 28066 -78588 -44058
183 -44058 -29889 -71421 -56924 -38703 -7409 -15140 -59458 -58459 -78568 -83789 -103674 -109735 -69994
170 -69994 -36788 -671 -91057 -132228 -145274 -118378 -15361 -54819 -224996 -249790 -207745 -221407
158 -221407 -221084 -193461 -124828 -166812 -208983 -224750 -172649 -180445 -42680 -2631 -129293 -119203
146 -119203 -81314 -127990 -173084 -184023 -152388 -230215 -196363 -178498 -92643 -110287 -193528 -151835
134 -151835 -131238 -112010 -173620 -190331 -169906 -195758 -222920 -164297 -145253 -212016 -277558 -230742
122 -230742 -196710 -246079 -282715 -234289 -177396 -186501 -192780 -68090 -140388 -179647 -221666 -204625
110 -204625 -106253 -99229 -243710 -169784 -117204 -18821 27351 -88313 -158339 -196876 -116997 -108181
$$ packed form
194b03882O2736m1433J9380k3982j4367k4420N1068J13131Q9835j06654L4530
183d4058J4169m1532J4497J8221L1294p731m4318R99k0109n221j9885o061L9741
170f9994L3206L6117r0386m1171j3046K6896J03017l9458j70177k4794M2045j3662
158b21407L23K7623O8633m1984m2171j5767N2101p796J37765M0049j26662J0090
146a19203L7889m6676m5094j0939L1635p7827L3852J7865Q5855j7644q3241M1693
134a51835K0597J9228o1610j6711K0425k5852k7162N8623J9044o6763o5542M6816
122b30742L4032m9369l6636M8426N6893r105o279J24690p2298l9259m2019J7041
110b04625R8372P024j44481P3926N2580R8383M6172j15664p0026l8537P9879Q816
$$ plain form
98 -108181 -116120 -94461 -56912 -136949 -119299 -100872 -114313 -150580 -104183 -107292 -146309 -209763
86 -209763 -125168 -189671 -144198 -47767 -202883 -203003 -103830 -194304 -188895 -133062 -241923 -185427
74 -185427 -205543 -196456 -90335 -143343 -122771 -155294 -196084 -47185 -125629 -152680 -111572 -98794
62 -98794 -56813 -87079 -186439 -159941 -109574 -216235 -152768 -141015 -164093 -95807 -138394 -227779
50 -227779 -206067 -118703 -32984 -114118 -122122 -76971 -169421 -104018 -146225 -138900 -99067 -165526
38 -165526 -22685 -35666 -177154 -172211 -157590 -144834 -178148 -160913 -170986 -179114 -169398 -180593
26 -180593 -239846 -291519 -276668 -198765 -71984 -87383 -146729 -206071 -229887 -265363 -181813 -194251
14 -194251 -278468 -240752 -261538 -223629 -143826 -201274 -262325 -199288 -145993 -106735 -175830 -185810
$$ packed form
98a08181p939K1659L7549q0037J7650J8427j3441l6267M6397l109l9017o3454
86b09763Q4595o4503M5473R6431j55116j20R9173r0474N409N5833j08861N6496
74a85427k0116R087J06121n3008K0572l2523m0790J48899p8444k7051M1108J2778
62i8794M1981l0266r9360K6498N0367j06661O3467J1753k3078O8286m2587q9385
50b27779K1712Q7364Q5719q1134q004M5151r2450O5403m2207P325L9833o6459
38a65526J42841j2981j41488M943J4621J2756l3314J7235j0073q128R716j1195
26a80593n9253n1673J4851P7903J26781j5399n9346n9342k3816l5476Q3550j2438
14a94251q4217L7716k0786L7909P9803n7448o1051O3037N3295L9258o9095r980
$$ plain form
2 -185810 -109781 -198497
0 -198497
$$ packed form
2a85810P6029q8716
0a98497
$$ Imaginary data points
##PAGE= N=2
##DATA TABLE= (X++(I..I)), XYDATA
$$ plain form
16383 -1729578 -1769246 -1776295 -1721685 -1680962 -1685231 -1681971 -1592975 -1514345 -1539582 -1554604 -1523816 -1583931
16371 -1583931 -1494474 -1462207 -1510153 -1475595 -1452813 -1393202 -1352661 -1393626 -1419946 -1410854 -1370864
16360 -1370864 -1387127 -1348130 -1328299 -1309808 -1294907 -1259331 -1275133 -1305039 -1273095 -1195000 -1172774
16349 -1172774 -1170498 -1160624 -1122987 -1081407 -1164625 -1069694 -1090452 -1128579 -1075473 -1050649 -1037927 -972445
16337 -972445 -873436 -868317 -845093 -889641 -942607 -960689 -893078 -845452 -869389 -862932 -884203 -859834
16325 -859834 -759165 -695874 -760262 -799292 -752619 -746021 -807600 -845196 -718019 -717596 -656182 -666349
16313 -666349 -760296 -702289 -684909 -681688 -637754 -665404 -643293 -653265 -617535 -576867 -572530 -579758
16301 -579758 -551474 -498298 -366990 -313397 -390341 -443140 -498494 -467507 -368048 -390814 -421131
$$ packed form
16383a729578l9668p049N4610M0723m269L260Q8996P8630k5237j5022L0788o0115
16371a583931Q9457L2267m7946L4558K2782N9611M0541m0965k6320R092L9990
16360a370864j6263L8997J9831J8491J4901L5576j5802k9906L1944P8095K2226
16349a172774K276R874L7637M1580q3218R4931k0758l8127N3106K4824J2722O5482
16337i72445R9009N119K3224m4548n2966j8082O7611M7626k3937O457k1271K4369
16325h59834J00669O3291o4388l9030M6673O598o1579l7596J27177M23O1414j0167
16313f66349r3947N8007J7380L221M3934k7650K2111r972L5730M0668M337p228
16301e79758K8284N3176J31308N3593p6944n2799n5354L0987R9459k2766l0317
$$ plain form
16290 -421131 -412601 -400854 -300617 -264543 -377221 -303929 -287664 -260461 -250831 -195252 -156460
16279 -156460 -170462 -234105 -162660 -120534 -66804 17896 18343 -15659 -38385 1670 -78290 -6126
16267 -6126 -9385 36045 28107 129132 134902 58285 35697 47426 115653 118118 172831 155838
16255 155838 124625 177541 132220 77141 79425 124887 186572 229671 208828 196014 147617 157576
16243 157576 109590 154606 250030 312183 281029 297588 216003 233282 90589 120592 209849
16232 209849 179143 122823 158226 177534 178100 185981 189931 91754 91899 224977 258260 144232
16220 144232 250603 338124 258701 247442 276574 376360 456177 503181 501840 415047 374170
16209 374170 438071 361278 474930 466048 422133 430186 517669 461275 407561 451411 492683 475486
$$ packed form
16290d21131Q530J1747J00237L6074j12678P3292J6265K7203R630N5579L8792
16279a56460j4002o3643P1445M2126N3730Q4700M47l4002k2726M0055p9960P2164
16267f126l259M5430p938J01025N770p6617k2588J1729O8227K465N4713j6993
16255A55838l1213N2916m5321n5079K284M5462O1685M3099k0843j2814m8397R959
16243A57576m7986M5016R5424O2153l1154J6559q1585J7279j42693L0003Q9257
16232B09849l0706n6320L5403J9308N66P881L950r8177J45J33078L3283j14028
16220A44232J06371Q7521p9423j1259K9132R9786P9817M7004j341q6793m0877
16209C74170O3901p6793J13652q882m3915Q053Q7483n6394n3714M3850M1272j7197
$$ plain form
16197 475486 515303 525011 564933 533908 632403 561274 563369 566102 639124 757766 628819 551470
16185 551470 523781 560186 674615 726745 657233 609520 697320 688867 687537 736607 638309 551875
16173 551875 608295 634863 670378 674344 650728 607018 651865 705641 622012 509655 531007
16162 531007 590081 609664 647531 648282 604889 585082 547434 578588 524680 518094 630097 656810
16150 656810 715414 672071 705846 678533 699942 695577 783606 834122 738138 702867 684059 641895
16138 641895 716176 711768 694227 674128 664182 718150 736139 731914 731820 640241 718651 814695 874138
16125 874138 860216 781290 807563 795081 829258 763146 700495 717821 755000 778147 810547
16114 810547 842728 859279 903385 978673 860127 851434 910280 920682 952790 985937 948301
$$ packed form
16197D75486L9817R708L9922l1025R8495p1129K095K733P3022J18642j28947p7349
16185E51470k7689L6405J14429N2130o9512m7713Q7800q453j330M9070r8298q6434
16173E51875N6420K6568L5515L966k3616m3710M4847N3776q3629j12357K1352
16162E31007N9074J9583L7867P51m3393j9807l7648L1154n3908o586J12003K6713
16150F56810N8604m3343L3775k7313K1409m365Q8029N0516r5984l5271j8808m2164
16138F41895P4281m408j7541k0099r946N3968J7989m225r4r1579P8410R6044N9443
16125H74138j3922p8926K6273j2482L4177o6112o2651J7326L7179K3147L2400
16114H10547L2181J6551M4106P5288j18546q693N8846J0402L2108L3147l7636
$$ plain form
16103 948301 828139 820382 877979 950567 906124 912786 922240 960066 971564 902303 772918 707327
16091 707327 758340 880139 910343 797173 747303 805623 855037 866576 817061 842026 896432
16080 896432 878651 839809 872397 874622 825107 831639 900105 894817 845997 815270 862079 950716
16068 950716 864074 879893 825318 753741 726713 710527 783001 891246 873958 742299 708012
16057 708012 810837 853839 867588 904539 799146 721062 699190 747806 853491 824866 803653
16046 803653 960089 1002260 950749 873351 885436 931284 872520 846518 850561 859028 872199 908575
16034 908575 844161 836238 799603 860768 875473 885420 838471 779345 800443 758332 804110 897088
16022 897088 903974 832057 796447 811421 864675 880745 873852 779349 764524 818938 884158 997183
$$ packed form
16103I48301j20162p757N7597P2588m4443O662R454L7826J1498o9261j29385o5591
16091G07327N1013J21799L0204j13170m9870N8320M9414J1539m9515K4965N4406
16080H96432j7781l8842L2588K225m9515O532O8466n288m8820l0727M6809Q8637
16068I50716q6642J5819n4575p1577k7028j6186P2474J08245j7288j31659l4287
16057G08012J02825M3002J3749L6951j05393p8084k1872M8616J05685k8625k1213
16046H03653J56436M2171n1511p7398J2085M5848n8764k6002M043Q467J3171L6376
16034I08575o4414p923l6635O1165J4705R947m6949n9126K1098m2111M5778R2978
16022H97088O886p1917l5610J4974N3254J6070o893r4503j4825N4414O5220J13025
$$ plain form
16010 997183 1006096 903098 788083 801518 869189 839250 747160 758928 838212 909057 832797
15999 832797 712443 767588 851458 951356 1009111 905411 854658 903228 869558 854817 768390
15988 768390 787548 831983 946949 1007339 962555 843361 779385 884280 921872 809936 764456
15977 764456 715243 826775 950889 926113 829543 786487 913459 900706 891657 896878 940947
15966 940947 868197 932633 919225 851092 766606 873727 1041290 916130 891874 849591 774714
15955 774714 866701 925713 913900 837651 715708 728284 889985 792092 706765 679033 788030
15944 788030 924080 958910 928045 895886 836298 932520 865306 811401 935463 850707 959630
15933 959630 924106 772620 815248 848554 762874 834205 771051 779756 837521 799137 824090
$$ packed form
16010I97183Q913j02998j15015J3435O7671k9939r2090J1768P9284P0845p6260
15999H32797j20354N5145Q3870R9898N7755j03700n0753M8570l3670j4741q6427
15988G68390J9158M4435J14966O0390m4784j19194o3976J04895L7592j11936m5480
15977G64456m9213J11532J24114k4776r6570m3056J26972j2753r049N221M4069
15966I40947p2750O4436j3408o8133q4486J07121J67563j25160k4256m2283p4877
15955G74714R1987N9012j1813p6249j21943J2576J61701r7893q5327k7732J08997
15944G88030J36050L4830l0865l2159n9588R6222o7214n3905J24062q4756J08923
15933I59630l5524j51486M2628L3306q5680P1331o3154Q705N7765l8384K4953
$$ plain form
15922 824090 794264 696651 747357 769687 821054 821543 838392 840634 823997 879692 789891 663973
15910 663973 635726 727409 816062 832634 864168 899284 999646 877855 844023 873352 731341
15899 731341 876245 995912 944280 879137 803929 890022 915436 808780 820728 794001 839245
15888 839245 960260 937055 969726 955538 964476 1035331 1005110 913346 946545 1019835 1040625
15877 1040625 1044641 1009937 1027287 946727 859059 955544 820910 831765 959131 973878 928401
15866 928401 891593 826309 706060 673862 729823 851371 798085 870483 833780 756504 792479
15855 792479 770073 626643 624904 675603 810915 826956 747828 813140 737236 713995 781988
15844 781988 751909 816865 806288 714469 681502 695654 760877 828619 857978 857945 836184 779996
$$ packed form
15922H24090k9826r7613N0706K2330N1367M89J6849K242j6637N5695q9801j25918
15910F63973k8247R1683Q8653J6572L1534L5116J00362j21791l3832K9329j42011
15899G31341J44904J19667n1632o5143p5208Q6093K5414j06656J1948k6727M5244
15888H39245J21015k3205L2671j4188Q938P0855l0221r1764L3199P3290K0790
15877A040625M016l4704J7350q0560q7668R6485j34634J0855J27366J4747m5477
15866I28401l6808o5284j20249l2198N5961J21548n3286P2398l6703p7276L5975
15855G92479k2406j43430j739N0699J35312J6041p9128O5312p5904k3241O7993
15844G81988l0079O4956j0577r1819l2967J4152O5223O7742K9359l3k1761n6188
$$ plain form
15832 779996 916707 885960 837925 956392 982963 970227 987841 895718 869217 964230 962839
15821 962839 822135 807335 904268 915910 929312 883747 943651 927919 1074844 1080553 902565
15810 902565 838671 889589 893745 917449 1012568 946745 922999 986058 1000583 899282 843708
15799 843708 864717 854824 906616 903323 863683 859079 943312 998274 925292 807806 795703 854928
15787 854928 804424 888315 814276 782475 807413 776690 816619 830920 942961 859617 811904
15776 811904 854128 814221 759533 793603 873937 848616 835666 902106 853370 907789 840864
15765 840864 706310 743218 867159 896015 805264 769864 787983 803700 985098 968633 847693
15754 847693 849741 940944 961797 864258 902378 834846 855079 815777 902472 861360 909107 933304
$$ packed form
15832G79996J36711l0747m8035J18467K6571j2736J7614r2123k6501R5013j391
15821I62839j40704j4800R6933J1642J3402m5565N9904j5732J46925N709j77988
15810I02565o3894N0918M156K3704R5119o5823k3746O3059J4525j01301n5574
15799H43708K1009r893N1792l293l9640m604Q4233N4962p2982j17486j2103N9225
15787H54928n0504Q3891p4039l1801K4938l0723L9929J4301J12041q3344m7713
15776H11904M2224l9907n4688L4070Q0334k5321j2950O6440m8736N4419o6925
15765H40864j34554L6908J23941K8856r0751l5400J8119J5717J81398j6465j20940
15754H47693K048R1203K0853r7539L8120o7532K0233l9302Q6695m1112M7747K4197
$$ plain form
15742 933304 967277 961542 927824 936722 842750 908900 1032858 838842 684618 757732 848421
15731 848421 887373 863806 884788 807377 777272 985592 867530 771776 929312 817002 830526
15720 830526 846949 800520 810912 775875 846590 862594 826051 919177 883882 852752 906631
15709 906631 922184 865175 888585 860994 840792 902398 785237 838468 906816 845135 860276
15698 860276 750437 771076 918591 879678 884471 889114 857593 836277 834590 871026 880727 773631
15686 773631 854246 893395 877525 1000174 1024768 951448 931958 850384 931954 1022997 950183
15675 950183 1000587 932586 807743 886308 970855 897138 849135 759678 863808 916916 863226
15664 863226 958810 909741 889908 921182 948072 950307 861111 862443 980660 1010806 996140 916725
$$ packed form
15742I33304L3973n735l3718Q898r3972O6150J23958j94016j54224P3114R0689
15731H48421L8952k3567K0982p7411l0105K08320j18062r5754J57536j12310J3524
15720H30526J6423m6429J0392l5037P0715J6004l6543R3126l5295l1130N3879
15709I06631J5553n7009K3410k7591k0202O1606j17161N3231O8348o1681J5141
15698H60276j09839K0639J47515l8913M793M643l1521k1316j687L6436R701j07096
15686G73631Q0615L9149j5870J22649K4594p3320j9490q1574Q1570R1043p2814
15675I50183N0404o8001j24843P8565Q4547p3717m8003q9457J04130N3108n3690
15664H63226R5584m9069j9833L1274K6890K235q9196J332J18217L0146j4666p9415
$$ plain form
15652 916725 878435 868969 807967 872609 889703 861596 938671 857808 769206 965322 943829
15641 943829 908900 955661 939025 988637 1033869 874976 969168 991968 962603 1062981 1044198
15630 1044198 999721 916328 1033082 1066764 792226 759247 903624 903615 949691 945819 861178 947367
15618 947367 976375 841625 785771 734919 834842 835649 866169 891715 864065 805614 880314 892690
15606 892690 941764 967443 893297 979965 997225 1029831 1046603 923125 808240 914635 901588
15595 901588 886055 781941 774543 767881 836777 921377 849265 718406 838358 829698 827277 785235
15583 785235 673434 738996 963252 945369 890586 847877 712930 829987 1011139 1023383
15573 1023383 1010328 920848 874862 957933 948900 927557 902539 977021 1000569 962934 948355
$$ packed form
15652I16725l8290r466o1002O4642J7094k8107P7075q0863q8602J96116k1493
15641I43829l4929M6761j6636M9612M5232j58893R4192K2800k9365J00378j8783
15630A044198m4477q3393J16754L3682k74538l2979J44377rM6076l872q4641Q6189
15618I47367K9008j34750n5854n0852R9923Q07L0520K5546k7650n8451P4700J2376
15606H92690M9074K5679p4146Q6668J7260L2606J6772j23478j14885J06395j3047
15595I01588j5533j04114p398o662O8896Q4600p2112j30859J19952q660k421m2042
15583G85235j11801O5562K24256j7883n4783m2709j34947J17057J81152J2244
15573A023383j3055q9480m5986Q3071r033k1343k5018P4482K3548l7635j4579
$$ plain form
15562 948355 999802 955503 1036130 1042941 972839 869114 829222 937847 905470 821839 817161
15551 817161 856168 851187 825562 838873 905828 915095 911717 908116 797021 801937 1012908 984730
15539 984730 924505 941482 894032 1029107 1016620 984582 841613 776683 823131 885856 969730
15528 969730 992961 919653 960057 1082850 1035596 866574 807004 778922 874871 945186 910602
15517 910602 820393 804189 873305 1014983 1014719 919617 801638 828005 944253 967965 895683
15506 895683 827466 916274 1152608 1094708 1010590 1066220 1096412 1043582 1047892 909227 762478
15495 762478 786254 803434 853687 940845 963502 802305 808349 912318 833673 864308 885437
15484 885437 935889 939773 954980 906609 855270 867089 896052 815011 764803 826145 994074
$$ packed form
15562I48355N1447m4299Q0627O811p0102j03725l9892J08625l2377q3631m678
15551H17161L9007m981k5625J3311O6955R267l378l601j11095M916K10971k8178
15539I84730o0225J6977m7450J35075j2487l2038j42969o4930M6448O2725Q3874
15528I69730K3231p3308M0404J22793m7254j69022n9570k8082R5949P0315l4584
15517I10602r0209j6204O9116J41678k64r5102j17979K6367J16248K3712p2282
15506H95683o8217Q8808K36334n7900q4118N5630L0192n2830M310j38665j46749
15495G62478K3776J7180N0253Q7158K2657j61197O044J03969p8645L0635K1129
15484H85437N0452L884J5207m8371n1339J1819K8963q1041n0208O1342J67929
$$ plain form
15473 994074 959080 792499 892793 894614 873019 763137 948784 957772 946306 977965 983101
15462 983101 804064 854402 874649 942832 925450 782884 784150 824398 863042 810319 835747
15451 835747 889003 799786 819696 861522 906113 839110 813852 924251 943701 872175 858659
15440 858659 906712 991026 1021385 1127904 1098592 955420 874220 900192 875989 890180 984119
15429 984119 976582 912250 950185 938637 857279 987997 1029140 864188 853543 898816 911733
15418 911733 940523 968495 1011119 864412 780664 760540 777326 846133 892400 1043393 937806
15407 937806 776919 835222 895445 896748 953179 922465 801763 867490 957214 976175 986113
15396 986113 968860 922677 1053945 1081702 1079753 969701 900790 976277 1006735 978140 877353
$$ packed form
15473I94074l4994j66581J00294J821k1595j09882J85647Q988j1466L1659N136
15462I83101j79037N0338K0247O8183j7382j42566J266M0248L8644n2723K5428
15451H35747N3256q9217J9910M1826M4591o7003k5258J10399J9450p1526j3516
15440H58659M8053Q4314L0359J06519k9312j43172q1200K5972k4203J4191R3939
15429I84119p537o4332L7935j1548q1358J30718M1143j64952j0645M5273J2917
15418I11733K8790K7972M2624j46707q3748k0124J6786O8807M6267J50993j05587
15407I37806j60887N8303O0223J303N6431l0714j20702O5727Q9724J8961R938
15396I86113j7253m6183J31268K7757j949j10052o8911P5487L0458k8595j00787
$$ plain form
15385 877353 859981 974711 973681 919028 922592 868275 930319 1092214 1047856 920480 879891
15374 879891 812817 793935 851835 899473 948982 888148 976956 954108 934364 887294 887365 953454
15362 953454 972031 923359 954166 958516 1054929 1080350 917045 888098 976323 937200 878704
15351 878704 854587 878749 848933 891472 837651 752074 745577 851094 879581 864101 877292
15340 877292 896103 890872 906284 878231 836943 924986 899157 818857 785887 824925 764150 840090
15328 840090 877330 880517 791845 794910 773900 818906 930663 983974 969886 903461 901505 925015
15316 925015 925630 921255 934614 927692 908829 971742 998926 961552 956256 979742 968954 863869
15304 863869 886841 888882 996237 1061217 1042373 1014638 922090 944783 896483 1028742 1004932
$$ packed form
15385H77353j7372J14730j030n4653L564n4317O2044J61895m4358j27376m0589
15374H79891o7074j8882N7900M7638M9509o0834Q8808k2848j9744m7070P1O6089
15362I53454J8577m8672L0807M350R6413K5421j63305k8947Q8225l9123n8496
15351H78704k4117K4162k9816M2539n3821q5577o497J05517K8487j5480J3191
15340H77292J8811n231J5412k8053m1288Q8043k5829q0300l2970L9038o0775P5940
15328H40090L7240L187q8672L065k1010M5006J11757N3311j4088o6425j956K3510
15316I25015O15m375J3359o922j8863O2913K7184l7374n296K3486j0788j05085
15304H63869K2972K041J07355O4980j8844k7735r2548K2693m8300J32259k3810
$$ plain form
15293 1004932 884301 949823 936865 910187 1025100 998134 944259 966506 894871 790017 866632
15282 866632 820949 868714 922978 936968 829592 742563 716274 860896 806877 768868 692918
15271 692918 693909 786482 810247 968402 798460 654772 680103 825429 879389 819010 693125
15260 693125 688656 718957 763451 842652 934582 973700 987586 878281 942218 936235 920706 945811
15248 945811 850317 726272 808771 818936 852925 921271 905976 925770 882710 997253 1014053
15237 1014053 876252 938039 1039600 975575 1038842 987773 825850 861836 1006507 1015974 981622
15226 981622 981762 989119 1007195 1040539 1096521 1029095 994593 1033373 948392 911081 1035503 876641
15214 876641 830022 843870 943365 907471 797686 942601 961323 965699 923806 870605 823306
$$ packed form
15293A004932j20631O5522j2958k6678J14913k6966n3875K2247p1635j04854P6615
15282H66632m5683M7765N4264J3990j07376q7029k6289J44622n4019l8009p5950
15271F92918R91R2573K3765J58155j69942j43688K5331J45326N3960o0379j25885
15260F93125m469L0301M4494P9201R1930L9118J3886j09305O3937n983j5529K5105
15248I45811r5494j24045Q2499J0165L3989O8346j5295J9794m3060J14543J6800
15237A014053j37801O1787J01561o4025O3267n1069j61923L5986J44671R467l4352
15226I81622J40P357J8076L3344N5982o7426l4502L8780q4981l7311J24422j58862
15214H76641m6619J3848R9495l5894j09785J44915J8722M376m1893n3201m7299
$$ plain form
15203 823306 801590 858629 876496 787031 798998 838486 842265 917371 915348 770218 942605
15192 942605 1049205 975964 929047 984570 921508 830684 1034564 1028579 935682 886474 906538
15181 906538 849323 902899 1018036 985016 896294 924755 850271 832786 943845 933892 889606
15170 889606 915801 989491 952850 924722 1027673 988802 959073 1002101 951506 863101 839452
15159 839452 973088 1022924 970886 1024748 1026649 947747 1070933 1097432 1068315 977593 937279
15148 937279 834742 826905 899133 997663 877341 893046 824311 663663 933970 1088144 940308
15137 940308 898392 887296 709266 829741 1002832 947188 894074 841554 818384 860446 855330
15126 855330 920986 863574 896384 887004 756466 794962 816885 960732 1009638 887956 953151
$$ packed form
15203H23306k1716N7039J7867q9465J1967L9488L779P5106k023j45130J72387
15192I42605J06600p3241m6917N5523o3062r0824K03880n985r2897m9208K0064
15181I06538n7215N3576J15137l3020q8722K8461p4484j7485J11059r953m4286
15170H89606K6195P3690l6641k8128J02951l8871k9729M3028n0595q8405k3649
15159H39452J33636M9836n2038N3862J901p8902J23186K6499k9117r0722m0314
15148I37279j02537p837P2228R8530j20322J5705o8735j60648K70307J54174j47836
15137I40308m1916j1096j78030J20475J73091n5644n3114n2520k3170M2062n116
15126H55330O5656n7412L2810r380j30538L8496K1923J43847M8906j21682O5195
$$ plain form
15115 953151 990852 959796 1050903 1037429 928559 816044 754513 815327 853610 785975 862144
15104 862144 726533 813358 823291 772679 943531 985076 975813 981992 960821 923264 856272 938660
15092 938660 1151009 955268 802482 851466 764245 796421 936736 821897 810279 741503
15082 741503 794080 763836 777719 841378 837678 849179 979262 952579 769911 809638 894351
15071 894351 893042 765494 766906 817202 738094 841121 929350 883598 932442 918481 873650
15060 873650 980107 915042 865660 885223 956147 962945 901736 970035 957109 866386 889537
15049 889537 904150 860518 865888 920487 880984 968843 925118 970761 1011665 925791 944516 858935
15037 858935 863819 984757 1088060 1037142 985090 955333 1032244 1067422 1066746 1001837 833593
$$ packed form
15115I53151L7701l1056R1107j3474j08870j12515o1531O0814L8283o7635P6169
15104H62144j35611Q6825R933n0612J70852M1545r263O179k1171l7557o6992Q2388
15092I38660K12349j95741j52786M8984q7221L2176J40315j14839j1618o8776
15082G41503N2577l0244J3883O3659l700J1501J30083k6683j82668L9727Q4713
15071H94351j309j27548J412N0296p9108J03027Q8229m5752M8844j3961m4831
15060H73650J06457o5065m9382J9563P0924O798o1209O8299j2926r0723K3151
15049H89537J4613m3632N370N4599l9503Q7859m3725M5643M0904q5874J8725q5581
15037H58935M884J20938J03303n0918n2052k9757P6911L5178o76o4909j68244
$$ plain form
15026 833593 787249 953658 980086 1096615 1053984 931789 912548 948810 904212 835327 871485
15015 871485 928215 990921 936301 897674 900856 867960 950010 992738 919064 800476 793964 833402
15003 833402 810835 846297 818436 859890 825546 916963 877022 843784 851910 807052 802714 846963
14991 846963 828960 763935 937955 887329 835723 909523 922537 884119 964591 957780 976853
14980 976853 882965 918249 943554 896857 881199 920542 967046 1000533 975184 991051 1036265
14969 1036265 1057114 1006170 971566 939873 915742 976584 943754 985759 857814 859856 839181
14958 839181 901715 884128 897557 878578 872086 923829 918057 983681 903166 920417 932367 879076
14946 879076 992315 909520 809606 825388 792554 887838 859536 875743 905651 879694 909480
$$ packed form
15026H33593m6344J66409K6428J16529m2631j22195j9241L6262m4598o8885L6158
15015H71485N6730O2706n4620l8627L182l2896Q2050M2728p3674j18588o512L9438
15003H33402k2567L5462k7861M1454l4344R1417l9941l3238Q126m4858m338M4249
14991H46963j8003o5025J74020n0626n1606P3800J3014l8418Q0472o811J9073
14980I76853r3888L5284K5305m6697j5658L9343M6504L3487k5349J5867M5214
14969A036265K0849n0944l4604l1693k4131O0842l2830M2005j27945K042k0675
14958H39181O2534j7587J3429j8979o492N1743n772O5624q0515J7251J1950n3291
14946H79076J13239q2795r9914J5782l2834R5284k8302J6207K9908k5957K9786
$$ plain form
14935 909480 855850 830000 888035 881179 886210 866518 837985 855807 838084 855874 885419 835487
14923 835487 711512 878310 814557 834250 1056723 992219 863907 841283 904244 895771 942371
14912 942371 991308 935153 850918 968320 1041289 996902 916979 837026 836191 950690 999825
$$ packed form
14935I09480n3630k5850N8035o856N031j9692k8533J7822j7723J7790K9545m9932
14923H35487j23975J66798o3753J9693K22473o4504j28312k2624O2961q473M6600
14912I42371M8937n6155q4235J17402P2969m4387p9923p9953q35J14499M9135
$$ [...]
##END NTUPLES=NMR SPECTRUM
##END=
