##TITLE=1H_CG-1141-1
 CDCl3,8 sc, 
 5.04.2021
##JCAMPDX= 6.0         $$ Bruker NMR JCAMP-DX V2.0
##DATA TYPE= NMR SPECTRUM
##DATA CLASS= NTUPLES
##ORIGIN= UXNMR, Bruker Analytische Messtechnik GmbH
##OWNER= root
$$ XWIN-NMR		Version 3.5
$$ Mon Apr  5 11:19:09 2021 Russian Standard Time (UT+4h)  she@DPX200
##.OBSERVE FREQUENCY= 200.131506
##.OBSERVE NUCLEUS= ^1H
##.ACQUISITION MODE= SIMULTANEOUS
##.ACQUISITION SCHEME= undefined
##.AVERAGES= 8
##.DIGITISER RES= 18
##SPECTROMETER/DATA SYSTEM= spect
##.PULSE SEQUENCE= zg30
##.SOLVENT NAME= CDCl3
##.SHIFT REFERENCE= (INTERNAL, CDCl3, 0, 15.9865)
##AUDIT TRAIL= $$ (NUMBER, WHEN, WHO, WHERE, WHAT)
$$ ##TITLE= Audit trail, XWIN-NMR		Version 3.5
$$ ##JCAMPDX= 5.01
$$ ##ORIGIN= Bruker BioSpin GmbH
$$ ##OWNER= she
$$ F:/spectra/data/she/nmr/H-F/1/pdata/1/auditp.txt
$$ ##AUDIT TRAIL=  $$ (NUMBER, WHEN, WHO, WHERE, WHAT)
(   1,<2021-04-05 11:18:03.34 +0400>,<she>,<DPX200>,
      <created by zg, POWCHK disabled, PULCHK disabled
       configuration hash MD5:
       00 E9 B6 7A A2 85 ED C7 34 08 36 98 17 FE 4E 26
       data hash MD5: 16K
       2E 00 BC 0A 8D F5 B4 1E 0F AF 20 CC 67 D7 F7 FB>)
(   2,<2021-04-05 11:18:07.18 +0400>,<she>,<DPX200>,
      <Start of raw data processing
       efp BC_mod = 2 LB = 0.24 FT_mod = 6 PKNL = 1 PHC0 = -11122.57 PHC1 = 12.20092 SI = 16K 
       data hash MD5: 16K
       D0 B4 24 06 0F 09 08 C2 F0 15 F1 12 27 B8 18 8C>)
(   3,<2021-04-05 11:18:25.07 +0400>,<she>,<DPX200>,
      <pk PHC0 = 1.04856 PHC1 = 1.399999 
       data hash MD5: 16K
       5C 8A B7 A3 0B 98 23 3B 3F 32 57 F4 05 9C 82 CA>)
(   4,<2021-04-05 11:18:28.15 +0400>,<she>,<DPX200>,
      <abs ABSG = 5 
       data hash MD5: 16K
       B1 98 26 90 52 A4 3E F0 01 B2 01 F3 B1 8B 12 15>)
$$ ##END=
$$ 
$$ hash MD5
$$ 6F 03 EB 21 95 83 55 4A A0 5F EA 1C 45 D3 11 92
##$RELAX= 
##$RELAX= 
##$RELAX= 
##$RELAX= 
##$RELAX= 
##$RELAX= 
$$ Bruker specific parameters
$$ --------------------------
##$DU= <F:/spectra>
##$EXPNO= 1
##$NAME= <H-F>
##$PROCNO= 1
##$TYPE= <nmr>
##$USER= <she>
##$AMP= (0..31)
100 100 100 100 100 100 100 100 100 100 100 100 100 100 100 100 100 100 
100 100 100 100 100 100 100 100 100 100 100 100 100 100 
##$AQSEQ= 0
##$AQ_mod= 1
##$AUNM= <au_zg>
##$AUTOPOS= <>
##$BF1= 200.13
##$BF2= 200.13
##$BF3= 200.13
##$BF4= 200.13
##$BF5= 200.13
##$BF6= 200.13
##$BF7= 200.13
##$BF8= 200.13
##$BYTORDA= 1
##$CFDGTYP= 0
##$CFRGTYP= 5
##$CHEMSTR= <none>
##$CNST= (0..31)
1 1 145 1 1 1 1 1 1 1 1 1 1 1 1 1 1 1 1 1 1 1 1 1 1 1 1 1 1 1 1 1 
##$CPDPRG= <>
##$CPDPRG1= <>
##$CPDPRG2= <>
##$CPDPRG3= <>
##$CPDPRG4= <mlev>
##$CPDPRG5= <mlev>
##$CPDPRG6= <mlev>
##$CPDPRG7= <mlev>
##$CPDPRG8= <mlev>
##$CPDPRGB= <>
##$CPDPRGT= <>
##$D= (0..31)
0 1.2 0 0 0 0 0 0 0 0.06 0 0.03 0 0 0 0 0.0002 0 0 0 0 0 0 0 0 0 0 0 0 
0 0 0 
##$DATE= 1617607082
##$DBL= (0..7)
120 120 120 120 120 120 120 120 
##$DBP= (0..7)
150 150 150 150 150 150 150 150 
##$DBP07= 0
##$DBPNAM0= <>
##$DBPNAM1= <>
##$DBPNAM2= <>
##$DBPNAM3= <>
##$DBPNAM4= <>
$$ [...]
##$SUBNAM3= <"">
##$SUBNAM4= <"">
##$SUBNAM5= <"">
##$SUBNAM6= <"">
##$SUBNAM7= <"">
##$SUBNAM8= <"">
##$SUBNAM9= <"">
##$SW= 16.9725357007746
##$SWIBOX= (0..15)
0 0 2 0 0 0 0 0 0 0 0 0 0 0 0 0 
##$SW_h= 3396.73913043478
##$TD= 16384
##$TD0= 1
##$TE= 0
##$TE2= 300
##$TE3= 300
##$TEG= 300
##$TL= (0..7)
0 120 120 120 120 120 120 120 
##$TP= (0..7)
150 150 150 150 150 150 150 150 
##$TP07= 0
##$TPNAME0= <>
##$TPNAME1= <>
##$TPNAME2= <>
##$TPNAME3= <>
##$TPNAME4= <>
##$TPNAME5= <>
##$TPNAME6= <>
##$TPNAME7= <>
##$TPOAL= (0..7)
0.5 0.5 0.5 0.5 0.5 0.5 0.5 0.5 
##$TPOFFS= (0..7)
0 0 0 0 0 0 0 0 
##$TUNHIN= 0
##$TUNHOUT= 0
##$TUNXOUT= 0
##$USERA1= <user>
##$USERA2= <user>
##$USERA3= <user>
##$USERA4= <user>
##$USERA5= <user>
##$V9= 5
##$VALIST= <valist>
##$VCLIST= <CCCCCCCCCCCCCCC>
##$VD= 0
##$VDLIST= <DDDDDDDDDDDDDDD>
##$VPLIST= <PPPPPPPPPPPPPPP>
##$VTLIST= <TTTTTTTTTTTTTTT>
##$WBST= 1024
##$WBSW= 4
##$XGAIN= (0..3)
0 0 0 0 
##$XL= 0
##$YL= 0
##$YMAX_a= 287033
##$YMIN_a= -293741
##$ZGOPTNS= <>
##$ZL1= 120
##$ZL2= 120
##$ZL3= 120
##$ZL4= 120
##$ABSF1= 16.08591
##$ABSF2= -0.8867531
##$ABSG= 5
##$ABSL= 3
##$ALPHA= 0
##$AQORDER= 0
##$ASSFAC= 0
##$ASSFACI= 0
##$ASSFACX= 0
##$ASSWID= 0
##$AUNMP= <proc_1d>
##$AZFE= 0.1
##$AZFW= 0.1
##$BCFW= 0
##$BC_mod= 2
##$BYTORDP= 0
##$COROFFS= 0
##$CY= -3
##$DATMOD= 1
##$DC= 0
##$DFILT= <>
##$DTYPP= 0
##$F1P= 0
##$F2P= 0
##$FCOR= 1
##$FTSIZE= 16384
##$FT_mod= 6
##$GAMMA= 0
##$GB= 0
##$INTBC= 1
##$INTSCL= 2.992141e-10
##$ISEN= 128
##$LB= 0.24
##$LEV0= 0
##$LPBIN= 0
##$MAXI= 10000
##$MC2= 0
##$MEAN= 0
##$ME_mod= 0
##$MI= 1.114404
##$NCOEF= 0
##$NC_proc= -6
##$NLEV= 6
##$NOISF1= 3.799351
##$NOISF2= 2.8
##$NSP= 0
##$NTH_PI= 0
##$NZP= 0
##$OFFSET= 15.98646
##$PC= 1
##$PHC0= -11121.52
##$PHC1= 13.60092
##$PH_mod= 1
##$PKNL= yes
##$PPARMOD= 0
##$PSCAL= 0
##$PSIGN= 0
##$REVERSE= no
##$SF= 200.130004998951
##$SI= 16384
##$SIGF1= 3
##$SIGF2= 2
##$SINO= 5.538805
##$SIOLD= 16384
##$SREGLST= <1H.CDCl3>
##$SSB= 0
##$STSI= 16384
##$STSR= 0
##$SW_p= 3396.73913043479
##$SYMM= 0
##$S_DEV= 0
##$TDeff= 16384
##$TDoff= 0
##$TI= <>
##$TILT= no
##$TM1= 0
##$TM2= 0
##$TOPLEV= 0
##$USERP1= <user>
##$USERP2= <user>
##$USERP3= <user>
##$USERP4= <user>
##$USERP5= <user>
##$WDW= 1
##$XDIM= 16384
##$YMAX_p= 419302230
##$YMIN_p= -560807
$$ End of Bruker specific parameters
$$ ---------------------------------
##NTUPLES= NMR SPECTRUM
##VAR_NAME=  FREQUENCY,     SPECTRUM/REAL,   SPECTRUM/IMAG
##SYMBOL=    X,             R,               I
##VAR_TYPE=  INDEPENDENT,   DEPENDENT,       DEPENDENT
##VAR_FORM=  AFFN,          ASDF,            ASDF
##VAR_DIM=   16384,         16384,           16384
##UNITS=     HZ,            ARBITRARY UNITS, ARBITRARY UNITS
##FACTOR=    0.207333158178282, 1,           1
##FIRST=     3199.37026609183, 0,            0
##LAST=      -197.368864342961, 0,           0
##MIN=       -197.368864342961, -560807,     0
##MAX=       3199.37026609183, 419302230,    0
$$ Real data points
##PAGE= N=1
##DATA TABLE= (X++(R..R)), XYDATA
$$ [...]
4812I262l0682P0328M1371j1760j00095K8117q1095k760K1991O311J0091k4253
$$ 9262 -21420 48908 90279 78519 -21576 6541 -74554 -77314 -55323 -49012 -38921 -63174
4800f3174L2536j332N9227j5305r4975L3944J2711p7524M3686K9733K5944L1221
$$ -63174 -30638 -31970 27257 11952 -83023 -49079 -36368 -113892 -70206 -40473 -14529 16692
4788A6692r6023P9164O473R389M1957K6773l8581K939L606j20505n6932L3789
$$ 16692 -79331 -167 6306 15695 57652 84425 45844 48783 52389 -68116 -125048 -91259
4776i1259N5482N8558K4616j5520J6412n4294q6315M1479J00866m0456L3288l2507
$$ -91259 -35777 22781 47397 31877 48289 -6005 -92320 -50841 50025 9569 42857 10350
4764A0350q0410L9186Q6611J7093n474r4463r4535L6503O1104j5403P5335j9591
$$ 10350 -70060 -30874 55737 72830 67356 -27107 -121642 -85139 -24035 -39438 35897 16306
4752A6306k3085M2R84L9284j1911Q0862j8651m4438j65736n2781P6075J3497j9745
$$ 16306 -6779 -6737 -5753 33531 21620 102482 83831 39393 -126343 -179124 -103049 -89552 -109297
4739a09297Q9790N9579k7503m8632J764m2329J1998P2375J141M7852J6840k4004
$$ -109297 -19507 40072 12569 -36063 -34299 -76628 -64630 7745 8886 56738 73578 49574
4727D9574q7233J5338j7729p08n3875r6035O0538R6357j2707k9990R8298r1972
$$ 49574 -37659 -22321 -40050 -40758 -94633 -190668 -130130 -33773 -46480 -76470 21828 -70144
4715g0144m3107J44709j7830O0501q1600k4838R6312o7282n1750O8935J17138
$$ -70144 -113251 31458 13628 74129 -7471 -32309 64003 -3279 -55029 13906 131044
4704A31044L0951j24081k9209O1434Q0824k9240p7302m7421J037r342J02162k4380
$$ 131044 161995 37914 8705 70139 150963 121723 44421 -3000 -1963 -11305 90857 66477
4692F6477k7638j00543J06336P7012n7649K4020M9196k3161p9850J1076n0048
$$ 66477 38839 -61704 44632 121644 63995 88015 137211 114050 34200 45276 -4772
4681d772k8314j880J05224J3347j42216K8678P8773m9141K8238K1041j8452j785
$$ -4772 -33086 -34966 70258 83605 -58611 -29933 48840 -301 27937 48978 30526 28741
4669B8741O9765j0854L8262k7664K0655k8557j8872l8365N6605K1014k3162J2145
$$ 28741 98506 87652 125914 98250 118905 90348 71476 33111 89716 110730 87568 99713
4657I9713J3927k4476J8454R3075J6902J4968n2740j31304o9056L4091j25444
$$ 99713 113640 89164 107618 200693 217595 232563 179823 48519 -20537 13554 -111890
4646a11890N0548M7901n9618J32627Q2870k7370j06060k3167J6871k8240N4112
$$ -111890 -61342 -13441 -73059 59568 142438 115068 9008 -14159 2712 -25528 28584
4635B8584m5334k8544p623O7930L0566q0629N8937O698m083l9200J7869n209o9802
$$ 28584 -16750 -45294 -52917 15013 45579 -35050 23887 30585 26502 -12698 5171 -38 -69840
4622f9840n9832P8949J07354M4083j03416P152L4394n8627o022j1146Q0038K3779
$$ -69840 -129672 -50723 56631 100714 -2702 4450 38844 -19783 -25805 -36951 43087 66866
4610F6866m9341J7313K9405k165L0318k1491k6402M5448M4911k5112q3960n9176
$$ 66866 17525 34838 64243 62078 92396 70905 44503 89951 134862 109750 25790 -33386
4598c3386N3750p435L3336m6141l8650J06913j0461l891K2749q4086J3378R3261
$$ -33386 20364 12929 46265 124 -38526 68387 57926 54035 76784 -7302 6076 99337
4586I9337n15j2866p0782k7447P1745J00147q7955L8092k0853L3567j8022o1624
$$ 99337 98822 85956 15174 -12273 59472 159619 71664 109756 88903 122470 104448 42824
4574D2824O8191M8951J0848n8278m1949N222m6632o3016Q8995Q7655K8127n3750
$$ 42824 111015 159966 170814 112536 70587 75809 29177 -33839 55156 142811 170938 117188
4562A17188j8061M9508L5160L2690k7439k8997k2816o0834L7941n1359m0421K4037
$$ 117188 99127 148635 183795 216485 189046 160049 137233 76399 114340 62981 22560 46597
4550D6597Q4238L3157n1451M0031Q5270o4984j23906j1935N7475K3240l9524p8709
$$ 46597 130835 163992 112541 152572 237842 172858 48952 37017 94492 117732 78208 -501
4538e01O7242O7700q418J4561P347Q160O6816P422j58009n9827Q6614K657L9986
$$ -501 66741 134441 126023 140584 147931 156091 222907 230329 72320 12493 99107 101764 141750
4525A41750J1278l8389L7468L629J6332M8300L3089k0823n3564j8532m4277q895
$$ 141750 153028 114639 152107 155736 172068 220368 253457 232634 179070 160538 116261 107366
4513A07366J1164O222J3157P151K1097l8586L5988M4715K734k408m7320K9380
$$ 107366 118530 124752 137909 145060 166157 127571 163559 208274 211008 208600 161280 190660
4501A90660r4817J08888K6919J2284m3954q7838J9436L8548l655m2075N3711l8457
$$ 190660 95843 204731 231650 243934 199980 112142 131578 170126 166471 124396 178107 139650
4489A39650j1964P1555p9003m5432q765Q3368Q5052R723K8418q0192j6705j2400
$$ 139650 127686 199241 120238 74806 66041 149409 234461 244184 272602 192410 175705 163305
4477A63305M2045o0633P6012O1929p2581m0515j5269M5701n9192K2926n4749n900
$$ 163305 205350 144717 220729 282658 210077 169562 154293 199994 140802 163728 108979 103079
4465A03079P1060n7795L467n416L0200J9093j0181o3253l3028j8846J35650K0281
$$ 103079 174139 116344 119811 114395 144595 163688 153507 90254 57226 38380 174030 194311
4453A94311m6912O356L7868o6850K7256O5541j08388j7783k3013M0354L8343O7981
$$ 194311 147399 153755 191623 124773 152029 217570 109182 91399 68386 108740 147083 215064
4441B15064k6203o7265l2902J01155K1636p9654J11071K727o9981P9369p957R780
$$ 215064 188861 121596 88694 189849 211485 131831 242902 245629 175648 255017 247060 256840
4429B56840k8362q5457M3730K0541k5595L2018k5019n493q539j3300K8339J9382
$$ 256840 228478 143021 186751 207292 181697 213715 188696 183203 174664 161364 189703 209085
4417B09085O2425p0907M6900q9636M8931O1574p9746L9187p2784l5440O830n7
$$ 209085 271510 200603 247503 157867 206798 268372 188626 227813 155029 119589 126419 126362
4405A26362j4304L7366M8795p823Q5876l5572J561o0575J08494K4853m6392l5547
$$ 126362 112058 149424 198219 190396 276272 240700 242261 181686 290180 315033 268641 233094
4393B33094l5919p35M1179q3008q7527J18998P8254j07663K2000Q2089j52941
$$ 233094 197175 196440 237619 154611 67084 186082 264336 156673 178673 260762 107821
4382A07821O7027r279L7813o5406k171l395L2248M0032o0543L881Q1694o2715
$$ 107821 174848 165569 203382 137976 135805 132410 164658 204690 144147 148028 229722 167007
4370A67007n9587O2201j28652O0438O7256k0856o2814L0126J2047P1937P2406
$$ 167007 107420 169621 40969 101407 168663 147807 84993 115119 127166 199103 271509
4359B71509j4011l7100q9089k5250P8794J36J2386Q0169j17545J07852Q2621k038
$$ 271509 257498 220398 131309 106059 184853 184989 197375 277544 159999 267851 350472 348434
4347C48434j39272l3946J37339p1847o6708L2594P2527K2472m3692L7490k9704
$$ 348434 209162 175216 312555 240708 174000 206594 279121 301593 257901 295391 265687
4336B65687K7317r4551n814p2577N5807J07756o6662L00Q4564M9808j35580J4397
$$ 265687 293004 198453 192639 120062 175869 283625 216963 217263 301827 351635 216055 230452
4324B30452M3234l3934J9777N563J291K1074p0267N3449j4868l9623M8037K9279
$$ 230452 273686 239752 259529 265092 266383 287457 217190 270639 255771 216148 264185 293464
4312B93464m1747J904P6371j5030l2236r363l3919j0334q8451J0037R8046m6609
$$ 293464 251717 253621 329992 314962 282726 273363 239444 229110 140659 150696 248742 202133
4300B02133K9642N1308L1490j0377j26875K2251R6967l3310M756k2501l9258K355
$$ 202133 231775 283083 314573 304196 177321 199572 296539 263229 267985 245484 206226 208581
4288B08581j2304K0942P8217k4179m0064M496L7342O4858p5545K4090r88p3424
$$ 208581 196277 217219 295436 271257 231193 235689 273031 337889 262344 286434 285446 212022
4276B12022J15337K8196l287j8278q5288L461R1333l9961q417K1473k0134k6814
$$ 212022 327359 355555 352268 333990 248702 252163 343496 303535 295118 316591 296457 269643
4264B69643k9179Q2752J0122P941p2653o5433J1196J1478O4744N0700o9610J6204
$$ 269643 240464 323216 333338 341279 268626 203193 214389 225867 290611 341311 271701 287905
4252B87905K393m2561Q615n6029L4728J3335j1401N7499J04721J1587k9452j24540
$$ 287905 290298 247737 256352 200323 235051 248386 236985 294484 399205 410792 381340 256800
4240B56800k4654P0981k2373K0262j6133N878p0707M4264M8692j0993O3706Q7213
$$ 256800 232146 303127 280754 301016 284883 290761 220054 264318 313010 302017 365723 452936
4228D52936m3152Q252n8372j8906M1037L8050J7345j06750m2937n0803k0938K6583
$$ 452936 409784 418036 359664 340758 381795 419845 437190 330440 287503 236700 215762 242345
4216B42345L4481L4969P0118q94p3845j7532M0546m5902q0274k9168q7625L8804
$$ 242345 276826 311795 381913 381019 307174 289642 330188 284286 204012 174844 87219 126023
4204A26023J59072L5007J4119l3600o7524n9660k0318P5671J8036k5561m8888
$$ 126023 285095 320102 334221 300621 233097 173437 153119 228790 246826 221265 172377
4193A72377j9040K6956J05284n217k8679L4365O8267k9263q2786J4789J00345
$$ 172377 153337 180293 285577 280360 251681 286046 354313 325050 242264 257053 357398
4182C57398N5033j19700r9968J3846Q7072Q6941l5868q7540L683L5625N2252k7903
$$ 357398 412431 292731 192763 206609 293681 380622 344754 257214 260897 296522 348774 320871
4170C20871r4116J00374M615L1223m5296j6119L5759j344M2091J8089L9908n9784
$$ 320871 226755 327129 331744 362967 317671 301552 337311 335967 378058 396147 436055 376271
4158C76271Q0494O707j051r6110j8684M6726P9124p6069n9267o0690M0495O0009
$$ 376271 456765 463472 462421 366311 347627 394353 473477 397408 338141 277451 317946 377955
4146C77955j29332L0626P4250K1417N4175j45505l4308L2545P793O518m4970J7742
$$ 377955 248623 279249 353499 374916 429091 283586 249278 281823 289616 296134 251164 268906
4134B68906n8743L9616Q4016Q873j8293j5967K903l5166o3000R8088m8254j4119
$$ 268906 210163 249779 333795 342668 324375 308408 311311 276145 213145 311233 262979 248860
4122B48860J08610j4549K2776n3139q755r031q3047J03806N2658k5793q171l1965
$$ 248860 357470 342921 365697 312558 303803 294772 211725 315531 368189 342396 334225 302260
4110C02260l6584K1130L6314m7520J443k0693L2287J4748O9421L5372q3954J00018
$$ 302260 265676 286806 323120 275600 277043 256350 288637 303385 372806 408178 324224 424242
4098D24242K1715j12937m354q03J0508J03134J8058j28084j03591R7901l474L2143
$$ 424242 445957 333020 328666 327863 338371 441505 459563 331479 227888 325789 322315 354458
4086C54458L1657O5492M0207K1919J3963K6752J07729n5524j26984k8637N58P2564
$$ 354458 386115 451607 491814 513733 527696 554448 662177 606653 479669 451032 451590 524154
4074E24154O5718l3823q0123l3701R5348k6075l7795J5129L8217Q4417N4195l1052
$$ 524154 589872 556049 475926 442225 537573 511498 473703 488832 527049 611466 665661 634609
4062F34609j7128q5049l6467J05542L3873j7622L6198N3352O6909O81q0852M538
$$ 634609 617481 532432 495965 601507 635380 617758 653956 707308 774217 774898 694046 698584
4050F98584J5903J45655m9989j08313l315J807L1917Q6056O6680l6744n77O3699
$$ 698584 714487 860142 810153 701840 698525 700332 732249 818305 884985 848241 847664 911363
4038I11363l79O697J02890p339J4126o0675l2440L4993J16189J09360N9146r493
$$ 911363 910984 917681 1020571 1013232 1027358 966683 934243 969236 1085425 1194785 1253931 1244438
4026A244438J6654L8362N7021O8004M5424J63744k570n1121Q7004O4552N2297
$$ 1244438 1261092 1299454 1356475 1424479 1469903 1633647 1631077 1579956 1666960 1731512 1783809
4015A783809J58436J18473J1666J23414R6038j0933M7793M556M3530Q7150n434
$$ 1783809 1942245 2060718 2072384 2195798 2291836 2280903 2328696 2333252 2376782 2463932 2458498
4004B458498L7278O2516N8494J1417M2427N041K0657n2874R9476J23913o3728
$$ 2458498 2495776 2558292 2616786 2628203 2670630 2675671 2696328 2643454 2742930 2866843 2803115
3993B803115R0397Q7053K6933j7788J9962P1924O5848J11282J42852R4774Q8358
$$ 2803115 2893512 2980565 3007498 2989710 3009672 3081596 3147444 3258726 3401578 3496352 3584710
3982C584710J25309R5466J07151K51637R7646J66249K39736J32217J05158L8573
$$ 3584710 3710019 3805485 3912636 4164273 4261919 4428168 4667904 4800121 4905279 4943852
3972D943852L9253L8726K5225k4136o300R0707M5455J1451j2238q3731M313m5942
$$ 4943852 4983105 5021831 5047056 5022920 5016620 5107327 5152782 5164233 5151995 5068264 5072577 5026635
3960E026635o585J7193j82359j29960j3511j17634o0398q6880p4385q163n0080
$$ 5026635 5020050 5037243 4854884 4724924 4711413 4593779 4533381 4446501 4372116 4363953 4313873
3949D313873J7906L417L402J20902M9520J6398J69849J53688R4131n086N2778
$$ 4313873 4331779 4335196 4338598 4459500 4509020 4525418 4695267 4848955 4943086 4938000 4990778
3938D990778J08150l5135L5925m6591M6612r426p3487M041m3367l4792j10218
$$ 4990778 5098928 5063793 5099718 5053127 5099739 5090313 5016826 5020867 4977500 4942708 4832490
3927D832490l1813l1887j92036p4591j07870k19378j27900j39314j58209j68864
$$ 4832490 4800677 4768790 4576754 4502163 4394293 4174915 4047015 3907701 3749492 3580628
3917C580628k12342j78485j53122j59868j42414q4944n5921o0699N5570k2611
$$ 3580628 3368286 3189801 3036679 2876811 2734397 2649453 2593532 2532833 2588403 2565792
3907B565792k6578o1592m3902m3704M5061o9773o0550j83673M738P3299m7149
$$ 2565792 2539214 2477622 2433720 2390016 2435077 2365304 2304754 2121081 2125819 2199118 2151969
3896B151969q7552l5506k5927p1582p9478n2407n0429j0514q7436n5258N9129
$$ 2151969 2064417 2028911 2002984 1931402 1851924 1799517 1749088 1738574 1651138 1595880 1655009
3885A655009j63862r1687j4726j04429j66280j38452j17451L7314m8414q7007
$$ 1655009 1491147 1399460 1384734 1280305 1114025 975573 858122 895436 847022 760015
3875G60015k5969n6300K6182J14794l7491j57226j47620K4955Q9899n005p7417
$$ 760015 734046 677746 703928 818722 781231 624005 476385 501340 591239 586234 508817
3864E08817n2593J9455q490p3562k7337n2899L7910j4430L757j2089p9330m3335
$$ 508817 456224 475679 467189 393627 366290 313391 351301 336871 340628 328539 249209 205874
3852B05874K8841k5611J06038O1787o3324q7120l5624N9520Q099L223m1248j4948
$$ 205874 234715 209104 315142 376929 313605 226485 190861 250381 258480 261703 220455 205507
3840B05507J1798j0240k5331n8204R7538O8473j64234m2079P9534j00142L3333
$$ 205507 217305 207065 181734 123530 221068 289541 125307 83228 162762 62620 95953
3829I5953J04000l3230k0552M2400j3907l6166K702L368K2058l2672k8453N264
$$ 95953 199953 166723 146171 188571 174664 138498 141200 144568 166626 133954 105501 110765
3817A10765M5648L223j4156o71J5707P7680k1541q8295o8313M6448P0294l6234
$$ 110765 156413 159636 145480 144809 160516 238196 216655 128360 60047 106495 176789 140555
3805A40555m6254L2807K8277p1550M8200m0984k1717J45008n6785o4680l6512
$$ 140555 94301 127108 155385 83835 132035 91051 69334 214342 157557 92877 56365
3794E6365O807p1460R5565J9465r1734N5229q364P1983j5342L1487Q421J8477
$$ 56365 63172 -8288 87277 106742 15008 70237 61873 133856 118514 150001 158422 176899
3782A76899J0255K8710l4877l4430j0041j3190l8683M1909l04J1879o22m4772
$$ 176899 187154 215864 180987 146557 136516 123326 84643 126552 126248 138127 137505 92733
3770I2733n2752J07653q0427N6976p0058n7984R3760o8067O0260J28583K3026
$$ 92733 39981 147634 67207 124183 54125 -3859 89901 21834 82094 210677 233703
3759B33703n7168j47261j1848O4317M2102L8733q8538k1314J7336l9679N3776
$$ 233703 176535 29274 17426 81743 123845 162578 74040 52726 70062 30383 84159
3748H4159O5321q1075j5156K0126k251o6255K130R577N985R319Q9002N1553r2466
$$ 84159 149480 68405 53249 73375 71124 4869 6999 16576 22561 31880 120882 172435 79969
3735G9969p516N1007k9615n9606o0086J51061p6343l7380Q3953q4698n8290R117
$$ 79969 72453 123460 93845 34239 -25847 125214 48871 11491 95444 10746 -47544 -38427
3723c8427L9056P3501J0174L3511O009k2431Q299L9929P4321q1596j49700L3585
$$ -38427 629 74130 84304 117815 123824 101393 109692 149621 223942 142346 -7354 26231
3711B6231j173Q2177K3598j14973j1073O700M5012r62l7072q5166O7288L1892
$$ 26231 25058 107235 130833 15860 4787 11487 56499 55537 18465 -66701 587 32479
3699C2479n3834j142J5548P2566N2260m4198m4656J17864L9437m7135r0757k0443
$$ 32479 -21355 -22497 -6949 65617 117877 73679 29023 146887 186324 139189 48432 27989
3687B7989M430k8622l6307M7061N9343K7395M495j7002l66r3944j7078J5779R3712
$$ 27989 32419 3797 -32510 14551 73894 101289 105784 88782 88416 -5528 -22606 -6827 86885
3674H6885K1377n8217k2165p1631K3363M2420J2753q56L2932p7313k9401L5331
$$ 86885 108262 50045 27880 -43751 -20388 22032 34785 33929 66861 -10452 -39853 -4522
3662d522j3930o651r0313p213K5720P0771P7451l9227M5101M3815j5341k8970
$$ -4522 -18452 -25103 -115416 -122629 -96909 -26138 51313 12086 57187 101002 85661 56691
3650E6691l2509P5112N1929K4464m5382J030N4011P4270r2088r8374K3606j069
$$ 56691 24182 99294 151223 175687 130305 131335 185346 259616 167528 69154 92760 91691
3638I1691n6645K3593Q0841K3866j14192o6015J12837J3979J758Q4795p4914J4244
$$ 91691 35046 58639 139480 163346 49154 -16861 95976 109955 111713 196508 121594 135838
3626A35838L6894q8980P915M5179J4887j2428n09r0252O416N7560K9077k5408
$$ 135838 172732 83752 91667 136846 151733 139305 138796 48544 54960 112520 141597 116189
3614A16189j7490K5328o5074m4826N4374M5983M9777q6021l0089k1210J8918j0670
$$ 116189 98699 124027 58953 14127 68501 114484 164261 78240 48151 26941 45859 35189
3602C5189j8334J02766k2981L5821K0800l0354j14620P372P9694k1188P779l4048
$$ 35189 16855 119621 96640 132461 153261 122907 8287 15659 95353 74165 81944 47896
3590D7896j5093N7261O4138N362K4141r730o986n5270l2929m3545k3113L0503
$$ 47896 32803 90064 154202 159564 183705 173975 166989 111719 78790 35245 12132 42635
3578D2635J15271J04040j3154r7682j16153j3797Q3702j4199k182o543N1221k0777
$$ 42635 157906 261946 248792 151110 34957 21160 104862 90663 88481 81938 133159 112382
3566A12382n1200n961j7829N9327J9706K9753j4599Q7969j45360j15868N7578
$$ 112382 61182 55221 37392 96719 116425 146178 131579 219548 74188 -41680 15898
3555A5898N7492m2836j22257k4727N9089R2080J8115l0981L8594n0538L8769M5985
$$ 15898 73390 30554 -91703 -116430 -57341 34739 52854 21873 60467 9929 48698 94683
3543I4683o0088N1111Q7924K86m5888k3296o3455L5429L8162k7598R5291j09444
$$ 94683 34595 85706 173630 173916 128028 104732 41277 76706 114868 87270 182561 73117
3531G3117j07425O2477J30150M2952k9051r4560J20339K6112l4153q7301O2853
$$ 73117 -34308 28169 158319 201271 172220 77660 197999 224111 189958 102657 165510
3520A65510k6278o9445P5787j4426k6831p4758M2166J6674k826r3254K0252J9467
$$ 165510 139232 69787 145574 131148 104317 29559 71725 88399 85573 -7681 12571 32038
3508C2038k315J18550N30m7932m4530K9293R6191k1649n7339j2588m055p7405
$$ 32038 29723 148273 148803 100871 56341 85634 181825 160176 102837 90249 86194 8789
3496H789J05244j6438N0061P3438Q1632k6461m2582m5161m8201j5190P1605m9513
$$ 8789 114033 97595 147656 221094 302726 276265 233683 188522 140321 125131 196736 147223
3484A47223j5141Q0098j34749K0888L0084k9783j4471j9759M5776M6927O1728
$$ 147223 132082 212180 77431 98319 128403 98620 84149 64390 110166 157093 218821
3473B18821n7527k3843l0521R927M8927o9306m5745M1283O2823l3044j08051n826
$$ 218821 161294 137451 106930 116857 165784 96478 50733 92016 154839 121795 13744 7918
3461G918M4370L4286P2473N2026n6048l6606O331J29251J808p173k9562p8711
$$ 7918 52288 86574 159047 211073 155025 118419 124750 254001 255809 248636 219074 140363
3449A40363M4309O5903O7635n1779p7576k0571N9270j0147O0705o0801J2450o401
$$ 140363 184672 250575 318210 266431 188855 168284 227554 217407 278112 217311 229761 223360
3437B23360q9897k0986l5357K4339N5769l0730L592q85m4924L0007Q5416j171
$$ 223360 133463 112477 77120 101459 157228 126498 130090 129205 84281 114288 199704 198533
3425A98533O985J15884j8412P0941K0478j06576q638N8419j0120k4544k6516J368
$$ 198533 205518 321402 302990 373931 394409 287833 279195 337614 327494 302950 276434 277802
3413B77802L6611o9137k1110N3369Q3537J15296k9297n4401l0083r6013j760L4858
$$ 277802 314413 245276 224166 277535 361072 476368 447071 392670 362587 266574 264814 299672
3401B99672J07119J196p8945k8097J286n6298m0609n303L1197P7841P1161p1394
$$ 299672 406791 407987 329042 300945 302231 245933 205324 200021 231218 309059 380220 308826
3389C08826k3767J7216K7430Q8218m8212m1133j1135J0201l9085m4500J05389
$$ 308826 285059 302275 329705 417923 369711 328578 317443 327644 288559 244059 349448
3378C49448M1967O8589K0026p8063j14141M527R026p3587J3572P3060K6149NQ0748
$$ 349448 391415 460004 480030 401967 287826 292353 301379 227792 241364 314424 340573 340578 421326
3365D21326l3725Q4387m9405m1415K4884n9986P3316n2691M5949P5163Q397o5862
$$ 421326 387601 471988 422583 381168 406052 346066 419382 366691 412640 487803 496200 430338
3353D30338o2675O7065Q1869k9718p2233j3659j6035L1036r014L9887r1205l3235
$$ 430338 367663 434728 516597 486879 414646 400987 384952 415988 406974 446861 355656 322421
3341C22421P446M4352k3436j7001n174j1971Q0490l1928k6625N0506j216m2300
$$ 322421 329867 374219 350783 333782 328608 316637 397127 365199 338574 389080 387864 345564
3329C45564M7126M4515J9236l9234p656P881L383m7126p7459L450M6941Q7571
$$ 345564 392690 437205 456441 417207 409551 417432 420815 373689 296230 299680 346621 434192
3317D34192l0886j0086M3052r7337l364Q2917K0944m6649r1078o3912Q2430M3433
$$ 434192 403306 393220 436272 338935 335571 418488 439432 392783 301705 237793 320223 363656
3305C63656k8102n699O7211j5687l3012M9473q2944j231N0922m4356N036R899
$$ 363656 335554 329855 397066 381379 348367 397840 314896 313665 364587 320231 325267 335166
3293C35166k5768n7338J40038j1947J5066k729m3991J10939N0617n4703m8100
$$ 335166 309398 252060 392098 380151 395217 392488 348497 459436 510053 455350 407250
3282D07250l1575P8181j4796j8802L7886M0691l4743j30326r374J7506l409J8721
$$ 407250 375675 453856 439060 420258 458144 498835 464092 333766 324392 341898 338489 357210
3270C57210M4578m2715L3853m2198L7194J071j8941K6203L973M5031Q2605o451
$$ 357210 401788 359073 392926 350728 387922 388993 370052 396255 400228 445259 527864 521413
3258E21413n4856l1497m3140m1513k862R7839O822j3535L6922j5172O3888j6071
$$ 521413 466557 435060 391920 350407 347545 445384 452206 438671 475593 460421 524309 508238
3246E08238L8547o5258m737M9120J4818N0740J48485q6672l2808n1395l1060j7762
$$ 508238 546785 481527 476790 525910 540728 591468 739953 653281 620473 569078 538018 520256
3234E20256O0182j9729J674J13763O3737j03418j2143J4719M545M0988m3866P4963
$$ 520256 580438 560709 562383 676146 739883 636465 624322 639041 643586 684574 640708 715671
3222G15671j112N6534m7134Q6566l8286l8806o994m6444L2074J20493K9649L4109
$$ 715671 714559 771093 723959 810525 772239 733433 726439 679995 712069 832562 862211 896320
3210H96320P8237l5483j07240p6849o908Q3312j683k0178O3377o3289m5157K8624
$$ 896320 974557 939074 831834 754985 748077 831389 829706 809528 872905 809616 764459 793083
3198G93083o6559O1015P5213j07797N7147Q3232K9642N2218K6452M1154o43l2064
$$ 793083 726524 787539 862752 754955 812102 895334 924976 977194 1003646 1044800 1044157 1012093
3186A012093m098L5109j1849M9854j2994M6482p0580Q266O9589r202k2505r9442
$$ 1012093 1007995 1043104 1031255 1081109 1068115 1114597 1044017 1052283 1121872 1112670 1090165 990723
3174I90723n4160O1183J23234J10266j05815l8113q583k5493Q6127O9286M0826
$$ 990723 936563 997746 1120980 1231246 1125431 1087318 1078735 1053242 1139369 1208655 1249481
3163A249481R671j03225N6080J02760R427J02749n4018j2529N5153k3414k4094
$$ 1249481 1259152 1155927 1212007 1314767 1324194 1426943 1372925 1360396 1415549 1392135 1368041
3152A368041n8278j5103K9623K0872J03045m0480M4186J34739m8146k7745J02850
$$ 1368041 1309763 1294660 1324283 1345155 1448200 1407720 1451906 1586645 1538499 1510754 1613604
3141A613604j4254P0539L0415n2322N3395J7538N2587N3164K4710N4207o5269
$$ 1613604 1599350 1669889 1700304 1647982 1701377 1718915 1771502 1824666 1849376 1903583 1838314
3130A838314n5966J09522M5747N1033R6634L6253J8081J12377m1473J1264P6845
$$ 1838314 1782348 1891870 1937617 1988650 2085284 2121537 2139618 2251995 2210522 2221786 2298631
3119B298631j0030N149Q6725J3824O4670M1907L825Q3191K3290K8707P976N7539
$$ 2298631 2288601 2293750 2380475 2394299 2458969 2500876 2504701 2587892 2611182 2639889 2647865 2705404
3107B705404J09894L2184Q6382J13817q022Q1205N0790L4687K8234J56378O2073
$$ 2705404 2815298 2847482 2933864 3047681 3039659 3120864 3171654 3206341 3234575 3390953 3453026
3096C453026R7691J23245P1711J26659N8918J49063K94935J06006Q0439J43641
$$ 3453026 3550717 3673962 3745673 3872332 3931250 4080313 4375248 4481254 4561693 4705334
3086D705334J47623K19845K09765J71118K63768K76522J46309K11682K86274K53903
$$ 4705334 4852957 5072802 5282567 5453685 5717453 5993975 6140284 6351966 6638240 6892143
3076F892143K33947K75944K19158L36725M06604L54240M38629M88375N69601O15228
$$ 6892143 7126090 7402034 7621192 7957917 8364521 8718761 9157390 9645765 10215366 10830594
3066A0830594P78734O73011N46821N10113L52702L42046L39151K97148K33408
$$ 10830594 11609328 12282339 12829160 13339273 13691975 14034021 14373172 14670320 14903728
3057A4903728K79086M28721N46906O48192Q38371J104271J219971J184132R45906
$$ 14903728 15182814 15611535 16158441 16806633 17645004 18749275 19969246 21153378 22099284
3048B2099284P98466N74237L06588l761j87703k29492l20568j06953O1561K53615
$$ 22099284 22897750 23471987 23778575 23774814 23587111 23357619 23037051 22930098 22991659 23245274
3038B3245274O79409Q75770J198141J154165R74628Q88509L46621k18614o19214
$$ 23245274 23924683 24800453 25998594 27152759 28127387 29015896 29362517 29143903 28524689
3029B8524689p35838r73048j030928j061757q09115n34839l30374J51844L37129
$$ 28524689 27788851 26815803 25784875 24723118 23914003 23379164 23048790 23200634 23537763
3020B3537763M06407L34739L18229M5690m71625o99095j025262j108265j142685
$$ 23537763 23944170 24278909 24597138 24642828 24171203 23472108 22446846 21338581 20195896
3011B0195896j313620j263258r43859p42187n16444l08596j85575j75557j77197
$$ 20195896 18882276 17619018 16675159 15932972 15416528 15107932 14922357 14746800 14569603
3002A4569603l83606l11119l77247o59523q02279p29211o77782o43807o27453
$$ 14569603 14185997 13874878 13497631 12838108 12035829 11306618 10628836 9985029 9357576
2993I357576p17370m99150m26885k23756k66611k57065k66722k49690o7872k84729
$$ 9357576 8640206 8141056 7714171 7490415 7223804 6966739 6700017 6450327 6382455 6097726
2983F097726k75136j96600k12255k33880j80408k55507j98989k75576q3716j10633
$$ 6097726 5822590 5625990 5413735 5179855 4999447 4743940 4544951 4269375 4185659 4075026
2973D075026j65275m8207o9585k5319j64690j1724r6428p2663n8962j28261n0954
$$ 4075026 3909751 3861544 3791959 3766640 3601950 3590226 3493798 3421135 3362173 3233912 3182958
2962C182958N255q3227n8100q5422P4572j14609j4484j8785m9617n9442N2127
$$ 3182958 3188213 3104986 3046886 2961464 3036036 2921427 2906943 2888158 2838541 2779099 2831226
2951B831226K2996m2671P491q3422r8085K262M3564L088k7287j3954J7042k7417
$$ 2831226 2854222 2811551 2819042 2735620 2637535 2639797 2683361 2686449 2659162 2645208 2662250 2634833
2939B634833q008r558O8964l2429m918m2736P6600j7604n2428R2750M7012k3320
$$ 2634833 2626825 2617267 2686231 2653802 2648884 2606148 2682748 2665144 2612716 2705466 2752478 2729158
2927B729158R6977m0494o888M2548Q2886p7859m2869J2605L2244q021k0258R0977
$$ 2729158 2826135 2785641 2778753 2821301 2904187 2826328 2783459 2796064 2828308 2820287 2800029 2891006
2915B891006K4737M3527k8571L2961O3005r668j6909J02894K974j9767N1593P3825
$$ 2891006 2915743 2959270 2930699 2963660 3026665 3016997 3000088 3102982 3105956 3086189 3137782 3211607
2903C211607N9552N8177J42658R7312n446K2255J33003N6897P8563p56l5256K9859
$$ 3211607 3271159 3329336 3471994 3569306 3563860 3586115 3719118 3776015 3854578 3853822 3818566 3848425
2891C848425J45730l2402q4306O9661O7083J7334p1936l8763k1127p8185j07659
$$ 3848425 3994155 3961753 3877447 3947108 4014191 4031525 3959589 3920826 3899699 3821514 3713855
2880C713855j398q864j3262Q280O8180L7984r0295L1337O5505r013K6030k1250
$$ 3713855 3712457 3703593 3690331 3698611 3766791 3804775 3714480 3745817 3811322 3802309 3828339 3807089
2868C807089P4284J03529J35526M2086J19256R0856j5342K2396R6585N7964J12303
$$ 3807089 3881373 3984902 4120428 4162514 4281770 4372626 4357284 4379680 4476265 4534229 4646532
2857D646532N4707K1721P4270K5431N3818J06511J29529N3134Q1167J02486O2149
$$ 4646532 4701239 4722960 4797230 4822661 4876479 4982990 5112519 5165653 5246820 5349306 5411455
2846E411455J21428J41476P1438M3308M8001K7360J25188P4659J10510J29099
$$ 5411455 5532883 5674359 5745797 5789105 5837106 5864466 5989654 6064313 6174823 6303922
2836F303922P8557R87R1102J36147J01701J180J01048J48544J03190J65480P4458
$$ 6303922 6382479 6383466 6474568 6610715 6712416 6713596 6814644 6963188 7066378 7231858 7306316
2825G306316J63528R5278J19583Q9378Q7848R9666J75397K08152J11781J44055
$$ 7306316 7469844 7565122 7684705 7774083 7861931 7961597 8136994 8345146 8456927 8600982
2815H600982K75085J53061J50581L00231K57112K08171K62675K98417L48724K29936
$$ 8600982 8876067 9029128 9179709 9479940 9737052 9945223 10207898 10506315 10855039 11084975
2805A1084975L68766L05092L69627M08180L52365L78102L89019M76515M96085
$$ 11084975 11453741 11758833 12128460 12536640 12889005 13267107 13656126 14132641 14628726
2796A4628726N92278N18823N49752O38484P09274P79907R56456J067002J166237
$$ 14628726 15221004 15739827 16289579 16928063 17637337 18417244 19373700 20440702 21606939
2787B1606939J192355J300626J548563J661700J910615K180243K393114K863782
$$ 21606939 22799294 24099920 25648483 27310183 29220798 31401041 33794155 36657937
2779C6657937L156241L442442L608322L926484M155331M210855L992054L691975
$$ 36657937 39814178 43256620 46864942 50791426 54946757 59157612 63149666 66841641
2771F6841641L288012K770329K123356J298732Q29192J39644m96924p26637q06094
$$ 66841641 70129653 72899982 75023338 76322070 77151262 77290906 76793982 76067345 75261251
2762G5261251q73401p45793n04461l08894j70950j00860j32796l37414p36112
$$ 75261251 74387850 73642057 73137596 72828702 72657752 72556892 72424096 72086682 71350570
2753G1350570j208987j876176k313393k806768l185278l661873l875590l843827
$$ 71350570 70141583 68265407 65952014 63145246 59959968 56298095 52422505 48578678
2745D8578678l913081l685911l305509l064710k803064k484537k122616j797883
$$ 48578678 44665597 40979686 37674177 34609467 31806403 29321866 27199250 25401367
2737B5401367j566807j390369j202064j086066r74853p76861q28750o81331o06645
$$ 25401367 23834560 22444191 21242127 20156061 19181208 18404347 17575597 16894266 16287621
2728A6287621n45295n06127m86185l92741l25117k93747l04794l06904j64479
$$ 16287621 15742326 15236199 14750014 14357273 14032156 13738409 13433615 13126711 12962232
2719A2962232k03097k30007j51181j72393j81999k30906j60807j11648m6144o4400
$$ 12962232 12759135 12529128 12377947 12205554 12023555 11792649 11631842 11520194 11474050 11409650
2709A1409650j51308j16609p1205j38115j69965j29547j04477O8294j15533j81531
$$ 11409650 11258342 11141733 11070528 10932413 10762448 10632901 10528424 10596718 10481185 10299654
2699A0299654j0466m5814q956j8560o2227O6853R496q07q6168p2449O9218N3685
$$ 10299654 10289188 10243374 10234418 10215858 10153631 10220484 10229980 10229173 10143005 10070556 10139774 10193459
2687A0193459J0925o9590l5629Q3193J17779J170J6314R0760K2269J4135O2763
$$ 10193459 10204384 10134794 10099165 10182358 10300137 10301307 10317621 10408381 10430650 10444785 10507548
2676A0507548L6026Q0334Q2547K3241J49810O1996k888J05371O5395J61189Q4192
$$ 10507548 10543574 10623908 10706455 10729696 10879506 10941502 10938614 11043985 11109380 11270569 11354761
2665A1354761J16262J08695N6508J54694P0482J10736J23053J85043K71006J11364
$$ 11354761 11471023 11579718 11636226 11790920 11861402 11972138 12095191 12280234 12551240 12662604
2655A2662604K07933K36036K27478L14481J91121K60181L13177M08185L68252
$$ 12662604 12870537 13106573 13334051 13648532 13839653 14099834 14413011 14821196 15189448
2646A5189448K71851L22079L10826L19674K22533K37765K42281K20309K00335
$$ 15189448 15461299 15783378 16094204 16413878 16636411 16874176 17116457 17336766 17537101
2637A7537101J51258J91846J53006J65452J11592J27239L47417M11980L54069
$$ 17537101 17688359 17880205 18033211 18198663 18310255 18437494 18784911 19196891 19550960
2628A9550960L52202M64773M15502N52298O04874O68319Q06331P63422R07424
$$ 19550960 19903162 20367935 20783437 21335735 21940609 22608928 23415259 24178681 25086105
2619B5086105R06042J001840J137184J031844J114934J229953J346754J380607
$$ 25086105 25992147 26993987 28131171 29163015 30277949 31507902 32854656 34235263
2611C4235263J479850J620395J734853J878259K389924K565386K915432L303213
$$ 34235263 35715113 37335508 39070361 40948620 43338544 45903930 48819362 52122575
2603E2122575L747966M218783M785971N655781O319563P135108Q110759R214336
$$ 52122575 55870541 60089324 64875295 70531076 76850639 83985747 92096506 101310842
2595A01310842J0391411J1476181J2323392J3198947J3384052J2991446J2211637
$$ 101310842 111702253 123178434 135501826 148700773 162084825 175076271 187287908
2588A87287908J0632109Q329020N630164K449390r18945m358889p448099r957233
$$ 187287908 197920017 206249037 211879201 214328591 213409646 209050757 201602658 191645425
2580A91645425j2121520j3310846j3795187j3824173j3306346j2375378j1214488
$$ 191645425 179523905 166213059 152417872 138593699 125287353 112911975 101697487
2573A01697487j0194442q949148p720670o818569o027050n172330m406504l929866
$$ 101697487 91503045 82553897 74833227 68014658 61987608 56815278 52408774 48478908
2565D8478908l362883k826681k703141k429836k135046j957599j679333j491532
$$ 48478908 45116025 42289344 39586203 37156367 35021321 33063722 31384389 29892857
2557B9892857j397771j142356j206143j097691r55250r42748q46470q02527r05036
$$ 29892857 28495086 27352730 26146587 25048896 24093646 23150898 22304428 21501901 20596865
2548B0596865o17553n15982o04918o23651m25277l94135m02672l60311m52819
$$ 20596865 19979312 19463330 18858412 18234761 17809484 17415349 17012677 16652366 16199547
2539A6199547m09787l42449k72222k89429k06760k58101k43150j61491j54069
$$ 16199547 15789760 15447311 15175089 14885660 14678900 14420799 14177649 14016158 13862089
2530A3862089j35340l0336j48790q6382r2613j28709q5526k34412k37190k02536
$$ 13862089 13726749 13696413 13547623 13461241 13368628 13239919 13154393 12919981 12682791 12480255
2520A2480255k32110l32314m22240k73367m04998k00980k76726l14851k30691
$$ 12480255 12248145 11915831 11493591 11220224 10815226 10614246 10337520 10022669 9791978
2511I791978k93085k63342k11306j73871k46226j29417k74851k01696j09451j27544
$$ 9791978 9498893 9235551 9024245 8850374 8604148 8474731 8199880 7998184 7888733 7761189
2501G761189j47495k04608j45946k02337j23423l7727n7060j98803j58172r4763
$$ 7761189 7613694 7409086 7263140 7060803 6937380 6899653 6842593 6643790 6485618 6390855
2491F390855n9129j34011n5996M9340j22909j20762m0615j3227j04342m3170j19687
$$ 6390855 6331726 6197715 6141719 6191059 6068150 5947388 5906773 5893546 5789204 5746034 5626347
2480E626347j30369N033l5226n8215p1093o8293l1960m2952q9241q9732m9497
$$ 5626347 5495978 5501011 5465785 5407570 5336477 5268184 5236224 5193272 5104031 5014299 4964802
2469D964802K180N8975J3245k0934n3910p5527N9799k1462J968K2553k8769N9524
$$ 4964802 4966982 5025957 5039202 5018268 4964358 4888831 4948630 4927168 4929136 4951689 4922920 4982444
2457D982444p8946n3269M4150J2701o3566r1060k8691M2133L902L3033M139p6709
$$ 4982444 4903498 4850229 4894379 4907080 4843514 4752454 4723763 4765896 4769798 4802831 4806970 4730261
2445D730261k9221K7661R7714n5390J6226j3644L386M6478K9463L211k8445M316
$$ 4730261 4701040 4728701 4826415 4771025 4787251 4773607 4776993 4823471 4852934 4856145 4827700 4832016
2433D832016R0215p9002P025J25383K2596M4968n5666O6556K389j8939O0470N104
$$ 4832016 4922231 4843229 4850254 4975637 4998233 5043201 4987535 5054091 5056480 5037541 5098011 5103115
2421E103115k9151M1402M7527Q2850L5463N2836J3736J7597j6417O5461J6203
$$ 5103115 5073964 5115366 5162893 5245743 5281206 5334042 5347778 5365375 5348958 5414419 5430622
2410E430622J5549Q9846J1841j0770J4198N4138P1367Q6123k2379Q9444P1364
$$ 5430622 5446171 5536017 5547858 5537088 5551286 5605424 5676791 5762914 5740535 5829979 5901343
2399E901343R0195O518R8850J26746J8943M9501j7076P1660J43360R7377R3345
$$ 5901343 5991538 5998056 6096906 6223652 6242595 6292096 6275020 6346680 6490040 6587417 6680762
2388F680762J27185J66612J12583J72792J01683M3644K82203K07534J64737O7087
$$ 6680762 6807947 6974559 7087142 7259934 7361617 7405261 7687464 7894998 8059735 8126822
2378H126822K56186L56089J26215J44994J71142J49749L27548L08848L61602L88888
$$ 8126822 8383008 8739097 8865312 9010306 9181448 9331197 9658745 9967593 10329195 10718083
2368A0718083L09121L39768L94984M43836N25254M29731O84595Q75940Q41928
$$ 10718083 11027204 11366972 11761956 12205792 12731046 13160777 13845372 14721312 15563240
2359A5563240J075617J197863J189124J179851J125158J025884P54294M78953
$$ 15563240 16638857 17836720 19025844 20205695 21330853 22356737 23111031 23589984
2351B3589984M56896K39536O72K132K00322K91868L78921L94372M56204K63108
$$ 23589984 24046880 24286416 24287088 24289220 24489542 24781410 25160331 25554703 26010907 26274015
2341B6274015L49345L09188M18016L96327L59715L11537K45584M28334L53277
$$ 26274015 26623360 26932548 27350564 27746891 28106606 28418143 28663727 29092061 29445338
2332B9445338L31445K06155K46416M22278L77696M35385O67328O11173Q26460
$$ 29445338 29776783 29982938 30229354 30651632 31029328 31464713 32132041 32743214 33569674
2323C3569674J056702J209126J034613O33765K28711k90718q37224j170636j536259
$$ 33569674 34626376 35835502 36870115 37503880 37732591 37441873 36604649 35434013 33897754
2314C3897754j946632k062094j775449j373245q20284n76311l58565m8544k804
$$ 33897754 31951122 29889028 28113579 26740334 25920050 25343739 24985174 24936630 24933826
2305B4933826K71904M63750N28284N92196P06403R23567J079739J193408J595538
$$ 24933826 25205730 25669480 26197764 26789960 27496363 28419930 29499669 30693077 32288615
2296C2288615J729012J970867K329745K499392K699564L016945L092999L030717
$$ 32288615 34017627 35988494 38318239 40817631 43517195 46534140 49627139 52657856
2288E2657856L205889L271036K926080K734590K332993K012021J762994J381295
$$ 52657856 55863745 59134781 62060861 64795451 67128444 69140465 70903459 72284754
2280G2284754R73467N36408K08133J7076m2961l23439m82551n97485o63408p89597
$$ 72284754 73258221 73794629 74002762 74019838 73976877 73653438 73170887 72573402 71909994 71120397
2270G1120397r12001r32370r96399q45020j064027j117543j220546j641549j752506
$$ 71120397 70208396 69276026 68279627 67434607 66370580 65253037 64032491 62390942 60638436
2261F0638436j978422k146945k275086k146523k083187j893676j673560j409920
$$ 60638436 58660014 56513069 54237983 52091460 50008273 48114597 46441037 45031117
2253D5031117j041284o01757k98768J21964N12941P45246J092134J317215J545195
$$ 45031117 43989833 43388076 43089308 43211272 43724213 44469459 45561593 46878808 48424003
2244D8424003J903624K056009K095345K183077K182851J977773J796534J756199
$$ 48424003 50327627 52383636 54478981 56662058 58844909 60822682 62619216 64375415
2236F4375415J391659J073459Q04175N27742L71781K30375m052j95201k43351
$$ 64375415 65767074 66840533 67644708 68172450 68544231 68774606 68770554 68575353 68332002
2227F8332002l85011m22711l87145n25277p17505p62309j137622j376094j628917
$$ 68332002 67946991 67524280 67137135 66611858 65894353 65132044 63994422 62618328 60989411
2218F0989411j900906k138322k316627k516947k578631k608443k850701k687652
$$ 60989411 59088505 56950183 54633556 52116609 49537978 46929535 44078834 41391182
2210D1391182k538118k366301k095209k026989j890558j549308j317216j334840
$$ 41391182 38853064 36486763 34391554 32364565 30474007 28924699 27607483 26272643
2202B6272643j107026q34854r14933p11344n43686m40284l53438l22445k93056
$$ 26272643 25165617 24330763 23415830 22704486 22160800 21720516 21367078 21044633 20751577
2193B0751577k69377q5092j01021k1368K26020K06306K43842M02517M43499L88120
$$ 20751577 20482200 20397108 20296087 20274719 20500739 20707045 20950887 21353404 21796903 22185023
2183B2185023O99696O37505N28493O39257O00209M58362M85408M36271L15687
$$ 22185023 22884719 23522224 24050717 24689974 25290183 25748545 26233953 26670224 26985911
2174B6985911K46091J61405J21239R5481o4825r683o2995j1614o7393l8999k8700
$$ 26985911 27232002 27393407 27514646 27610127 27545302 27535619 27472624 27461010 27393617 27354618 27325918
2163B7325918j32724j73085k29458j37664k84921l69724l02947m40639m70809
$$ 27325918 27193194 27020109 26790651 26652987 26368066 25998342 25695395 25254756 24783947
2154B4783947n91951o48558p40505o59266n90075p41878n84026n26935n65830
$$ 24783947 24191996 23543438 22802933 22143667 21553592 20811714 20227688 19700753 19134923
2145A9134923n62704m82397m92249m73127l13788m46254n25409l88580l63545
$$ 19134923 18572219 18089822 17597573 17124446 16810658 16364404 15838995 15450415 15086870
2136A5086870k65942k83185r8898k02357j54663j06332j02039n5421M124p5826
$$ 15086870 14820928 14537743 14438845 14236488 14081825 13975493 13873454 13818033 13822157 13746331
2126A3746331q1459R9057J25254J31153J38810P3357K29039K19286K69673K43959
$$ 13746331 13664872 13763929 13889183 14020336 14159146 14232503 14461542 14680828 14950501 15194460
2116A5194460L40956M60618L75128L57839L55570M91019O96878O92631Q19734
$$ 15194460 15535416 15996034 16371162 16729001 17084571 17575590 18272468 18965099 19784833
2107A9784833Q79698R83609J058275J153705J364091J560421J895344J994058
$$ 19784833 20664531 21648140 22706415 23860120 25224211 26784632 28679976 30674034
2099C0674034K303249K408041K588804K608605K471020K417819K264958K228372
$$ 30674034 32977283 35385324 37974128 40582733 43053753 45471572 47736530 49964902
2091D9964902K252083K363861K454243K503541K478192K282776J984478J676582
$$ 49964902 52216985 54580846 57035089 59538630 62016822 64299598 66284076 67960658
2083F7960658J392343J128447Q91650Q99350R13726Q45662P00086N85167J29212
$$ 67960658 69353001 70481448 71373098 72272448 73186174 74031836 74731922 75317089 75446301
2074G5446301k21957p23964j263079j803908k454753k987929l285428l556845
$$ 75446301 75224344 74500380 73237301 71433393 68978640 65990711 62705283 59148438
2066E9148438l821744m071345l877580l760698l619341l348511l063918k575083
$$ 59148438 55326694 51255349 47377769 43617071 39997730 36649219 33585301 31010218
2058C1010218k459955k117165j806228j641474j451706j217813r70589q66040
$$ 31010218 28550263 26433098 24626870 22985396 21533690 20315877 19345288 18479248
2050A8479248q06094o58103p04290o69773o28137n35720n76015l98680m81744
$$ 18479248 17673154 17015051 16310761 15640988 15012851 14477131 13901116 13502436 13020692
2041A3020692m47813k84064l91507l96931l28592l69263k82376l92172j61709
$$ 13020692 12572879 12288815 11897308 11500377 11171785 10802522 10520146 10127974 9966265
2032I966265k02618k86838j19043o8349q5681j33745K0501K1922o4422K5201J27509
$$ 9966265 9763647 9476809 9357766 9289417 9203736 9069991 9090492 9112414 9047992 9073193 9200702
2021I200702R9896L3152J56026L48466R0578J01810K02925J76075N2717j5406
$$ 9200702 9300598 9333750 9489776 9838242 9928820 10030630 10233555 10409630 10462347 10446941
2011A0446941p4564q2626j29971k27229l43989l15160l80607l93543l24384m57069
$$ 10446941 10372377 10289751 10159780 9932551 9588562 9273402 8892795 8499252 8174868 7717799
2001G717799l12482k92905k29003k69080l07088q7580j68892k45555j19106j10739
$$ 7717799 7405317 7112412 6883409 6614329 6307241 6219661 6050769 5805214 5686108 5575369
1991E575369k5777j60558o1306j73157j21140p7085j3668j00331q3056l7431p3361
$$ 5575369 5549592 5389034 5327728 5154571 5033431 4956346 4942678 4842347 4759291 4721860 4648499
1980D648499j17233k8858J03728P028q4559n4774J27666k612p8232m5441m2669
$$ 4648499 4531266 4502408 4606136 4613164 4528605 4473831 4601497 4598885 4520653 4475212 4432543
1969D432543n2551m955n3231r9942j46450j2687m9242n806o6016p460o6276j7019
$$ 4432543 4379992 4375037 4321806 4221864 4075414 4062727 4013485 4007679 3941663 3934203 3867927 3850908
1957C850908P3483p6640j42M4670K1831J00821m4320o5957p0496L0007O4406J04823
$$ 3850908 3924391 3847751 3847609 3892279 3914110 4014931 3970611 3904654 3834158 3864165 3928571 4033394
1945D033394K1398p6031q486K3175l3673J26100O90m0506M6731K1556J42161P5857
$$ 4033394 4054792 3978761 3970275 3993450 3959777 4085877 4086567 4046061 4092792 4114348 4256509 4332366
1933D332366m4549k6978J5451m282J40611O7160l5724p1277P4950J25017p353
$$ 4332366 4287817 4260839 4276290 4272008 4412619 4479779 4444055 4372778 4447728 4572745 4565392
1922D565392j0222J5491o7769l909P9651j3588N3610N8649R7506O6491j50753
$$ 4565392 4555170 4570661 4502892 4498983 4578634 4565046 4618656 4677305 4774811 4841302 4690549
1911D690549J14177J12306l1823l0983R0456J08905n9021j5550k7811J24180k3649
$$ 4690549 4804726 4917032 4885209 4854226 4944682 5053587 4994566 4979016 4951205 5075385 5051736
1900E051736j3625Q2085J72052Q5940O398J7904R1306J48010N4833O8702J66058
$$ 5051736 5038111 5120196 5292248 5378188 5384586 5402490 5493796 5641806 5696639 5765341 5931399
1889E931399J42397J55379J12882K34292J52348J13933J35910J14526J67146J00272
$$ 5931399 6073796 6229175 6342057 6576349 6728697 6842630 6978540 7093066 7260212 7360484
1879G360484J51501K56594K12075K42952J84291K74593M22154K37636L31439L00392
$$ 7360484 7511985 7768579 7980654 8223606 8407897 8682490 9104644 9342280 9673719 9974111
1869I974111K61584K02059K55084J90484J43535J91808J27795J19131K19501J54616
$$ 9974111 10235695 10437754 10692838 10883322 11026857 11218665 11346460 11465591 11685092 11839708
1859A1839708K08475N7940J87423J95222J10746J97173K54142K78239L02248J78144
$$ 11839708 12048183 12106123 12293546 12488768 12599514 12796687 13050829 13329068 13631316 13809460
1849A3809460K21159K66590K54973K40411K28564K89615K57790K34730K18640
$$ 13809460 14030619 14297209 14552182 14792593 15021157 15310772 15568562 15803292 16021932
1840A6021932L40162L63220L47978M46518K93275L31286N10005M49096M42457
$$ 16021932 16362094 16725314 17073292 17519810 17813085 18144371 18654376 19103472 19545929
1831A9545929L87389M59343M57614M05919N59335N82962N97946O52073O88530
$$ 19545929 19933318 20392661 20850275 21256194 21815529 22398491 22996437 23648510 24337040
1822B4337040P00643O96806O91275P45225Q10938Q66046R61438J068391J248118
$$ 24337040 25037683 25734489 26425764 27170989 27981927 28847973 29809411 30877802 32125920
1813C2125920J315386J482256J633760J686101J846136J892459J906122K026431
$$ 32125920 33441306 34923562 36557322 38243423 40089559 41982018 43888140 45914571
1805D5914571K141263K085250K167497J969226K082647K406283K539433K907097
$$ 45914571 48055834 50141084 52308581 54277807 56360454 58766737 61306170 64213267
1797F4213267L073506L551455M238674N098188N918915P107114Q127871R051170
$$ 64213267 67286773 70838228 75076902 80175090 86094005 93201119 101328990 110380160
1789A10380160J0199258J1211093J2266827J3709443J5807136J8692146K2727883
$$ 110380160 120579418 131790511 144057338 157766781 173573917 192266063 214993946
1782B14993946K7441075L2778093L7179404L8111512L4187204K4812127R798869
$$ 214993946 242435021 275213114 312392518 350504030 384691234 409503361 419302230
1775D19302230o897415j9635838k7060501l2719572l8192650m0466267l7742397
$$ 419302230 412404815 392768977 365708476 332988904 294796254 254329987 216587590
1768B16587590l1128521k4010396j8304908j4187428j1528476r786170q575133
$$ 216587590 185459069 161448673 143143765 128956337 117427861 107641691 99066558
1761I9066558p492198o637510o056001n462702m923641m491471l934206l543647
$$ 99066558 91574360 84936850 78880849 73418147 68494506 64003035 60068829 56525182
1753E6525182l196475k932642k659756k330485k229149j957281j934824j747709
$$ 56525182 53328707 50396065 47736309 45405824 43176675 41219394 39284570 37536861
1745C7536861j663441j402774j468563j526013j459884j360706j216352j139792
$$ 37536861 35873420 34470646 33002083 31476070 30016186 28655480 27439128 26299336
1737B6299336j107571j036632r92821r63244r43409q72330p43502o36441o18279
$$ 26299336 25191765 24155133 23162312 22199068 21255659 20383329 19639827 19003386 18385107
1728A8385107o37113m77233n69099m96437m75496m46044l58278m35187l35063
$$ 18385107 17747994 17270761 16701662 16205225 15729729 15283685 14925407 14490220 14155157
1719A4155157l34176l95884l66819l14843j92379k86282k53729k34106k43796
$$ 14155157 13820981 13425097 13058278 12743435 12551056 12264774 12011045 11776939 11533143
1710A1533143k20078k73135l06925j91009k18197k05203j52118k54263j05992
$$ 11533143 11313065 11039930 10733005 10541996 10323799 10118596 9966478 9712215 9606223
1701I606223j88484j66564j48862k5960j49940k49597j69824j24833k00566j85511
$$ 9606223 9417739 9251175 9102313 9076353 8926413 8676816 8506992 8382159 8181593 7996082
1691G996082j13731j89147k47534l08192j01030j15312l20819j82598j06151k19758
$$ 7996082 7882351 7693204 7445670 7137478 7036448 6921136 6600317 6417719 6311568 6091810
1681F091810k1860n0662m0992j77710p4573j10319j17834j23336j51808q8147
$$ 6091810 6069950 6019288 5978296 5800586 5726013 5615694 5497860 5374524 5222716 5134569
1671E134569j14594k52296r2748k2784o3137K3495j53008j11969r701p845k2014
$$ 5134569 5019975 4767679 4674931 4652147 4589010 4612505 4459497 4347528 4337827 4329982 4307968
1660D307968n8213n8230j81180j62905p4250Q976j30583K853P132j33300j06294
$$ 4307968 4249755 4191525 4010345 3847440 3773190 3782166 3651583 3654436 3661568 3528268 3421974
1649C421974j13076l8718j88226j04679P6898j2342o0886q9684p2628m9967k9769
$$ 3421974 3308898 3270180 3081954 2977275 3054173 3041831 2980945 2891261 2818633 2768666 2738897
1638B738897l0681m9677m769r6874j2433r7108l590P7877j00775k27558l5471
$$ 2738897 2708216 2658539 2653770 2556896 2544463 2447355 2443765 2521642 2420867 2193309 2157838
1627B157838N0277n5938k079n6024n6400J8583M0926n7532J3361J3584p9797n9244
$$ 2157838 2208115 2152177 2150098 2094074 2037674 2056257 2097183 2039651 2053012 2066596 1986799 1927555
1615A927555r6286k1057l1656j4855m232M6692l361q9534Q3520k870O612p2576
$$ 1927555 1831269 1810212 1778556 1763701 1759469 1806161 1802800 1713266 1796786 1793916 1800528 1727952
1603A727952l625P0337J3203l9098J5573M2706o3863j22647l7272R1978O8057
$$ 1727952 1724327 1794664 1807867 1768769 1784342 1827048 1763185 1640538 1603266 1695244 1763301
1592A763301l0019j11142o8409n4402J0579L704k2062j10434l0375r2809K873
$$ 1763301 1733282 1622140 1553731 1499329 1509908 1513612 1491550 1381116 1350741 1257932 1260805
1581A260805j2339P4901j05081L1838l7260M6458L5187m9108o2504o3985P2793
$$ 1260805 1248466 1323367 1218286 1250124 1212864 1259322 1294509 1245401 1182897 1118912 1191705
1570A191705j9189k9913k4738l5933m689M3634o0352m2848j7022j349m2262j0732
$$ 1191705 1172516 1142603 1117865 1081932 1077243 1120877 1060525 1017677 1000655 999306 957044 946312
1558I46312j3734L0972J5777o454j6200K5400M1735M7918M3984J1533o6459r5043
$$ 946312 932578 963550 979327 972873 956673 982073 1023808 1071726 1115710 1127243 1060784 965741
1546I65741l0254J6131M3778O9877r5591n495j6871j8631k5692O4592l0284k9214
$$ 965741 935487 951618 995396 1065273 969682 964187 947316 928685 902993 967585 937301 908087
1534I08087M0181o5724Q680J5354l4827r814o2394j17267J8898k6006j292P8936
$$ 908087 948268 882544 891224 906578 871751 861937 799543 682276 701174 675168 673876 752812
1522G52812q5531J0764M7048O455p4971n1172L8790o1516J5811K8441k432p3J399
$$ 752812 667281 678045 725093 731548 656577 605405 644195 582679 598490 626931 624499 624426 625825
1509F25825k9779m1167J07955R2198O380j08031K2812J0932Q1305j3639j3933
$$ 625825 596046 554879 662834 755032 761412 653381 676193 687125 768430 754791 740858
1498G40858K3213j3065L3091k5190k0700n3357P610P6295j2737J23694J54394
$$ 740858 764071 751006 784097 758907 738207 684850 692460 768755 756018 879712 1034106
1487A034106K1140J86181O1408Q2788m7091J60350J42979J36263J65815J43836
$$ 1034106 1055246 1241427 1302835 1385623 1338532 1498882 1641861 1778124 1943939 2087775
1477B087775K26445K12591P0846L2412m2866j35599j61549k22130j58885l30841
$$ 2087775 2314220 2526811 2597657 2630069 2587203 2451604 2290055 2067925 1909040 1578199
1467A578199j24291j15304N500j10545k67535j76071k7026L001r476K0772k0720
$$ 1578199 1453908 1338604 1344104 1233559 966024 789953 762927 765928 756452 777224 756504
1456G56504L4453j08365k0157l9896k2251o8006j5979k0544q3682n2539L7672
$$ 756504 790957 682592 662435 622539 600288 532282 516303 495759 412077 359538 397210
1445C97210M7767K6048m2672k0600l4413j4725k7447K961R1752M7964j7544R26
$$ 397210 444977 471025 428353 407753 373340 358615 331168 334129 425881 473845 456301 457227
1433D57227K2856o3230m7609r7573L2958R2258q1754o6990p2556O5017L2180o4486
$$ 457227 480083 416853 369244 271671 304629 396887 315133 248143 175587 240604 272784 208298
1421B08298l4321o5262O6817l1616N2248R5613k6165N2695n0905j896m5894l5919
$$ 208298 173977 108715 175532 143916 196164 291777 265612 318307 267402 265506 219612 183693
1409A83693J959k3902J02464o3793M274J4032l5024M1560p7854m0833l9763M1975
$$ 183693 185652 161750 264214 200421 204695 218727 183703 225263 147409 106576 66813 108788
1397A08788P7586k0805M1935n8939j2544j3158j173n685N6117K0814j8551L9136
$$ 108788 186374 165569 207504 148565 136021 122863 121690 116005 172122 192936 174385 213521
1385B13521K5217k4923K0208l5410J4889l7811K5021K7054p4083N3969m8519L6793
$$ 213521 238738 213815 234023 198613 213502 175691 200712 227766 153683 207652 159133 195926
1373A95926r6159m7833O0548J9339k1587P1381k097n0063K2137j7675o2535Q2274
$$ 195926 99767 51934 112482 131821 110234 181615 179518 129455 151592 133917 71382 153656
1361A53656J3028q5586P3507m7048M6331m7007p9682M2733O296J1980Q3056q4762
$$ 153656 166684 81098 154605 107557 153888 106881 27199 69932 76228 88208 171264 86502
1349H6502q4699Q697l494P9200L6840J3812k8413j0682p0499m9692l082j5904
$$ 86502 1803 10500 7006 86206 123046 136858 108445 97763 27264 -22428 -25510 -41414
1337d1414P5828O1622J9027j7697P5735k8076q5408l1394O9404K2832N4390n973
$$ -41414 34414 96036 115063 97366 173101 145025 59617 28223 97627 120459 174849 168876
1325A68876j01355o7961L6319R8946N6204n400J2507j5617j38612R9662O0822
$$ 168876 67521 -440 35879 134825 191029 185629 198136 182519 43907 143569 204391
1314B04391j7668q4201n1473p5957M2040j6310K3529J0022q5612m1392M9281K90
$$ 204391 186723 102522 51049 -24908 17132 822 24351 34373 -51239 -92631 -43350 -43060
1302d3060J9439R3927K9921N57k8637p027K5190O0185k2745l6661j18988M9390
$$ -43060 -23621 70306 100227 100784 72147 65120 90310 150495 127750 91089 -27899 21491
1290B1491K6912L811J010O753n154r454n712O0138M4838O8186j37667m7674K9114
$$ 21491 48403 52214 53224 59977 54823 45369 39657 99795 144633 212819 75152 27478 56592
1277E6592L4990L6702L2907k4499j20205K8110N0480k562j6670k7741j7126K4208
$$ 56592 91582 128284 161191 136692 16487 44597 95077 92515 75845 48104 30978 55186
1265E5186k2613L3549m5830L4697N4600L5561o7215K0717M0150k5879J5872j8698
$$ 55186 32573 66122 20292 54989 109589 145150 77935 98652 138802 112923 128795 110097
1253A10097l3132R9801L3226n3277j20032L5929J00645j118l58l5896M026O4488
$$ 110097 76965 176766 209992 156715 36683 72612 173257 172139 171781 135885 139911 204399
1241B04399n0302J381l4903N3193R1331K8093l0430n8726O6290m9090r9864K0215
$$ 204399 154097 155478 120575 173768 265099 293192 262762 204036 270326 221236 121372 141587
1229A41587R8709l9334M7669o2144p2461N403p2908r251m8920M5493n9983J0367
$$ 141587 240296 200962 248631 186487 114026 119429 46521 37270 -11650 33843 -26140 -15773
1217a5773Q1819O6304l5726R168N607m3571K5754K0268M2575j8021j41299n9223
$$ -15773 66046 132350 96624 105792 111399 67828 93582 113850 156425 138404 -2895 -62118
1205f2118J68502J2233j38388l0802k530Q3189P4612o4635m0424k3504J13971
$$ -62118 106384 118617 -19771 -50573 -53103 30086 104698 40063 -361 -23865 90106
1194I0106J6042l6420p3566J2752P0374L6086q8574K1766o9334j33272R9666R0211
$$ 90106 106148 69728 -3838 8914 79288 115374 26800 48566 -20768 -154040 -54374 35837
1182C5837L2595m3133l7019K2398R1972L5152k7268k0763n1867o3707J6630M9674
$$ 35837 68432 25299 -11720 10678 102650 137802 110534 89771 37904 -25803 -9173 40501
1170D0501j5768L3428p2280o2182J8495Q3692K5158O8368m2880L1644O1830o0423
$$ 40501 24733 58161 -14119 -76301 -57806 25886 51044 119412 76532 108176 170006 109583
1158A09583j9459L0324P8161q3054k3569J4675m0309K2669q4990N016K2471r539
$$ 109583 90124 120448 198609 115555 91986 106661 66352 89021 4031 9047 31518 21979
1146B1979M5382K2851K5043K6948l3446q0493J5290J04267p2174n5323N3035N688
$$ 21979 67361 90212 115255 142203 108757 28264 43554 147821 75647 20324 73359 79047
1134G9047J7962J8484Q5004p444k5699p6441Q0809n4656m7096M1215L2983l0580
$$ 79047 97009 115493 200497 193053 167354 90913 171722 117066 69970 111185 144168 113588
1122A13588j16231M9417L4562R031L4932k8697J18472P1370r3951o6087O9700
$$ 113588 -2643 46774 81336 90367 125299 96602 215074 286444 192493 126406 196106
1111A96106j0420K5646n968j0139k059J06416L4687p5298r263J7092K7499L287
$$ 196106 185686 211332 205364 195225 193166 299582 334269 258971 249708 266800 294299 297586
1099B97586K2789o7122J116J9716L7356m1500j18878L8878n8163q669O7309j0478
$$ 297586 320375 253253 254369 274085 311441 269941 151063 189941 131778 123109 190418 179940
1087A79940N9356L5563P9145m2083j7101p9126p1K0463L920J10039J8361p8217
$$ 179940 239296 274859 354004 311921 294820 215694 215623 236086 240006 350045 368406 290189
1075B90189K4218j2993K0553K0821K6902Q6513j5582j20696j02344J04671K1702
$$ 290189 314407 301414 321967 342788 369690 456203 440621 319925 217581 322252 343954
1064C43954n0301n3924N7137O2214P6051j8951J9624o0020J3229N0323o8311n6385
$$ 343954 293653 239729 296866 359080 435131 416180 435804 375784 389013 439336 371025 314640
1052C14640m5270M8095M7926J6208N5236J15743k389Q9182Q319n5681j18469J8553
$$ 314640 269370 317465 365391 381599 436835 552578 550189 639371 647690 592009 473540 492093
1040D92093Q7724L6176J3452M4224J8807M61k6487R412J4616O091L0194k0539
$$ 492093 579817 615993 629445 673669 692476 692937 666450 675862 690478 696569 726763 706224
1028G06224M8604J59463o564l6849p5961R2280L8567p3832Q5794k2874p7j7107
$$ 706224 754828 914291 907727 870878 794917 887197 925764 851932 937726 914852 914775 897668
1016H97668K8798L4618l2295P3601J8L1963M0373j2523M6221N601J42156O3682
$$ 897668 926466 961084 928789 1002390 1002408 1034371 1074744 1062221 1108442 1114043 1256199 1319881
1004A319881K2061o8943O9495m385N3982L7787q5660Q3034J45059N9589m6241
$$ 1319881 1341942 1272999 1342494 1338109 1392091 1429878 1344218 1427252 1572311 1631900 1585659
993A585659K4063R6522J41793N1090J65043P7049N2388J01621J29538P2853J68993
$$ 1585659 1609722 1706244 1848037 1899127 2064170 2141219 2193607 2295228 2424766 2497619 2666612
982B666612J47271J42032K66473Q9997J80599K05425J80803O3508J64201K15710
$$ 2666612 2813883 2955915 3222388 3312385 3492984 3698409 3879212 3942720 4106921 4322631
972D322631L06196K84511L00387L46661M29078M07320O21664O09951O71619P60164
$$ 4322631 4628827 4913338 5213725 5560386 5989464 6396784 7018448 7628399 8300018 9060182
962I060182P26865Q77447R24581J289439J527029J939083K539134L346411L917402
$$ 9060182 9787047 10664494 11589075 12878514 14405543 16344626 18883760 22230171 26147573
953B6147573M030373L575405K896197M87016k624430k938234k429406l371795
$$ 26147573 30177946 33753351 36649548 37136564 34512134 31573900 29144494 25772699
945B5772699m452267m353276l208831k048623j474615j086570r17935o60382n10242
$$ 25772699 21320432 16967156 13758325 11709702 10235087 9148517 8230582 7570200 7059958
936G059958l88835l10196l93699l66875k55317l77044m06648m03453k33230j41211
$$ 7059958 6671123 6360927 5967228 5600353 5345036 4967992 4561344 4157891 3924661 3783450
926C783450k16375j93368j79465j35470j99166j11217j15795r0930j31619j08659
$$ 3783450 3567075 3373707 3194242 3058772 2859606 2748389 2632594 2541664 2410045 2301386
916B301386q6464r8178j28167j18467k5700j00746j04961K4582j08368n1905o9300
$$ 2301386 2214922 2116744 1988577 1870110 1844410 1743664 1638703 1663285 1554917 1503012 1433712
905A433712o8970j02812n9584J5143l8404O0322J1653j03082j48172r0390K2087
$$ 1433712 1364742 1261930 1202346 1217489 1179085 1239407 1251060 1147978 999806 909416 931503
894I31503M998k8725m0270p771j835p0713k343L4523q4417j6924n3884q1680N2009
$$ 931503 936501 907776 867506 859735 857900 787187 784844 819367 734950 718026 664142 582462 634471
881F34471k628n72M2562m661J0668j20778O6080O7244k4791k2169j66061p445
$$ 634471 631843 631271 673833 669172 679840 559062 625142 692386 667595 645426 479365 471920
869D71920P3230q6904l7518M7434J07241o2977r6862P1623q937j12553Q891P5401
$$ 471920 545150 458246 420728 468162 575403 512426 415564 487187 478250 365697 374588 449989
857D49989j0453n3556o2213J18596j2380j7278n5714Q6694O70j16545j49556p7471
$$ 449989 439536 385980 323767 442363 429983 412705 356991 443685 444355 327810 178254 100783
845A00783J17248L9794M1070j0439l2913k521O5430J1562o6881q2893k0505j4485
$$ 100783 218031 257825 298895 288456 255543 253022 318452 330014 263133 180240 159735 145250
833A45250L7700N2011n7665q8594P0477O0502o0719j4925p7426O0118Q5214r950
$$ 145250 182950 234961 177296 88702 159179 219681 158962 144037 66611 126729 211943 201993
821B01993k1007J816O105j05653K4820n8746L1257J20422J2729o7146n1324J09655
$$ 201993 180986 182802 188907 83254 108074 49328 80585 201007 213736 146590 95266 204921
809B04921M0457m9459j24911K4238K6590p1413R0264K0912p5789M9800M7153n4437
$$ 204921 245378 195919 71008 95246 121836 50423 140687 161599 85810 135610 182763 128326
797A28326l6480J06046o1375m6095j9867L9377J23503J9660j75359p936J7684
$$ 128326 91846 197892 136517 90422 70555 109932 233435 253095 77736 69800 87484
786H7484o254Q750n0575k6657P9843o109K3660k6627m2430P28l0536L2760p3465
$$ 87484 81230 89980 39405 12748 92591 86482 110142 83515 41085 41813 11277 44037 -29428
773b9428k3894J22031r231J03030Q043j71596M8079k9262n9898j095Q5677K2388
$$ -29428 -53322 68709 59478 162508 170551 -1045 47034 17772 -42126 -43221 42456 64844
761F4844k4070q4484l6455L7845Q4656M1548j4280n6469j748n6953j3492l9819
$$ 64844 40774 -43710 -80165 -42320 42336 83884 69604 13135 11387 -45566 -59058 -98877
749i8877K3592j952P7267K232n4859O2926K665k3563j3977r404N7363l3001M3398
$$ -98877 -75285 -77237 30 2262 -52597 10329 12994 -10569 -24546 -33950 23413 -9588 33810
736C3810r7925m2419Q1650J124j8845q8150M0390Q3289J41834m0665o3530n5874
$$ 33810 -64115 -106534 -24884 -23760 -42605 -130755 -90365 -7076 134758 94093 30563 -25311
724b5311L5570N8214K248j25908o425P0084k8986N7225k5688r1365K8529K0589
$$ -25311 10259 68473 70721 -55187 -61612 8472 -20514 36711 11023 -80342 -51813 -31224
712c1224N2202j7656N7590n2421n5905J938L8932K9146q1130J9797k9500P3143
$$ -31224 20978 3322 60912 8491 -47414 -45476 -6544 22602 -58528 -38731 -68231 4912
700D912k55L3921n5168M3033l5841J1164K21j5313R669k2010M7484o2113P0497
$$ 4912 4657 38578 -16590 26443 -9398 1766 1987 -13326 -3657 -25667 21817 -40296 30201
687C0201n1258Q299k3991P0750k7971l6267Q9321n499j6089k9920P6p7651P0452
$$ 30201 -21057 -12758 -36749 34001 6030 -30237 59084 53585 37496 7576 7652 -69999 453
674D53J6078p8511J4099J01749K9098l9655L4223K1683k3304M7300J1451M8791
$$ 453 16531 -61980 -47881 53868 82966 43311 77534 99217 75913 123213 134664 183455
662A83455k7039r5962K7081q5695O457M1225k5691J0167P252K1257n535J07581
$$ 183455 156416 60454 87535 1840 8297 49522 23831 33998 41250 62507 56972 164553
650A64553r2522r741j7089n0670M74O2887l5626j17444l9779k1847J16128k8381
$$ 164553 72031 62290 45201 -5469 -4995 57892 22266 -95178 -134957 -156804 -40676 -69057
638f9057O0700J7633l2856K2834j3132O0967j470q6603m875N5970K0303j08074
$$ -69057 -8357 9276 -23580 -746 -13878 47089 45619 -40984 -45859 10111 30414 -77660
626g7660Q64O2250j1563m6099l3190O5890p960K8675M2048p6266o5149J1127J9157
$$ -77660 -76796 -14546 -26109 -72208 -105398 -39508 -47468 -18793 23255 -53011 -118160 -107033 -87876
613h7876j26152L1782J01220M3016j9450P3536K5287L0538q3085o2748P8379k1290
$$ -87876 -214028 -182246 -81026 -38010 -57460 16076 41363 71901 -11184 -73932 4447 -16843
601a6843r2063M8599J4185o0145l6804m6025O4268Q4823J2929m1052J5950J6823
$$ -16843 -108906 -60307 -46122 -106267 -143071 -189096 -124828 -40005 -27076 -68128 -52178 -35355
589c5355j776j40662p372J79004M0245j32422L2219M9916N0236L1727m6375M9948
$$ -35355 -37131 -177793 -185165 -6161 34084 -98338 -66119 -16203 34033 65760 19385 69333
577F9333m5039r752n9882j03058o241l0849n4938J86876M7694J0287m886j9540
$$ 69333 24294 14542 -45340 -148398 -154639 -185488 -240426 -53550 -5856 4431 -455 -19995
565a9995k3545n3530M7880L3790k6865m0536n096q7612O1483O9649m3384M428
$$ -19995 -43540 -97070 -49190 -15400 -42265 -82801 -87897 -175509 -114026 -44377 -87761 -83333
553h3333M5323N080l2424j14841M6599J3937K2665J5379N1962M4718Q743l2233
$$ -83333 -38010 -32930 -65354 -180195 -133596 -119659 -96994 -81615 -29653 15065 23808 -8425
541h425o8966O698n6294n1668N057m239l6567n206J28568L8016k5004p660L9373
$$ -8425 -77391 -70693 -126987 -178655 -173598 -177837 -214404 -219610 -91042 -53026 -78030 -85690 -46317
528d6317j04864J9392r250o7701L3865P1875k2715L952L5941K4002n2077K993
$$ -46317 -151181 -131789 -141039 -208740 -174875 -103000 -125715 -121763 -85822 -61820 -113897 -110904
516a10904O1376L0429L1253l2754k7952l7078R3632j03304m631J27809j0079M069
$$ -110904 -49528 -19099 12154 -20600 -48552 -85630 8002 -95302 -99933 27876 17797 21866
504B1866l9702j36622p3225O7382J42772j0202j6659m8455M45m9113M1662l7152
$$ 21866 -17836 -154458 -227683 -160301 -17529 -27731 -44390 -92845 -92400 -141513 -99851 -137003
492a37003J7381N911N1886q977l1374K2968Q8139j0512p3256q6441K0334K5242
$$ -137003 -119622 -113711 -61825 -70802 -102176 -79208 8931 -1581 -74837 -161278 -140944 -115702
480a15702R097J01986n8252j0492k3839J443O4987l370q1703j2484J10191L4310
$$ -115702 -106605 -4619 -62871 -73363 -97202 -95759 -30772 -34142 -115845 -128329 -18138 16172
468A6172l9007k0779M5599j5441n1424P83o9494q6998O9445P6315K4815K8422
$$ 16172 -22835 -43614 1985 -13456 -64880 -64097 -133591 -220589 -151144 -74829 -50014 -21592
456b1592p3272k0986L1036J0858L2171L3138j0413p2873o3335J0331J1867K2306
$$ -21592 -94864 -115850 -84814 -73956 -41785 -8647 -19060 -91933 -155268 -144937 -133070 -110764
444a10764l8123J17449n5495N3931l0788J0337l9101J134o0564M7810j2471j1160
$$ -110764 -148887 -31438 -86933 -33002 -63790 -53453 -92554 -91420 -151984 -104174 -116645 -127805
432a27805l3077K9336O5886J178k7346K3131M3294J4997K8193k8992q9447k334
$$ -127805 -160882 -131546 -65660 -64482 -91828 -68697 -25403 -10406 17787 -11205 -100652 -102986
420a02986L5258m1265O1519K0797L6923N1755m8883p0089p332K3074L5067p5129
$$ -102986 -67728 -108993 -47474 -26677 10246 62001 13118 -56971 -64303 -41229 -6162 -81291
408h1291N4544l3517p6590P4078L4915j2733O8797p8673J3671K4540L0186Q1366
$$ -81291 -26747 -60264 -136854 -62776 -27861 -40594 28203 -50470 -36799 -12259 17927 99293
396I9293j08145j9631j00766q2510Q5532Q713n220N8023J5274p6455L5771o7543
$$ 99293 -8852 -28483 -129249 -211759 -126227 -117514 -122734 -64711 -49437 -125892 -90121 -157664
384a57664O4578o5704k481j3568K7328J17346Q7690q3497n3821k3953N2777m6847
$$ -157664 -93086 -158790 -161271 -174839 -147511 -30165 57525 -25972 -79793 -103746 -50969 -97816
372i7816P6786L8449L6327n135j11431p0107N7495J9309j9820q9447L505R7289
$$ -97816 -21030 17419 53746 48611 -62820 -132927 -75432 -56123 -75943 -165390 -161885 -64596
360f4596J1827L33R62K0765o1320n698J0300K1758q3725p6628O042J01726K005
$$ -64596 -52769 -52436 -51474 -30709 -92029 -97727 -87427 -65669 -149394 -226022 -219980 -118254 -116249
347a16249l2912M6894k4493N0035n978j39782K6345M2414J09827J0245r0885m571
$$ -116249 -149161 -102267 -126760 -76725 -82703 -222485 -196140 -153726 -43899 -33654 -124539 -129110
335a29110P9272j204P9920p5686L3842l2478p7729n2215M2841K8838M1182L0159
$$ -129110 -49838 -51042 28878 -46808 -12966 -45444 -123173 -175388 -132547 -103709 -62527 -32368
323c2368n7315k6699J8609L8721l2144K587j1961P695J11970l1841m9309q3604
$$ -32368 -89683 -116382 -97773 -59052 -91196 -88609 -100570 -92875 19095 -12746 -62055 -145659
311a45659J2138K4904N1079Q7340Q095R263j28432l088O1164k6959l1018q086
$$ -145659 -133521 -108617 -57538 29802 37897 47160 -81272 -84360 -23196 -50155 -81173 -89259
299h9259j3428K968m2348Q651M2395k7294j775J5127M7569j8106j2463k6195K6341
$$ -89259 -102687 -99719 -142067 -133416 -91021 -118315 -120090 -104963 -57394 -75500 -87963 -114158 -87817
286h7817l9153o5141l1022l3557J15446q345N8302M1656o599j8303o8169n4477
$$ -87817 -126970 -192111 -223133 -256690 -141244 -149589 -91287 -49631 -56230 -74533 -142702 -197179
274a97179q943L4252j7727J5676J30662p4473m5273p314J1689N3983L6189K5132
$$ -197179 -206122 -171870 -189597 -173921 -43259 -117732 -163005 -170319 -158630 -104647 -68458 -43326
262d3326j20591O2973M6568n3676J3860N7338K0711j2557l4146j1081K302l2603
$$ -43326 -163917 -100944 -54376 -108052 -94192 -36854 -16143 -28700 -62846 -73927 -71625 -104228
250a04228k7021P1252K0269n8730N8425o41j5595p1440K1393K8864m2614K3659
$$ -104228 -131249 -59997 -39728 -98458 -40033 -40674 -56269 -127709 -106316 -77452 -120066 -96407
238i6407K9585m2142l6998M942l1619j5239M14K924j1622K5278M1840Q5849r566
$$ -96407 -66822 -108964 -145962 -141020 -172639 -187878 -187464 -184540 -196162 -170884 -129044 -43195 -52761
225e2761m9580k6342k0298j2507p8274N1684J7377k7835Q762m195N3059k6032
$$ -52761 -102341 -128683 -148981 -161488 -239762 -188078 -170701 -198536 -189774 -193969 -140910 -166942
213a66942J8101K3857k1530k4060L3839k1302L8004k5283L9866p3667k7288P5490
$$ -166942 -148841 -124984 -146514 -170574 -136735 -158037 -120033 -145316 -105450 -179117 -206405 -130915
201a30915p7051M7046K733Q197K8155K3128m7888K0938j1350m8884J8385j0677
$$ -130915 -207966 -160920 -158187 -149990 -121835 -98707 -146595 -125657 -137007 -185891 -167506 -178183
189a78183k8091Q7075k4795O52J5705O5262L2077l4985n0117l6022j7516m6567
$$ -178183 -206274 -119199 -143994 -143342 -127637 -62375 -30298 -65283 -115400 -151422 -168938 -215505
177b15505L6839j6964L3809R9275l1701k1916j17505L1386J8535L0435O5137m7272
$$ -215505 -178666 -195630 -161821 -62546 -94247 -116163 -233668 -202282 -183747 -153312 -88175 -135447
165a35447J24961p6748j0610m9913Q8953m3766j21290l245M2845N3102o9023J3944
$$ -135447 -10486 -87234 -97844 -147757 -58804 -102570 -223860 -227105 -184260 -131158 -200181 -186237
153a86237P640L8871l3363O3508j15789n6025M6278K4894L4046j641l4936K0736
$$ -186237 -178597 -139726 -173089 -109581 -225370 -281395 -235117 -210223 -176177 -177818 -212754 -192018
141a92018j2779n5338j3900N6761q384J06351L2827j9413m2672L8570j1043n3704
$$ -192018 -204797 -260135 -274035 -217274 -225658 -119307 -86480 -105893 -148565 -109995 -121038 -174742
129a74742L6235j32133J1013M1088J10327K4042n1044l3670J39629m7879k7754
$$ -174742 -138507 -270640 -259627 -218539 -108212 -84170 -135214 -168884 -29255 -77134 -104888
118a04888j9041m1942p9291N2059N5074l8656j563j8301M959k7812J06526j6497
$$ -104888 -123929 -165871 -245162 -193103 -138029 -176685 -178248 -196549 -191590 -219402 -112876 -129373
106a29373m2477K1275l6693L1352L9876N5368m2155j4904J2833p8600J4875q596
$$ -129373 -171850 -150575 -187268 -155916 -116040 -60672 -102827 -117731 -104898 -183498 -168623 -177219
94a77219l3379N0813P6207n4857K31L099Q383j0624K9437L0696l140j6461j9328
$$ -177219 -210598 -159785 -83578 -138435 -138204 -135105 -126722 -137346 -107909 -77213 -80353 -96814 -116142
81a16142n5813N687m9874J2138P6832k750l4241l7584N2387K4644o7002N271o9852
$$ -116142 -171955 -166268 -216142 -204004 -127172 -129922 -164163 -201747 -149360 -124716 -191718 -186447 -256299
68b56299K8269J6084K3419J8483m4435M2963J5903N6310o0904q890q5641Q4219
$$ -256299 -228030 -211946 -188527 -170044 -214479 -171516 -155613 -99303 -160207 -169097 -254738 -170519
56a70519q2726L281J5490O9430q249J4597J803n4799k2203L2636K9263o2923q9481
$$ -170519 -253245 -249964 -234474 -165044 -173293 -158696 -156893 -211692 -233895 -201259 -171996 -234919 -324400
43c24400J1357J13811l85P927j7997P836l0967l2933l3753O2656K7689q0701m1949
$$ -324400 -313043 -199232 -199617 -191690 -209687 -201851 -232818 -265751 -299504 -236848 -209159 -289860 -331809
30c31809O1657K7913p326K6175M320K43j5174J7525L5557k2530J3242q007L0247
$$ -331809 -270152 -242239 -249565 -223390 -219070 -218827 -234001 -216476 -180919 -203449 -190207 -198214 -167967
17a67967o120o1554o57M4965l7890k0166N2724M1631K8965Q972p878p3430M2142
$$ -167967 -174087 -235641 -236298 -191333 -229223 -249389 -196665 -155034 -126069 -117097 -124975 -198405 -156263
4a56263N0546l9487o4736M885
$$ -156263 -105717 -145204 -209940 -205055
0b05055
$$ -205055
$$ Imaginary data points
##PAGE= N=2
##DATA TABLE= (X++(I..I)), XYDATA
16383b550364O7839m170M6421l2171P9860K1580l9341J7291R3203K5238O0367
$$ -2550364 -2482525 -2486695 -2440274 -2472445 -2392585 -2371005 -2410346 -2393055 -2299852 -2274614 -2214247
16372b214247M141N843l748p568O3453N4389J40818k731n794M8828k5626j9281
$$ -2214247 -2210106 -2204263 -2208011 -2215579 -2152126 -2097737 -1956919 -1959650 -1965444 -1916616 -1942242 -1961523
16360a961523j6346P1539Q2794p698j8023l231O4583M9967N0379J3346j6074q649
$$ -1961523 -1977869 -1906330 -1823536 -1831234 -1849257 -1852488 -1787905 -1737938 -1687559 -1674213 -1690287 -1698936
16348a698936K6628L7545M3569K5740N0010J9444K1326J7220k0857N9627R7185
$$ -1698936 -1672308 -1634763 -1591194 -1565454 -1515444 -1496000 -1474674 -1457454 -1478311 -1418684 -1321499
16337a321499r951k3840J7629O7407m1044n5019J6521P1420P0765O1495O856L9521
$$ -1321499 -1331450 -1355290 -1337661 -1270254 -1311298 -1366317 -1349796 -1278376 -1207611 -1146116 -1139260 -1099739
16325a099739J847K1929O7497K7210q620J5554J442K8920J2268K0034M5355K6697
$$ -1099739 -1097892 -1075963 -1008466 -981256 -989876 -974322 -972880 -943960 -931692 -911658 -866303 -839606
16313h39606m6497l2968O8360M2754J9249Q923l7266N4711M8856J4420J9456N6195
$$ -839606 -886103 -919071 -850711 -807957 -788708 -779785 -817051 -762340 -713484 -699064 -679608 -623413
16301f23413M0801n428P808L4744o1555J7626O3073o812P5311M539O3160p303
$$ -623413 -582612 -588040 -580232 -545488 -607043 -589417 -526344 -533156 -457845 -453306 -390146 -397449
16289c97449k0788N2117M2315J7220j1843n9050r672P4064K4529Q968M1984J33788
$$ -397449 -418237 -366120 -323805 -306585 -318428 -377478 -387150 -313086 -288557 -279589 -237605 -103817
16277a03817l0525n2350O009M5681O0052K0368l1552o96J6993P6738J5793O839
$$ -103817 -134342 -186692 -180683 -135002 -74950 -54582 -86134 -86830 -69837 6901 22694 29533
16265B9533J6082n0454M6508K2809P528O4762M4218m4989m8868N8650N8969o0882
$$ 29533 45615 -4839 41669 64478 72006 136768 180986 135997 87129 145779 204748 143866
16253A43866J552L054M8878j3562K8221O9701J5074l5978N2174j02481L8938J8717
$$ 143866 145418 148472 197350 183788 212009 281710 296784 260806 312980 210499 249437 268154
16241B68154N6254R8618k4286q4977N2071J69287j7637l4042L9448j5375m0438
$$ 268154 324408 423026 398740 313763 365834 535121 517484 483442 522890 507515 467077
16230D67077k5390L0214J5338N2414N4619K120N1535m7409J2687J8342o3293P1756
$$ 467077 441687 471901 487239 539653 594272 596392 647927 600518 613205 631547 568254 640010
16218F40010J4284p2337M5345M8450K6130J4839J01271j8097p9432j00026J6266
$$ 640010 654294 581957 627302 675752 701882 716721 817992 799895 720463 620437 636703
16207F36703M5100P2188r2323m0794P7823R5807l1415l8942j909L2117O5742o6707
$$ 636703 681803 753991 661668 620874 698697 794504 763089 724147 722238 754355 820097 753390
16195G53390M2186L7510j1425p954K1759K7082l1709M4417n109N9792M7332n7664
$$ 753390 795576 833086 821661 813707 835466 862548 830839 875256 870147 929939 977271 919607
16183I19607j790N2856j2697r1713O2941r447l3093p8274R5319J9244k3191J77307
$$ 919607 917817 970673 957976 866263 929204 919757 886664 808390 903709 922953 899762 1077069
16171A077069j3373j27017l030M2170R946q5940p0675O3589J08550k3559p2542
$$ 1077069 1063696 936679 933649 975819 985765 899825 829150 892739 1001289 977730 905188
16160I05188m8070J21376N0769o7092L7872j2261M8841n135N0783J08001L8223
$$ 905188 857118 978494 1029263 962171 1000043 987782 1036623 1031488 1082271 1190272 1228495
16149A228495j10065q4329M2717K0722O076J17320o4264p4864N4707M8787J8372
$$ 1228495 1118430 1034101 1076818 1097540 1103616 1220936 1156672 1081808 1136515 1185302 1203674
16138A203674q489r5547q817k3203o3104Q2469J14124k9512j81485R3528J28215
$$ 1203674 1195185 1099638 1090821 1067618 1004514 1086983 1201107 1171595 990110 1083638 1211853
16127A211853N7553n8323l0333j07949N5719L5104J6620p5524L4618Q7531k9717
$$ 1211853 1269406 1211083 1180750 1072801 1128520 1163624 1180244 1104720 1139338 1226869 1197152
16116A197152L2737L3914M9926M130p0557j10142k8558O8430M3897M0940L7305
$$ 1197152 1229889 1263803 1313729 1317859 1247302 1137160 1108602 1177032 1220929 1261869 1299174
16105A299174r5483J3471j09996K8236J28005r6789K9647Q3175R63o8233k135
$$ 1299174 1203691 1217162 1107166 1135402 1263407 1166618 1196265 1279440 1280403 1212170 1210035
16094A210035Q1146n8674K9206O4570j9291J9505p5123J3158j0654k3550o3739
$$ 1210035 1291181 1232507 1261713 1326283 1306992 1326497 1251374 1264532 1253878 1230328 1166589
16083A166589M2391O5788l248j4029L8685k0404R605l6622m9737M7131r8921N1905
$$ 1166589 1208980 1274768 1271520 1257491 1296176 1275772 1285377 1248755 1199018 1246149 1147228 1199133
16071A199133R0392n2023l4693O9296k64J6883m5800L6460p9017k4792j1443J5312
$$ 1199133 1289525 1237502 1202809 1272105 1271841 1288724 1242924 1279384 1200367 1175575 1164132 1179444
16059A179444j0850R601Q7841R853k2992L0045q3171N5841l2288k215k4517K0507
$$ 1179444 1168594 1178195 1266036 1275889 1252897 1282942 1199771 1255612 1223324 1221109 1196592 1217099
16047A217099N388L9800M550p3452Q4851k4747M2223Q3070l2562j298l6504n8168
$$ 1217099 1222487 1262287 1266837 1193385 1278236 1253489 1295712 1378782 1346220 1344922 1308418 1250250
16035A250250q370L4669l8393O0658K9427j19806O43P0907o8693L9232Q6943n8004
$$ 1250250 1241880 1276549 1238156 1298814 1328241 1208435 1209078 1279985 1211292 1250524 1337467 1279463
16023A279463m9041k15372R5896J7304M4241P4827J19504M8229j13247r438l4108
$$ 1279463 1230422 1015050 1110946 1128250 1172491 1247318 1366822 1415051 1301804 1292366 1258258
16012A258258j6025l5674n0461Q0296k6199J4908P5481k7310O6408M2448j09535
$$ 1258258 1242233 1206559 1156098 1236394 1210195 1225103 1300584 1273274 1339682 1382130 1272595
16001A272595k9613O7905Q5370o7865j439l4159n9894k0411J12373M9281j25990
$$ 1272595 1242982 1310887 1396257 1328392 1326953 1292794 1232900 1212489 1324862 1374143 1248153
15990A248153N4430J0914M5202l7132j8277m4365L9987m84n8968N0788O873m0831
$$ 1248153 1302583 1313497 1358699 1321567 1303290 1258925 1298912 1298428 1239460 1290248 1297121 1256290
15978A256290O915m218L2728K4073o5252j3780N5120r1155J24639L9518q0671
$$ 1256290 1263205 1258987 1291715 1315788 1250536 1236756 1291876 1200721 1325360 1364878 1284207
15967A284207M0747j42443O8274J7413K985l767J3685j0674j9451j5951P8855
$$ 1284207 1324954 1182511 1250785 1268198 1271183 1267416 1281101 1270427 1250976 1235025 1313880
15956A313880m7510m4578o0460k1799Q2260l3693J0211O3515J3936j6945j098
$$ 1313880 1266370 1221792 1161332 1139533 1221793 1188100 1198311 1261826 1275762 1258817 1257719
15945A257719L4604L1367k1462n9676L9403j05877n1888Q5125J07369J6272o3238
$$ 1257719 1292323 1323690 1302228 1242552 1281955 1176078 1124190 1209315 1316684 1332956 1269718
15934A269718N1867R396p0264l3969K9488L2423Q579J0164P3429Q6158k7846j30790
$$ 1269718 1321585 1330981 1260717 1226748 1256236 1288659 1297238 1307402 1380831 1466989 1439143 1308353
15922A308353M0053Q610l4767n8992J0035n102Q172r0107M8519J6405o255K9708
$$ 1308353 1348406 1357016 1322249 1263257 1273292 1268190 1276362 1186255 1234774 1251179 1244924 1274632
15910A274632O6977J1704p3773M9682J1705o0601k929N9688L0502k0369n7641
$$ 1274632 1341609 1353313 1279540 1329222 1340927 1280326 1277397 1337085 1367587 1347218 1289577
15899A289577M6038n0934r5299m1566Q7722M0495l5738L5282L1920N1095k8712
$$ 1289577 1335615 1284681 1189382 1147816 1235538 1276033 1240295 1275577 1307497 1358592 1329880
15888A329880R062k0632l9256j0305j5829Q6651J20992m2273l3070m5678n0010
$$ 1329880 1338942 1318310 1279054 1268749 1252920 1339571 1460563 1418290 1385220 1339542 1289532
15877A289532k4900o0842J06841J3089L175O500K10L7062K8863q6788O619o0648
$$ 1289532 1264632 1203790 1310631 1323720 1326895 1333395 1333605 1370667 1399530 1312742 1319361 1258713
15865A258713n6302j8985J12202L8446l7498o262J64J5325j414j4332r478p3728
$$ 1258713 1202411 1183426 1295628 1334074 1296576 1290314 1290478 1305803 1304389 1290057 1280579 1206851
15853A206851o0697R5730K3910P7385j0315K2780q882J8826j3012m2621M7392
$$ 1206851 1146154 1241884 1265794 1343179 1332864 1355644 1346762 1365588 1352576 1309955 1357347
15842A357347j2382k9331n955k2816L8647m3912q1894O3232p824m4727r20J5051
$$ 1357347 1344965 1315634 1309679 1286863 1325510 1281598 1199704 1262936 1255112 1210385 1209465 1224516
15830A224516P3773j9079j8850p643J13366M467o6051k0592l0872J5597L2482
$$ 1224516 1298289 1279210 1260360 1252717 1366083 1370550 1304499 1283907 1253035 1268632 1301114
15819A301114K052r085m1994p029j846Q9128o5023L0851l1369m6108L7966L6659
$$ 1301114 1303166 1294081 1252087 1245058 1243212 1332340 1267317 1298168 1266799 1220691 1258657 1295316
15807A295316P7787m4301j6049K0486o6993O4239m5436K6580K6325o1363N4635
$$ 1295316 1373103 1328802 1312753 1333239 1266246 1330485 1285049 1311629 1337954 1276591 1331226
15796A331226K3362o9846K1696N7049o6220R1065m9812K3980M8104q9641m2314
$$ 1331226 1354588 1284742 1306438 1363487 1297267 1388332 1338520 1362500 1410604 1320963 1278649
15785A278649N7777n8983r1957Q1882N4661q7416K9115n0121l6344M9704M3703
$$ 1278649 1336426 1277443 1185486 1267368 1322029 1234613 1263728 1213607 1177263 1226967 1270670
15774A270670L4402l2915R1420k5401q329k9164j7724O6421Q057M1833n8828k1515
$$ 1270670 1305072 1272157 1363577 1338176 1329847 1300683 1282959 1349380 1357437 1399270 1340442 1318927
15762A318927q359N2055j1045N8460k4078q4461j951O5191O180j29469O5511J13944
$$ 1318927 1310568 1362623 1351578 1410038 1385960 1301499 1299548 1364739 1370919 1241450 1306961 1420905
15750A420905k3879o1397n7431K4466m3875K3122Q5020l2971O071p7073q718N4949
$$ 1420905 1397026 1335629 1278198 1302664 1258789 1281911 1366931 1333960 1340031 1262958 1254240 1309189
15738A309189K1710P2922j08554N3827M302K0141n1439O9793k0940r138r3502
$$ 1309189 1330899 1403821 1295267 1349094 1353396 1373537 1322098 1391891 1370951 1361813 1268311
15727A268311m8217K7295Q150M3257o2279M2081K6540J5613k6509m6442J1481
$$ 1268311 1220094 1247389 1255539 1298796 1236517 1278598 1305138 1320751 1294242 1247800 1259281
15716A259281M5289m1020m8504R2350j38985k0692J15348n2593K9563n6664J15064
$$ 1259281 1304570 1263550 1215046 1307396 1168411 1147719 1263067 1210474 1240037 1183373 1298437
15705A298437K6877q978K2507l1476J2436L9338j9733O9739n4093n4322J3965
$$ 1298437 1325314 1316336 1338843 1307367 1319803 1359141 1339408 1409147 1355054 1300732 1314697
15694A314697j4149R4087O417o7212m2028m3767M8095r04O1358K4873J2487J1973
$$ 1314697 1300548 1394635 1401052 1333840 1291812 1248045 1296140 1295236 1356594 1381467 1393954 1405927
15682A405927m5131L1101l6095n3904K6469p7754M4187o9p738J4476l2565K6727
$$ 1405927 1360796 1391897 1355802 1301898 1328367 1250613 1294800 1294731 1286993 1301469 1268904 1295631
15670A295631J1575K7632l9763k8302k3796Q1003j5792r9647O5006J18780o3685
$$ 1295631 1307206 1334838 1295075 1266773 1242977 1323980 1308188 1208541 1273547 1392327 1328642
15659A328642l2148O309P1110M4242m1989n158o7107J0276M6721q3442J533O0196
$$ 1328642 1296494 1302803 1373913 1418155 1376166 1371008 1303901 1314177 1360898 1277456 1278989 1339185
15647A339185k2896j8696l033L6350p4331J01342o0027J2506L851L4256m6113
$$ 1339185 1316289 1297593 1294560 1330910 1256579 1357921 1297894 1310400 1314251 1348507 1302394
15636A302394l3655O261n4614N0175o8135L919J7398P6486n0854O091l0057M0611
$$ 1302394 1268739 1275000 1220386 1270561 1202426 1206345 1223743 1300229 1249375 1255466 1225409 1266020
15624A266020R3473l3992n1726R4940k4335p3720p039J4854j884l7614M5685k0463
$$ 1266020 1359493 1325501 1273775 1368715 1344380 1270660 1263621 1278475 1276591 1238977 1284662 1264199
15612A264199j4163J7444J2482l0737N8334j5209l1749N1140Q3786j0825q8281
$$ 1264199 1250036 1267480 1279962 1249225 1307559 1292350 1260601 1311741 1395527 1384702 1296421
15601A296421r158Q5824m910N5343m7051n4721M0089J6738n6637l3641J3662N2546
$$ 1296421 1287263 1373087 1368177 1423520 1376469 1321748 1361837 1378575 1321938 1288297 1301959 1354505
15589A354505L8396N846q9529j7332L7861Q1792p5512k2534O167L2663j7330p1873
$$ 1354505 1392901 1398747 1309218 1291886 1329747 1411539 1336027 1313493 1319660 1352323 1334993 1263120
15577A263120l3829L6859J36674L7299j6527p4894j0711m6795j9019l5612J0872
$$ 1263120 1229291 1266150 1402824 1440123 1423596 1348702 1337991 1291196 1272177 1236565 1247437
15566A247437Q9174J10895r5244L2487J832L2661m3738j6861K8794l8652J3640
$$ 1247437 1336611 1447506 1352262 1384749 1386581 1419242 1375504 1358643 1387437 1348785 1362425
15555A362425k8813o3202l3444l7077J7102J6044P4195o7789L7059J05683N3301
$$ 1362425 1333612 1270410 1236966 1199889 1216991 1233035 1307230 1239441 1276500 1382183 1435484
15544A435484k8988n9311n6987k1662m2984K4058M9287K9055q1590m2393Q1712
$$ 1435484 1406496 1347185 1290198 1268536 1225552 1249610 1298897 1327952 1246362 1203969 1285681
15533A285681L1349j595L3221J2299L9367N335l3272r0322n1185K7154N324P585
$$ 1285681 1317030 1315435 1348656 1360955 1400322 1405657 1372385 1282063 1230878 1258032 1263356 1270941
15521A270941n3631R5107k5987J8971m223L329M2657P4913l7903l7132q801L7756
$$ 1270941 1217310 1312417 1286430 1305401 1301178 1304507 1347164 1422077 1384174 1347042 1338241 1375997
15509A375997M8717j04578M2922P104p5639R5109l920k4576l7630K6153j1668
$$ 1375997 1424714 1320136 1363058 1370162 1294523 1389632 1385712 1361136 1323506 1349659 1337991
15498A337991q6148J2746p9720N2324L1667k9452O9296p094j9628R004L9802K3949
$$ 1337991 1251843 1264589 1184869 1237193 1268860 1239408 1308704 1301610 1281982 1290986 1330788 1354737
15486A354737j682l2225n393Q8907N1510j10051r6214O5769L9296M685q165M610
$$ 1354737 1353055 1320830 1315437 1404344 1455854 1345803 1249589 1315358 1354654 1359339 1351174 1355784
15474A355784J2767L2111R535n2655j18073m147J5962N9905R5471K6507o313n4138
$$ 1355784 1368551 1400662 1410197 1357542 1239469 1235322 1251284 1311189 1406660 1433167 1426854 1372716
15462A372716K0410J1910o3502o611l8748M0993k1266L8217p1657q9971J43141
$$ 1372716 1393126 1405036 1341534 1334923 1296175 1337168 1315902 1354119 1282462 1192491 1335632
15451A335632K4003Q38L600l06K9948m3261j5665l061J7350J15454q0599m8639
$$ 1335632 1359635 1360473 1364073 1363767 1393715 1350454 1334789 1331728 1349078 1464532 1383933 1335294
15439A335294K3966L6768p4918M2057j6649m7063L9292k8597j3022M8030L8133
$$ 1335294 1359260 1396028 1321110 1363167 1346518 1299455 1338747 1310150 1297128 1345158 1383291
15428A383291q3612L6841n6432J4416n1791m0600R7314N8447o3436M0774J31894
$$ 1383291 1299679 1336520 1280088 1294504 1242713 1202113 1299427 1357874 1294438 1335212 1467106
15417A467106j34826l5299K0649N1619m1324J9575j933O3528K792L1486n4974
$$ 1467106 1332280 1296981 1317630 1369249 1327925 1347500 1345567 1409095 1411887 1443373 1388399
15406A388399m4818l256P2668j23155k0542J08199l1766J98p4249M2195k4044
$$ 1388399 1343581 1340325 1412993 1289838 1269296 1377495 1345729 1345927 1271678 1313873 1289829
15395A289829K0677J5640J7382J03548j6692j63379j36381R3044P9534m4232R3138
$$ 1289829 1310506 1326146 1343528 1447076 1430384 1267005 1130624 1223668 1303202 1258970 1352108
15384A352108Q0547j08309k6685R0694L0495n0291k253J9139J26820M6087r7268
$$ 1352108 1432655 1324346 1297661 1388355 1418850 1368559 1366306 1385445 1512265 1558352 1461084
15373A461084j9590J0618r9296p4562j7547N901Q7164m6353P7458N6810r9805
$$ 1461084 1441494 1452112 1352816 1278254 1260707 1266608 1353772 1307419 1384877 1441687 1341882
15362A341882k5690N9152Q8834j6892o2144j067m9065K7930j02692l5970n4663
$$ 1341882 1316192 1375344 1464178 1447286 1385142 1384075 1335010 1362940 1260248 1224278 1169615
15351A169615N9504K6594Q599J07530l8409o2171N3760K6959q606n6190j9996
$$ 1169615 1229119 1255713 1264312 1371842 1333433 1271262 1325022 1351981 1343375 1287185 1267189
15340A267189L8867J3837O2380m4711k6835L9593j0386L9859R336m6956n806K9644
$$ 1267189 1306056 1319893 1382273 1337562 1310727 1350320 1339934 1379793 1389129 1342173 1336367 1366011
15328A366011L9903o9921j6509M2472j01j1488K2071l4508j37402O7641M8165
$$ 1366011 1405914 1335993 1319484 1361956 1361855 1350367 1372438 1337930 1200528 1268169 1316334
15317A316334k3628m6231N5336j0129M9861J03959L1451p885l9341m00K1080j69599
$$ 1316334 1292706 1246475 1301811 1291682 1341543 1445502 1476953 1469068 1429727 1429327 1450407 1280808
15305A280808J700R9383m8924j7057o085L2357o2364J02298N5737k9203k7084
$$ 1280808 1282508 1381891 1332967 1315910 1309825 1342182 1279818 1382116 1437853 1408650 1381566
15294A381566K2772l0239q8303P7621J00350L0413k7916m4730o3865K6895j8892
$$ 1381566 1404338 1374099 1285796 1363417 1463767 1494180 1466264 1421534 1357669 1384564 1365672
15283A365672j19946j7883J334L472O9875l515m4794P5512N0528p728j4939J3134
$$ 1365672 1245726 1227843 1229177 1232649 1302524 1299009 1254215 1329727 1380255 1372527 1357588 1370722
15271A370722J6213J3192L669j14157P294R6n1967L2745l5361K7200N4276R0703
$$ 1370722 1386935 1400127 1403796 1289639 1296933 1297029 1245062 1277807 1242446 1269646 1323922 1414625
15259A414625k1675p6649k8570O0729L1290o5065M088J17784l469j02475l7114
$$ 1414625 1392950 1316301 1287731 1348460 1379750 1314685 1318773 1436557 1433088 1330613 1293499
15248A293499N3787j2021k9602P4O4644k9303L5524M7199k6721j08819m7530J3661
$$ 1293499 1347286 1335265 1305663 1305737 1370381 1341078 1376602 1423801 1397080 1288261 1240731 1254392
15236A254392j467N1740j8050J9272Q9116N0701n164m5466o3089K470J457J4472
$$ 1254392 1252925 1304665 1286615 1305887 1395003 1445704 1440540 1395074 1331985 1334455 1335912 1350384
15224A350384J1549j38936j653J31940J19840M55r4968P0097j9006j9268r8146
$$ 1350384 1361933 1222997 1221344 1353284 1473124 1473579 1378611 1448708 1429702 1410434 1312288
15213A312288M4034L4766n7675j7457o784O9599K5631n5006k0714o9773Q1764
$$ 1312288 1356322 1391088 1333413 1315956 1309172 1378771 1404402 1349396 1328682 1258909 1340673
15202A340673M1844M10j01035j6338M3257k1356K7756P6269M3654p941m8068j26763
$$ 1340673 1382517 1382927 1281892 1265554 1308811 1287455 1315211 1391480 1435134 1427193 1379125 1252362
15190A252362K7321N9995k0221j015L2506n9676J874P1050j9166J8410M5953N1380
$$ 1252362 1279683 1339678 1319457 1318442 1350948 1291272 1293146 1364196 1345030 1363440 1409393 1460773
15178A460773K7529j25575k1071M6304P4835k5258R6372o7746l7196q5394p8883
$$ 1460773 1488302 1362727 1341656 1387960 1462795 1437537 1533909 1466163 1428967 1343573 1264690
15167A264690L7994L7140j8207N965N0253r5622M4478J1085p8212j8853J05075
$$ 1264690 1302684 1339824 1321617 1327582 1377835 1282213 1326691 1337776 1259564 1240711 1345786
15156A345786N5383p7415R3737P3316M920n5123J4088m9687m0462M1201p3179
$$ 1345786 1401169 1323754 1417491 1490807 1495727 1440604 1454692 1405005 1364543 1405744 1332565
15145A332565N0625O4792j10926j5614L4458J780M1539p0111O231K073M5587k2184
$$ 1332565 1383190 1447982 1337056 1321442 1355900 1357680 1399219 1329108 1335339 1337412 1382999 1360815
15133A360815M222P1111l6547q1472J3636P6752M794l0430k3421l8484M1917J1222
$$ 1360815 1365037 1436148 1399601 1318129 1331765 1408517 1413311 1382881 1359460 1320976 1362893 1374115
15121A374115Q2229O9245j14775L4182K0391q1939L2451O6235q7646J0335N4179
$$ 1374115 1456344 1525589 1410814 1444996 1465387 1383448 1415899 1482134 1394488 1404823 1459002
15110A459002n9899N824l623n9663k5464r8524j8232J75050k4698j0048o816l0708
$$ 1459002 1399103 1404927 1401304 1341641 1316177 1217653 1199421 1374471 1349773 1339725 1332909 1302201
15098A302201R5164L0554j7666p9991K114M7906L8349N6580k9234q4086M0025
$$ 1302201 1397365 1427919 1410253 1330262 1332376 1380282 1418631 1475211 1445977 1361891 1401916
15087A401916R347q2942M6245k6508m5011r208o0618K7762J48911l2744m4153
$$ 1401916 1411263 1328321 1374566 1348058 1303047 1293839 1233221 1260983 1409894 1377150 1332997
15076A332997J311j2490N444M8129j612J32042j14177o9939L6088M4100j4705
$$ 1332997 1334308 1321818 1327262 1375391 1373779 1505821 1391644 1321705 1357793 1401893 1387188
15065A387188K511O8552n8304n1452j319O6278q8025m5114J2934P7973K2695M707
$$ 1387188 1389699 1458251 1399947 1348495 1347176 1413454 1325429 1280315 1293249 1371222 1393917 1398624
15053A398624o259m6651j5234L0131R9697o4447n4023L1245l3197Q2277K0156
$$ 1398624 1392365 1345714 1330480 1360611 1460308 1395861 1341838 1373083 1339886 1422163 1442319
15042A442319o8282o3160Q8848K6795M3112Q904l9854m6610o1028m5183k9793
$$ 1442319 1374037 1310877 1399725 1426520 1469632 1478536 1438682 1392072 1331044 1285861 1256068
15031A256068J27465K2675l4670r6823M2959M3154p3418O964j961L6268P4369
$$ 1256068 1383533 1406208 1371538 1274715 1317674 1360828 1287410 1294374 1292413 1328681 1403050
15020A403050j1941j60854j5969M8900P5663O5990J6830j3511J5384R9608q0819
$$ 1403050 1391109 1230255 1214286 1263186 1338849 1404839 1421669 1408158 1423542 1523150 1442331
15009A442331m9692N0375N327R3140p9359j37500K6078J29689l1684K7287R53
$$ 1442331 1392639 1443014 1448341 1541481 1462122 1324622 1350700 1480389 1448705 1475992 1476945
14998A476945o6207k9771k386Q4054K5261N85N7258M5448p0099j22271q577J6113
$$ 1476945 1410738 1380967 1378581 1462635 1487896 1488481 1545739 1591187 1521088 1398817 1390240 1406353
14986A406353N2929l1835q9494K5091j6836O3666K938p4628q5940O7794L2703
$$ 1406353 1459282 1427447 1337953 1363044 1346208 1409874 1412812 1338184 1252244 1320038 1352741
14975A352741n3659j3359J14297O359l9988L005N1012O9378q085n601k6033n5701
$$ 1352741 1299082 1285723 1400020 1406379 1366391 1369396 1420408 1489786 1481701 1476100 1450067 1394366
14963A394366P3374l3661L305o200N8418K0279L5931j22240p2010N5341K0699
$$ 1394366 1467740 1434079 1437384 1431184 1489602 1509881 1545812 1423572 1351562 1406903 1427602
14952A427602k0754m3452l0272K7593Q013j6190O3546p2417l1959q650M3564J6777
$$ 1427602 1406848 1363396 1333124 1360717 1368730 1352540 1416086 1343669 1311710 1303060 1346624 1363401
14940A363401J344j0661J58705o132j757j4502M5249n5600p2251r0124N8853k1183
$$ 1363401 1364745 1354084 1512789 1506657 1504900 1490398 1535647 1480047 1407796 1317672 1376525 1355342
$$ [...]
##END NTUPLES=NMR SPECTRUM
##END=
