##TITLE=1H_CG-1139
 CDCl3, 8 sc, 
 22.12.2020
##JCAMPDX= 6.0         $$ Bruker NMR JCAMP-DX V2.0
##DATA TYPE= NMR SPECTRUM
##DATA CLASS= NTUPLES
##ORIGIN= UXNMR, Bruker Analytische Messtechnik GmbH
##OWNER= root
$$ XWIN-NMR		Version 3.5
$$ Tue Dec 22 10:41:03 2020 Russian Standard Time (UT+4h)  she@DPX200
##.OBSERVE FREQUENCY= 200.1315066352
##.OBSERVE NUCLEUS= ^1H
##.ACQUISITION MODE= SIMULTANEOUS
##.ACQUISITION SCHEME= undefined
##.AVERAGES= 8
##.DIGITISER RES= 18
##SPECTROMETER/DATA SYSTEM= spect
##.PULSE SEQUENCE= zg30
##.SOLVENT NAME= CDCl3
##.SHIFT REFERENCE= (INTERNAL, CDCl3, 0, 15.9854)
##AUDIT TRAIL= $$ (NUMBER, WHEN, WHO, WHERE, WHAT)
$$ ##TITLE= Audit trail, XWIN-NMR		Version 3.5
$$ ##JCAMPDX= 5.01
$$ ##ORIGIN= Bruker BioSpin GmbH
$$ ##OWNER= she
$$ F:/spectra/data/she/nmr/H-F/1/pdata/1/auditp.txt
$$ ##AUDIT TRAIL=  $$ (NUMBER, WHEN, WHO, WHERE, WHAT)
(   1,<2020-12-22 10:39:36.01 +0400>,<she>,<DPX200>,
      <created by zg, POWCHK disabled, PULCHK disabled
       configuration hash MD5:
       00 E9 B6 7A A2 85 ED C7 34 08 36 98 17 FE 4E 26
       data hash MD5: 16K
       B6 60 AB 1C 0F 1A 3A FD D9 DF 0A E1 D8 81 86 8B>)
(   2,<2020-12-22 10:40:00.59 +0400>,<she>,<DPX200>,
      <Start of raw data processing
       efp BC_mod = 2 LB = 0.24 FT_mod = 6 PKNL = 1 PHC0 = -10762.05 PHC1 = 10.20095 SI = 16K 
       data hash MD5: 16K
       A8 AB 3E CF 44 DC 77 0D 9F C4 29 74 C0 E3 D1 B8>)
(   3,<2020-12-22 10:40:17.92 +0400>,<she>,<DPX200>,
      <pk PHC0 = 0.2315972 PHC1 = -2.8 
       data hash MD5: 16K
       92 3A 48 65 54 14 83 50 21 65 69 03 13 E6 6C 49>)
(   4,<2020-12-22 10:40:21.71 +0400>,<she>,<DPX200>,
      <abs ABSG = 5 
       data hash MD5: 16K
       6B EB E2 90 27 EA 0E B6 E7 55 95 D9 4E A9 76 08>)
$$ ##END=
$$ 
$$ hash MD5
$$ EB B0 E6 EA DA 92 C0 6E 40 C5 B2 B6 2E 10 1C E4
##$RELAX= 
##$RELAX= 
##$RELAX= 
##$RELAX= 
##$RELAX= 
##$RELAX= 
$$ Bruker specific parameters
$$ --------------------------
##$DU= <F:/spectra>
##$EXPNO= 1
##$NAME= <H-F>
##$PROCNO= 1
##$TYPE= <nmr>
##$USER= <she>
##$AMP= (0..31)
100 100 100 100 100 100 100 100 100 100 100 100 100 100 100 100 100 100 
100 100 100 100 100 100 100 100 100 100 100 100 100 100 
##$AQSEQ= 0
##$AQ_mod= 1
##$AUNM= <au_zg>
##$AUTOPOS= <>
##$BF1= 200.13
##$BF2= 200.13
##$BF3= 200.13
##$BF4= 200.13
##$BF5= 200.13
##$BF6= 200.13
##$BF7= 200.13
##$BF8= 200.13
##$BYTORDA= 1
##$CFDGTYP= 0
##$CFRGTYP= 5
##$CHEMSTR= <none>
##$CNST= (0..31)
1 1 145 1 1 1 1 1 1 1 1 1 1 1 1 1 1 1 1 1 1 1 1 1 1 1 1 1 1 1 1 1 
##$CPDPRG= <>
##$CPDPRG1= <>
##$CPDPRG2= <>
##$CPDPRG3= <>
##$CPDPRG4= <mlev>
##$CPDPRG5= <mlev>
##$CPDPRG6= <mlev>
##$CPDPRG7= <mlev>
##$CPDPRG8= <mlev>
##$CPDPRGB= <>
##$CPDPRGT= <>
##$D= (0..31)
0 1.2 0 0 0 0 0 0 0 0.06 0 0.03 0 0 0 0 0.0002 0 0 0 0 0 0 0 0 0 0 0 0 
0 0 0 
##$DATE= 1608619175
##$DBL= (0..7)
120 120 120 120 120 120 120 120 
##$DBP= (0..7)
150 150 150 150 150 150 150 150 
##$DBP07= 0
##$DBPNAM0= <>
##$DBPNAM1= <>
##$DBPNAM2= <>
##$DBPNAM3= <>
##$DBPNAM4= <>
$$ [...]
##$SUBNAM3= <"">
##$SUBNAM4= <"">
##$SUBNAM5= <"">
##$SUBNAM6= <"">
##$SUBNAM7= <"">
##$SUBNAM8= <"">
##$SUBNAM9= <"">
##$SW= 16.9725356469052
##$SWIBOX= (0..15)
0 0 2 0 0 0 0 0 0 0 0 0 0 0 0 0 
##$SW_h= 3396.73913043478
##$TD= 16384
##$TD0= 1
##$TE= 0
##$TE2= 300
##$TE3= 300
##$TEG= 300
##$TL= (0..7)
0 120 120 120 120 120 120 120 
##$TP= (0..7)
150 150 150 150 150 150 150 150 
##$TP07= 0
##$TPNAME0= <>
##$TPNAME1= <>
##$TPNAME2= <>
##$TPNAME3= <>
##$TPNAME4= <>
##$TPNAME5= <>
##$TPNAME6= <>
##$TPNAME7= <>
##$TPOAL= (0..7)
0.5 0.5 0.5 0.5 0.5 0.5 0.5 0.5 
##$TPOFFS= (0..7)
0 0 0 0 0 0 0 0 
##$TUNHIN= 0
##$TUNHOUT= 0
##$TUNXOUT= 0
##$USERA1= <user>
##$USERA2= <user>
##$USERA3= <user>
##$USERA4= <user>
##$USERA5= <user>
##$V9= 5
##$VALIST= <valist>
##$VCLIST= <CCCCCCCCCCCCCCC>
##$VD= 0
##$VDLIST= <DDDDDDDDDDDDDDD>
##$VPLIST= <PPPPPPPPPPPPPPP>
##$VTLIST= <TTTTTTTTTTTTTTT>
##$WBST= 1024
##$WBSW= 4
##$XGAIN= (0..3)
0 0 0 0 
##$XL= 0
##$YL= 0
##$YMAX_a= 195792
##$YMIN_a= -67297
##$ZGOPTNS= <>
##$ZL1= 120
##$ZL2= 120
##$ZL3= 120
##$ZL4= 120
##$ABSF1= 15.98024
##$ABSF2= -0.9924221
##$ABSG= 5
##$ABSL= 3
##$ALPHA= 0
##$AQORDER= 0
##$ASSFAC= 0
##$ASSFACI= 0
##$ASSFACX= 0
##$ASSWID= 0
##$AUNMP= <proc_1d>
##$AZFE= 0.1
##$AZFW= 0.1
##$BCFW= 0
##$BC_mod= 2
##$BYTORDP= 0
##$COROFFS= 0
##$CY= -3
##$DATMOD= 1
##$DC= 0
##$DFILT= <>
##$DTYPP= 0
##$F1P= 0
##$F2P= 0
##$FCOR= 1
##$FTSIZE= 16384
##$FT_mod= 6
##$GAMMA= 0
##$GB= 0
##$INTBC= 1
##$INTSCL= 2.992141e-10
##$ISEN= 128
##$LB= 0.24
##$LEV0= 0
##$LPBIN= 0
##$MAXI= 10000
##$MC2= 0
##$MEAN= 0
##$ME_mod= 0
##$MI= 1.114404
##$NCOEF= 0
##$NC_proc= -8
##$NLEV= 6
##$NOISF1= 3.799351
##$NOISF2= 2.8
##$NSP= 0
##$NTH_PI= 0
##$NZP= 0
##$OFFSET= 15.98542
##$PC= 1
##$PHC0= -10761.82
##$PHC1= 7.400949
##$PH_mod= 1
##$PKNL= yes
##$PPARMOD= 0
##$PSCAL= 0
##$PSIGN= 0
##$REVERSE= no
##$SF= 200.130005842015
##$SI= 16384
##$SIGF1= 3
##$SIGF2= 2
##$SINO= 5.538805
##$SIOLD= 16384
##$SREGLST= <1H.CDCl3>
##$SSB= 0
##$STSI= 16384
##$STSR= 0
##$SW_p= 3396.73913043478
##$SYMM= 0
##$S_DEV= 0
##$TDeff= 16384
##$TDoff= 0
##$TI= <>
##$TILT= no
##$TM1= 0
##$TM2= 0
##$TOPLEV= 0
##$USERP1= <user>
##$USERP2= <user>
##$USERP3= <user>
##$USERP4= <user>
##$USERP5= <user>
##$WDW= 1
##$XDIM= 16384
##$YMAX_p= 465765479
##$YMIN_p= -2457918
$$ End of Bruker specific parameters
$$ ---------------------------------
##NTUPLES= NMR SPECTRUM
##VAR_NAME=  FREQUENCY,     SPECTRUM/REAL,   SPECTRUM/IMAG
##SYMBOL=    X,             R,               I
##VAR_TYPE=  INDEPENDENT,   DEPENDENT,       DEPENDENT
##VAR_FORM=  AFFN,          ASDF,            ASDF
##VAR_DIM=   16384,         16384,           16384
##UNITS=     HZ,            ARBITRARY UNITS, ARBITRARY UNITS
##FACTOR=    0.207333158178281, 1,           1
##FIRST=     3199.16224342674, 0,            0
##LAST=      -197.576887008042, 0,           0
##MIN=       -197.576887008042, -2457918,    0
##MAX=       3199.16224342674, 465765479,    0
$$ Real data points
##PAGE= N=1
##DATA TABLE= (X++(R..R)), XYDATA
$$ [...]
$$ plain form
3822 8746933 7859154 7930064 8532118 7859567 8111577 8158263 8350420 8289453 8022708 8887795
3812 8887795 8602896 7985404 8565022 8380015 8433388 8352585 8710975 8453636 8511240 8579808
3802 8579808 7998322 7945131 7549694 8023492 8006244 7253263 7399736 7253945 6158856 6295464
3792 6295464 6817602 6840699 6878929 6017263 5797014 6612432 6628864 7174537 7062972 6050808
3782 6050808 6993740 7689621 7168779 7792187 8123936 8213979 9044169 9465216 9148052 9685033
3772 9685033 10127273 10038359 10029442 9602521 9418454 9110894 8472068 6715476 6269678 6506320
3762 6506320 5786255 6201269 5816651 5068781 5897369 5710964 5325099 5385940 4410918 4310785
3752 4310785 4664167 4293599 4453529 4512434 4532787 5209037 4887657 5747544 4987055 4569448
$$ packed form
3822H746933q87779P0910O02054o72551K52010M6686J92157o0967k66745Q65087
3812H887795k84899o17492N79618j85007N3373q0803L58390k57339N7604O8568
3802H579808n81486n3191l95437M73798j7248p52981J46473j45791j095089J36608
3792F295464N22138K3097L8230q61666k20249Q15418J6432N45673j11565j012164
3782F050808R42932O95881n20842O23408L31749R0043Q30190M21047l17164N36981
3772I685033M42240q8914q917m26921j84067l07560o38826j756592m45798K36642
3762F506320p20065M15014l84618p47870Q28588j86405l85865O0841r75022j00133
3752D310785L53382l70568J59930N8905K0353O76250l21380Q59887p60489m17607
$$ plain form
3742 4569448 5326671 4755174 5596799 6112092 5584782 6464128 6485465 5831128 5944900 5531186
3732 5531186 5344265 4369522 4081692 3926538 3255459 3668047 3753268 3962494 4974936 4446481
3722 4446481 3987914 3661227 3952924 4527988 4257506 4248778 4075584 4526057 3979416 3338713
3712 3338713 2842541 2728685 3210478 2883655 2851230 3042876 2832330 2940953 2363941 2370404
3702 2370404 3012833 2830350 3034541 2888259 3098450 2804610 2962605 3823193 3254555 3007312
3692 3007312 4184455 4339369 3566945 4050869 4249754 4236068 4064605 3465454 3508152 3547130
3682 3547130 3781902 3030540 2514814 3129523 2842417 2334765 1749235 2153120 2833121 2083556
3672 2083556 2025054 2747778 2111197 2366009 2354054 1866069 2323436 2681628 2141085 2019627
$$ packed form
3742D569448P57223n71497Q41625N15293n27310Q79346K1337o54337J13772m13714
3732E531186j86921r74743k87830j55154o71079M12588Q5221K09226J012442n28455
3722D446481m58567l26687K91697N75064k70482q728j73194M50473n46641o40703
3712C338713m96172j13856M81793l26823l2425J91646k10546J08623n77012O463
3702B370404O42429j82483K04191j46282K10191k93840J57995Q60588n68638k47243
3692C007312J177143J54914p72424M83924J98885j3686j71463n99151M2698L8978
3682C547130K34772p51362n15726O14709k87106n07652n85530M03885O80001p49565
3672B083556n8502P22724o36581K54812j1955m87985M57367L58192n40543j21458
$$ plain form
3662 2019627 2355542 2041854 2417555 1794352 2021664 2073593 1951222 2790331 1895654 1932729
3652 1932729 2370498 1854995 2297981 2127487 2187135 2404254 2468467 2449055 2305649 2569514
3642 2569514 2715227 1766914 1425045 2155203 1208766 1422582 1469751 686315 1319622 1486453
3632 1486453 387581 1214392 1190262 58308 849436 810700 1320344 1058478 583775 1296160
3622 1296160 670032 346995 1197671 577413 133818 787682 996036 923049 769002 1370360
3612 1370360 1055237 62358 599454 1429300 563041 574802 1168946 924564 1114849 387720
3602 387720 -135769 -323540 -148744 318836 980538 453584 350586 600918 -283472 -750825
3592 -750825 -448405 -453810 -919133 -542463 -368788 -205844 -346870 -405506 -194696 318437
$$ packed form
3662B019627L35915l13688L75701o23203K27312N1929j22371Q39109q94677L7075
3652A932729M37769n15503M42986j70494N9648K17119O4213j9412j43406K63865
3642B569514J45713r48313l41869P30158r46437K13816M7169p83436O33307J66831
3632A486453j098872Q26811k4130j131954P91128l8736N09644k61866m74703P12385
3622A296160o26128l23037Q50676o20258m43595O53864K08354p2987j54047O01358
3612A370360l15123r92879N37096Q29846q66259J1761N94144k44382J90285p27129
3602C87720n23489j87771J74796M67580O61702n26954j02998K50332q84390m67353
3592g50825L02420n405m65323L76670J73675J62944j41026n8636K10810N13133
$$ plain form
3582 318437 -603822 -791748 -620979 -572938 -305812 20219 293486 655828 871064 223468
3572 223468 77380 -119133 -744528 -330878 -221314 -391625 -420017 106950 251962 -847970
3562 -847970 -665963 -320020 -1051255 -1279284 -907852 -1275575 -316231 -890995 -1540352 -665026
3552 -665026 -779507 -962292 -530115 -1513185 -1202705 -573108 -1103194 -333899 -66225 -4368
3542 -4368 -30641 70739 -409559 -475987 200908 -30985 -92427 -88664 -454469 -229240 6622
3531 6622 -68284 81325 -575373 -693689 -676250 -441026 -136542 -51156 4544 -31265 -1287106
3520 -1287106 -966195 -494534 -1083069 -819125 -422721 -297240 -101247 -464077 27287 -233886
3510 -233886 -378014 389184 -277673 50097 -156048 369277 312269 -577752 131521 -177598
$$ packed form
3582C18437r22259j87926J70769M8041K67126L26031K73267L62342K15236o47596
3572B23468j46088j96513o25395M13650J09564j70311k8392N26967J45012j099932
3562h47970J82007L45943p31235k28029L71432l67723R59344n74764o49357Q75326
3552f65026j14481j82785M32177r83070L10480O29597n30086P69295K67674O1857
3542d368k6273J01380m80298o6428O76895k31893o1442L763l65805K25229K35862
3531F622p4906J49609o56698j18316J7439K35224L04484Q5386N5700l5809j255841
3520a287106L20911M71661n88535K63944L96404J25481J95993l62830M91364k61173
3510b33886j44128P67198o66857L27770k06145N25325n7008q90021P09273l09119
$$ plain form
3500 -177598 -859944 -96712 -458237 -585567 -643411 -512756 425926 182281 451167 445543
3490 445543 465609 291291 -23330 591426 227850 130437 179759 -405932 -848794 -183733
3480 -183733 -680172 -656146 -366930 -118299 93034 -206076 -376171 -312540 -975098 -1052502
3470 -1052502 -536534 -973328 -564097 685081 -169419 -445703 -688751 -727612 272898
3461 272898 337250 288424 597702 -275252 -880885 -439860 -678817 -841093 -460776 -9362
3451 -9362 72021 423390 -209506 -291391 -604939 -316102 -3175 -195205 -510267 -442141 -406171
3440 -406171 -104792 975760 29606 5189 669471 -518430 -1165936 -504839 -1135948 -1187476
3430 -1187476 -641511 -299054 3433 -885399 -698260 -964411 -1539040 -1267699 -1085132 -695712
$$ packed form
3500a77598o82346P63232l61525j27330n7844J30655R38682k43645K68886n624
3490D45543K0066j74318l14621O14756l63576r7413M9322n85691m42862O65061
3480a83733m96439K4026K89216K48631K11333k99110j70095O3631o62558p7404
3470a052502N15968m36794M09231J249178q54500k76284k43048l8861J000510
3461B72898O4352m8826L09278q72954o05633M41025k38957j62276L80317M51414
3451i362Q1383L51369o32896q1885l13548K88837L12927j92030l15062O8126L5970
3440d06171L01379J080552r46154k4417O64282j187901o47506O61097o31109n1528
3430a187476N45965L42457L02487q88832J87139k66151n74629K71341J82567L89420
$$ plain form
3420 -695712 325147 -158359 -473764 -141419 -448382 -1139124 -1132566 -1009171 -1434271 71847
3410 71847 250420 -841686 -479196 -555296 -651436 -163495 -517134 -1544687 -1812620 -331907
3400 -331907 192719 -1269613 -1084970 -900572 -1407572 -1339669 -767315 -381643 2805 -413709
3390 -413709 -540739 -1064677 -1572124 -1753288 -2260859 -1235368 -954116 -1264302 -625010 -174714
3380 -174714 -1192652 -516044 -507301 -856673 -450693 -383924 -561820 -433921 -132294 -794251
3370 -794251 -603266 -438684 -453414 -354949 186302 -1146364 -1413360 -452783 -94340 -134780
3360 -134780 -353244 -1023257 -1294146 -525007 -877083 -1352564 -1106675 -687066 -48717 -254514
3350 -254514 -932034 -86195 -41341 -753759 -454647 -626150 -772309 -372563 -1144898 -1030340
$$ packed form
3420f95712J020859m83506l15405L32345l06963o90742O558J23395m25100J506118
3410G1847J78573j092106L62490p6100r6140M87941l53639j027553k67933J480713
3400c31907N24626j462332J84643J84398n07000O7903N72354L85672L84448m16514
3390d13709j27030n23938n07447j81164n07571J025491K81252l10186O39292M50296
3380a74714j017938O76608Q743l49372M05980O6769j77896J27899L01627o61957
3370g94251J90985J64582j4730R8465N41251j332666k66996R60577L58443m0440
3360a34780k18464o70013k70889P69139l52076m75481K45889M19609O38349k05797
3350b54514o77520Q45839M4854p12418K99112j71503j46159L99746p72335J14558
$$ plain form
3340 -1030340 57790 182056 -558780 -1451721 -771612 214587 570986 101848 -589211
3331 -589211 -202622 334697 -625619 -792243 -208207 120895 627430 174704 -183790 154786
3321 154786 1084676 983592 163734 -185605 917443 742889 331114 287034 -205817 1175897
3311 1175897 168019 -829264 -130999 -260246 804446 117590 -738952 531938 1021918
3302 1021918 -105346 -316618 -682543 81181 972934 173410 308491 1574751 916103
3293 916103 1357437 1950694 1108020 1558449 982245 366193 211168 654202 734637 972775
3283 972775 2322422 1616366 1095031 1612116 12560 197904 948652 248462 72668
3274 72668 230383 208226 -206994 -428032 -402622 -526251 -313150 -52172 -616751 -939355
$$ packed form
3340a030340J088130J24266p40836q92941O80109R86199L56399m69138o91059
3331e89211L86589N37319r60316j66624N84036L29102N06535m52726l58494L38576
3321A54786R29890j01084q19858l49339J103048j74554m11775m4080m92851J381714
3311A175897j007878r97283O98265j29247J064692o86856q56542J270890M89980
3302A021918j127264k11272l65925P63724Q91753p99524J35081J266260o58648
3293I16103M41334N93257q42674M50429n76204o16052j55025M43034Q0435K38138
3283I72775J349647p06056n21335N17085j599556J85344P50748p00190j75794
3274G2668J57715k2157m15220k21038K5410j23629K13101K60978n64579l22604
$$ plain form
3264 -939355 -321673 -125244 206365 270681 -548006 -638028 -579218 -686743 -633131 -10064
3254 -10064 308525 418339 860567 887077 822605 329791 568163 940154 140834 59473
3244 59473 1420528 1486602 1338709 909279 1290976 1035868 841876 359407 -391829 1430578
3234 1430578 586106 -311280 226666 14115 4777 -101973 -1236754 -721738 -120782 -507405
3224 -507405 -494293 -1117176 -773680 87755 -913130 -1192269 -1290136 -314897 271861 -228578
3214 -228578 -618698 -187011 157541 -257996 -856289 -1236641 -1083443 -724956 -527123 -854288
3204 -854288 -331431 127017 363732 -1017806 -1483024 -267537 871561 -114152 -647152
3195 -647152 -536515 -557083 -578369 -1275342 -1370774 -583023 154024 282303 -974705 -435006
$$ packed form
3264i39355O17682J96429L31609O4316q18687r0022N8810j07525N3612O23067
3254a0064L18589J09814M42228K6510o4472m92814K38372L71991p99320q1361
3244E9473J361055O6074j47893m29430L81697k55108j93992m82469p51236J822407
3234A430578q44472q97386N37946k12551r338j06750j134781N15016O00956l86623
3224e07405J3112o22883L43496Q61435j000885k79139r7867R75239N86758n00439
3214b28578l90120M31687L44552m15537n98293l80352J53198L58487J97833l27165
3204h54288N22857M58448K36715j381538m65218J215487J139098r85713n33000
3195f47152J10637k0568k1286o96973r5432P87751P37047J28279j257008N39699
$$ plain form
3185 -435006 265906 -2416 -268820 -157411 3140 -48879 155187 -330641 -1089943 -507183
3175 -507183 227302 -1232252 -939946 -415630 -781470 4230 -867203 -1581312 -12172
3166 -12172 25484 -384253 51590 -523998 157901 337347 -432339 -299762 -710827 -128464
3156 -128464 -342012 -806798 354602 -23695 -492102 170029 -619711 -698780 -828101 -1123038
3146 -1123038 -1107076 -1047221 -532821 -139055 -997601 -653139 -326862 -520226 161548 157994
3136 157994 -245075 260046 13413 282582 147326 -157245 422161 -100737 70079 -89183
3126 -89183 -733677 -447744 -467472 -617539 -21487 -520481 -178592 144311 166490 319580
3116 319580 330698 -353658 -276495 -308834 -115617 61747 -47086 -49393 -413637 -911808 -712798
$$ packed form
3185d35006P00912k68322k66404J11409J60551n2019K04066m85828p59302N82760
3175e07183P34485j459554K92306N24316l65840P85700q71433p14109J569140
3166a2172L7656m09737M35843n75588O81899J79446p69686J32577m11065N82363
3156a28464k13548m64786J161400l78297m68407O62131p89740p9069j29321k94937
3146a123038J5962N9855N14400L93766q58546L44462L26277j93364O81774l554
3136A57994m03069N05121k46633K69169j35256l04571N79406n22898J70816j59262
3126h9183o44494K85933j9728j50067N96052m98994L41889L22903K2179J53090
3116C19580J1118o84356P7163l2339J93217J77364j08833k307l64244m98171J99010
$$ plain form
3105 -712798 -853378 -1116572 -1067676 -582158 -348840 -291146 439415 840487 -41177 -505130
3095 -505130 480751 -10452 -25033 475507 -695386 -124775 911327 544852 146677 -407321
3085 -407321 -357774 -186815 -605757 -651889 -16710 906787 1155201 897993 1208694 124429
3075 124429 563221 463613 -150457 386894 266936 917431 400947 227126 1682827 -39587
3065 -39587 -348426 447079 -762783 -400504 -92114 -349923 410700 -35471 672824 1563688
3055 1563688 858899 1277090 1336643 512354 999107 992053 959903 1253094 1413939 1193611
3045 1193611 209084 164839 -36454 -696741 -213109 518499 347391 509830 270627 305661
3035 305661 -265644 -1286326 -659480 -707500 -795026 -285414 119443 901473 221465 -554888
$$ packed form
3105g12798j40580k63194M8896M85518K33318N7694P30561M01072q81664m63953
3095e05130R85881m91203j4581N00540j170893N70611J036102l66475l98175n53998
3085d07321M9547J70959m18942m6132O35179R23497K48414k57208L10701j084265
3075A24429M38792r9608o14070N37351j19958O50495n16484j73821J455701j722414
3065c9587l08839P95505j209862L62279L08390k57809P60623m46171P08295Q90864
3055A563688p04789M18191N9553q24289M86753p054l2150K93191J60845k20328
3045A193611r84527m4245k01293o60287M83632P31608j71108J62439k39203L5034
3035C05661n71305j020682O26846m8020q7526N09612M04857P82030o80008p76353
$$ plain form
3025 -554888 108320 165682 -57700 462318 387338 628221 1797659 714897 -61867 -80215
3015 -80215 -309143 -95097 192187 633028 1087898 291265 882636 526480 154138 625363
3005 625363 -456406 -863920 -1110393 -497471 386716 -361641 -431681 534157 -329759 -330658
2995 -330658 277683 45796 315709 828542 -122273 93569 563148 210307 80463 -309564
2985 -309564 -155458 227089 15757 454589 -214647 -500747 3409 -501225 -117731 324447
2975 324447 -611390 -784176 -1052713 -1270390 -496268 -501827 -843877 479819 1358340 -148028
2965 -148028 157876 -4579 -502225 -84338 -631504 -583179 -381881 -283432 82515 -416758
2955 -416758 -1097180 41364 -243292 -1132074 -1228878 -795182 -668656 -952216 -651829 -576656
$$ packed form
3025e54888O63208N7362k23382N20018p4980K40883J169438j082762p76764j8348
3015h0215k28928K14046K87284M40841M54870p96633N91371l56156l72342M71225
3005F25363j081769m07514k46473O12922Q84187p48357p0040R65838q63916q99
2995c30658O08341k31887K69913N12833r50815K15842M69579l52841j29844l90027
2985c09564J54106L82547k11332M38832o69236k86100N04156n04634L83494M42178
2975C24447r35837j72786k68537k17677P74122n559l42050J323696Q78521j506368
2965a48028L05904j62455m97646M17887n47166M8325K01298R8449L65947m99273
2955d16758o80422J138544k84656q88782r6804M33696J26526k83560L00387P5173
$$ plain form
2945 -576656 -851084 -674953 -509964 -141040 -258266 -391073 -312859 -521926 -619727 -688930
2935 -688930 250647 -43924 -444565 -520650 -1418234 -850636 -869260 -468673 -72083 -57386
2925 -57386 -356464 -785851 -514305 -291776 -973894 -1633075 -1062337 -680320 -384853 219871
2915 219871 -153790 -391124 -756035 -497010 -641335 -1066746 -123792 115742 -595590 -579676
2905 -579676 -332523 -262759 -230439 -768091 -1054504 -419411 -268145 176293 -232577 -960025
2895 -960025 -716512 -778591 -997544 -1365164 -923037 51045 -631016 -425294 333232 -277911
2885 -277911 183032 -689272 -1140576 -490393 77189 -45231 391274 373092 599640 752135
2875 752135 -66552 -729236 -887229 -1164449 155696 62259 -198839 337172 214517 202751
$$ packed form
2945e76656k74428J76131J64989L68924j17226j32807P8214k09067r7801o9203
2935f88930R39577k94571m00641p6085q97584N67598j8624M00587L96590J4697
2925e7386k99078m29387K71546K22529o82118o59181N70738L82017K95467O04724
2915B19871l73661k37334l64911K59025j44325m25411R42954K39534p11332J5914
2905e79676K47153O9764L2320n37652k86413O35093J51266M44438m08870p27448
2895i60025K43513o2079k18953l67620M42127R74082o82061K05722P58526o11143
2885b77911M60943q72304m51304O50183N67582j22420M36505j8182K26548J52495
2875G52135q18687o62684j57993k77220J320145r3437k61098N36011j22655j1766
$$ plain form
2865 202751 -407075 -1750597 -320195 344554 -218421 -139713 427873 -53166 309986 766277
2855 766277 -576884 -818781 -224696 -707940 -1179936 -477902 -81983 -101193 -191153 -496887
2845 -496887 -163019 64266 -352297 -484464 -858361 -804912 417172 4951 -560318 -294820
2835 -294820 -831096 -417250 -712068 -832829 -206367 328741 -70451 -693498 -1061494 -655212
2825 -655212 -468467 -241401 -228284 -277248 1116897 1015063 -4817 -50827 70984 -269032
2815 -269032 -479779 -380489 -254735 -411490 67226 439500 -521102 680893 292670 -1028230
2805 -1028230 -144222 -233244 -128976 1052990 368574 56437 638924 -131974 -1392377
2796 -1392377 -561580 -1164441 -526451 626212 -712317 -617834 23302 -275301 392196
$$ packed form
2865B02751o09826j343522J430402O64749n62975P8708N67586m81039L63152M56291
2855G66277j343161k41897N94085m83244m71996P02034L95919j9210q9960l05734
2845d96887L33868K27285m16563j32167l73897N3449J222084m12221n65269K65498
2835b94820n36276M13846k94818j20761O26462N35108l99192o23047l67996M06282
2825f55212J86745K27066J3117m8964J394145j01834j019880m6010J21811l40016
2815b69032k10747R9290J25754j56755M78716L72274r60602J201995l88223j320900
2805a028230Q84008q9022J04268J181966o84416l12137N82487p70898j260403
2796a392377Q30797o02861O37990J152663j338529R4483O41136k98603O67497
$$ plain form
2787 392196 -209561 -1215222 -718680 -822602 -834771 -298817 -656462 -289456 -20517 -568285
2777 -568285 -232513 -476100 -726629 -645943 -284662 -245440 -461380 240910 -58758 -651376
2767 -651376 -670733 25789 -294841 -492569 328428 -472063 -388745 -313745 206953 -220949
2757 -220949 25774 256148 -17859 9355 633555 566675 908513 1205546 469345 374187
2747 374187 65873 -100973 402657 162185 -881531 71367 -273094 -409488 -227155 -292219
2737 -292219 219385 108296 -427261 437568 101042 113956 338110 -819228 -729468 102806
2727 102806 -428147 -571903 -192738 -269541 12962 243995 -158231 -669060 -698253 -48149
2717 -48149 81971 142477 490203 286468 752324 -568863 -359837 212186 -133642 205762
$$ packed form
2787C92196o01757j005661M96542j03922j2169N35954l57645L67006K68939n47768
2777e68285L35772k43587k50529Q0686L61281L9222k15940P02290k99668n92618
2767f51376j9357O96522l20630j97728Q20997q00491Q3318P5000N20698m27902
2757b20949K46723K30374k74007K7214O24200o6880L41838K97033p36201r5158
2747C74187l08314j66846N03630k40472j043716R52898l44461j36394J82333o5064
2737b92219N11604j11089n35557Q64829l36526J2914K24154j157338Q9760Q32274
2727A02806n30953j43756L79165p6803K82503K31033m02226n10829k9193O50104
2717d8149J30120O0506L47726k03735M65856j321187K09026N72023l45828L39404
$$ plain form
2707 205762 -437611 -74215 73377 55019 931919 590536 779017 1433941 300161 135539
2697 135539 373917 532342 189249 282894 -84714 67698 497034 245177 143001 106205
2687 106205 536457 851480 858665 928756 711891 985471 1271038 509189 901422 980045
2677 980045 469756 742269 1073396 1000209 1677642 1027439 1005777 1559351 1240335 1473443
2667 1473443 918283 728327 1743816 1580866 1152704 968933 1334062 1674444 1413323
2658 1413323 1391903 1423221 1024495 1897074 1755961 1159059 1356545 1997030 1637812 1460643
2648 1460643 954072 1547696 1287580 1331153 1601723 1701065 2461764 1731280 1545765 1776707
2638 1776707 1275173 2413765 2388176 2073921 3033520 3183366 3164504 2918505 1920519 1779569
$$ packed form
2707B05762o43373L63396J47592j8358Q76900l41383J88481O54924j133780j64622
2697A35539K38378J58425l43093R3645l67608J52412M29336k51857j02176l6796
2687A06205M30252L15023P185P0091k16865K73580K85567p61849L92233P8623
2677I80045n10289K72513L31127p3187O77433o50203k1662N53574l19016K33108
2667A473443n55160j89956J015489j62950m28162j83771L65129L40382k61121
2658A413323k1420L1318l98726Q72579j41113n96902J97486O40485l59218j77169
2648A460643n06571N93624k60116M3573K70570R9342P60699p30484j85515K30942
2638A776707n01534J138592k5589l14255R59599J49846j8862k45999r97986j40950
$$ plain form
2628 1779569 2636381 2658780 2763872 2486650 2002622 2372418 2491749 2203751 2451015 1985503
2618 1985503 1902126 1606710 2038964 2603667 2116221 2564094 1883799 1441657 2583368 1788921
2608 1788921 1770392 2700969 2474388 2687074 3439165 2483261 2228925 2226217 1623768 2052477
2598 2052477 2262462 1608958 2400888 3071073 3490884 3068266 2549356 2684379 2331435 2469187
2588 2469187 2918206 2642481 2931547 3380186 2768719 2179591 2306204 1960237 2565040 2092238
2578 2092238 1667392 2457680 2581544 2624593 2935837 1602108 1890394 2852642 1848164
2569 1848164 2039798 2556212 2351379 3049751 3652199 2920679 2761733 3279192 2656110 1941718
2559 1941718 2000091 2481516 2442734 3498254 3799040 3590312 3960945 2655298 3161457 3722100
$$ packed form
2628A779569Q56812K2399J05092k77222m84028L69796J19331k87998K47264m65512
2618A985503q3377k95416M32254N64703m87446M47873o80295m42142J141711p94447
2608A788921j8529R30577k26581K12686P52091r55904k54336k708o02449M28709
2598B052477K09985o53504P91930O70185M19811m22618n18910J35023l52944J37752
2588B469187M49019k75725K89066M48639o11467n89128J26613l45967O04803m72802
2578B092238m24846P90288J23864M3049L11244j333729K88286R62248j004478
2569A848164J91634N16414k04833O98372O02448p31520j58946N17459o23082p14392
2559A941718N8373M81425l8782J055520L00786k08728L70633j305647N06159N60643
$$ plain form
2549 3722100 2889396 3214948 4091170 3561309 3797986 3906748 4399334 3440683 3056419 3658905
2539 3658905 2403329 3018117 3849777 3357556 4383945 3473040 2997631 3402169 2433293
2530 2433293 3204909 3126580 1970741 2702348 2950958 3152350 3250932 2027194 3042088
2521 3042088 3391463 2718201 3513663 3082536 2755056 3979916 3511353 3065550 3928038
2512 3928038 3280007 3543237 3457970 2994402 4408122 3853105 3439734 4755122 4710949 5258052
2502 5258052 5133798 3616374 4235954 4229335 3558612 3783246 3766359 3936216 4804347 4213686
2492 4213686 3874780 4358113 4084849 3516642 3301019 3979580 4414814 4448610 4493134 4422039
2482 4422039 4252549 4594750 4262905 3281844 4688804 5994856 4986814 4859230 5335333
$$ packed form
2549C722100q32704L25552Q76222n29861K36677J08762M92586r58651l84264O02486
2539C658905j255576O14788Q31660m92221J026389r10905m75409M04538r68876
2530B433293P71616p8329j155839P31607K48610K01392R8582j223738J014894
2521C042088L49375o73262P95462m31127l27480J224860m68563m45803Q62488
2512C928038o48031K63230q5267m63568J413720n55017m13371J315388m4173N47103
2502E258052j24254j517424O19580o619o70723K24634j6887J69857Q68131n90661
2492D213686l38906M83333k73264n68207k15623O78561M35234L3796M4524p1095
2482D422039j69490L42201l31845r81061J406960J306052j008042j27584M76103
$$ plain form
2473 5335333 4946843 4928797 5489932 4741001 4846522 5195012 5288614 5254926 5562768 5839040
2463 5839040 5943911 5527569 5368106 5155350 5509151 6522763 5676413 5773020 5448273 5823357
2453 5823357 6115959 5895206 5117321 5795535 6029442 6065068 6233981 5347361 6350023 6059614
2443 6059614 5209994 5985353 5889294 5457245 6530854 5934845 5358819 6149328 6171516 6458228
2433 6458228 6840878 5839316 6341191 6223322 6450707 6191826 5588249 6988629 6451586
2424 6451586 6337531 6924629 6610712 6870188 6751036 6627925 6277509 6396076 7386112 8040736
2414 8040736 7625471 7925510 7454296 7182170 7328528 6721116 7280193 7433433 7535415 7745501
2404 7745501 7072405 8028899 8467464 7767803 7931856 7153478 7839685 8805154 7817143 7812761
$$ packed form
2473E335333l88490j8046N61135p48931J05521L48490R3602l3688L07842K76272
2463E839040J04871m16342j59463k12756L53801J013612q46350R6607l24747L75084
2453E823357K92602k20753p77885O78214K33907L5626J68913q86620J002662k90409
2443F059614q49620P75359r6059m32049J073609n96009n76026P90509K2188K86712
2433F458228L82650j001562N01875j17869K27385k58881o03577J400380n37043
2424F451586j14055N87098l13917K59476j19152j23111l50416J18567R90036O54624
2414H040736m15265L00039m71214k72126J46358o07412N59077J53240J01982K10086
2404G745501o73096R56494M38565o99661J64053p78378O86207R65469r88011m382
$$ plain form
2394 7812761 9364893 9004459 9301834 9575029 8855472 8957601 8900755 9264650 9144412 10017985
2384 10017985 11764945 11254126 11398017 11367210 11221701 12078995 11994261 11536910 12116416 12825604
2374 12825604 12611221 13191820 12781821 13652957 14558752 14147510 15104846 14695902 15790750
2365 15790750 17692328 17376434 18933888 20043829 20427073 21876862 22853445 24357789 26164186
2356 26164186 28048992 30714472 33345457 35679256 38814208 41485857 44976496 47689091
2348 47689091 47495685 46716179 44414019 41286446 38801445 35244227 33031406 32260481 30922741
2339 30922741 30731226 29878491 29189978 30246190 29564950 28966187 29237910 28214113 28599050
2330 28599050 30097524 30084201 32046719 34424472 35235979 37005817 38520426 40503851 42403531
$$ packed form
2394G812761J552132l60434K97375K73195p19557J02129n6846L63895j20238Q73573
2384A0017985J746960n10819J43891l0807j45509Q57294q4734m57351N79506P09188
2374A2825604k14383N80599m09999Q71136R05795m11242R57336m08944J094848
2365A5790750J901578l15894J557454J109941L83244J449789R76583J504344J806397
2356B6164186J884806K665480K630985K333799L134952K671649L490639K712595
2348D7689091j93406p79506k302160l127573k485001l557218k212821p70925j337740
2339C0922741j91515q52735o88513J056212o81240n98763K71723j023797L84937
2330B8599050J498474j3323J962518K377753Q11507J769838J514609J983425J899680
$$ plain form
2321 42403531 45320255 48906603 53066135 58761573 64217514 70755269 76834538 81272269
2313 81272269 83369411 79931352 73749596 66408731 59214529 54750332 48982677 44939253
2305 44939253 42333257 39447363 37294498 35997328 33518828 32564830 32444871 30580078
2297 30580078 29945667 29580160 29368652 28847881 28941117 28882469 29129544 29033378 31120366 31310820
2287 31310820 31015178 33888883 34496960 36513386 38990967 40129535 43069415 46210883
2279 46210883 48414904 48579357 47896357 46428894 42506638 39145412 36280681 33168532
2271 33168532 31702284 30116936 27788774 26927837 26959306 26012795 24493246 23617776 23778612
2262 23778612 23924013 23640658 23135175 23018441 23631780 23814297 23457201 23885293 24622448
$$ packed form
2321D2403531K916724L586348M159532N695438N455941O537755O079269M437731
2313H1272269K097142l438059o181756p340865p194202m464197n767655m043424
2305D4939253k605996k885894k152865j297170k478500r53998j19959j864793
2297C0580078o34411l65507k11508n20771R3236n8648K47075r6166K086988J90454
2287C1310820k95642K873705O08077K016426K477581J138568K939880L141468
2279D6210883K204021J64453o83000j467463l922256l361226k864731l112149
2271C3168532j466248j585348k328162q60937L1469r46511j519549q75470J60836
2262B3778612J45401k83355n05483j16734O13339J82517l57096M28092P37155
$$ plain form
2253 24622448 24664123 25313457 25703986 25437588 26834901 26859381 28213366 28575659 27065342
2244 27065342 28325961 26846751 25325092 25228573 24243743 24779272 25542362 24689543 24922967
2235 24922967 25407760 26094516 26386101 25784350 26153219 26777696 27359559 28675684 27247351
2226 27247351 28602970 30505101 30089020 31408986 31652782 31926188 33415233 33560628 34817051
2217 34817051 35876541 37302195 39992817 40336858 42354685 44428356 43977105 43443585 42292359
2208 42292359 40560807 40371789 40584449 40567447 40490491 40917315 42769426 42786244 43286233 44557265
2198 44557265 44769055 46471343 46945475 47113112 48774644 50080303 50775893 52434230 53807436
2189 53807436 55091311 56555030 59955946 61860285 64052713 67673878 69857715 73483270
$$ packed form
2253B4622448M1675O49334L90529k66398J397313K4480J353985L62293j510317
2244B7065342J260619j479210j521659r6519r84830N35529P63090q52819K33424
2235B4922967M84793O86756K91585o01751L68869O24477N81863J316125j428333
2226B7247351J355619J902131m16081J319966K43796K73406J489045J45395J256423
2217C4817051J059490J425654K690622L44041K017827K073671m51251n33520j151226
2208D2292359j731552j89018K12660j7002p6956M26824J852111J6818M99989J271032
2198D4557265K11790J702288M74132J67637J661532J305659O95590J658337J373206
2189E3807436J283875J463719L400916J904339K192428L621165K183837L625555
$$ plain form
2181 73483270 76963581 78686543 82571703 85595525 87527321 89298048 89921897 90281867
2173 90281867 90175488 89206886 89655141 89214132 88307248 88708206 86822741 86172275 85408666
2164 85408666 83955479 82651257 79519716 77029797 74222964 70203280 67700003 64060678
2156 64060678 60679226 59576545 57043353 55555742 54888184 52833133 51287313 50952102
2148 50952102 49320552 47349195 46392992 45058488 44294638 42977461 41812704 40799724
2140 40799724 39881149 40377445 39730590 38940874 39321791 39241213 38861007 38486885 37068696
2131 37068696 36840373 36474598 35568045 35230903 34661237 34400369 34835166 34134948 34309099
2122 34309099 35612376 36383661 37574883 38710482 40556555 41657639 42947442 42982396 43516587
$$ packed form
2181G3483270L480311J722962L885160L023822J931796J770727O23849L59970
2173I0281867j06379r68602M48255m41009r06884M00958j885465o50466p63609
2164H5408666j453187j304222l131541k489919k806833m019684k503277l639325
2156F4060678l381452j102681k533192j487611o67558k055051j545820l35211
2148E0952102j631550j971357r56203j334504p63850j317177j164757j012980
2140D0799724r18575M96296o46855p89716L80917q0578l80206l74122j418189
2131C7068696k28323l65775r06553l37142n69666k60868M34797p00218J74151
2122C4309099J303277P71285J191222J135599J846073J101084J289803L4954N34191
$$ plain form
2113 43516587 45358718 45374139 44441247 44605759 44069430 44586569 44932084 44317691 44068667
2104 44068667 43652743 43770948 44339933 44673851 44767708 43415755 41583891 39097304 37085611
2095 37085611 35775777 34987319 34037043 33027615 32495950 32794250 33186873 32604886 33309548
2086 33309548 34016304 33422869 34133766 35290261 35137088 36147338 36247160 36865250 37637166
2077 37637166 37188948 36665481 36086472 36960405 37486477 37760016 38523805 38386159 37806328
2068 37806328 38074384 36973738 35418303 34979352 31787191 29227198 28340113 25676853 25263935
2059 25263935 25183627 24152480 23353804 22329006 21305050 21082195 20961216 20909627 20927626
2050 20927626 21499214 21757385 21146301 20069619 19460558 18659892 18521271 17978402 17475787
$$ packed form
2113D3516587J842131J5421r32892J64512n36329N17139L45515o14393k49024
2104D4068667m15924J18205N68985L33918R3857j351953j831864k486587k011693
2095C7085611j309834p88458r50276j009428n31665K98300L92623n81987P04662
2086C3309548P06756n93435P10897J156495j53173J010250R9822O18090P71916
2077C7637166m48218n23467n79009Q73933N26072K73539P63789j37646n79831
2068C7806328K68056j100646j555435m38951l192161k559993q87085k663260m12918
2059B5263935q0308j031147p98676j024798j023956k22855j20979n1589J7999
2050B0927626N71588K58171o11084j076682o09061q00666j38621n42869n02615
$$ plain form
2041 17475787 18995496 19295239 19522045 19724263 20209761 20590769 19771666 18851079 17901950
2032 17901950 17598725 17729951 16833639 16003885 14916519 14519838 14086008 12865272 12168324
2023 12168324 11779126 11566080 11435251 11349102 11179413 11441869 10493698 9945569 9836868 9363543
2013 9363543 10082364 9175696 9052481 8846932 8586154 8901738 8060544 7461240 8228467 8421853
2003 8421853 7845192 7646803 7902845 8693749 9243474 8987347 8310484 7841866 7712588 7420921
1993 7420921 7094368 7122694 7402040 7672246 7643165 7330276 7070543 6419467 6429776 5808060
1983 5808060 5235801 6372958 6024772 5781235 5957665 5749039 6562184 6185876 5099494
1974 5099494 5119670 4958737 5324148 6458799 5366475 5943781 6454539 5817862 6127880
$$ packed form
2041A7475787J519709K99743K26806K02218M85498L81008q19103r20587r49129
2032A7901950l03225J31226q96312q29754j087366l96681m33830j220736o96948
2023A2168324l89198k13046j30829q6149j69689K62456r48171n48129j08701m73325
2013I363543P18821r06668j23215k05549k60778L15584q41194n99304P67227J93386
2003H421853n76661j98389K56042P90904N49725k56127o76863m68618j29278k91667
1993G420921l26553K8326K79346K70206k9081l12889k59733o51076J0309o21716
1983E808060n72259J137157l48186k43537J76430k08626Q13145l76308j086382
1974E099494K0176j60933L65411J134651j092324N77306N10758o36677L10018
$$ plain form
1965 6127880 5424016 4855249 5680131 5309707 5740665 5020962 3740629 5186054 5720177
1956 5720177 4502652 4833898 5143169 5148095 5433433 5113714 5312406 5352051 5676185 5510278
1946 5510278 4282359 4062167 4902651 4437949 4888454 5279354 5338619 5364761 4419000 4789998
1936 4789998 5310644 5054867 5809300 5494774 4885461 5307552 5484823 5599767 5399144 4922073
1926 4922073 5644997 5878859 6346448 5954828 5752433 6891317 6436280 6310413 6940237
1917 6940237 6375971 7917964 8422549 7022259 7470118 7569002 8502430 8249090 7598035
1908 7598035 8917281 8361892 8126219 9305038 8325928 8616848 9376209 8351264 9139482
1899 9139482 9308789 8606216 9658129 9886231 9597094 10676240 10004760 10355065 10303353
$$ packed form
1965F127880p03864n68767Q24882l70424M30958p19703j280333J445425N34123
1956E720177j217525L31246L09271M926K85338l19719J98692L9645L24134j65907
1946E510278j227919k20192Q40484m64702M50505L90900N9265K6142r45761L70998
1936D789998N20646k55777P54433l14526o09313M22091J77271J14944k00623m77071
1926D922073P22924K33862M67589l91620k02395J138884m55037j25867O29824
1917F940237n64266J541993N04585j400290M47859R8884R33428k53340o51055
1908G598035J319246n55389k35673J178819r79110K90920P59361j024945P88218
1899I139482J69307p02573J051913K28102k89137J079146o71480L50305n1712
$$ plain form
1890 10303353 9788254 10564915 10730767 10931731 11496086 12007995 12288330 12591345 12717758
1881 12717758 12601940 12958995 13904325 14898610 14692142 14607352 14986269 15014666 15026997 15151822
1871 15151822 15203930 15014840 15248051 15846101 16421771 16952646 16913123 16439302 16932113 16851217
1861 16851217 16526346 17093861 17383795 17354978 18210315 17638083 17590420 18480873 18650819 18528980
1851 18528980 18483913 19038151 19593002 20766472 22016234 21903879 23530228 23821224 23305434
1842 23305434 24745280 25782031 27958149 29346170 29156891 30660048 31402225 31718044 32742556
1833 32742556 30830813 31066211 31978579 30937741 32303104 33515283 32772402 33160743 32561974
1824 32561974 32432144 32560215 31964830 31990163 32710953 32741911 33604877 33484500 33637834 34120183
$$ packed form
1890A0303353n15099P76661J65852K00964N64355N11909K80335L03015J26413
1881A2717758j15818L57055R45330R94285k06468q4790L78917K8397J2331J24825
1871A5151822N2108j89090K33211N98050N75670N30875l9523m73821M92811q0896
1861A6851217l24871N67515K89934k8817Q55337n72232m7663Q90453J69946j21839
1851A8528980m5067N54238N54851J173470J249762j12355J626349K90996n15790
1842B3305434J439846J036751K176118J388021j89279J503157P42177L15819J024512
1833C2742556j911743K35398R12368j040838J365363J212179p42881L88341n98769
1824C2561974j29830J28071n95385K5333P20790L0958Q62966j20377J53334M82349
$$ plain form
1814 34120183 33995786 35194698 36372199 37307739 38749111 40776991 43092890 45462166
1806 45462166 47547638 50237588 51023628 51037310 48570463 43872110 41263226 38973028 35617782
1797 35617782 33962539 31819559 29907134 28930803 27695501 26862315 25994821 25204744 26003966
1788 26003966 24649407 24570217 25130658 23894390 23869660 23942183 23683926 23860413 24080203 24294227
1778 24294227 25157041 25214482 25054861 24178783 24630170 25239212 24416310 24547991 23651396 21794720
1768 21794720 21620771 19942901 18754890 18250656 16879279 16367078 15305770 14892416 14393335
1759 14393335 13368353 13169708 12964686 11734993 11936564 11008129 10119015 11619004 11075623
1750 11075623 9894258 10840257 9712968 8325182 9364263 8942607 8173919 7968194 8029034
$$ packed form
1814C4120183j24397J198912J177501R35540J441372K027880K315899K369276
1806D5462166K085472K689950P86040J3682k466847m698353k608884k290198l355246
1797C5617782j655243k142980j912425r76331j235302q33186q67494p90077P99222
1788B6003966j354559p9190N60441j236268k4730P2523k58257J76487K19790K14024
1778B4294227Q62814N7441j59621q76078M51387O09042q22902J31681q96595j856676
1768B1794720j73949j677870j188011n04234j371377n12201j061308m13354m99081
1759A4393335j024982j98645k05022j229693K01571r28435q89114J499989n43381
1750A1075623j181365R45999j127289j387786J039081m21656p68688k05725O0840
$$ plain form
1741 8029034 7244297 6674273 6560585 5551119 5580094 5710832 4950941 5166690 5198270 4572095
1731 4572095 4930246 4497478 3936636 3956281 3415446 3734672 4041189 3405052 4012420 3948473
1721 3948473 3911887 3893103 2963504 2988768 2962888 3417157 3347534 1879477 2904018 3410416
1711 3410416 3027522 4174783 3183753 1918733 3071395 2903944 2071512 3328998 2918568
1702 2918568 2258304 2181689 1512722 1487595 1947304 1884107 1650080 1802873 2303315 2147380
1692 2147380 1240906 1063036 590827 -27405 1142837 499512 280837 1283732 103695
1683 103695 690001 1378444 244676 557185 -77564 -401749 768671 179090 345805
1674 345805 903676 168633 59662 71663 -540148 -147657 335981 381754 918751 1206618
$$ packed form
1741H029034p84737n70024j13688j009466K8975J30738p59891K15749L1580o26175
1731D572095L58151m32768n60842J9645n40835L19226L06517o36137O07368o3947
1721C948473l6586j8784r29599K5264k5880M54269o9623j468057J024541N06398
1711C410416l82894J147261r91030j265020J152662j67451q32432J257486m10430
1702B918568o60264p6615o68967k5127M59709o3197k34027J52793N00442j55935
1692B147380r06474j77870m72209o18232J170242o43325k18675J002895j180037
1683A03695N86306O88443j133768L12509o34749l24185J170420n89581J66715
1674C45805N57871p35043j08971J2001o11811L92491M83638M5773N36997K87867
$$ plain form
1664 1206618 934296 783382 1342600 605294 162851 1206179 350791 69330 1049338
1655 1049338 1068097 814968 369392 255097 438451 433226 650972 -478357 -376987 229333
1645 229333 -684724 -936971 -527803 -1169029 -1236139 -943901 -1364053 -1211061 -656843 -233730
1635 -233730 -468121 -633706 -369625 -308903 -834053 -173234 -1323955 -1256053 -286056 -921080
1625 -921080 -1020166 314176 229180 -771335 -606225 126757 -625448 -1146912 -339078 -880187
1615 -880187 -778134 380 -1271520 -1319017 -1271437 -1246644 -327587 -455894 -980444 -242004
1605 -242004 -257653 -1373977 -1793510 -1440686 -1353125 -1074432 -112830 -1354425 -1096631 182369
1595 182369 -327584 -439158 -576867 -286080 138580 -1071422 -1412424 -696774 -1235337 -796327
$$ packed form
1664A206618k72322j50914N59218p37306m42443J043328q55388k81461R80008
1655A049338J8759k53129m45576j14295J83354n225K17746j129329J01370O06320
1645B29333r14057k52247M09168o41226o7110K92238m20152J52992N54218M23113
1635b33730k34391j65585K64081O0722n25150O60819j150721O7902R69997o35024
1625i21080r9086J334342q4996j000515J65110P32982p52205n21464Q07834n41109
1615h80187J02053P78514j271900m7497M7580K4793R19057j28307n24550P38440
1605b42004j5649j116324m19533L52824Q7561K78693R61602j241595K57794J279000
1595A82369n09953j11574j37709K90787M24660j210002l41002P15650n38563M39010
$$ plain form
1585 -796327 -884387 -922053 684957 -270625 -1027919 -1100691 -1113513 -380088 -1352158 -1894927
1575 -1894927 -762219 -412473 -490896 -445718 -1371770 -1551836 65557 -1101094 -1412730
1566 -1412730 -63288 -97549 10017 -219440 -680284 -510911 84840 -445240 -1481822
1557 -1481822 -832764 -1264595 -313047 -186572 -256280 -18652 -47899 -220048 -90537 15006
1547 15006 -394518 -434074 -223595 -223562 549 -63457 670579 1121293 539046 656232 1383620
1536 1383620 391843 49885 312716 -439538 355488 743534 519740 270410 9146 -300890
1526 -300890 52592 -519064 -420150 -17394 357978 430670 218360 -832970 -284187 343628
1516 343628 157429 -83225 -434624 238284 1286388 904183 766491 716676 879111 1493318
$$ packed form
1585g96327q8060l7666J607010r55582p57294p2772j2822P33425r72070n42769
1575a894927J132708L49746p8423M5178r26052j80066J617393j166651l11636
1566a412730J349442l4261J07566k29457m60844J69373N95751n30080j036582
1557a481822O49058m31831R51548J26475o9708K37628k9247j72149J29511J05543
1547A5006m09524l9556K10479L3K24111o4006P34036M50714n82247J17186P27388
1536A383620r91777l41958K62831p52254P95026L88046k23794k49330k61264l10036
1526c00890L53482n71656R8914M02756L75372P2692k12310j051330N48783O27815
1516C43628j86199k40654l51399O72908J048104l82205j37692m9815J62435O14207
$$ plain form
1506 1493318 695164 900746 1259021 1043960 1023925 733325 1093794 1498938 1014675 421305
1496 421305 197668 1013058 857359 528604 549542 323446 841574 1427223 697536 -171687
1486 -171687 146555 -214508 352412 629177 -277662 423481 520725 365666 426175 7176
1476 7176 210507 504366 142538 -88611 90005 357857 -119192 -536935 508508 1204090
1466 1204090 131650 -43696 136587 577763 577209 194211 -22036 41245 551399 -141052
1456 -141052 -308339 837960 773221 -387963 122152 184783 878854 1107419 675096 298956
1446 298956 -13710 651962 -58140 -1099105 -671063 -820119 -596427 -406884 -969459 -396331
1436 -396331 746984 -158017 -322559 -428842 -411421 -208135 -260017 -650381 -166400 49079
$$ packed form
1506A493318p98154K05582L58275k15061k0035k90600L60469M05144m84263n93370
1496D21305k23637Q15390j55699l28755K0938k26096N18128N85649p29687q69223
1486a71687L18242l61063N66920K76765r06839P01143R7244j55059O0509m18999
1476G176K03331K93859l61828k31149J78616K67852m77049m17743J045443O95582
1466A204090j072440j75346J80283M41176n54l82998k16247O3281N10154o92451
1456a41052j67287J146299o4739j161184N10115O2631O94071K28565m32323l76140
1446B98956l12666O65672p10102j040965M28042j49056K23692J89543n62575N73128
1436c96331J143315r05001j64542j06283J7421K03286n1882l90364M83981K15479
$$ plain form
1426 49079 -437279 -632227 -1453772 -1328148 -394500 -232523 -892355 -370766 -571057 -166518
1416 -166518 -156562 -457945 -1216704 -1227097 -1170317 -636867 -80633 -90532 -333542 -590967 -684567
1405 -684567 -1122363 -1330778 -922446 -1165653 -1173303 -912862 -1197534 -1103757 -859567 -701124
1395 -701124 -972148 -570313 -1095692 -1140972 -1489654 -1313790 -386592 -669698 -1644004 -1775772
1385 -1775772 -1751484 -1173300 -1043498 -914094 -634095 -317709 -390456 -737527 -871062 -565997
1375 -565997 103906 17783 -59199 -702103 -491016 -626529 -1109281 -1124470 -786872 -708299
1365 -708299 -609365 -1056250 -1393310 -142996 -338525 -1208598 -1394233 -1570847 -636229 -711095
1355 -711095 -1047594 -1108913 -1244760 -551460 -1214782 -1528885 -1108753 -1463466 -1670986 -1148100
$$ packed form
1426D9079m86358j94948q21545J25624R33648J61977o59832N21589k00291M04539
1416a66518R956l01383p58759j0393N6780N33450N56234r899k43010k57425r3600
1405f84567m37796k08415M08332k43207p650K60441k84672R3777K44190J58443
1395g01124k71024M01835n25379m5280l48682J75864R27198k83106r74306j31768
1385a775772K4288N78184J29802J29404K79999L16386p2747l47071j33535L05065
1375e65997O69903q6123p6982o42904K11087j35513m82752j5189L37598P8573
1365g08299R8934m46885l37060J250314j95529q70073j85635j76614R34618p4866
1355g11095l36499o1319j35847O93300o63322l14103M20132l54713k07520N22886
$$ plain form
1345 -1148100 -1651944 -966596 -336558 -752857 -769710 -1526155 -1225956 -1169732 -1301989 -579549
1335 -579549 -170164 135005 893728 378079 -26330 253235 -420652 -545502 -305031 -520058
1325 -520058 -440902 -177999 383146 208200 -453071 393446 -201551 -683943 19313 -870981
1315 -870981 -642742 -637958 -422162 -167405 -247037 -1185535 -326035 306884 -13032 -55569
1305 -55569 66819 119366 19941 172385 -359787 191370 431051 -562279 -183620 446199
1295 446199 634857 156096 -18440 -1197 277312 58030 264382 237271 409033 1001697
1285 1001697 -16838 864386 394347 -46395 1169238 895492 -124337 282713 233281
1276 233281 417812 32462 453954 836363 -36978 127391 203527 -406301 295098 41621
$$ packed form
1345a148100n03844O85348O30038m16299j6853p56445L00199N6224j32257P22440
1335e79549M09385L05169P58723n15649m04409K79565o73887j24850K40471k15027
1325e20058P9156K62903N61145j74946o61271Q46517n94997m82392P03256q90294
1315h70981K28239M784K15796K54757p9632r38498Q59500O32919l19916m2537
1305e5569J22388N2547r9425J52444n32172N51157K39681r93330L78659O29819
1295D46199J88658m78761j74536J7243K78509k19282K06352k7111J71762N92664
1285A001697j018535Q81224m70039m40742J215633k73746j019829M07050m9432
1276B33281J84531l85350M21492L82409q73341J64369P6136o09828P01399k53477
$$ plain form
1266 41621 -404733 432143 254106 -171605 517187 575215 686862 777243 434236 484092
1256 484092 645589 762808 1084762 870949 579651 207427 489387 1411008 578222 162655
1246 162655 669600 303483 153499 777458 466669 716947 1604567 1813738 1831936 1745152
1236 1745152 1906267 1493089 1104618 762141 66797 32239 218510 549839 -109985 -85121
1226 -85121 538 288057 483638 -425922 -260683 -596521 -1123712 -432296 -795539 -64766
1216 -64766 994345 238587 -261540 535106 474149 92181 435422 164880 391137 682873
1206 682873 -302590 -469816 -9835 -291812 154765 -10729 -283520 523007 934136 194180
1196 194180 -353083 -257218 -39997 114322 -999224 -452832 98732 220693 921880 -178388
$$ packed form
1266D1621m46354Q36876j78037m25711O88792N8028J11647R0381l43007M9856
1256D84092J61497J17219L21954k13813k91298l72224K81960R21621q32786m15567
1246A62655N06945l66117j49984O23959l10789K50278Q87620K09171J8198q6784
1236A745152J61115m13178l88471l42477o95344l4558J86271L31329o59824K4864
1226h5121Q5659K87519J95581r09560J65239l35838n27191O91416l63243P30773
1216f4766J059111p55758n00127P96646o0957l81968L43241k70542K26257K91736
1206F82873r85463j67226M59981k81977M46577j65494k72791Q06527M11129p39956
1196A94180n47263R5865K17221J54319j113546N46392N51564J21961P01187j100268
$$ plain form
1186 -178388 -321643 171580 -715652 -1010217 -1433628 -381916 941953 724799 841090
1177 841090 518556 17969 600280 -295557 -978895 30914 745171 1082640 622162 270069
1167 270069 180140 467934 -68082 -692597 -656976 209377 558240 648911 766163 267934
1157 267934 -121156 -528056 -1844115 -798220 -85668 -196458 -74321 719868 1043417
1148 1043417 1097575 750267 134252 -55122 -239437 755180 1249327 1051496 1657715 1993530
1138 1993530 1024676 1502992 1508501 1093728 1073931 1041589 1886523 2581004 2534072 2009040
1128 2009040 2748944 2521495 1487283 1168815 1514575 1930370 2534179 3511400 3161291
1119 3161291 2037945 2782945 2771695 2372174 3387248 3914471 2838189 2358576 2845311
$$ packed form
1186a78388j43255M93223q87232k94565m23411J051712J323869k17154J16291
1177H41090l22534n00587N82311q95837o83338J009809P14257L37469m60478l52093
1167B70069q9929K87794n36016o24515L5621Q66353L48863R0671J17252m98229
1157B67934l89090m06900j316059J045895P12552j10790J22137P94189L23549
1148A043417N4158l47308o16015j89374j84315R94617M94147j97831O06219L35815
1138A993530r68854M78316N509m14773j9797l2342Q44934O94481m6932n25032
1128B009040P39904k27449j034212l18468L45760M15795O03809R77221l50109
1119C161291j123346P45000j1250l99521J015074N27223j076282m79613M86735
$$ plain form
1110 2845311 2706870 2683649 3433987 1835577 1413709 2860034 2090164 2026153 2717087 2600893
1100 2600893 2950379 2961998 2563882 3532354 3184164 3726925 2954264 2665894 3815122 4075803
1090 4075803 3645411 4112708 3882609 4126192 4292500 3286016 3065416 4414900 4328962
1081 4328962 3479758 3850594 3848901 4443233 5199792 4515084 4040097 4211256 4715459 4406078
1071 4406078 3422576 3563733 4567162 4207694 4171907 4161351 4396759 4767204 5347727 4971959
1061 4971959 4436180 4865257 4737351 5188249 5480360 5737993 5263075 5335542 5228449 4945668
1051 4945668 5123151 5043991 5935350 6094954 6192246 6694142 6166279 5774515 6494953 6304863
1041 6304863 6019389 7045444 5870010 6239189 7670315 7092398 8199191 8978998 8166135
$$ packed form
1110B845311j38441k3221P50338j598410m21868J446325p69870o4011O90934j16194
1100B600893L49486J1619l98116R68472l48190N42761p72661k88370J149228K60681
1090D075803m30392M67297k30099K43583J66308j006484k20600J349484q5938
1081D328962q49204L70836j693N94332P56559o84708m74987J71159N04203l09381
1071D406078r83502J41157J003429l59468l5787j0556K35408L70445N80523l75768
1061D971959n35779M29077j27906M50898K92111K57633m74918P2467j07093k82781
1051D945668J77483p9160Q91359J59604R7292N01896n27863l91764P20438j90090
1041F304863k85474J026055j175434L69179J431126n77917J106793P79807q12863
$$ plain form
1032 8166135 8451516 8586830 8122027 8896907 9634194 9658991 9944976 10151128 10685470 10626641
1022 10626641 10601379 11577598 11709280 11420701 12825888 13411691 13231576 13677033 13572445
1013 13572445 13322365 14227520 14183937 14166026 15712729 16449336 17123656 18065738 18372184 19077516
1003 19077516 19194984 18472039 18858432 19656679 20583744 21363448 21464578 22113343 23096063
994 23096063 23694439 24016858 24653613 26562309 28159784 29665373 30986694 32060487 34212605
985 34212605 35890469 37895457 39721999 41529990 44542419 46761859 48309824 51085263
977 51085263 53728036 56544550 58380449 60328997 63100725 67321173 73511687 79724453
969 79724453 85912591 91286638 96385570 102895873 109717859 120459049 134441262 149663774
$$ packed form
1032H166135K85381J35314m64803P74880P37287K4797K85985K06152N34342n8829
1022A0626641k5262R76219J31682k88579J405187N85803j80115M45457j04588
1013A3572445k50080R05155m3583j7911J546703P36607O74320R42082L06446P05332
1003A9077516J17468p22945L86393P98247R27065P79704J01130O48765R82720
994B3096063N98376L22419O36755J908696J597475J505589J321321J073793K152118
985C4212605J677864K004988J826542J807991L012429K219440J547965K775439
977E1085263K642773K816514J835899J948548K771728M220448O190514O212766
969G9724453O188138N374047N098932O510303O821986J0741190J3982213J5222512
$$ plain form
961 149663774 166823456 187332666 210770486 243054736 282886425 331560795 392362445
954 392362445 453136685 465765479 410121111 326121831 255258525 207826384 170641908
947 170641908 142799634 121430981 103809386 90168728 80215594 72987393 67897401 63450757
939 63450757 61141426 57731061 54399044 50818602 45306737 40794045 37442805 34791177
931 34791177 31385267 27972738 26554731 24614848 22688426 22154915 20169789 18736207
923 18736207 18445303 17076480 16625698 15666498 14691547 14459143 12938384 12196251 11911061
914 11911061 11172238 11247580 10669707 10941685 10418988 9413554 9212465 9079864 7605932
905 7605932 7315795 8324993 7148155 7578282 7655474 7084882 7186024 6665512 6849283 6862591
$$ packed form
961A49663774J7159682K0509210K3437820L2284250L9831689M8674370O0801650
954C92362445O0774240J2628794n5644368q3999280p0863306m7432141l7184476
947A70641908k7842274k1368653j7621595j3640658r953134p228201n089992m446644
939F3450757k309331l410365l332017l580442n511865m512692l351240k651628
931C4791177l405910l412529j418007j939883j926422n33511j985126j433582
923A8736207k90904j368823m50782r59200r74951k32404j520759p42133k85190
914A1911061p38823P5342n77873K71978n22697j005434k01089j32601j473932
905G605932k90137J009198j176838M30127P7192n70592J01142n20512J83771J3308
$$ plain form
895 6862591 6377821 6516034 7375052 6862844 5743970 5502288 5673519 5518547 5831590 5403128
885 5403128 5435158 5666652 5840877 5077922 5075923 5127368 4651382 5229786 4621467 4223646
875 4223646 3787741 3977296 4487445 3010464 3583036 4050177 2977964 3130765 2646885
866 2646885 2912778 3131523 3104163 3155439 2789234 2265600 2271631 1967785 1999613 1935370 1925207
855 1925207 1991866 1993776 2564827 2355064 2213010 1916328 1933860 2341783 1218161 989415
845 989415 1306640 828564 1347371 1426985 444176 1271580 1384521 773523 1102070 1196175
835 1196175 1512606 805060 -326974 66707 692440 915364 877624 218361 119063 333688
825 333688 424276 85996 59873 751199 1244564 1102418 1150066 2279745 2250714 1468019
$$ packed form
895F862591m84770J38213Q59018n12208j118874k41682J71231j54972L13043m28462
885E403128L2030K31494J74225p62955j999N1445m75986N78404o08319l97821
875D223646m35905J89555N10149j476981N72572M67141j072213J52801m83880
866B646885K65893K18745k7360N1276l66205n23634O031l03846L1828o4243j0163
855A925207O6659J910N71051k09763j42054k96682J7532M07923j123622k28746
845I89415L17225m78076N18807P9614r82809Q27404J12941o10998L28547R4105
835A196175L16431p07546j132034L93681O25733K22924l7740o59263r9298K14625
825C33688R0588l38280k6123O91326M93365j42146M7648J129679k9031p82695
$$ plain form
815 1468019 1554309 1711555 1443026 1009638 1016307 1099239 1366809 1254144 910104 146596
805 146596 344870 526458 163137 101264 -587222 267303 1233699 262527 52824 -190976
795 -190976 295433 875588 220965 781351 1018855 1398887 1216095 -66286 -384551 340598
785 340598 266000 -796900 -982118 -366235 -284080 179950 326891 43385 32300 74619
775 74619 17569 25789 -92516 196747 1953 714441 1690291 830733 910452 933812 178607
764 178607 435617 852632 509078 679057 628710 509374 621762 -494843 -337225 -62058
754 -62058 -371952 228331 324288 -423552 326167 86374 -509388 -373641 -563337 -688962
744 -688962 256101 295576 67815 264839 64786 354329 216989 -1235471 -684194 -244862
$$ packed form
815A468019Q6290J57246k68529m33388O669Q2932K67570j12665l44040p63508
805A46596J98274J81588l63321o1873o88486Q54525R66396r71172k09703k43800
795a90976M86409N80155o54623N60386K37504L80032j82792j282381l18265P25149
785C40598p4598j062900j85218O15883Q2155M64030J46941k83506j1085M2319
775G4619n7050Q220j18305K89263j94794P12488R75850q59558P9719K3360p55205
764A78607K57010M17015l43554J69979n0347j19336J12388j116605J57618K75167
754f2058l09894O00283R5957p47840P49719k39793n95762J35747j89696j25625
744f88962R45063L9475k27761J97024k00053K89543j37340j452460N51277M39332
$$ plain form
734 -244862 -587297 -53578 -170102 485255 1111127 72152 -65537 270563 -213473 -127736
724 -127736 -372778 -86050 -497545 -631038 308116 -515480 -1407847 -23748 -336635 163315
714 163315 826376 -777211 -336562 144375 -966101 -290185 -324409 75403 411450 -404251
704 -404251 108870 68855 -620528 40553 -539718 -558092 -110406 -984670 -577656 -123236
694 -123236 6646 462967 -512133 -455861 -139697 -212517 -708985 -648914 -441859 430598
684 430598 829853 232641 -257200 -263946 -135950 127668 409884 371918 972141 733588
674 733588 75199 494247 552266 134350 408280 1236713 1209714 1777863 2496234 1776676
664 1776676 1890936 1349492 493955 932777 660931 410547 1193611 499730 417996 440187
$$ packed form
734b44862l42435N33719j16524O55357O25872j038975j37689L36100m84036Q5737
724a27736k45042K86728m11495j33493R39154q23596q92367J384099l12887M99950
714A63315O63061j603587M40649M80937j110476O75916l4224L99812L36047q15701
704d04251N13121m0015o89383O61081n80271j8374M47686q74264M07014M54420
694a23236J29882M56321r75100N6272L16164p2820m96468O0071K07055Q72457
684D30598L99255n97212m89841o746J27996K63618K82216l7966O00223k38553
674G33588o58389M19048N8019m17916K73930Q28433k6999N68149P18371p19558
664A776676J14260n41444q55537M38822k71846k50384P83064o93881q1734K2191
$$ plain form
654 440187 -493386 -567235 290168 -1123512 -650826 571536 69541 380579 830502 -201101
644 -201101 61629 -306712 -513747 -290700 232700 737666 -309740 -88477 534547 80491
634 80491 21688 265930 -475017 605588 410406 -743218 191888 90033 -319142 -257048
624 -257048 -1003950 -216881 143535 376754 609277 -315731 112015 795688 -234041 233978
614 233978 150177 -355809 268888 508250 84277 237541 140402 348865 -114105 11578
604 11578 803706 792021 933169 -213003 -472485 269744 669302 -52733 -916572 -963791
594 -963791 -377568 -113585 -625794 -156388 -551154 -15800 880377 -355293 28597 -91292
584 -91292 -1179839 -171568 -295291 -306177 1092777 52484 -689806 -187643 -670041 -565322
$$ packed form
654D40187r33573p3849Q57403j413680M72686J222362n01995L11038M49923j031603
644b01101K62730l68341k07035K23047N23400N04966j047406K21263O23024m54056
634H0491n8803K44242p40947J080605j95182j153624R35106j01855m09175O2094
624b57048p46902P87069L60416K33219K32523r25008M27746O83673j029729M68019
614B33978q3801n05986O24697K39362m23973J53264r7139K08463m62970J25683
604A1578P92128j1685J41148j146172k59482P42229L99558p22035q63839m7219
594i63791N86223K63983n12209M69406l94766N35354Q96177j235670L83890j19889
584i1292j088547J008271j23723j0886J398954j040293p42290N02163m82398J04719
$$ plain form
574 -565322 -32247 -450499 497579 -219379 -619660 -938668 -1398578 -788232 -168393 -586146
564 -586146 -823361 -246478 -733094 -65136 7644 -825445 -277151 -400886 -555530 -385606
554 -385606 -825925 -588645 -228352 -703829 -773519 -930484 -788201 -58625 -467766 -768268
544 -768268 -451475 -651390 -343973 -624980 -1187528 -796442 -939864 -1075700 -682703 -382168
534 -382168 73202 539015 -7047 468872 -443895 -1376112 7628 -347958 522179 142692
524 142692 -917229 118899 -521648 -1245008 -694068 -1192544 -188897 829560 -762038
515 -762038 250859 87462 -1041559 -497 -405525 -883870 -508131 -389772 -574575
506 -574575 -602815 -384817 -1209613 -385631 12484 -537942 -718412 -586649 -659733 226935
$$ packed form
574e65322N33075m18252R48078p16958m00281l19008m59910O10346O19839m17753
564e86146k37215N76883m86616O67958P2780q33089N48294j23735j54644J69924
554c85606m40319K37280L60293m75477o9690j56965J42283P29576m09141l00502
544g68268L16793j99915L07417k81007n62548L91086j43422j35836L92997L00535
534c82168M55370M65813n46062M75919r12767r32217J383740l55586Q70137l79487
524A42692j059921J036128o40547p23360N50940m98476J003647J018457j591598
515g62038J012897j63397j129021J041062m05028m78345L75739J18359j84803
506e74575k8240K17998q24796Q23982L98115n50426j80470J31763p3084Q86668
$$ plain form
496 226935 391198 -66440 719643 560051 -136971 -561204 -723175 507956 308569 -413444
486 -413444 290067 -563015 -257088 231035 -927741 -217890 232402 95194 117115 -829629
476 -829629 -295470 876561 840253 433067 185063 159777 144878 -276411 274786 29179
466 29179 63705 371285 -1041207 -437023 940661 -21150 211452 -278945 -497224 587144
456 587144 195593 -153759 -209428 -302856 280505 41789 -296 203796 703176 431078
446 431078 -471381 -597292 404135 498168 290161 -55458 -626331 -58949 361522 -321025
436 -321025 -915108 -855659 -310057 -457562 -1026828 59885 61660 479804 -75236 -249171
426 -249171 -139122 896358 1005150 639324 -29543 368630 610460 -485518 -131912 -285110
$$ packed form
496B26935J64263m57638P86083j59592o97022m24233j61971J231131j99387p22013
486d13444P03511q53082L05927M88123j158776P09851M50292j37208K1921r46744
476h29629N34159J172031l6308m07186k48004k5286j4899m21289N51197k45607
466B9179L4526L07580j412492O04184J377684r61811K32602m90397k18279J084368
456E87144l91551l49352n5669r3428N83361k38716m2085K04092M99380k72098
446D31078r02459j25911J001427R4033k08007l45619n70873N67382M20471o82547
436c21025n94083N9449N45602j47505n69266J086713J775M18144n55040j73935
426b49171J10049J035480J08792l65826o68867L98173K41830j095978L53606j53198
$$ plain form
416 -285110 -36251 1001145 516722 117473 450950 634909 555143 626507 351967 828956
406 828956 1512390 689756 787631 1369163 1501349 1469914 35630 -18695 674535 -86162
396 -86162 436683 248776 954405 1555163 1266739 1088189 498133 -65119 596081 66861
386 66861 594200 1348057 63147 757705 73307 -678646 167526 -134037 611438 585640
376 585640 305760 1384977 1581193 1060922 938179 1197473 1182006 755764 1147127 1714199
366 1714199 1645085 1830965 1550984 1410687 1112373 1455630 1219921 438330 281706 645085
356 645085 1675732 965795 915857 835998 348519 710948 499928 1036948 1035415 1574859
346 1574859 1384324 536149 1192016 397812 -113418 329581 300033 873410 1109112 758996
$$ packed form
416b85110K48859J037396m84423l99249L33477J83959p9766P1364k74540M76989
406H28956O83434q22634R7875N81532J32186l1435j434284n4325O93230p60697
396h6162N22845j87907P05629O00758k88424j78550n90056n63252O61200n29220
386F6861N27339P53857j284910O94558o84398p51953Q46172l01563P45475k5798
376E85640k79880J079217J96216n20271j22743K59294j5467m26242L91363N67072
366A714199o9114J85880k79981j40297k98314L43257k35709p81591j56624L63379
356F45085J030647p09937m9938p9859m87479L62429k11020N37020j533N39444
346A574859j90535q48175O55867p94204n11230M42999k9548N73377K35702l50116
$$ plain form
336 758996 726136 220331 272946 835717 803896 1062969 1357727 1136853 1524901 1309805
326 1309805 67136 581802 680100 841747 881759 -40008 1072834 793936 596995 813341
316 813341 71399 890271 851771 -653425 -174711 531560 797871 1312742 774887 -402705
306 -402705 641372 1244588 617952 317022 986744 1030219 681200 486329 793887 1460666
296 1460666 934729 813280 -109997 317134 895863 -61607 378440 630220 282148 284887
286 284887 628036 693387 660361 1217589 619356 666576 973981 509614 61330 -255172
276 -255172 254149 807520 175768 1045061 554680 761369 1774643 581878 1139 215708
266 215708 552670 645529 838636 914696 1104175 1349987 1341780 251013 593817 358703
$$ packed form
336G58996l2860n05805N2615N62771l1821K59073K94758k20874L88048k15096
326A309805j242669N14666R8298J61647M0012r21767J112842k78898j96941K16346
316H13341p41942Q18872l8500j505196M78714P06271K66311N14871n37855j177592
306d02705J044077O03216o26636l00930O69722M3475l49019j94871L07558O66779
296A460666n25937j21449r23277M27131N78729r57470M40047K51780l48072K739
286B84887L43149O5351l3026N57228n98233M7220L07405m64367m48284l16502
276b55172N09321N53371o31752Q69293m90381K06689J013274j192765n80739K14569
266B15708L36962R2859J93107P6060J89479K45812q207j090767L42804k35114
$$ plain form
256 358703 -476073 220475 117487 462248 1133660 -20920 116415 695168 342382 821016
246 821016 720956 734302 1519569 797483 432443 616609 503465 1359967 1029160 450839
236 450839 479950 1219787 1522355 804449 194501 499821 1512858 1238518 741232 841821
226 841821 431524 882094 1208297 155761 218172 1463259 -8954 221565 353684 -127990
216 -127990 714047 608275 -306719 70053 495983 1104350 1555069 1056967 1440543 1050902
206 1050902 1104609 818016 -105465 300598 940013 573459 545476 1672025 1022214 491973
196 491973 907558 675654 435976 144229 483009 780695 1070944 1763150 941161 611919
186 611919 951903 -932130 102167 439589 -100554 923410 858890 974687 790435 -34860
$$ packed form
256C58703q34776O96548j02988L44761O71412j154580J37335N78753l52786M78634
246H21016j00060J3346P85267p22086l65040J84166j13144Q56502l30807n78321
236D50839K9111P39837L02568p17906o09948L05320J013037k74340m97286J00589
226H41821m10297M50570L26203j052536O2411J245087j472213K30519J32119m81674
216a27990Q42037j05772r14994L76772M25930O08367M50719m98102L83576l89641
206A050902N3707k86593r23481M06063O39415l66554k7983J126549o49811n30241
196D91973M15585k31904k39678k91747L38780K97686K90249O92206q21989l29242
186F11919L39984j884033J034297L37422n40143J023964o4520J15797j84252q25295
$$ plain form
176 -34860 386240 298532 -2306 1137974 903227 932449 1568357 1198882 1311706 1259599
166 1259599 533290 809167 1089380 690253 1145889 1232545 485917 442262 618970 317913
156 317913 -7505 273092 116851 921316 1242215 588696 835974 678139 619121 29861
146 29861 -377576 4365 253258 152879 1154962 958358 292461 1048671 257096 -819688
136 -819688 -553682 -59083 326350 624940 72689 170673 518097 205176 625298 483004
126 483004 992085 1158323 1490585 1454658 1127207 832689 967882 1088786 556985 587717
116 587717 1027201 758124 930833 868084 986351 1063557 969853 393404 54174 1028053
106 1028053 901381 254926 -82572 46225 209664 522162 -127799 30139 615311 498826
$$ packed form
176c4860M21100q7708l00838J140280k34747K9222O35908l69475J12824n2107
166A259599p26309K75877K80213l99127M55636Q6656p46628m3655J76708l01057
156C17913l25418K80597j56241Q04465L20899o53519K47278j57835n9018n89260
146B9861m07437L81941K48893j00379J002083j96604o65897P56210p91575j076784
136h19688K66006M94599L85433K98590n52251R7984L47424l12921M20122j42294
126D83004N09081J66238L32262l5927l27451k94518J35193J20904n31801L0732
116E87717M39484k69077J72709o2749J18267P7206r3704n76449l39230R73879
106A028053j26672o46455l37498J28797J63439L12498o49961J57938N85172j16485
$$ plain form
96 498826 117845 278738 558005 760912 189312 -221247 108048 -178603 202459 501756
86 501756 244240 184600 598264 744934 464987 272060 842353 1006573 447075 304206
76 304206 1027014 765072 759348 957649 221856 896614 978927 304272 614322 5818 81521
65 81521 1314550 434066 317272 453976 58666 -10686 -180054 -381064 312772 564146
55 564146 638046 980423 792621 475507 612029 574359 1212748 1173402 423270 559273 520344
44 520344 424994 749429 595136 951783 898141 508652 1114815 717429 1112751 1321820
34 1321820 181097 284743 630694 524396 53908 -234447 -35815 312420 564745 -148729
24 -148729 61326 725973 567179 591186 876469 582606 427075 165027 308589 419972
$$ packed form
96D98826l80981J60893K79267K02907n71600m10559L29295k86651L81062K99297
86E01756k57516n9640M13664J46670k79947j92927N70293J64220n59498j42869
76C04206P22808k61942n724J98301p35793O74758Q2313o74655L10050o08504P5703
65H1521J233029q80484j16794J36704l95310o9352j69368k01010O93836K51374
55E64146P3900L42377j87802l17114J36522l7670O38389l9346p50132J36003l8929
44E20344r5350L24435j54293L56647n3642l89489O06163l97386L95322K09069
34A321820j140723J03646L45951j06298m70488k88355J98632L48235K52325p13474
24a48729K10055O64647j58794K4007K85283k93863j55531k62048J43562J11383
$$ plain form
14 419972 490889 883082 562290 845345 1017218 947210 762883 565165 600961 336430 86347
3 86347 -28032 -330084 810003
0 810003
$$ packed form
14D19972P0917L92193l20792K83055J71873p0008j84327j97718L5796k64531k50083
3H6347j14379l02052J140087
0H10003
$$ Imaginary data points
##PAGE= N=2
##DATA TABLE= (X++(I..I)), XYDATA
$$ plain form
16383 -3366747 -2629205 -3165642 -2802878 -2468848 -2916428 -2496275 -2723655 -2696545 -2405387 -2345255
16373 -2345255 -2620293 -2397004 -2382319 -2731050 -2330312 -1871653 -1767878 -1695395 -1622603 -1506206
16363 -1506206 -1793107 -2650141 -2047954 -1510642 -1135856 -607934 -528505 -506752 -638942 -462661
16353 -462661 -302134 -1061398 -588434 -311645 -1166849 -959764 -230057 285969 183503 -190317
16343 -190317 -573380 -881413 -425734 -594958 -760517 -580579 135847 828075 252445 59680
16333 59680 -445201 -924761 -331072 -490105 21249 912734 757915 665579 926773 468628
16323 468628 389878 329490 226058 369725 725639 1273593 1040891 1570250 1526425 1541202
16313 1541202 1368558 853697 1189067 1189989 1201033 2214851 1508937 2041196 2319727 1484933
$$ packed form
16383c366747P37542n36437L62764L34030m47580M20153k27380K7110K91158O0132
16373b345255k75038K23289J4685l48731M00738M58659J03775P2483P2792J16397
16363a506206k86901q57034O02187N37312L74786N27922P9429K1753j32190J76281
16353d62661J60527p59264M72964K76789q55204K07085P29707N16026j02466l73820
16343a90317l83063l08033M55679j69224j65559J79938P16426O92228n75630j92765
16333E9680n04881m79560N93689j59033N11354Q91485j54819r2336K61194m58145
16323D68628p8750o0388j03432J43667L55914N47954k32702N29359m3825J4777
16313A541202j72644n14861L35370R22J1044J013818p05914N32259K78531q34794
$$ plain form
16303 1484933 1765460 1768149 1045976 1810694 2884689 2401670 3049624 2719540 2196436 2042911
16293 2042911 1290694 1067455 1681559 1956480 2498253 3063551 2481174 2953701 3287305
16284 3287305 2413397 2408989 2611688 2813287 3693350 3399594 3351686 3355466 2453977 2374642
16274 2374642 2383758 2365201 2802043 2993565 3559876 3779405 3884519 4127577 4088927 3594795
16264 3594795 4124970 4527488 3812149 4364433 4498297 3672876 3891387 4401960 3567202
16255 3567202 3633365 4134850 3596063 4080483 4788267 4367438 4243403 4246723 3949397 4360169
16245 4360169 4401891 3856587 3516207 3346403 4132533 4363153 4507067 5008472 4845394 4595362
16235 4595362 4688088 5267914 5233198 5290775 5314847 4134303 4868276 5475827 4626662 5501630
$$ packed form
16303A484933K80527K689p22173P64718J073995m83019O47954l30084n23104j53525
16293B042911p52217k23239O14104K74921N41773N65298n82377M72527L33604
16284C287305q73908m408K02699K01599Q80063k93756m7908L780r01489p9335
16274B374642R116j8557M36842J91522N66311K19529J05114K43058l8650m94132
16264C594795N30175M02518p15339N52284J33864q25421K18511N10573q34758
16255C567202O6163N01485n38787M84420P07784m20829j24035L320k97326M10772
16245D360169M1722n45304l40380j69804P86130K30620J43914N01405j63078k50032
16235D595362R2726N79826l4716N7577K4072j180544P33973O07551q49165Q74968
$$ plain form
16225 5501630 5262442 5023659 5798955 4956453 3863321 4301280 4662856 4946682 4927384
16216 4927384 5244411 5422129 5142013 5330086 4783759 4661624 5376886 5783463 5254386
16207 5254386 4861466 5163855 6018597 6296684 5963333 6010652 5346927 4639631 4793161 5323383
16197 5323383 6090408 6643014 6536880 6040429 6584168 6459853 5180277 5503948 5630988
16188 5630988 5124867 6099807 5634642 5516180 6183889 6198923 6251327 5583879 5528538 6510102
16178 6510102 5701835 5567273 5488318 5684146 7115982 6156196 5729553 6162669 5212666
16169 5212666 5505446 6042135 5509428 6364236 6863814 5916110 6020925 5605972 4548845
16160 4548845 5522310 5129709 4971566 5580918 5276797 5451071 5225162 4781240 5769951
$$ packed form
16225E501630k39188k38783P75296q42502j093132M37959L61576K83826j9298
16216D927384L17027J77718k80116J88073n46327j22135P15262M06577n29077
16207E254386l92920L02389Q54742K78087l33351M7319o63725p07296J53530N30222
16197E323383P67025N52606j06134m96451N43739j24315j279576L23671J27040
16188E630988n06121R74940m65165j18462O67709J5034N2404o67448n5341R81564
16178F510102q08267j34562p8955J95828J431836r59786m26643M33116r50003
16169E212666K92780N36689n32707Q54808M99578r47704J04815m14953j057127
16160D548845R73465l92601j58143O09352l04121J74274k25909m43922R88711
$$ plain form
16151 5769951 5538580 4772870 5610582 6098553 6752536 7632521 6719117 6727288 6506992 6128259
16141 6128259 5122407 4431561 5454013 5540894 6564429 6807603 7080177 7055254 5970444
16132 5970444 5966885 5490567 5852912 6852912 6547228 6461906 7269033 6950719 6429169 6316793
16122 6316793 5950477 5928426 5691155 6440974 6804334 6429292 7116717 6368547 5691265 6084741
16112 6084741 5554461 6248911 5995175 5966145 6465023 6129951 6662935 6602599 6471967 6762897
16102 6762897 5978950 5725468 6928015 6147394 6856232 7731658 6092903 6905853 6803091
16093 6803091 5685700 6156954 5987144 6282996 7455201 6898240 6908468 6351314 6216635
16084 6216635 6368646 6140225 6304035 6660174 6592349 6813532 6939245 6753518 7403280 6911682
$$ packed form
16151E769951k31371p65710Q37712M87971O53983Q79985r13404Q171k20296l78733
16141F128259j005852o90846J022452Q6881J023535K43174K72574k4923j084810
16132E970444l559m76318L62345J000000l05684q5322Q07127l18314n21550j12376
16122F316793l66316k2051k37271P49819L63360l75042O87425p48170o77282L93476
16112F084741n30280O94450k53736k9030M98878l35072N32984o0336j30632K90930
16102F762897p83947k53482J202547p80621P08838Q75426j638755Q12950j02762
16093F803091j117391M71254j69810K95852J172205n56961J0228n57154j34679
16084F216635J52011k28421J63810L56139o7825K21183J25713j85727O49762m91598
$$ plain form
16074 6911682 6646535 6626510 6955643 7502155 7122509 7587018 7219034 6536459 7423972 7083902
16064 7083902 6129352 6797974 6432861 6405905 7271990 7352095 7232089 6993908 7175293 7679744
16054 7679744 6529021 5970498 6342099 7112435 6934782 7285572 6890352 6751740 7343969
16045 7343969 6786674 7065443 6203629 6251411 6693437 6585958 6556593 6703298 6879500 7605863
16035 7605863 7360915 6984587 7739018 7260847 6809198 7705210 6854584 6827785 7384748 6831549
16025 6831549 6584806 6879997 5772809 6530458 6814983 7231454 6919430 6610342 6955773
16016 6955773 6410014 7040152 7961460 7599209 7017484 6400518 6681376 7077976 7210735
16007 7210735 6681856 6285312 6598585 6498282 6400501 6853655 7476508 7276467 7252318 7189401
$$ packed form
16074F911682k65147k0025L29133N46512l79646M64509l67984o82575Q87513l40070
16064G083902r54550O68622l65113k6956Q66085Q0105j20006k38181J81385N04451
16054G679744j150723n58523L71601P70336j77653L50790l95220j38612N92229
16045G343969n57295K78769q61814M7782M42026j07479k9365J46705J76202P26363
16035G605863k44948l76328P54431m78171m51649Q96012q50626k6799N56963n53199
16025F831549k46743K95191j107188P57649K84525M16471l12024l09088L45431
16016F955773n45759O30138R21308l62251n81725o16966K80858L96600J32759
16007G210735n28879l96544L13273j00303r7781M53154O22853k00041k4149o2917
$$ plain form
15997 7189401 7122011 6376644 5990365 6248342 6458889 7371159 7414995 6872843 7232865 7650605
15987 7650605 7319724 6557966 6379445 6311817 7386851 7537497 7145166 8678299 8554997
15978 8554997 7577790 7397025 7017489 8426628 8089473 7281602 7324068 6698133 7796192
15969 7796192 7519046 6549854 7910545 7559928 7932318 7729261 6738589 7581445 7267624
15960 7267624 6819999 7922281 7128789 7664016 8339334 6693378 7128180 7907934 6711216
15951 6711216 7312695 7493771 7500761 8337148 8004398 8172409 8227373 7363882 7568828 6890305
15941 6890305 6635967 7454110 6611518 7444030 7349066 6353642 7168813 7464393 7004328 7417369
15931 7417369 7379434 7390573 7510566 7682069 7918196 7792494 7926510 6841675 7654936 8445924
$$ packed form
15997G189401o7390p45367l86279K57977K10547R12270M3836n42152L60022M17740
15987G650605l30881p61758j78521o7628J075034J50646l92331J533133j23302
15978H554997r77207j80765l79536J409139l37155q07871M2466o25935J098059
15969G796192k77146r69192J360691l50617L72390k03057r90672Q42856l13821
15960G267624m47625J102282p93492N35227O75318j645956M34802P79754j196718
15951F711216O01479J81076O990Q36387l32750J68011N4964q63491K04946o78523
15941F890305k54338Q18143q42592Q32512r4964r95424Q15171K95580m60065M13041
15931G417369l7935J1139J19993J71503K36127j25702J34016j084835Q13261P90988
$$ plain form
15921 8445924 7006339 7521863 7463201 6655907 8154969 8143512 7358519 8394265 7250859
15912 7250859 7608043 8442846 7123106 7692590 8292857 7854205 8277588 7323004 6856823
15903 6856823 7834340 7100600 7053142 7336912 7572247 7557304 7209014 7085704 6381613 7136858
15893 7136858 7492236 7386360 8340470 8361907 8205307 7995149 7148537 6818104 7375575 7348283
15883 7348283 6830887 7391595 7257841 7552919 7515844 7638910 7637163 6500577 6236591 6550389
15873 6550389 6469834 6784865 7277126 7647185 7110000 7230147 7766656 7246540 7479483 6519885
15863 6519885 6655109 8039444 7334345 7099684 7623714 6566195 7057317 6738266 5294108
15854 5294108 6344073 6489980 6460990 7284961 6205536 7048256 6938149 6177220 6812625
$$ packed form
15921H445924j439585N15524n8662q07294J499062j1457p84993J035746j143406
15912G250859L57184Q34803j319740N69484O00267m38652M23383r54584m66181
15903F856823R77517p33740m7458K83770K35335j4943l48290j23310p04091P55245
15893G136858L55378j05876R54110K1437j56600k10158q46612l30433N57471k7292
15883G348283n17396N60708j33754K95078l7075J23066j747j136586k63986L13798
15873F550389q0555L15031M92261L70059n37185J20147N36509n20116K32943r59598
15863F519885J35224J384335p05099k34661N24030j057519M91122l19051j444158
15854E294108J049965J45907k8990Q23971j079425Q42720j10107p60929O35405
$$ plain form
15845 6812625 6428479 6193442 6786697 7297300 7549945 7745834 8210658 6983942 7049665
15836 7049665 7675932 7463124 7320457 7675980 7335297 6869517 8039608 7113226 6811571
15827 6811571 7358388 7055794 7884353 6713737 6074924 7309497 7404759 7546743 6701489
15818 6701489 6230624 7004057 6901878 6116649 6375323 6035099 7030796 7773240 7489258
15809 7489258 6735188 6502300 6884530 6676684 6424439 6643186 6742004 7417307 7630701 7436064
15799 7436064 8258241 7918750 7700413 7333319 7131551 7994902 7543331 7246934 7977117
15790 7977117 8051232 7032949 7423915 6618325 6438920 7626228 7094916 7017935 7377896
15781 7377896 6687555 7439420 7348345 6379807 6077541 6657473 7499406 7359836 6532071 6424252
$$ packed form
15845F812625l84146k35037N93255N10603K52645J95889M64824j226716O5723
15836G049665O26267k12808j42667L55523l40683m65780J170091r26382l01655
15827F811571N46817l02594Q28559j170616o38813J234573R5262J41984q45254
15818F701489m70865P73433j02179p85229K58674l40224R95697P42444k83982
15809G489258p54070k32888L82230k07846k52245K18747R8818O75303K13394j94637
15799G436064Q22177l39491k18337l67094k01768Q63351m51571k96397P30183
15790G977117P4115j018283L90966q05590j79405J187308n31312p6981L59961
15781G377896o90341P51865r1075r68538l02266N79932Q41933j39570q27765j07819
$$ plain form
15771 6424252 7446898 7296980 6966099 6636678 6686815 7865120 7879322 7833089 7685008 7073531
15761 7073531 7272585 7727203 7729827 6983604 7727172 7912187 6748159 7778830 7558031
15752 7558031 7312181 7787168 6924314 7200803 8060453 7711521 7540947 7103793 7200287 7436809
15742 7436809 7087755 7502399 7840182 7985394 7881923 7653873 7326248 7409271 7461101 7377519
15732 7377519 6904736 6883967 6971028 7418043 7545892 7464026 7493567 8147240 7952262 7343785
15722 7343785 8022448 8199706 7583568 7679783 7892239 6841472 7023229 7630128 6896652
15713 6896652 7323362 7571446 7579069 7726311 7750766 6865372 7067086 7323176 6928499 7354788
15703 7354788 7864423 8268296 8335552 7482403 7198255 7315948 8332403 7613945 7403764
$$ packed form
15771F424252J022646j49918l30881l29421N0137J178305J4202m6233j48081o11477
15761G073531J99054M54618K624p46223P43568J85015j164028J030671k20799
15752G558031k45850M74987q62854K76489Q59650l48932j70574m37154R6494K36522
15742G436809l49054M14644L37783J45212j03471k28050l27625Q3023N1830q3582
15732G377519m72783k0769Q7061M47015J27849q1866K9541O53673j94978o08477
15722G343785O78663J77258o16138R6215K12456j050767J81757O06899p33476
15713F896652M26710K48084P623J47242K4455q85394K01714K56090l94677M26289
15703G354788N09635M03873O7256q53149k84148J17693J016455p18458k10181
$$ plain form
15694 7403764 7172692 7334259 7855858 8301852 8180990 7758227 8121946 8059015 7706488 7965158
15684 7965158 8858940 8655601 7623639 7631232 8190305 8818852 8316639 7247978 7718280
15675 7718280 7315024 7332873 7345801 6670932 7525436 8188453 7815033 6973690 6735490 7383490
15665 7383490 7520412 7184191 7839725 9030311 8516244 8155023 7660893 7520152 7667796
15656 7667796 7343700 7365991 7054357 7544605 8330054 7696630 7912002 8143458 7149864 7875221
15646 7875221 7951576 7697683 7696277 7576119 7927738 8431491 7937148 7233526 7622454 6912435
15636 6912435 7398786 7857569 8109098 7627331 8614479 8741413 7970856 7800717 7727618 7019529
15626 7019529 7332448 6990807 7631136 7364611 6589836 7395913 7399002 7203422 7445368 7170728
$$ packed form
15694G403764k31072J61567N21599M45994j20862m22763L63719o2931l52527K58670
15684G965158Q93782k03339j031962P593N59073O28547n02213j068661M70302
15675G718280m03256J7849J2928o74869Q54504O63017l73420q41343k38200O48000
15665G383490J36922l36221O55534J190586n14067l61221m94130j40741J47644
15656G667796l24096K2291l11634M90248P85449o33424K15372K31456r93594P25357
15646G875221P6355k53893j406j20158L51619N03753m94343p03622L88928p10019
15636F912435M86351M58783K51529m81767R87148J26934p70557j70139p3099p08089
15626G019529L12919l41641O40329k66525p74775Q06077L089j95580K41946k74640
$$ plain form
15616 7170728 7131016 7752060 7661521 7240785 6902921 7120041 7457755 6682694 6970407 7843528
15606 7843528 7372828 7694746 8028094 7582423 7163879 7855130 7759707 7209993 8417318
15597 8417318 7926935 6966868 7387372 7402766 7488058 8495005 7678614 7062480 8136703
15588 8136703 8004279 7392456 7400302 7760322 7973424 8181015 7933985 7887682 7171992 7812780
15578 7812780 8327142 7987964 7716835 7952321 7802507 7284047 7422328 7522232 7338353 7966897
15568 7966897 7154244 7172103 7964463 7493846 7422731 7108766 6645449 7045489 7337856 6802897
15558 6802897 7901563 7157004 6378392 7254663 6904670 6900756 7187189 6491749 7328009 7521159
15548 7521159 6841781 7737126 7339093 6990166 7255189 7019908 6999158 8131842 8590637
$$ packed form
15616G170728l9712O21044r0539m20736l37864K17120L37714p75061K87713Q73121
15606G843528m70700L21918L33348m45671m18544O91251r5423n49714J207325
15597H417318m90383r60067M20504J5394Q5292J006947q16391o16134J074223
15588H136703j32424o11823P846L60020K13102K07591k47030m6303p15690O40788
15578G812780N14362l39178k71129K35486j49814n18460J38281R9904j83879O28544
15568G966897q12653J7859P92360m70617p1115l13965m63317M00040K92367n34959
15558F802897J098666p44559p78612Q76271l49993l914K86433o95440Q36260J93150
15548G521159o79378Q95345l98033l48927K65023k35281k0750J132684M58795
$$ plain form
15539 8590637 7511341 7698584 8166700 7062112 6914477 7292075 7364231 7852545 7636437
15530 7636437 7305775 7106527 6840340 7327356 7818789 7023247 7804907 8415654 7372921
15521 7372921 7517365 6730527 6776245 8229235 7986456 7096625 7417528 7544157 8167166
15512 8167166 8089538 6617812 7365180 8730227 7502073 6687457 7179961 7899815 8396010
15503 8396010 8250641 7363564 7182294 7991334 8301586 7581510 7523991 7471029 8270081 7655120
15493 7655120 6573511 7738991 8234978 7666432 7190277 7056023 7341622 8118865 8601348
15484 8601348 7896027 7782918 7716381 8191185 7391343 7123847 8499610 8294917 7980805
15475 7980805 8880671 7982019 8255311 9545061 8091160 6977651 8283020 8790887 8810692
$$ packed form
15539H590637j079296J87243M68116j104588j47635L77598P2156M88314k16108
15530G636437l30662j99248k66187M87016M91433p95542P81660O10747j042733
15521G372921J44444p86838M5718J452990k42779q89831L20903J26629O23009
15512H167166p7628j471726P47368J365047j228154q14616M92504P19854M96195
15503H396010j45369q87077j81270Q09040L10252p20076n7519n2962P99052o14961
15493G655120j081609J165480M95987n68546m76155j34254K85599P77243M82483
15484H601348p05321j13109o6537M74804p99842k67496J375763k04693l14112
15475G980805Q99866q98652K73292J289750j453901j113509J305369N07867J9805
$$ plain form
15466 8810692 8672809 6993613 8265770 8824526 7447433 7591490 8512985 8073998 8437345
15457 8437345 7956573 7181229 8026006 8754029 8586385 8280960 7870214 7914372 7961702 7796250
15447 7796250 8609429 9198558 8850963 8390132 7428690 7396379 7986729 7834054 6949541 7675233
15437 7675233 8224906 8229164 8105933 7505850 7546677 8244771 7850453 7785487 7678266 7308893
15427 7308893 8165860 8312750 7192817 7753646 8375072 8588032 7763220 7309593 7942867
15418 7942867 7872250 7618179 8060241 7463168 7461449 8438426 7353999 7482895 7461753 7669200
15408 7669200 7841321 7647549 7900424 7736532 7392753 7842459 7892012 8057389 7788847 8348398
15398 8348398 8246797 7066273 7171665 7894050 7403127 7138665 7734007 7104089 8138648
$$ packed form
15466H810692j37883j679196J272157N58756j377093J44057R21495m38987L63347
15457H437345m80772p75344Q44777P28023j67644l05425m10746M4158M7330j65452
15447G796250Q13179N89129l47595m60831r61442l2311N90350j52675q84513P25692
15437G675233N49673M258j23231o00083M0827O98094l94318o4966j07221l69373
15427G308893Q56967J46890j119933N60829O21426K12960q24812m53627O33274
15418G942867p0617k54071M42062n97073j719R76977j084427J28896k1142K07447
15408G669200J72121j93772K52875j63892l43779M49706M9553J65377k68542N59551
15398H348398j01601j180524J05392P22385m90923k64462N95342o29918J034559
$$ plain form
15389 8138648 8475231 7974295 8290206 7896005 7923518 7626908 7641853 8048713 8307701 8451009
15379 8451009 7949090 7744402 8186492 7715333 7553090 7392372 6707521 6807061 7376597 7256828
15369 7256828 7140287 7775118 8357880 7820485 7795698 8235432 8047708 7932465 7254923 7160815
15359 7160815 8253078 7967677 7578035 7974132 7827792 8090569 8492414 7713133 8147587
15350 8147587 8520199 7414384 7149762 7355753 8334857 7943520 7751136 7884143 7795210
15341 7795210 8220832 8640470 7620567 8321889 9083791 8062496 6926015 6693066 7288806
15332 7288806 8274986 7994089 7589992 7028925 7553112 7559954 7034221 7461252 7932155 8601306
15322 8601306 8469327 7924399 7164283 8296888 9529447 7748940 7075176 7644854 7015981
$$ packed form
15389H138648L36583n00936L15911l94201K7513k96610J4945M06860K58988J43308
15379H451009n01919k04688M42090m71159j62243j60718o84851R9540N69536j19769
15369G256828j16541O34831N82762n37395k4787M39734j87724j15243o77542r4108
15359G160815J092263k85401l89642L96097j46340K62777M01845p79281M34454
15350H147587L72612j105815k64622K05991R79104l91337j92384J33007q8933
15341G795210M25622M19638j019903P01322P61902j021295j136481k32949N95740
15332G288806R86180k80897m04097n61067N24187O842n25733M27031M70903O69151
15322H601306j31979n44928p60116J132605J232559j780507o73764N69678o28873
$$ plain form
15313 7015981 7846131 8318808 7908414 9083145 9095397 7648445 6551611 6458376 7426306
15304 7426306 7239252 7020217 7521764 8351359 8642958 8164302 7554097 8352553 7759198
15295 7759198 8410806 8010906 7463634 7358697 8487022 8650915 7799467 8493410 8473552
15286 8473552 7998787 7588588 6794159 6959312 8315390 8974916 8259448 7683343 8065905
15277 8065905 8628546 8019609 7912664 7922691 8075696 9319172 8842423 8883710 8925258 8135487
15267 8135487 8276154 7592192 7259617 8561888 8997353 8812876 8148848 7176463 7755603
15258 7755603 8549375 8160246 7490245 6932399 7970667 8700524 7512934 8019751 8622902
15249 8622902 7916784 8438524 7955107 7701211 8475367 8811335 8156285 8011867 8269181
$$ packed form
15313G015981Q30150M72677m10394J174731J2252j446952j096834r3235R67930
15304G426306j87054k19035N01547Q29595K91599m78656o10205P98456n93355
15295G759198O51608l99900n47272j04937J128325J63893q51448O93943j9858
15286H473552m74765m10199p94429J65153J356078O59526p15468n76105L82562
15277H065905N62641o08937j06945J0027J53005J243476m76749M1287M1548p89771
15267H135487J40667o83962l32575J302271M35465j84477o64028r72385N79140
15258G755603P93772l89129o70001n57846J038268P29857j187590N06817O03151
15249H622902p06118N21740m83417k53896P74156L35968o55050j44418K57314
$$ plain form
15240 8269181 8589666 8744106 8306789 8093823 8028741 8084795 7966540 8458529 8791926 8671063
15230 8671063 8051704 8323654 8584865 8230403 8025150 8113567 8036908 8428940 8477624 7296035
15220 7296035 7551565 8177007 7735063 7999978 7792389 7505702 7815245 7782048 7798916 7352596
15210 7352596 7965518 8266899 7663021 7471490 8324320 8364634 8613955 7644125 8161271 9019123
15200 9019123 8342629 7573294 7051867 7768236 9284684 8832506 8053551 7523044 7425291
15191 7425291 8182491 7872163 7405511 7892574 7896014 7711471 7869733 7874609 8290479 8162075
15181 8162075 8460949 8536962 8363942 9014230 8559455 7855763 8199698 7721458 7697434 7415803
15171 7415803 7570940 8551586 7977293 7766529 8209585 7321162 8345649 8781627 7303671
$$ packed form
15240H269181L20485J54440m37317k12966o5082N6054j18255M91989L33397j20863
15230H671063o19359K71950K61211l54462k05253Q8417p6659L92032M8684j181589
15220G296035K55530O25442m41944K64915k07589k86687L09543l3197J6868m46320
15210G352596O12922L01381o03878j91531Q52830M0314K49321r69830N17146Q57852
15200I019123o76494p69335n21427P16369J516448m52178p78955n30507r7753
15191G425291P57200l10328m66652M87063L440j84543J58262M876M15870j28404
15181H162075K98874P6013j73020O50288m54775p03692L43935m78240k4024k81631
15171G415803J55137R80646n74293k10764M43056q88423J024487M35978j477956
$$ plain form
15162 7303671 8336933 7775040 7446663 8852046 8498449 8831508 8977337 8162921 8335020
15153 8335020 8191246 8420896 7912501 7979556 9336459 8826848 7819025 7674588 7743678
15144 7743678 8050286 8084626 7703488 8077882 8047045 8348857 7806050 7211529 8668837 7641695
15134 7641695 7419845 7546901 6607905 7802874 8582464 8248356 8656120 8707686 8756960 8802001
15124 8802001 7075737 7310356 7972374 8216380 8670116 8974542 9184833 8882543 8417334
15115 8417334 8892394 8403227 8593941 8708956 8083236 8693760 8445967 8223063 8393969
15106 8393969 7495937 7390494 8136912 7466953 7948968 8715396 8304585 8600880 8601742 8656874
15096 8656874 8306442 7905079 7752989 7614804 7755260 8606533 8631769 8105423 8744613 8167515
$$ packed form
15162G303671J033262n61893l28377J405383l53597L33059J45829q14416J72099
15153H335020j43774K29650n08395O7055J356903n09611j007823j44437O9090
15144G743678L06608L4340l81138L74394l0837L01812n42807n94521J457308j027142
15134G641695k21850J27056r38996J194969P79590l34108M07764N1566M9274M5041
15124H802001j726264K34619O62018K44006M53736L04426K10291l02290m65209
15115H417334M75060m89167J90714J15015o25720O10524k47793k22904J70906
15106H393969q98032j05443P46418o69959M82015P66428m10811K96295Q62N5132
15096H656874l50432m01363j52090j38185J40456Q51273K5236n26346O39190n77098
$$ plain form
15086 8167515 8384537 8635922 8425315 8118795 8369473 8883643 7738871 8384400 8634061
15077 8634061 7629836 7740886 8004840 7997574 8464459 8737010 8803934 8790774 8926644 8621554
15067 8621554 8167847 7473577 8010697 7944669 7856356 7979092 8042954 8289667 8659762 8070230
15057 8070230 8445585 9052128 9060665 9372112 8509659 8858616 8709869 8344415 8846745 8043479
15047 8043479 8435551 8584278 7312055 7895551 8174375 8179271 9402107 8988786 8216588
15038 8216588 8410974 8352070 8386783 8091181 8570937 9323118 8862177 8460561 8588273 9062358
15028 9062358 9470030 8764197 8624616 8723038 8494996 8421396 8735731 8214080 8757173 9297028
15018 9297028 8259076 7666658 8245269 8359537 8170572 7789018 7957549 7768762 8916580
$$ packed form
15086H167515K17022K51385k10607l06520K50678N14170j144772O45529K49661
15077H634061j004225J11050K63954p266M66885K72551O6924j3160J35870l05090
15067H621554m53707o94270N37120o6028q8313J22736O3862K46713L70095n89532
15057H070230L75355O06543Q537L11447q62453L48957j48747l65454N02330q03266
15047H043479L92072J48727j272223N83496K78824M896J222836m13321p72198
15038H216588J94386n8904L4713k95602M79756P52181m60941m01616J27712M74085
15028I062358M07672p05833j39581R8422k28042p3600L14335n21651N43093N39855
15018I297028j037952n92418N78611J14268j88965l81554J68531j88787J147818
$$ plain form
15009 8916580 8198374 6916670 8067162 8057572 8217082 7912755 7230271 7985743 8655309
15000 8655309 8293988 8326202 8825401 8972916 9067435 8366864 8166616 8614298 9267740 8229456
14990 8229456 7340380 7917526 8065664 8931429 9161210 7906998 8361469 9201775 8528057
14981 8528057 8487873 8795896 9076040 10132650 9345012 8678437 8970253 8875063 9085928 8537441
14971 8537441 7969903 8685925 8819980 8776718 8190544 7440126 7753029 8307081 7463554 7145606
14961 7145606 7849428 8251694 8751625 8050871 8627386 8882384 8250890 8094349 8243107
14952 8243107 8373893 9409467 9337626 8741767 8811128 9259258 9151872 8672183 8316640 8356580
14942 8356580 8406187 8530629 8673161 9033617 9657066 9321771 8499001 8616240 8694605 8924215
$$ packed form
15009H916580p18206j281704J150492r590J59510l04327o82484P55472O69566
15000H655309l61321L2214M99199J47515R4519p00571k00248M47682O53442j038284
14990H229456q89076N77146J48138Q65765K29781j254212M54471Q40306o73718
14981H528057m0184L08023K80144J056610p87638o66575K91816r5190K10865n48487
14971H537441n67538P16022J34055m3262n86174p50418L12903N54052q43527l17948
14961G145606P03822M02266M99931p00754N76515K54998o31494j56541J48758
14952H243107J30786J035574p1841n95859O9361M48130j07386m79689l55543L9940
14942H356580M9607J24442J42532L60456O23449l35295q22770J17239P8365K29610
$$ plain form
14932 8924215 9135018 8259094 8853765 9226634 8564381 8679713 8689431 8049403 8589754 8503651
14922 8503651 7212979 7008766 7348754 7391062 8329697 8699261 8177615 9103141 8907373
14913 8907373 8458372 9047630 8628755 8618787 9174320 8577992 8593042 8026126 8043463 9692519
14903 9692519 8592751 8068382 9153818 8601918 8634195 8877878 8608792 8870615 9196868
14894 9196868 9113713 8524370 8576799 8879552 8566340 8726427 8508631 8245900 8829292 9234379
14884 9234379 8639257 8392566 8604045 9198228 8602839 9323336 8969611 8766098 9527184
14875 9527184 8956289 8761336 9149106 8767173 8602833 8393025 8620527 9009031 8224888
14866 8224888 8647928 9005722 7967773 8742940 8417589 7765832 8406870 8280002 8802994
$$ packed form
14932H924215K10803q75924N94671L72869o62253J15332R718o40028N40351q6103
14922H503651j290672k04213L39988M2308R38635L69564n21646R25526j95768
14913H907373m49001N89258m18875r968N55533n96328J5050n66916J7337J649056
14903I692519j099768n24369J085436n51900L2277K43683k69086K61823L26253
14894I196868q3155n89343N2429L02753l13212J60087k17796k62731N83392M05087
14884I234379n95122k46691K11479N94183n95389P20497l53725k03513P61086
14875I527184n70895j94953L87770l81933j64340k09808K27502L88504p84143
14866H224888M23040L57794j037949P75167l25351o51757O41038j26868N22992
$$ plain form
14857 8802994 8680591 9332739 9156306 8518052 8906678 8893515 8662354 8986233 8590502 8584334
14847 8584334 8444112 8948585 8340095 7684997 8664554 8896525 8954304 8960578 8247781 8557071
14837 8557071 9464694 8795386 8480379 9563880 9995590 8756719 8552397 8335629 8644328
14828 8644328 9214766 8950649 9333579 9346911 10113652 9533244 8484626 9019107 9750096
14819 9750096 8949259 9469829 9150482 8375321 8530165 9178612 8480704 7761768 8539703
14810 8539703 8662875 7417743 8307123 8865943 8088816 8418012 7697254 8261062 8820363
14801 8820363 9475809 8675654 8004962 8782125 9432799 8752261 8592234 8324941 8541415
14792 8541415 8894960 8288500 7783988 8213965 8940552 8702022 8591971 8200565 8189606 9093032
$$ packed form
14857H802994j22403O52148j76433o38254L88626j3163k31161L23879l95731o168
14847H584334j40222N04473o08490o55098R79557K31971N7779O274p12797L09290
14837H557071R07623o69308l15007J083501M31710j238871k04322k16768L08699
14828H644328N70438k64117L82930J3332P66741n80408j048618N34481P30989
14819I750096q00837N20570l19347p75161J54844O48447o97908p18936P77935
14810H539703J23172j245132Q89380N58820p77127L29196p20758N63808N59301
14801H820363O55446q00155o70692P77163O50674o80538j60027k67293K16474
14792H541415L53545o06460n04512M29977P26587k38530j10051l91406j0959R03426
$$ plain form
14782 9093032 8762287 8472306 8550466 8650586 9157212 8478723 8292727 8301473 8218600 7650764
14772 7650764 8145005 8311785 8163813 8583893 8466597 7686906 7873952 8716310 7826905
14763 7826905 7733265 8078759 8212995 8221088 8407664 8242767 7525400 8059729 7849726 7986778
14753 7986778 8359375 8563019 9211384 9264044 9163533 9194389 9007651 8592686 8218416 8455487
14743 8455487 8548783 8791788 8774340 8384556 8222475 8843815 8362638 7907461 8293327 8392311
14733 8392311 8696867 8350747 8032164 8562852 8822426 7845888 8396656 8273067 8456462
14724 8456462 8709940 8333818 8878558 9727501 9277801 8491408 8338614 7926645 7727078
14715 7727078 8297515 8540100 9114309 9040704 8801378 8995945 8931900 9196529 9485434 9471008
$$ packed form
14782I093032l30745k89981P8160J00120N06626o78489j85996Q746q2873n67836
14772G650764M94241J66780j47972M20080j17296p79691J87046Q42358q89405
14763G826905r3640L45494J34236Q093J86576j64897p17367N34329k10003J37052
14753G986778L72597K03644O48365N2660j00511L0856j86738m14965l74270K37071
14743H455487R3296K43005j7448l89784j62081O21340m81177m55177L85866R8984
14733H392311L04556l46120l18583N30688K59574r76538N50768j23589J83395
14724H456462K53478l76122N44740Q48943m49700p86393j52794m11969j99567
14715G727078N70437K42585N74209p3605k39326J94567o4045K64629K88905j4426
$$ plain form
14705 9471008 9240816 9109496 9844223 9673939 8474463 9065803 9183913 8390769 8898471
14696 8898471 8443764 8085595 8930891 8898265 8658079 8522687 8621375 8994189 7557053 7798572
14686 7798572 8375988 8724332 10132658 9715391 9350088 9091574 8329610 8399749 8824349
14677 8824349 8690005 8743611 8864280 8989463 9103689 8971712 9737743 10111040 9328577 9444575
14667 9444575 9162886 9907914 10040788 9685654 9674846 9508972 9204185 8670934 8176566 8910873
14657 8910873 8934053 8306771 9092125 9456106 8576604 10049099 9781503 8676457 8813553
14648 8813553 8091257 8548591 8888028 8809230 8959047 8775569 9034538 9143107 8884414 8470027
14638 8470027 8709920 9423755 8765856 9177274 9351354 9139720 9005090 9488336 8856049
$$ packed form
14705I471008k30192j31320P34727j70284j199476N91340J18110p93144N07702
14696H898471m54707l58169Q45296l2626k40186j35392R8688L72814j437136K41519
14686G798572N77416L48344J408326m17267l65303k58514p61964P0139M24600
14677H824349j34344N3606J20669J25183J14226j31977P66031L73297p82463J15998
14667I444575k81689P45028J32874l55134j0808j65874l04787n33251m94368P34307
14657H910873K3180o27282P85354L63981q79502J472495k67596j105046J37096
14648H813553p22296M57334L39437p8798J49817j83478K58969J08569k58693m14387
14638H470027K39893P13835o57899M11418J74080k11634j34630M83246o32287
$$ plain form
14629 8856049 9226136 8684182 9193193 9778679 9690965 10222669 9602393 9580903 9731875 9321214
14619 9321214 9555432 8959997 9060546 9932068 9633178 9153855 9485858 9185032 8682236
14610 8682236 8586091 7965507 8789793 9009233 9554487 9121338 8397620 8723126 8748451 8346950
14600 8346950 9076364 9084167 8906811 9813693 10102566 9952387 8955806 8677969 8989798 9079628
14590 9079628 9179689 9190304 8964121 9102824 9845891 10090078 10114624 9885368 9802085 9642260
14580 9642260 9566385 9499928 9369918 9209060 8888560 8668381 9674401 8998423 8720483 9201267
14570 9201267 7868755 8183771 9033438 8180416 9463758 9109212 8198082 8661028 8327784
14561 8327784 8271627 9429315 9350660 9280220 9841126 8683713 9123814 9874622 8682591
$$ packed form
14629H856049L70087n41954N09011N85486q7714N31704o20276k1490J50972m10661
14619I321214K34218n95435J00549Q71522k98890m79323L32003l00826n02796
14610H682236r6145o20584Q24286K19440N45254m33149p23718L25506K5325m01501
14600H346950P29414P803j77356R06882K88873j50179r96581k77837L11829Q9830
14590I079628J00061J0615k26183J38703P43067K44187K4546k29256q3283j59825
14580I642260p5875o6457j30010j60858l20500k20179J006020o75978k77940M80784
14570I201267j332512L15016Q49667q53022J283342l54546r11130M62946l33244
14561H327784n6157J157688p8655p0440N60906j157413M40101P50808j192031
$$ plain form
14552 8682591 9185199 8825853 9151653 10472751 10196522 10368390 9634695 9370542 9917351
14543 9917351 9812227 9214677 9408175 8831812 9135710 9746697 9592875 9468967 9858628
14534 9858628 9781803 9404424 8638311 8996007 8824535 8686883 9325391 9075594 9044358 9061010
14524 9061010 9417257 8558017 8244037 8625606 7771582 9166693 9263313 8745037 9177493
14515 9177493 8379786 8067104 8613384 8801398 8632117 8670438 8603250 9171973 9229601 8662344
$$ packed form
14552H682591N02608l59346L25800J321098k76229J71868p33695k64153N46809
14543I917351j05124n97550J93498n76363L03898O10987j53822j23908L89661
14534I858628p6825l77379p66113L57696j71472j37652O38508k49797l1236J6652
14524I061010L56247q59240l13980L81569q54024J395111R6620n18276M32456
14515I177493p97707l12682N46280J88014j69281L8321o7188N68723N7628n67257
$$ [...]
##END NTUPLES=NMR SPECTRUM
##END=
