##TITLE=1H_CG-1139-3
 CDcl3, 8 sc, 
 25.12.2020
##JCAMPDX= 6.0         $$ Bruker NMR JCAMP-DX V2.0
##DATA TYPE= NMR SPECTRUM
##DATA CLASS= NTUPLES
##ORIGIN= UXNMR, Bruker Analytische Messtechnik GmbH
##OWNER= root
$$ XWIN-NMR		Version 3.5
$$ Fri Dec 25 10:05:46 2020 Russian Standard Time (UT+4h)  she@DPX200
##.OBSERVE FREQUENCY= 200.1315066352
##.OBSERVE NUCLEUS= ^1H
##.ACQUISITION MODE= SIMULTANEOUS
##.ACQUISITION SCHEME= undefined
##.AVERAGES= 8
##.DIGITISER RES= 18
##SPECTROMETER/DATA SYSTEM= spect
##.PULSE SEQUENCE= zg30
##.SOLVENT NAME= CDCl3
##.SHIFT REFERENCE= (INTERNAL, CDCl3, 0, 15.9771)
##AUDIT TRAIL= $$ (NUMBER, WHEN, WHO, WHERE, WHAT)
$$ ##TITLE= Audit trail, XWIN-NMR		Version 3.5
$$ ##JCAMPDX= 5.01
$$ ##ORIGIN= Bruker BioSpin GmbH
$$ ##OWNER= she
$$ F:/spectra/data/she/nmr/H-F/1/pdata/1/auditp.txt
$$ ##AUDIT TRAIL=  $$ (NUMBER, WHEN, WHO, WHERE, WHAT)
(   1,<2020-12-25 10:02:59.62 +0400>,<she>,<DPX200>,
      <created by zg, POWCHK disabled, PULCHK disabled
       configuration hash MD5:
       00 E9 B6 7A A2 85 ED C7 34 08 36 98 17 FE 4E 26
       data hash MD5: 16K
       AC 96 44 19 D1 ED 18 11 54 68 16 C9 9F 44 50 C6>)
(   2,<2020-12-25 10:03:05.82 +0400>,<she>,<DPX200>,
      <Start of raw data processing
       efp BC_mod = 2 LB = 0.24 FT_mod = 6 PKNL = 1 PHC0 = -10766.7 PHC1 = 14.20095 SI = 16K 
       data hash MD5: 16K
       BC 76 29 69 78 D2 D7 72 8C 4B 7F EF B7 DF 09 FD>)
(   3,<2020-12-25 10:03:24.65 +0400>,<she>,<DPX200>,
      <pk PHC0 = 5.654834 PHC1 = -5 
       data hash MD5: 16K
       06 7C FD E3 A8 12 A1 38 AC 18 84 AE DF 5D 23 CE>)
(   4,<2020-12-25 10:03:27.82 +0400>,<she>,<DPX200>,
      <abs ABSG = 5 
       data hash MD5: 16K
       13 77 1F 8C D0 3A 28 28 35 78 DF 90 9E 11 2B 80>)
(   5,<2020-12-25 10:03:47.34 +0400>,<she>,<DPX200>,
      <pk PHC0 = 5.037749 PHC1 = -7.799999 
       data hash MD5: 16K
       B9 85 A8 A3 01 1A DF 3B B8 35 18 82 13 F8 EC 33>)
(   6,<2020-12-25 10:03:50.51 +0400>,<she>,<DPX200>,
      <abs ABSG = 5 
       data hash MD5: 16K
       04 75 CB 4A 95 AC 62 22 B7 B9 4C E3 D4 8A 11 56>)
$$ ##END=
$$ 
$$ hash MD5
$$ D7 FA 4F 7C 4C 8B A2 F7 88 7F 67 23 90 C2 16 50
##$RELAX= 
##$RELAX= 
##$RELAX= 
##$RELAX= 
##$RELAX= 
##$RELAX= 
$$ Bruker specific parameters
$$ --------------------------
##$DU= <F:/spectra>
##$EXPNO= 1
##$NAME= <H-F>
##$PROCNO= 1
##$TYPE= <nmr>
##$USER= <she>
##$AMP= (0..31)
100 100 100 100 100 100 100 100 100 100 100 100 100 100 100 100 100 100 
100 100 100 100 100 100 100 100 100 100 100 100 100 100 
##$AQSEQ= 0
##$AQ_mod= 1
##$AUNM= <au_zg>
##$AUTOPOS= <>
##$BF1= 200.13
##$BF2= 200.13
##$BF3= 200.13
##$BF4= 200.13
##$BF5= 200.13
##$BF6= 200.13
##$BF7= 200.13
##$BF8= 200.13
##$BYTORDA= 1
##$CFDGTYP= 0
##$CFRGTYP= 5
##$CHEMSTR= <none>
##$CNST= (0..31)
1 1 145 1 1 1 1 1 1 1 1 1 1 1 1 1 1 1 1 1 1 1 1 1 1 1 1 1 1 1 1 1 
##$CPDPRG= <>
##$CPDPRG1= <>
##$CPDPRG2= <>
##$CPDPRG3= <>
##$CPDPRG4= <mlev>
##$CPDPRG5= <mlev>
##$CPDPRG6= <mlev>
##$CPDPRG7= <mlev>
$$ [...]
##$SUBNAM3= <"">
##$SUBNAM4= <"">
##$SUBNAM5= <"">
##$SUBNAM6= <"">
##$SUBNAM7= <"">
##$SUBNAM8= <"">
##$SUBNAM9= <"">
##$SW= 16.9725356469052
##$SWIBOX= (0..15)
0 0 2 0 0 0 0 0 0 0 0 0 0 0 0 0 
##$SW_h= 3396.73913043478
##$TD= 16384
##$TD0= 1
##$TE= 0
##$TE2= 300
##$TE3= 300
##$TEG= 300
##$TL= (0..7)
0 120 120 120 120 120 120 120 
##$TP= (0..7)
150 150 150 150 150 150 150 150 
##$TP07= 0
##$TPNAME0= <>
##$TPNAME1= <>
##$TPNAME2= <>
##$TPNAME3= <>
##$TPNAME4= <>
##$TPNAME5= <>
##$TPNAME6= <>
##$TPNAME7= <>
##$TPOAL= (0..7)
0.5 0.5 0.5 0.5 0.5 0.5 0.5 0.5 
##$TPOFFS= (0..7)
0 0 0 0 0 0 0 0 
##$TUNHIN= 0
##$TUNHOUT= 0
##$TUNXOUT= 0
##$USERA1= <user>
##$USERA2= <user>
##$USERA3= <user>
##$USERA4= <user>
##$USERA5= <user>
##$V9= 5
##$VALIST= <valist>
##$VCLIST= <CCCCCCCCCCCCCCC>
##$VD= 0
##$VDLIST= <DDDDDDDDDDDDDDD>
##$VPLIST= <PPPPPPPPPPPPPPP>
##$VTLIST= <TTTTTTTTTTTTTTT>
##$WBST= 1024
##$WBSW= 4
##$XGAIN= (0..3)
0 0 0 0 
##$XL= 0
##$YL= 0
##$YMAX_a= 136865
##$YMIN_a= -50910
##$ZGOPTNS= <>
##$ZL1= 120
##$ZL2= 120
##$ZL3= 120
##$ZL4= 120
##$ABSF1= 16.00097
##$ABSF2= -0.971693
##$ABSG= 5
##$ABSL= 3
##$ALPHA= 0
##$AQORDER= 0
##$ASSFAC= 0
##$ASSFACI= 0
##$ASSFACX= 0
##$ASSWID= 0
##$AUNMP= <proc_1d>
##$AZFE= 0.1
##$AZFW= 0.1
##$BCFW= 0
##$BC_mod= 2
##$BYTORDP= 0
##$COROFFS= 0
##$CY= -3
##$DATMOD= 1
##$DC= 0
##$DFILT= <>
##$DTYPP= 0
##$F1P= 0
##$F2P= 0
##$FCOR= 1
##$FTSIZE= 16384
##$FT_mod= 6
##$GAMMA= 0
##$GB= 0
##$INTBC= 1
##$INTSCL= 2.992141e-10
##$ISEN= 128
##$LB= 0.24
##$LEV0= 0
##$LPBIN= 0
##$MAXI= 10000
##$MC2= 0
##$MEAN= 0
##$ME_mod= 0
##$MI= 1.114404
##$NCOEF= 0
##$NC_proc= -9
##$NLEV= 6
##$NOISF1= 3.799351
##$NOISF2= 2.8
##$NSP= 0
##$NTH_PI= 0
##$NZP= 0
##$OFFSET= 15.97713
##$PC= 1
##$PHC0= -10756
##$PHC1= 1.40095
##$PH_mod= 1
##$PKNL= yes
##$PPARMOD= 0
##$PSCAL= 0
##$PSIGN= 0
##$REVERSE= no
##$SF= 200.130007501606
##$SI= 16384
##$SIGF1= 3
##$SIGF2= 2
##$SINO= 5.538805
##$SIOLD= 16384
##$SREGLST= <1H.CDCl3>
##$SSB= 0
##$STSI= 16384
##$STSR= 0
##$SW_p= 3396.73913043478
##$SYMM= 0
##$S_DEV= 0
##$TDeff= 16384
##$TDoff= 0
##$TI= <>
##$TILT= no
##$TM1= 0
##$TM2= 0
##$TOPLEV= 0
##$USERP1= <user>
##$USERP2= <user>
##$USERP3= <user>
##$USERP4= <user>
##$USERP5= <user>
##$WDW= 1
##$XDIM= 16384
##$YMAX_p= 354667255
##$YMIN_p= -3430412
$$ End of Bruker specific parameters
$$ ---------------------------------
##NTUPLES= NMR SPECTRUM
##VAR_NAME=  FREQUENCY,     SPECTRUM/REAL,   SPECTRUM/IMAG
##SYMBOL=    X,             R,               I
##VAR_TYPE=  INDEPENDENT,   DEPENDENT,       DEPENDENT
##VAR_FORM=  AFFN,          ASDF,            ASDF
##VAR_DIM=   16384,         16384,           16384
##UNITS=     HZ,            ARBITRARY UNITS, ARBITRARY UNITS
##FACTOR=    0.207333158178281, 1,           1
##FIRST=     3197.50313398949, 0,            0
##LAST=      -199.235996445285, 0,           0
##MIN=       -199.235996445285, -3430412,    0
##MAX=       3197.50313398949, 354667255,    0
$$ Real data points
##PAGE= N=1
##DATA TABLE= (X++(R..R)), XYDATA
$$ [...]
10005d59349n27885K64089L56637J9989m78581N95160R8783M25306O96167p22920
9995B67396n45944n77514n52032O0365Q9912j49468J08095j31516J092588M31583
9985I3465m25696j6268J14187l82138k21362J9835j07055K11147j33729l29636
9975a177250O88521Q43451k96159n23513n84993J29687L33850J52699m91253m12036
9965a336996J27302L45668M34169m7403M03839j36302m60020o93583N57668j81801
9955i87459o45540J45219J24310N09939J82038l95433o5881N53324L12128J58130
9945a09225l13483J15385K32666k75601p2116m54885K6340J85472n53636N07275
9935g11808J048797j5885n43665j59128j45398j48721m54073K21573k22488L32299
$$ y = [-459349, -987234, -723145, -366508, -346519, -825100, -229940, -131157, 294149, 990316, 267396, -278548, -856062, -1408094, -1347729, -1257817, -1407285, -1299190, -1430706, -338118, 93465, -332231, -348499, -234312, -616450, -837812, -817977, -925032, -713885, -847614, -1177250, -488729, 354722, 58563, -464950, -1049943, -920256, -586406, -433707, -924960, -1336996, -1209694, -864026, -429857, -477260, -73421, -209723, -669743, -1363326, -805658, -987459, -1632999, -1487780, -1363470, -853531, -671493, -1066926, -1132807, -579483, -267355, -109225, -422708, -307323, -74657, -350258, -422374, -877259, -850919, -665447, -1219083, -711808, 336989, 321104, -222561, -381689, -527087, -675808, -1129881, -908308, -1130796, -798497]
9925g98497L03359O05642m1163p19982O20964j50899o58542q2428j81510k76684
9915a379740K34321Q25211m69308j147399O03928N07600J77204L41950M76510
9906A70277k76184J49442L84658o44189n93539L94895r3329k97703J01956N08358
9896a95358O49356R622l36790m72884l2449J32601k25196m0312L4262j04219P48273
9885A66906j14165p89953k34969M05970o70565P25842N86448m09029l43878O2676
9875f14717l083j47624j24144M36317K19751K71135K24753K03379n86574l66510
9865d87317j97093m68548o9371r5507j42216M63419L43729N97892j84859l15823
9855e55694k00923l28430O27316o98403Q5927Q20637O2654R5605l58469N58470
$$ y = [-798497, -495138, 110504, 69341, -650641, -29677, -180576, -839118, -921546, -1103056, -1379740, -1145419, -320208, -789516, -1936915, -1332987, -825387, -648183, -306233, 170277, -105907, 43535, 428193, -215996, -809535, -414640, -507969, -805672, -703716, -195358, 453998, 463620, 126830, -346054, -378503, -245902, -471098, -511410, -477148, -581367, 166906, 52741, -737212, -972181, -566211, -1236776, -510934, 75514, -333515, -677393, -614717, -617800, -765424, -889568, -453251, -233500, 37635, 262388, 465767, -120807, -487317, -684410, -1152958, -1222329, -1317836, -1460052, -996633, -652904, -55012, -239871, -555694, -756617, -1085047, -457731, -1156134, -1070207, -249570, -186916, -91311, -449780, 108690]
9845A08690p1940q559L67484j328273o75311L83410P9885k03151L78784L64758
9835f04223K87909n04316K58743L2331n2967n41985J274N99228r8876p57342K34312
9824a145912N44475k30712L29729L52223k9768N3638n42490k11478K60481n32395
9814a152209M3164M05469l43730O91692M8056K2401p26010O94174L71216n82294
9804e28071J41285k4121q81444j032344P27764P91740l84162P92942J68534r811
9794b37688M15437n97664o37321m26854k89951r718J07316M92160L60941L35661
9784d87681P6460k82612j50575m10536K30019k21618n43456Q51940K42243p28156
9774a423972m3401K82977P36066J0684l90654N10050L1412k36064J6828j311341
$$ y = [108690, 36750, 28191, 395675, -932598, -1607909, -1224499, -1144614, -1347765, -968981, -604223, -316314, -820630, -561887, -529556, -582523, -1124508, -1123234, -524006, -622882, -1380224, -1145912, -601437, -832149, -502420, -150197, -179965, -126327, -668817, -880295, -619814, -1152209, -1109045, -703576, -1047306, -355614, -307558, -285157, -1011167, -316993, 54223, -528071, -386786, -410907, -1292351, -2324695, -1596931, -805191, -1189353, -396411, -227877, -237688, 177749, -419915, -1057236, -1484090, -1774041, -1783759, -1676443, -1184283, -823342, -487681, -411221, -693833, -844408, -1254944, -1024925, -1246543, -1789999, -938059, -695816, -1423972, -1467373, -1184396, -448330, -437646, -828300, -318250, -286838, -522902, -506074, -1817415]
9764a817415N10439O13424M03696Q3547K53085j99596n49840o32221k82700L59989
9754a257592k0125P22736M58244o09741k89940j8086j20064j62386P77169K67954
9744b51831M76583R19793j48533o45451l58580J33060j64360j97125k93567j91738
9734g21749o41423N72069L05644L8069m43469n64184j09951n91223J13702J53599
9724a888916O06702M60273L29615M84183J65704n17725q16775k61068k67420K34269
9714a471158r8490P96460K97385k5806l36549P0485M5085j51097r5906j18552
9704a088143O621k32061P98615l57630Q99648P13254q5756j318396m58735K94710
9694h27873L02038K51117q38497k53357K05482l43063Q80857l06593j43268J96613
$$ y = [-1817415, -1306976, -693552, -289856, -206309, 46776, -152820, -702660, -1334881, -1617581, -1257592, -1277717, -554981, -96737, -706478, -996418, -1014504, -1134568, -1296954, -519785, -251831, 224752, 1144545, 996012, 350561, -8019, 125041, -39319, -236444, -530011, -721749, -1363172, -791103, -485459, -447390, -890859, -1455043, -1564994, -2156217, -2042515, -1888916, -1282214, -821941, -492326, -8143, 157561, -360164, -1176939, -1438007, -1705427, -1471158, -1569648, -773188, -475803, -501609, -838158, -767673, -722588, -873685, -969591, -1088143, -1081522, -1313583, -514968, -872598, 27050, 740304, 654548, -663848, -1122583, -827873, -525835, -274718, -1113215, -1366572, -1161090, -1504153, -623296, -929889, -1073157, -876544]
9684h76544L99572r238m51960O9532l33699J34271N4622m43075J85549P61673
9674e09297L35617J7828J3465k19164q74120J90905N00538n50007l29991J212463
9664b11763j78324P4150R2736N52674j55194R4620k12837n19191k51132P4837
9654f39424J50096k80895K4786j30446N05975M68671j155289j09127K51911l87891
9644a301633L00453L91500l95783J08074O6172J29924l55732K2657J270230k7110
9634B08752l14129l35198P40389l00667r21169j01088p1705k23237J93669M90626
9624f33757n59476o90439J590908N01790l47277k3757l76284L55987o54856q81824
9614a718985Q09772P42698j51880j68370n89140o32805J91851O64865M3676l62592
$$ y = [-876544, -476972, -486210, -938170, -868638, -1202337, -1068066, -1013444, -1456519, -1270970, -509297, -173680, -155852, -142387, -361551, -1235671, -1044766, -544228, -1094235, -1424226, -211763, -390087, -315937, -223201, 329473, 174279, 268899, 56062, -463129, -714261, -639424, -489328, -770223, -745437, -875883, -369908, 98763, -1056526, -1165653, -913742, -1301633, -1001180, -609680, -1005463, -897389, -831217, -701293, -1057025, -1034368, 235862, 208752, -105377, -440575, 299814, -853, -922022, -1023110, -1094815, -1318052, -1124383, -633757, -1193233, -1883672, -292764, 209026, -138251, -162008, -538292, -182305, -837161, -1718985, -909213, -166515, -318395, -486765, -1075905, -1708710, -1516859, -851994, -808318, -1170910]
9604a170910k4974o9990K42385L356O18185q0214m69559j1441J16606j47014J81082
9593h12488O48007M8050l9014Q99701n99862o80213l56945r2582J57554M46101
9583c81691L46348n39439o1055k86731k15768P35075J01224n65121M05268m22408
9573h84298k14100K02187o94632K33156J064110q7488n18338l1163N42070k29223
9563f17719j13059J35407K53544p72796J08080k37865O87593j29620n02404N39856
9553f48983k02452J1284L56819O08570K05157o65963j25210J21618k58939l13066
9543i11165l07859k15585j124717L13130J029026L45131O08340m78332j89960
9534i31991K3183m62416n46187L15539O05284P36742P492l75783O15529M4142
$$ y = [-1170910, -1195884, -1265874, -1023489, -1020133, -401948, -482162, -951721, -963162, -846556, -993570, -812488, -164481, -116431, -155445, 744256, 144394, -535819, -892764, -985346, -827792, -381691, -35343, -574782, -635837, -922568, -1138336, -403261, -302037, -867158, -461890, -884298, -1098398, -896211, -1590843, -1357687, -293577, -381065, -899403, -930566, -388496, -617719, -730778, -595371, -341827, -1114623, -1006543, -1244408, -556815, -686435, -1188839, -648983, -851435, -840151, -483332, 125238, 330395, -335568, -460778, -339160, -598099, -911165, -1219024, -1434609, -2559326, -2246196, -1217170, -872039, -263699, -742031, -931991, -908808, -1371224, -1917411, -1601872, -996588, -259846, -252354, -628137, -12608, 31534]
9524C1534p2853r36970q61240k60339M24099M58814P98029k7214l89999P9052
9514g57087k61406J01648j30441L71778L48749M01211L75598l16318n62544o02765
9504a031577m5672o95560L0645L09553M51333K5348Q47292N97178m17147o21521
9494e50128k96562j62675k84042L90337M58213P16049J75257r36285k99462P46856
9484d2442p6860o44907l58132P4590j59305N9182m3929n0307L897M80509k07856
9473i65560l61578l28919M80858L73600m76315J13819r8829N57029R42390m89545
9463b53050J91180N45319n29573P9173j47283r78786R5631L31340N3183J62783
9453d50083q28712M42707n21468o30913N01383o39741P24584K41808L37090J35844
$$ y = [31534, -41319, -978289, -1839529, -2099868, -1675769, -1216955, -418926, -446140, -836139, -757087, -1018493, -916845, -1047286, -675508, -326759, 74452, 450050, 133732, -428812, -1031577, -1077249, -1772809, -1742164, -1432611, -981278, -955930, -108638, 488540, 71393, -550128, -846690, -1009365, -1293407, -903070, -444857, 271192, 446449, -489836, -789298, -42442, -119302, -764209, -1122341, -1047751, -1207056, -1147874, -1191803, -1242110, -1238213, -757704, -965560, -1327138, -1656057, -1175199, -801599, -1277914, -1164095, -1262924, -705895, 236495, -253050, -61870, 483449, -46124, 33049, -114234, -1093020, -997389, -666049, -612866, -450083, -1278795, -836088, -1357556, -1988469, -1487086, -2126827, -1402243, -1160435, -823345, -687501]
9443f87501k75411L16156m4089l27088l20831P54271j40388r618L92169O63838
9433C21508J72822k28055n44407l02917k15425k62277o5153j09422k6022M09531
9423h49817j70686J85130N9919K27469r75175P9185N65545l82733M37168k2314
9413h46309J68720l19638K78441O16700k49782j63314O78860l1687l85584j30980
9403c84573P53187l38474p12111p98362L65785m12828j6512L18335M69950N49915
9393b05688o12883J24320P0315l9215m98475L02957J65089M62119j51609R26005
9383E42935J56775n62236R3306j22733J12183p0512q69332j037951J15437L01570
9373a340558K12171K33211L29236J97288l16393k23442k04144r2345l30465J14784
$$ y = [-687501, -962912, -646756, -690845, -1017933, -1338764, -584493, -724881, -734499, -342330, 321508, 494330, 266275, -278132, -581049, -796474, -1058751, -1123904, -1233326, -1259348, -849817, -1020503, -835373, -775454, -547985, -1523160, -1443975, -878430, -1261163, -823995, -846309, -677589, -997227, -718786, -102086, -351868, -515182, 163678, 131991, -253593, -384573, 368614, 30140, -681971, -1480333, -1114548, -1527376, -1543888, -1225553, -755603, -205688, -818571, -694251, -623936, -663151, -1161626, -858669, -693580, -231461, -383070, 542935, 699710, 137474, 230780, 108047, 220230, 149718, -719614, -1757565, -1642128, -1340558, -1128387, -895176, -565940, -368652, -685045, -908487, -1112631, -1204976, -1535441, -1420657]
9363a420657M21991j70098L11379L87462j47027k81744N80548o18453N39155J74568
9353b22876m72290k1935J44893M9395p97774K38704R7821k89162P59332O3359
9343d50533r83444k41087p6669K77303l07596m45534O12155J014928K23272o76725
9333a053930P60015P17500L1046o76620q87857L6416O5028J9968r4039K1220Q67877
9322a93376M31764j43647k02664k98769n46229l21394K12132j340739O03514Q07706
9312i91702j62281J46205l824K52585l41194R55889J63115o68823M86643m78272
9302f41659p62624K41557r1333L95649J81572L26417m0578l13052m61542k57806
9292a423399m09304l49449Q11897K44094l17584m9583J47895L36819n33074M65448
$$ y = [-1420657, -998666, -1168764, -857385, -469923, -616950, -898694, -318146, -936599, -397444, -222876, -695166, -717101, -572208, -522813, -1320587, -1081883, -984062, -1273224, -513892, -450533, -1433977, -1675064, -1751733, -1474430, -1782026, -2227560, -1615405, -600477, -377205, -1053930, -293915, 423585, 454631, -221989, -1109846, -1073430, -1008402, -988434, -1082473, -1061253, -193376, 238388, 94741, -107923, -406692, -952921, -1274315, -1062183, -2402922, -1799408, -991702, -1153983, -1007778, -1011602, -759017, -1100211, -144322, 18793, -650030, -163387, -641659, -1404283, -1162726, -1254059, -858410, -676838, -350421, -390999, -704051, -1165593, -1423399, -1832703, -2182152, -1370255, -1126161, -1443745, -1493328, -1345433, -1008614, -1541688, -1076240]
9282a076240L84295J19967O95503k24791k7780l7916P23097K04818j299535m48253
9272i86835j78149k09323N29385j98365k27704q7505J99071O39016K23684n60838
9262h57563l45234o3442l36800K41393P52533K8256N48825l01897k99754R4873
9252e38810l6658j19063j51760K49608j7563k82532N24816j665m13950Q65014
9242G7437j01247k88631m72876n46621J44022n42066m69603Q15057J70105n35154
9232a749577O9363R95137L15817l33373R87690k12072o32975j61113l86912N31903
9222e76112J01557q19027l70157k41897k91798M96893O03914K44225J78122l9110
9212g13390J61731p66457J12087K28487k49044J12841l00910j49166N05595R5250
$$ y = [-1076240, -691945, -571978, 123525, -101266, -129046, -166962, 556135, 760953, -538582, -986835, -1164984, -1374307, -844922, -1043287, -1270991, -1358496, -1159425, -520409, -296725, -857563, -1202797, -1266239, -1603039, -1361646, -609113, -580857, -32032, -333929, -633683, -538810, -575468, -694531, -846291, -596683, -614246, -896778, -371962, -373627, -787577, 77437, -23810, -312441, -785317, -1331938, -1187916, -1729982, -2199585, -1384528, -1214423, -1749577, -1680214, -685077, -369260, -702633, 285057, 72985, -559990, -721103, -1108015, -576112, -474555, -1293582, -1663739, -1905636, -2197434, -1700541, -1096627, -852402, -674280, -713390, -551659, -1318116, -1206029, -977542, -1226586, -1113745, -1414655, -1563821, -1058226, -962976]
9202i62976N93292N7791m12497M62294l24177m56662j8605M17075P28290j60958
9192g7133p75753O9271O86698N5553p36900j61798l15827n72955l80454M7656
9182b161642N51978J60503Q06005O3184j5013L65296r44698r71281K22908N22768
9172a399992m64752L9163M66602O99545L53017M91497j83965j62330n34087k50301
9162i45603n9283p23969Q61330j93330M83388O80949J88688l41297p26354k0641
9152g96122j17879j39541m33087M40916N2720l15875K57677m20137n95398O84603
9142a382123L28119J38248P1820N00471j68248n52132m83606m75391L49019q3755
9132a757578J15773Q18867Q62146J31681l80855k76943j031828O28210M84482
$$ y = [-962976, -369684, -311893, -724390, -262096, -586273, -1042935, -1061540, -644465, 83825, -77133, -852886, -783615, -96917, -41364, -778264, -940062, -1255889, -1828844, -2209298, -2161642, -1609664, -1449161, -643156, -579972, -594985, -229689, -1174387, -2145668, -1922760, -1399992, -1864744, -1825581, -1358979, -659434, -306417, 185080, 1115, -161215, -695302, -945603, -1004886, -1728855, -867525, -1060855, -577467, 103482, 292170, -49127, -775481, -796122, -914001, -1053542, -1486629, -1045713, -992993, -1308868, -1051191, -1471328, -2066726, -1382123, -1054004, -915756, -843936, -343465, -511713, -1063845, -1547451, -2022842, -1673823, -1757578, -1641805, -822938, 39208, 170889, -209966, -486909, -1518737, -890527, -406045]
9123d06045K73136p14412K45182o25999o09844Q70266J75362K02873N005K08127
9113c76349L78268k10659p17950q36113j38488N37558J033273J373226o58645
9104C84121j39318l083q58796N8834K39776n05695m74788n90011L80946J093607
9094d14407L11499p86409J1607L51045J41358p29707j0772l91123N09608j97398
9084a204699j12069N03504j40319j1454O48674J76774k63899J17111l74796n0304
9074g11477K50850l18557o83823j98521K18921M58715M20871k17009k74496J95876
9064h58650q06556o2145K54696K719K41222L0263o8873J157106P69669k75119
9054C84332l65654N9068K94394m73195o11687O34551L26231r27336l16543L31254
$$ y = [-406045, -132909, -847321, -602139, -1228138, -1837982, -967716, -792354, -589481, -584476, -376349, 1919, -208740, -926690, -1762803, -1901291, -1363733, -330460, 1042766, 384121, 244803, 241720, -617076, -558242, -318466, -824161, -1298949, -1888960, -1508014, -414407, -102908, -889317, -877710, -526665, -385307, -1115014, -1125786, -1516909, -1007301, -1204699, -1316768, -813264, -953583, -965037, -316363, -139589, -403488, -286377, -661173, -711477, -460627, -779184, -1463007, -1661528, -1442607, -983892, -563021, -780030, -1054526, -858650, -1665206, -1727351, -1472655, -1469936, -1228714, -1198451, -1267324, -110218, 659451, 384332, 18678, 77746, 372140, -101055, -712742, -78191, 248040, -679296, -995839, -664585]
9044f64585P2581n30881O5490N05628J25395n69264r95340M31930K97660K09184
9034a052202L85381k77704J33315Q0772m25397q35992k49281P22622J321616P11251
9024E14381N27280m66695n45907l7607r00125p78679k92513Q81217N25880N87399
9014A4631N42179j073897l16706l80823m59853l45623N6099O34179J54780J076815
9004i8219J03011J75648k61113m29482r3882R5419n4674j30175J19311P57491
8994A83335M00749j183327l94633K8245o677Q19936m57365m89789r7327J7701
8984a179152k3936K50224J167097O54264q1661J93541o48804j5027k07052n39926
8974d30432J274728Q04837J54058K59488m06509k2730N14895o52640m35966R9734
$$ y = [-664585, -592004, -1122885, -1057395, -551767, -426372, -995636, -1990976, -1559046, -1261386, -1052202, -666821, -944525, -811210, -730438, -1155835, -1991827, -2241108, -1518486, -196870, 514381, 1041661, 574966, 29059, -8548, -908673, -1687352, -1979865, -1098648, -572768, 14631, 556810, -517087, -833793, -1214616, -1674469, -2020092, -1963993, -1329814, -1175034, -98219, 4792, 180440, -80673, -510155, -604037, -508618, -563292, -693467, -574156, 183335, 584084, -599243, -993876, -965631, -972308, -152372, -609737, -1099526, -1196853, -1179152, -1203088, -952864, 214233, 868497, 786836, 980377, 331573, 316546, 109494, -430432, 844296, 1649133, 1803191, 2062679, 1656170, 1633440, 2148335, 1495695, 1059729, 1159463]
8964A159463k92511L18470O01743J19652k47696j475959J4358o5569K73289o58776
8954b53536O16967N42233K06739M31656K19770k47312L69559q58547j42195J7320
8944I02654p80865l6643M13217O68594L63411j64631r51212j61688q33611J59519
8934d21255k359j31255Q26223R05057l89969K24315P41949J3483o1385k53590
8924A451214k13415o95090j64355K03243K34342k99786j39829K17961J192986
8915A787271Q73977j692364K47659k87801p49485J04958l37023K07077l6224q69893
8905g51848j99348j96325j17285M6799N06244J19796J259096k86800j21728m44533
8895a85932k65793O11680l73749o37540m95883R33520J01572L70391L35431n9105
$$ y = [1159463, 866952, 1185422, 1787165, 1906817, 1659121, 183162, 197520, 131951, 405240, -253536, 363431, 905664, 1112403, 1544059, 1763829, 1516517, 1886076, 1027529, 885334, 902654, 121789, 85146, 498363, 1166957, 1530368, 1365737, 414525, 252837, -580774, -421255, -423614, -554869, 271354, 1176411, 786442, 1010757, 1752706, 1766189, 1704804, 1451214, 1237799, 542709, 378354, 581597, 815939, 516153, 376324, 594285, 1787271, 2661248, 968884, 1216543, 928742, 179257, 284215, -52808, 154269, 118045, -751848, -951196, -1147521, -1264806, -1218007, -711763, -591967, 667129, 380329, 258601, -185932, -451725, 159955, -213794, -851334, -1347217, -413697, -312125, 58266, 393697, 334592]
8885C34592j342883J16627O3699n58347K52581K61581n1942J28709r5789M37772
8875d53400P73588K32236j39915p03111j52431M47892O04847l92546l27844M23021
8865C12337L28670p78181l07643J002j48359j29118k86886M28481O79141n88329
8855d88885m51414J06475J82735M57618Q32599m7399m22729k57463O19389k41761
8845B89165K54057K90059n15869J07346Q82359k29585P8682p26280l14540O55612
8835G71006J47987p49744m99296K41995j37570K9055m87600O40094o53287M42462
8825b54898R97337L34560j66858l20644m02739o20311k93836J300191M03050k02472
8815G73380L39272K18328p92381l92330m50526n68947K34271L22922Q72589O26871
$$ y = [334592, -1008291, -891664, -827965, -1386312, -1133731, -872150, -924092, -795383, -891172, -453400, 320188, 552424, 412509, -290602, -443033, 4859, 609706, 217160, -110684, 312337, 641007, -137174, -444817, -443815, -592174, -721292, -1008178, -579697, 99444, -488885, -940299, -833824, -651089, -193471, 639128, 591729, 169000, -88463, 530926, 289165, 543222, 833281, 317412, 424758, 1307117, 1077532, 1156214, 429934, 115394, 771006, 918993, 169249, -330047, -88052, -225622, -196567, -684167, -44073, -697360, -254898, 742439, 1076999, 910141, 589497, 186758, -433553, -727389, 572802, 975852, 773380, 1112652, 1330980, 538599, 146269, -304257, -873204, -638933, -316011, 556578, 1183449]
8805A183449j78261k83034L39340J68396j00424o08860L86329Q08810L52847j29154
8795A939438L12214k14943o00484R05148j25013q04209p5032j34819m61716L6655
8785G77239k78111N74901o96817j89855N75795l23535J49818q9147Q93187O22116
8775B015591o10144m8592m61166o82541l25948L10143K4530L43812M9165j37638
8765D77212N41360J75283r7135j42452m71358j45064K5060P19332m95039K24412
8755H11611m9802J0418N66281N91014J29728n72754o96928j367592l97476R38980
8745c6520R30800l07989O1222O07928Q6085k0615J78557j83762j9237L1707j2811
8734A315365L4713M97763p0278m93037l02930K09002k47809m85737n88739O68004
$$ y = [1183449, 1005188, 722154, 1061494, 1229890, 1129466, 520606, 906935, 1715745, 2068592, 1939438, 2251652, 2036709, 1436225, 2341373, 2216360, 1412151, 1337119, 1202300, 740584, 777239, 499128, 1074029, 377212, 187357, 763152, 439617, 589435, 500288, 1393475, 2015591, 1405447, 1356855, 895689, 213148, -112800, 197343, 221873, 565685, 614850, 477212, 1018572, 1193855, 1096720, 954268, 482910, 337846, 362906, 1082238, 587199, 811611, 761809, 772227, 1338508, 1929522, 2059250, 1486496, 789568, -578024, -975500, -36520, 894280, 586291, 647513, 1255441, 1341526, 1320911, 1499468, 1315706, 1296469, 1328176, 1315365, 1350078, 1847841, 1777563, 1284526, 981596, 1190598, 942789, 457052, -131687, 536317]
8724E36317j20645M57812N45686j45672j55142l28256k59665P37402L56269P0927
8714A695033O6339M84135o61127Q14453r7530l92127J13581k41626J36608n12598
8704A405141l93904K76015N20196L936M82142l83682r4896L04371j9042M65766
8694B566043O62125K89301M2256L67382j73405m95438k92552l36369l34236Q1886
8684B376993n60020O8679M77158O36546J53491k42781K24082J93294J41022o45970
8674B822494R9121K45182m98201M23538P47017J90494R92214L67904J62184j3770
8664E538177O8374j78153Q3900k14580l79535J83030J292033j67323N77877K72847
8654G076647o38558J00318R5719O77703m83334j52938P55599j30731O4980n18010
$$ y = [536317, 415672, 873484, 1419170, 1273498, 1118356, 790100, 530435, 1267837, 1624106, 1695033, 1761372, 2245507, 1584380, 2398833, 2301303, 1909176, 2022757, 1781131, 1917739, 1405141, 1011237, 1287252, 1807448, 1811384, 2293526, 1909844, 1814948, 2119319, 2100277, 2566043, 3228168, 3517469, 3559725, 3927107, 3753702, 3258264, 2965712, 2629343, 2295107, 2376993, 1816973, 1885652, 2362810, 2999356, 3152847, 2910066, 3134148, 3327442, 3468464, 2822494, 2921615, 3166797, 2668596, 3092134, 3839151, 4029645, 5021859, 5389763, 5551947, 5538177, 5606551, 5428398, 5512298, 5297718, 4918183, 5101213, 6393246, 6225923, 6803800, 7076647, 6438089, 6538407, 6634126, 7311829, 6828495, 6675557, 7431156, 7300425, 7365405, 6847395]
8644F847395N65442O54022Q8770l3964K16056J320175m7286N13K45422L24527
8634A0181072M66749k46952n54682M59389N91583Q54376O37364N1231O73764K34350
8624A3348244M00756N138J393985Q45051M29274o5711L25061J258355R81546J363480
8614B0285179P0924K81977K16843Q75779Q54852J827868J208601J009486J112058
8605B7743567K147752J906840J657444j89191J354020J209782J497663J971245
8597C9299122K620137L393970K823658M071605K532424L155967L348428M387770
8589F5633081M570943O827461Q677304R725666J1843317J5528568J7903120J9880550
8581A60590010K2048855K3345747K0039646J3183719R624326N945601N60597k044725
$$ y = [6847395, 7412837, 8066859, 8155629, 8121665, 8337721, 9657896, 9610610, 9611123, 9856545, 10181072, 10647821, 10400869, 9846187, 10305576, 10897159, 11751535, 12388899, 12440130, 13113894, 13348244, 13749000, 13754138, 15148123, 15993174, 16422448, 16356737, 16681798, 17940153, 18921699, 20285179, 20356103, 20638080, 20854923, 21730702, 22585554, 24413422, 25622023, 26631509, 27743567, 29891319, 31798159, 33455603, 33266412, 34620432, 35830214, 37327877, 39299122, 41919259, 45313229, 48136887, 52208492, 54740916, 57896883, 61245311, 65633081, 70204024, 77031485, 85708789, 95434455, 107277772, 122806340, 140709460, 160590010, 182638865, 205984612, 226024258, 239207977, 248832303, 254777904, 255338501, 253293776]
8573B53293776N14376j885695q868065j0769201j2311304j6642730k1839966j9368484
8565A62122707j4546821j0666202q090784n567342l754050k496678j779186j324980
8557A13896664q45359J26644j18306J007412L498170L865402L862835O851261
8549A32144723Q127051J0161173J2250766J5685189J9165703K3068056K6196484
8542B46799145K6723351K1254234J1779838M413717k724302n018628k746376p54747
8534B99726232n891028j2735505j7789716k3914121k8075564k4730026j9498998
8527A67091274j5696431j2147819j0136256q386505o175418n912207m692890m158075
8519I9785673l999582m695933k745346k778594k410538k432071k437766k544697
$$ y = [253293776, 253808152, 251922457, 243054392, 232285191, 219973887, 203331157, 181491191, 162122707, 147575886, 136909684, 128818900, 123251558, 119497508, 117000830, 115221644, 113896664, 113051305, 113177949, 113059643, 114067055, 117565225, 121430627, 125293462, 132144723, 140271774, 150432947, 162683713, 178368902, 197534605, 220602661, 246799145, 273522496, 294776730, 306556568, 310970285, 308245983, 303227355, 300480979, 299726232, 293835204, 281099699, 263309983, 239395862, 211320298, 186590272, 167091274, 151394843, 139247024, 129110768, 120724263, 114548845, 108636638, 103943748, 99785673, 95786091, 91090158, 88344812, 85566218, 83155680, 80723609, 78285843, 75741146]
8511G5741146k515161k273975k817021k857985k396466j585748j502786j307609
8503E8484395j261978j098634J95379p20737q22318r10432k95811j128069P591
8494E2449386l09525m69422O3330O06231K12793m3675O86017O31453L07834l6200
8484E4098222J229279J40718K53899P76138O07724O83476l57205J125837J841821
8475F0399909J440271J245206M48190J255058J946723J886586K102289K521586
8467G3245818L465017K578715L201141M131910N779180O586203Q139311J0249418
8459A17376713J1821133J4908862J7543241K0300508K0446812K1375371J6066590
8452B39839230J1879796Q852424O667076J568150r09878k020827p664179j3898185
$$ y = [75741146, 73225985, 70952010, 68134989, 65277004, 62880538, 61294790, 59792004, 58484395, 57222417, 56123783, 56319162, 55598425, 54776107, 53865675, 53569864, 52441795, 52449386, 52139861, 51670439, 51733769, 52340000, 52552793, 52509118, 53195135, 53826588, 54134422, 54098222, 55327501, 55468219, 55722118, 56498256, 57105980, 57789456, 57432251, 58558088, 60399909, 61840180, 63085386, 63533576, 64788634, 66735357, 68621943, 70724232, 73245818, 76710835, 79289550, 82490691, 86622601, 92401781, 98987984, 107127295, 117376713, 129197846, 144106708, 161649949, 181950457, 202397269, 223772640, 239839230, 251719026, 260571450, 267238526, 268806676, 267896798, 265875971, 258211792, 244313607]
8444B44313607j8295071k1728958k1136169j7343926j3454345j0227034r010335
8437A33117769p720578n000150l845813k677207j094229j244668l84176k51707
8429A10899241J014628J422713J820239L203912L988013O742611Q527641R934794
8421A47553792J2906571J7419720K0864928K3645962K4673539K5536885K0655006
8414B93256403J3708792J1856521J0909818N894577L27153l868177r745233j5765386
8406C06574468j9579653k4183279k8552722k7194942k3597405j8088062j4411896
8399A50966509j3358764j1617214r231917q465825p509499n698305n248587m959751
8391H4876647m239895m511600l178783k594493k453739k543894k422654k725475
$$ y = [244313607, 226018536, 204289578, 183153409, 165809483, 152355138, 142128104, 133117769, 125397191, 120397041, 116551228, 113874021, 112779792, 111535124, 111150948, 110899241, 111913869, 113336582, 115156821, 118360733, 122348746, 129091357, 137618998, 147553792, 160460363, 177880083, 198745011, 222390973, 247064512, 272601397, 293256403, 306965195, 318821716, 329731534, 335626111, 335953264, 332085087, 322339854, 306574468, 286994815, 262811536, 234258814, 207063872, 183466467, 165378405, 150966509, 137607745, 125990531, 116758614, 108292789, 100783290, 95084985, 89836398, 84876647, 80636752, 76125152, 72946369, 70351876, 67898137, 65354243, 62931589, 60206114]
8383F0206114k237220j371925r49594r49227j089245o1122q04136O6173Q62712
8374E3672530N60783Q76354O11039K89639k68554k27378k75515o32553P521q39104
8364E3774762k60767m58082j001951j330414j183192j928349k401277k001755
8356D3208975j935834j146473k78721K80472p53838m03484r39798j425962p53308
8347C5852029j24764j211783p60888n22931P7464n94653l11695r734j21290J58644
8337C2430399J85371m46166K08823M45159L16018j85888j92268q08139j077435
8328C0875874j301823q42605L46795m50165m88522o96061J39574J56376R35604
8319B8675047J590279K13363m43620q14686k00105J11303q91982Q00655J077520
$$ y = [60206114, 57968894, 56596969, 55647375, 54698148, 53608903, 53547781, 52743645, 52809818, 53672530, 54233313, 55109667, 55720706, 56010345, 55741791, 55514413, 55238898, 54606345, 54613866, 53774762, 53513995, 53055913, 52053962, 50723548, 49540356, 47612007, 45210730, 43208975, 41273141, 40126668, 39847947, 40128419, 39374581, 38971097, 38031299, 36605337, 35852029, 35727265, 34515482, 33754594, 33231663, 33309127, 32714474, 32402779, 32393045, 32271755, 32430399, 32615770, 32169604, 32378427, 32823586, 33139604, 32953716, 32761448, 31953309, 30875874, 29574051, 28731446, 29078241, 28628076, 28139554, 27443493, 27583067, 27739443, 28675047, 30265326, 30478689, 30035069, 29220383, 29020278, 29131581, 28239599, 29040254, 30117774]
8310C0117774n0943r15277K22549m84905r77507o85531N1394n34227O2963l30397
8300B6475893N70816Q80313P1309n36948l35319n3669K57393J235246L06245J168698
8290C0039977P26406k95799l09184N93364j123964J05169L06057P52202R90190
8281C1784418K625956J725898J456070K277129J528970J429215O04457M71196
8273D3903309P87001M60906K9433N39568j119195n08280Q55698p2218o1569l53914
8263D4460739j433007j347708j474586k58624n13100N1475R81485P23093P44889
8254D1934656J025261Q48046l12043j172044j252136O76907J393825J021748J285658
8245D5449878J386385J007061J627736J667906J966431J599135J752777J744333
$$ y = [30117774, 30066831, 29151554, 29374103, 28889198, 27911691, 27226160, 27277554, 26743327, 26806290, 26475893, 27046709, 27927022, 27998331, 27461383, 27126064, 27072395, 27329788, 28565034, 28871279, 30039977, 30766383, 30470584, 30161400, 30754764, 29630800, 29735969, 30042026, 30794228, 31784418, 34410374, 36136272, 37592342, 39869471, 41398441, 42827656, 43432113, 43903309, 44690310, 45151216, 45180649, 45720217, 44601022, 44092742, 44948440, 44876222, 44814653, 44460739, 43027732, 41680024, 40205438, 39946814, 39433714, 39485189, 40466674, 41189767, 41934656, 42959917, 43807963, 43495920, 42323876, 41071740, 41748647, 43142472, 44164220, 45449878, 46836263, 47843324, 49471060, 51138966, 53105397, 54704532, 56457309, 58201642]
8237E8201642Q02362P93829P06795j53682j129736l11677p27965p72808N29212
8228E7937972r28862j258478j236970j637974j458089q8448N98023L36956M00960
8219E2665090L53030M29920L70244M08193M40563J73317R06279P64585J214122
8210E7725343J694691l24137J518792R22078N17596Q97387J867847K430497L271811
8201G0521905K584187L703650L839714N174522O406970Q069416Q426613J0100661
8193A18827638R196761J3606657J3922076J732630k04181q70719K062597M354018
8185A62627477L904085J039025n386262j1144016j0818567p412326m387488l868098
8177A24553830j986180j13787N6409l2446p46198J418276J874161J491302J568117
$$ y = [58201642, 59004004, 59797833, 60504628, 60350946, 59221210, 58909533, 58181568, 57408760, 57937972, 57009110, 55750632, 54513662, 52875688, 51417599, 51329151, 51927174, 52264130, 52665090, 53018120, 53448040, 53818284, 54226477, 54667040, 54840357, 55746636, 56511221, 57725343, 59420034, 59095897, 60614689, 61536767, 62054363, 62951750, 64819597, 67250094, 70521905, 73106092, 76809742, 80649456, 85823978, 92230948, 100300364, 108726977, 118827638, 128024399, 141631056, 155553132, 157285762, 157081581, 156210862, 158273459, 162627477, 166531562, 167570587, 162184325, 151040309, 140221742, 132809416, 128421928, 124553830, 122567650, 122453863, 122510272, 122477826, 121731628, 123149904, 125024065, 126515367, 128083484]
8168A28083484K152543L859274O053388O480102Q713179J0624612J3051793J6054654
8160A95073029J9456031K2374522K3239324K2295288J7997908P532641m93036
8153C07475707j004126j413963O53920J692838j497153r564304j4913188j5453473
8145B65976258j4333721j6010649j5076408j2090702j0398568p907981o948107
8138A83210122o108796n892446n323702m615556m033032l478740k205233j438658
8130A50113959l02366K97875P71453J698792L874032O181884O812289J0233325
8122A79681243J2627408J4573687J5576103J3775733J0989275K325978o714476
8115B42834951p470395k876752K067186L010583J428523l365550j2057511j6736793
$$ y = [128083484, 130236027, 134095301, 140148689, 146628791, 155341970, 165966582, 179018375, 195073029, 214529060, 236903582, 260142906, 282438194, 300436102, 307968743, 307475707, 306471581, 305057618, 305711538, 307404376, 305907223, 296342919, 281429731, 265976258, 251642537, 235631888, 220555480, 208464778, 198066210, 190158229, 183210122, 177101326, 171208880, 165885178, 161269622, 157236590, 153757850, 151552617, 150113959, 149811593, 150109468, 150880921, 152579713, 156453745, 162635629, 169447918, 179681243, 192308651, 206882338, 222458441, 236234174, 247223449, 249549427, 242834951, 235364556, 232487804, 234554990, 237565573, 238994096, 235628546, 223571035, 206834242]
8107B06834242j4175027j0810128p358509m084437k195991k117528k053996j177311
8099A62861315q99965M71333K248920M868210O465030Q109867J0282669J3017618
8091B07424997J6318321J8098839J9561614J7944486R772769j510672n837793
8084B81772561j454483L024073L785845Q24088r845751k2896684k4091091j9280643
8076B11837915j3911596j0744213q000745p342287o957988m600004n315251l524437
8068A51441394j832744r17616k84143N10338J810396K400396L462494L900520
8060A60491035P144872Q644323J0808470J4258282J6133558J9345882K2266364
8053B59092786K4319981K1146214J5541783J0151462M947319j390198j954704
$$ y = [206834242, 192659215, 181849087, 174490578, 170406141, 168210150, 166092622, 164038626, 162861315, 161961350, 162432683, 164681603, 169549813, 176014843, 184124710, 194407379, 207424997, 223743318, 241842157, 261403771, 279348257, 289121026, 287610354, 281772561, 280318078, 283342151, 287127996, 287952084, 278106333, 255209649, 231118558, 211837915, 197926319, 187182106, 179181361, 171839074, 164881086, 160281082, 154965831, 151441394, 149608650, 148691034, 148406891, 148917229, 150727625, 153128021, 156590515, 160491035, 167635907, 176280230, 187088700, 201346982, 217480540, 236826422, 259092786, 283412767, 304558981, 320100764, 330252226, 335199545, 333809347, 331854643]
8046C31854643k88539k327602q514568j7510347k5930002k6363641k1334330j6238198
8038B13347416j3615447j1007624r901889q279912n897819n465949l327844k747788
8030A53103144l350348l055183l967680l306572k114367j516836r8508J087848
8022A36781498K520836L394142L781841O174215P801695P352344Q813854P549910
8014A84170335K689643k919392l271739j656365j564089j731056n298544j1421297
8006A58997496j3051751j0760676q692335o396588n773235m325771l108659k914870
7998A03973611k057962j388068o39765r21542j808116k685336j910745j755312
7990I0806765j105925j176889j311380j657261j050508J02690L32419J24330J127030
$$ y = [331854643, 331566104, 329238502, 320723934, 303213587, 277283585, 250919944, 229585614, 213347416, 199731969, 188724345, 178822456, 170542544, 164644725, 159178776, 155850932, 153103144, 149752796, 146697613, 142729933, 139423361, 137308994, 135792158, 135693650, 136781498, 139302334, 142696476, 146478317, 152652532, 160454227, 167806571, 176620425, 184170335, 186859978, 183940586, 180668847, 179012482, 177448393, 175717337, 170418793, 158997496, 145945745, 135185069, 126492734, 120096146, 114322911, 109997140, 106888481, 103973611, 101915649, 100527581, 99887816, 98966274, 97158158, 94472822, 92562077, 90806765, 89700840, 88523951, 87212571, 85555310, 84504802, 84607492, 84939911, 85064241, 86191271]
7981H6191271L027179M514198M538713O855412Q988376J1896197J4168395J4551475
7973A54731216j030798j9149928j8798158j2161205q380218o462807n327727n454626
7965G7965749m901970m075898l156313j586857k588565k102381l49967p8514j355524
7956E7769760j329832j253371k121961j211053j123552j546154o46886r11717
7948D7625234k258458j520394o09102o03576K44383j46802q65107j75256j49618
7939D1541304J8566R6812L78223m78168N43186O73906L56134o22089l92734j097423
7929D1017717l15530R26279j29389j27258R03489r97792n77081K59722o43998
7920D0316159q24930k97746L35190l43486o88560q55879m78133j281116j065910
$$ y = [86191271, 89218450, 93732648, 98271361, 105126773, 114115149, 126011346, 140179741, 154731216, 153700418, 134550490, 115752332, 103591127, 95210909, 88748102, 83420375, 77965749, 73063779, 68987881, 65831568, 64244711, 61656146, 59553765, 59203798, 59125284, 57769760, 56439928, 55186557, 53064596, 51853543, 50729991, 49183837, 48536951, 47625234, 45366776, 43846382, 43237280, 42633704, 42878087, 42731285, 41866178, 41690922, 41541304, 41559870, 41656682, 42034905, 41556737, 42099923, 42773829, 43129963, 42507874, 42115140, 41017717, 40702187, 41628466, 41499077, 41371819, 42275308, 41277516, 40700435, 40960157, 40316159, 39491229, 39193483, 39528673, 39185187, 38496627, 37640748, 37162615, 35881499, 34815589]
7911C4815589l61221j426889q84364n87780R14710j25026n60787p62678o32483
7902C0389071j76641K72073j04680K99683R37825R75255M77471L05951L85885
7893C3761893K55911N90245O56867M54338R09897N06818L05129O20388K05999
7884C8267485J92366Q88700R91523N86220k50106p32273K32360N00115Q86627
7875D1563017J405458R68666o77989j493554j432203j494515k246766k592589
7867C3999525k530066j557999j028637M77154K10087k13203K66699m22792r15728
7858B8285040n80392n65730L04310n536o32859k07332N64829m90866N55852k82129
7848B6945187o89263k83373j583480R8556J312177l86007j66123m37318q58397
$$ y = [34815589, 34454368, 33027479, 32143115, 31555335, 32470045, 32345019, 31784232, 31021554, 30389071, 30212430, 30484503, 30379823, 30679506, 31617331, 32592586, 33070057, 33376008, 33761893, 34017804, 34608049, 35264916, 35719254, 36629151, 37135969, 37441098, 38061486, 38267485, 38459851, 39348551, 40340074, 40926294, 40676188, 39943915, 40176275, 40676390, 41563017, 42968475, 43937141, 43259152, 41765598, 40333395, 38838880, 36592114, 33999525, 31469459, 29911460, 28882823, 29359977, 29570064, 29356861, 29623560, 29200768, 28285040, 27704648, 27138918, 27443228, 27437692, 26804833, 26597501, 27162330, 26671464, 27227316, 26945187, 26255924, 25972551, 24389071, 24487627, 25799804, 25413797, 25247674, 24810356, 23951959]
7839B3951959L88316N67712M19993k88496N63539P54019r3365l90170J96179N9499
7829B6129185j466427k138145j133249Q0989p72401n79489m86455l70819n21126
7820A8742063R3399q90656j06193j14513q23784q95017n09766k92178L00782l12873
7810A5191264k71233O69802j5667k0871o06685m49373m56808k54992n28905j98621
7800A3057911P67128Q29477j69830l81617j075363k00007J741N86825L98414J18843
7790A3933522m27793L02423L55849j204861R1119J02363l97410K7433R27697M56195
7780A4166537j775730m34893N64745R16411n3501j266025n72838l32739Q31634
7771A2043601R27617j61009o55209l99538O11503k96004r38954o37444q33981
$$ y = [23951959, 24340275, 24907987, 25327980, 25039484, 25603023, 26357042, 26263677, 25873507, 26069686, 26129185, 24662758, 22524613, 21391364, 21472353, 20699952, 20120463, 19634008, 19263189, 18742063, 18835462, 17944806, 17838613, 17724100, 16900316, 16005299, 15495533, 15203355, 15504137, 15191264, 14920031, 15589833, 15574166, 15553295, 14946610, 14497237, 14040429, 13785437, 13256532, 13057911, 13825039, 14654516, 14484686, 14103069, 13027706, 12827699, 12829440, 13416265, 13814679, 13933522, 13505729, 13808152, 14164001, 12959140, 13050259, 13152622, 12755212, 12782645, 13710342, 14166537, 12390807, 11955914, 12520659, 13437070, 13383569, 12117544, 11544706, 11211967, 12043601, 12971218, 12810209, 12155000, 11755462, 12366965, 12070961, 11132007, 10494563, 9660582]
7762I660582j316520P97765M93271q8935K00828J68505L66670n14569j047075
7753H720522N44040N27389j045148j75497l70266K53367J048937P6666L26666
7744I906676k94417K43099j07213n18535o09910K35338n71432l53314L15478K47547
7734H493317M35623o8786J16614m43365p64755r32647P19658Q23594q674J64964
7724H535543L76479l59909K11913k34079j33383R77094P9002n22616M42739k067162
7714G305621n07049r7646o42915k78724J067116O37475M09710M26087J94404O82538
7704I196617n12975n38301j91112k11211j01052P51449L21859j56858J105675
7695I664091J2232k81659j6392q74207j297574q66694r21241k45178N13784J4444
$$ y = [9660582, 8344062, 9141827, 9635098, 9546163, 9746991, 9915496, 10282166, 9767597, 8720522, 9264562, 9791951, 8746803, 8571306, 8201040, 8454407, 9503344, 9580010, 9906676, 9612259, 9855358, 9748145, 9229610, 8619700, 8855038, 8283606, 7930292, 8245770, 8493317, 8928940, 8860154, 8976768, 8533403, 7768648, 6836001, 7555659, 8379253, 8370579, 8535543, 8912022, 8552113, 8764026, 8529947, 8396564, 9373658, 9452660, 8930044, 9372783, 7305621, 6798572, 6700926, 6058011, 5779287, 6846403, 7483878, 7893588, 8319675, 8514079, 9196617, 8683642, 8145341, 7954229, 7743018, 7641966, 8393415, 8715274, 8558416, 9664091, 9676323, 9394664, 9378272, 8504065, 7206491, 6339797, 5418556, 5173378, 5687162, 5701606]
7685E701606O13624M04568P67273M54040j327j630435j052763M05329l79032m02992
7675D879891J70414M86753P68350R03367j21056m32872O2697R4230l09907q1806
7665F420061J88064k07942k18985K77577o82671m6303M58075P61681R20608Q316
7655G878481j4167n17852q2901j315447l94376M55876p33879n35870Q35382O53405
7645F228652L32239M27033M83875r47978m25463q04244m62753o01162K02471n6766
7635D375904k7314N07724K70309n17045m61747l27013p89179k19576K53033J640931
7625D706027L21321L9853k30366Q0824K14489l55801j261382k05218J77280K7098
7615C514125L79257O13504k17728J64678J53030R4602J54530m39141p31974j469604
$$ y = [5701606, 6315230, 6719798, 7487071, 7941111, 7939784, 6309349, 5256586, 5661915, 5282883, 4879891, 5050305, 5537058, 6305408, 7208775, 7087719, 6654847, 6717544, 6811774, 6501867, 6420061, 6608125, 6400183, 6181198, 6458775, 5776104, 5729801, 6187876, 6949557, 7870165, 7878481, 7864314, 7346462, 7263561, 5948114, 5553738, 6009614, 5275735, 4739865, 5575247, 6228652, 6560891, 6987924, 7471799, 6523821, 6098358, 5294114, 4831361, 4230199, 4432670, 4375904, 4348590, 4856314, 5126623, 4609578, 4147831, 3820818, 3031639, 2812063, 3065096, 4706027, 5027348, 5067201, 4836835, 4917659, 5132148, 4776347, 3514965, 3309747, 3487027, 3514125, 3893382, 4506886, 4289158, 4453836, 4606866, 4701468, 4855998, 4416857, 3684883, 2215279]
7605B215279K47458J123682J222888J5258l18807j10478L51847o5965j520850
7596C160312o31533P74570L16917O84862m30859r8300k41831j27548L28743m16799
7586C318534O56304j77637L51531k22755p22820P48435n1514o35850k61668K35070
7576C237630J83898n12201j62231K42874J506873p46257o70280J57277J47796
7567C385379Q55862n21084p08690O0935O79561L33949j7707j36142k11707k77398
7557C442958Q3462l56957P72714L44346k59106o15749m99153j61502M32288M3705
7547C227006J46974Q13629n25745J82891k46930N14964K85894n2917l30588J52375
7537D167553m18407l500n70721l32850P98760N92112k97804j41312M12232M62038
$$ y = [2215279, 2462737, 3586419, 4809307, 4824565, 4505758, 4395280, 4747127, 4681162, 3160312, 2528779, 3303349, 3620266, 4305128, 3874269, 3775969, 3534138, 3406590, 3735333, 3318534, 3974838, 3797201, 4148732, 3925977, 3203157, 3951592, 3900078, 3264228, 3002560, 3237630, 3421528, 2909327, 2747096, 2989970, 4496843, 3750586, 3080306, 3237583, 3385379, 4241241, 3720157, 3011467, 3072402, 3751963, 4085912, 4068205, 3932063, 3720356, 3442958, 3526420, 3169463, 3942177, 4286523, 4027417, 3411668, 2912515, 2751013, 3183301, 3227006, 3373980, 4187609, 3661864, 3844755, 3597825, 4112789, 4398683, 4345766, 4015178, 4167553, 3749146, 3745646, 3174925, 2842075, 3640835, 4232947, 3935143, 3793831, 4206063, 4668101]
7527D668101q47327M30948L27607J13353q87148j95766N46396M57447J073824
7518E687435J96420j9115p02440l77597p35035l1693R30922l30481q96423p78260
7508B943733J45353J012953k49103O0143j71182M22R16195P91902o5726L07059
7498E691749o67497O7346o79100L69213m57026O39922K87130j6090j85791j91973
7488D857883P0239m879N5354k39686M18938n397k19347N63016M97644o88649j83966
7477E121150J038602O91730N72333k20593R2856L36694j27559j21191J14375Q04745
7467H303142N49864P6774n04999m00370N07758k16848l64651Q00539O60672O16333
7457A0028214p3593l45406m7665j75969K36247O71347J2535J778531K69542N66545
$$ y = [4668101, 3820774, 4251722, 4579329, 4692682, 3805534, 3609768, 4156164, 4613611, 5687435, 5883855, 5864740, 5162300, 4784703, 4049668, 4017975, 4948897, 4618416, 3721993, 2943733, 3089086, 4102039, 3852936, 3913079, 3741897, 3742319, 4658514, 5450416, 5384690, 5691749, 5024252, 5091598, 4412498, 4781711, 4324685, 4964607, 5251737, 5235647, 5049856, 4857883, 4928122, 4923243, 4978597, 4738911, 5157849, 5152452, 4933105, 5496121, 5993765, 5305116, 5121150, 6159752, 6851482, 7423815, 7203222, 7296078, 7632772, 7505213, 7384022, 7498397, 8303142, 8853006, 8929780, 8424781, 8024411, 8532169, 8315321, 7950670, 8751209, 9411881, 10028214, 9954621, 9609215, 9561550, 9385581, 9621828, 10293175, 10305710, 12084241, 12353783, 12920328]
7447A2920328j9550K92550r51359K27047K65497M55021J198062M90436R41050
7438A5819082M52443R39281R4683K51003N13994J110192M75895j88482Q88831
7429B0356922Q23634J014655J076750J147627K389238P94971J085469J832747
7421C0522013J370223J247529K345786K117117K230656K813526L144230K928707
7413D8719787N217175N447602O411157Q773485J0243997J1883829J2615825J4887856
7405A24200713J4314101J3693571J0305287K858001k350682j609442J469052L389479
7397A66270080J877995j865112r608778j6236138j7959950j5271201j1808264
7390I5398632r669355o948990o232937n084107m966482l973498l389174k764570
$$ y = [12920328, 12900778, 13193328, 12241969, 12469016, 12734513, 13189534, 14387596, 14878032, 15819082, 16271525, 17210806, 17305489, 17556492, 18070486, 19180678, 19656573, 19468091, 20356922, 21180556, 22195211, 23271961, 24419588, 26808826, 27603797, 28689266, 30522013, 31892236, 33139765, 35485551, 37602668, 39833324, 42646850, 45791080, 48719787, 53936962, 59384564, 65795721, 74569206, 84813203, 96697032, 109312857, 124200713, 138514814, 152208385, 162513672, 165371673, 163020991, 161411549, 162880601, 166270080, 168148075, 166282963, 156674185, 140438047, 122478097, 107206896, 95398632, 85729277, 78780287, 72547350, 67463243, 62496761, 58523263, 55134089, 52369519]
7382E2369519k157308k361909k318777j627799j112955p73227k87846q29614l65900
7373D0534184m45689o89910P88549J34259m37483j70153k09510K81696n77502
7364C9208441L46561J268678J355392L6961N4119P28099M39257m97517j12504
7355D2827487l05829N71781R33786J97226J366931K092021J478851J538956K522583
7346E3223793K126083K128397K436337J734326K440238K458690L232543L270571
7338G3050978M471197M201181L991246M986250N925120P165042P929496R901197
7330A21621707J2528155J6126082J8884777K1420087K6664534L2280409L3097469
7323B82623220L1284628K6699479J4059928l783093j0153897n237057J719116
$$ y = [52369519, 50212211, 47850302, 45531525, 43903726, 42790771, 42017544, 41729698, 40900084, 40534184, 40088495, 39398585, 40187134, 40321393, 39883910, 39713757, 39504247, 39785943, 39208441, 39555002, 40823680, 42179072, 42216033, 42270152, 42998251, 43437508, 42939991, 42827487, 42521658, 43093439, 44027225, 44224451, 45591382, 47683403, 49162254, 50701210, 53223793, 55349876, 57478273, 59914610, 61648936, 64089174, 66547864, 69780407, 73050978, 77522175, 81723356, 85714602, 90700852, 96625972, 103791014, 111720510, 121621707, 134149862, 150275944, 169160721, 190580808, 217245342, 249525751, 282623220, 313907848, 340607327, 354667255, 350884162, 340730265, 335493208, 337212324]
7316C37212324L424780Q20448j1065646k6467256l5338817l4019175k8402494
7309B06164164k2341646j8963712j3952839j2448814j1626846r819995p532899
7302A09477413o313365n383497m612010l619283l457965m779838l328765k623165
7294G5359525k225008j813545l193838k756496k036805k852883j679067j112645
7286E7689238o35683q4423N99576O72699L24139k69344L20380j076114k634562
7277E4905906k934634k445329l524645k361028p92606j001448j362044l87058
7269D0097114k07156o52946n52982k93650O48820O17829N0114M55769R2267J9389
7259D0274568P3401J096085P86501J613598R13274Q80567J162338r63543k801764
$$ y = [337212324, 340637104, 341457552, 330391906, 303924650, 268585833, 234566658, 206164164, 183822518, 164858806, 150905967, 138457153, 126830307, 117010312, 109477413, 103164048, 97780551, 93168541, 89549258, 86091293, 81311455, 77982690, 75359525, 73134517, 71320972, 68127134, 65370638, 63333833, 60480950, 58801883, 57689238, 57053555, 56969132, 57568708, 58241407, 58565546, 58296202, 58616582, 57540468, 54905906, 51971272, 49525943, 46001298, 43640270, 42847664, 41846216, 40484172, 40097114, 39889958, 39237012, 38684030, 38390380, 39039200, 39657029, 39707143, 40162912, 40255179, 40274568, 40347969, 41444054, 42230555, 43844153, 44757427, 45637994, 46800332, 45836789, 43035025]
7250D3035025k837723j031367k72495j356515r52075k27660r87251j95038J61981
7241C5336882K10655l32658N34606J372942O22812J377598J262093R61127R45834
7232D2291891K682216J973246L61549j304780j909679m59659o03091N01864J077533
7223D4611090J88893K01194N35089L43541N6665J561768J800079J294524J848526
7214E2441369J199580J551675K555960K595095K937040L674628M032909N070235
7206G6058491O627402Q573954R535606J3086251J4941378J7312840K1062784K3578852
7198A90777558K5118605K0072372O566900j2961554k5633473k7168729k2464661
7191A54307018j7579673j3734703j0861408r957895p731528o992628n417938m189724
$$ y = [43035025, 40197302, 39165935, 38893440, 37536925, 36584850, 36357190, 35369939, 35174901, 35336882, 35547537, 35214879, 35749485, 37122427, 37745239, 39122837, 40384930, 41346057, 42291891, 44974107, 46947353, 47308902, 46004122, 44094443, 43634784, 43031693, 43533557, 44611090, 44799983, 45001177, 45536266, 45879807, 45936472, 47498240, 49298319, 50592843, 52441369, 53640949, 55192624, 57748584, 60343679, 63280719, 66955347, 70988256, 76058491, 82685893, 91259847, 100795453, 113881704, 128823082, 146135922, 167198706, 190777558, 215896163, 235968535, 242535435, 229573881, 203940408, 176771679, 154307018, 136727345, 122992642, 112131234, 102173339, 94441811, 87449183, 82031245, 77841521]
7183G7841521l571981l483296k318241j029157k028546j054360q00230j028687
7175F2527023j04467M21677J073702N89266J915389J383221K008518J689812P43146
7166G2247287J485715M092579M389793L806712N985913N871463P977758R603491
7158A15460711J0145806J0776582J1634186J1928099J3912500J6959428K0911795
7151B11729107K6743938L0552011L0740930K0874877l820425k9384557l7910799
7144B49525082l3462345k6596003k0510495j5006793j2896289j0335615q307114
7137A22410428q122521p825715p320914o135054n051701m245135l013270k634174
7129G8061944k002776o05068j718506l16188l06249R00780J717962K306761N007338
$$ y = [77841521, 74269540, 70786244, 68468003, 67438846, 65410300, 64355940, 63555710, 62527023, 62422556, 62844233, 63917935, 64507201, 66422590, 67805811, 69814329, 71504141, 72247287, 73733002, 77825581, 82215374, 86022086, 92007999, 97879462, 105857220, 115460711, 125606517, 136383099, 148017285, 159945384, 173857884, 190817312, 211729107, 238473045, 269025056, 299765986, 320640863, 316820438, 287435881, 249525082, 216062737, 189466734, 168956239, 153949446, 141053157, 130717542, 122410428, 114287907, 106462192, 99141278, 93006224, 87954523, 83709388, 80696118, 78061944, 76059168, 75454100, 73735594, 73419406, 73113157, 74013937, 75731899, 78038660, 83045998]
7120H3045998N919604P727016R597776J1317042J0145026P306282r83094r327928
7112A24747722j1977653j1079547q358163o604208n669096n274092n300832n020056
7104F5464075m843806m390269l709306k158569j703851k621291j679447j462875
7096D2894661M8847q07975n34630m82279m29420J66727k69746k2532K74487M1589
7086D0879729K10447J677661P71317Q55228J678682J177491J700132K565836L981886
7077E5498409K701187K975052M463844M462581N958489P328180R132850J1905185
7069A04425777J3553395J3048576J1501180N458722o218710j4943825j8003530
7062A08821585j5356595j2427908q574489o849313o678382n700120m231711m115460
$$ y = [83045998, 88965602, 96692618, 106290394, 117607436, 127752462, 135058744, 134075650, 124747722, 112770069, 101690522, 93332359, 86728151, 81059055, 75784963, 70484131, 65464075, 60620269, 56230000, 52520694, 50362125, 48658274, 46036983, 44357536, 42894661, 42943508, 42135533, 41600903, 41118624, 40689204, 40855931, 40586185, 40563653, 40838140, 40879729, 41090176, 42767837, 43539154, 44394382, 46073064, 47250555, 48950687, 51516523, 55498409, 58199596, 61174648, 65638492, 70101073, 76059562, 83387742, 92520592, 104425777, 117979172, 131027748, 142528928, 147987650, 141768940, 126825115, 108821585, 93464990, 81037082, 72462593, 65613280, 58934898, 53234778, 49003067, 44887607]
7054D4887607l395248l533747l366095j854875k027946q43092j217940j356719
7046B7291945j260849r05052m01050j185946q96897j006160j218550j85291p68316
7037A9463834O88756J10925j090924k91691N39019M09435Q94556J55450L4970
7028B0914330q64861j056044k79435l57522j029600q86659n10190m73386n44850
7019A4911783k93913l48831o2241j075951l44569p47087j62884L7782l1022j11948
7009A1771119n46924K43138k0991n81137q36214j62809k88840L01717L22665j55344
6999A0046380J28489N67357n37886l59237j09613p4394K84544m472K95948m15208
6989I821908k57626L67858J25663K32669J59638J38671j35111k0868M87157J295601
$$ y = [44887607, 41492359, 37958612, 34592517, 32737642, 30709696, 29866604, 28648664, 27291945, 26031096, 25126044, 24724994, 23539048, 22642151, 21635991, 20417441, 20232150, 19463834, 20152590, 20263515, 19172591, 18880900, 19419919, 19829354, 20723910, 20879360, 20914330, 20049469, 18993425, 18713990, 18356468, 17326868, 16440209, 15930019, 15456633, 14911783, 14617870, 14269039, 14206798, 13130847, 12786278, 12039191, 11876307, 11914089, 11883067, 11771119, 11224195, 11467333, 11446342, 10865205, 10028991, 9866182, 9577342, 9879059, 10201724, 10046380, 10174869, 10742226, 10204340, 9845103, 9735490, 9661096, 9945640, 9941168, 10237116, 9821908, 9564282, 9932140, 10057803, 10290472, 10450110, 10588781, 10453670, 10432802, 10919959, 12215560]
6979A2215560M58004k71655j000707j058517j255441l19266p62168k77949j10727
6970G617134K34636j174501j204754n00760P85079R04159N41910o73845p06056
6961E823002n42146n79381l74026l45799J54709j64647K54938L29780J270906
6952E827336P51076j250318r1594K11260k08894L40j29850m38585R7354j22199
6942D645926k35240k55427J72010O33495o10439n24290j168223J63538P3487J36658
6932C031495k87088P67679K10674J23634k12438q99298j49303R95071L06199n9880
6922C826745J30727J37479K85550k93996n98346L17082k20143l50409l02821K90470
6912C222338N2073L0397j89320m85873M99095J27969L22765O27914q32612J85319
$$ y = [12215560, 12673564, 12401909, 11401202, 10342685, 9087244, 8767978, 8005810, 7727861, 7617134, 7851770, 6677269, 5472515, 4971755, 5756834, 6660993, 7202903, 6529058, 5823002, 5280856, 4701475, 4327449, 3981650, 4136359, 3971712, 4226650, 4556430, 5827336, 6578412, 5328094, 5236500, 5447760, 5238866, 5239206, 5109356, 4670771, 4768125, 4645926, 4410686, 4155259, 4327269, 4960764, 4350325, 3826035, 2657812, 2821350, 2894837, 3031495, 2744407, 3512086, 3722760, 3846394, 3633956, 2734658, 2585355, 3580426, 3886625, 3826745, 3957472, 4094951, 4380501, 4086505, 3488159, 3805241, 3585098, 3234689, 2931868, 3222338, 3274411, 3304808, 3115488, 2629615, 3128710, 3256679, 3579444, 4207358, 3374746, 3560065]
6902C560065l7313N63751N91138P89785J409453j08394J57719p66240j529811
6893D630153j137063o51758j32499N44567J12762M03673K26773K4411j392685
6884B628334J16642N9349k17919o15005m50765M75690O15993m46585n5312K40488
6874B350910p876n41202r7001M13751k33809q8764p16296J18164M48760n08806
6864A137831N30937J51678l60290l22802j95877M21718l98694M60431M05377L43083
6854B173392L26117j70179p12979N91047J981p64669M1855K65264L85974J93233
6844B331036n02567J90042m48758R72758j76435j6701N230n60717k88259m8230
6834A457399O91267j05830r314n40502K28877J1326k5906M80586O02192L70811
$$ y = [3560065, 3522752, 4086503, 4677641, 5467426, 6876879, 6768485, 6926204, 6159964, 4630153, 3493090, 2841332, 2708833, 3253400, 3366162, 3769835, 3996608, 4021019, 2628334, 2744976, 2804325, 2586406, 1971401, 1520636, 1996326, 2612319, 2165734, 2110422, 2350910, 2343034, 1801832, 1704831, 2118582, 1884773, 1796009, 1079713, 1197877, 1646637, 1137831, 1668768, 1820446, 1460156, 1137354, 941477, 1363195, 964501, 1424932, 1830309, 2173392, 2499509, 2329330, 1616351, 2207398, 2209379, 1444710, 1486565, 1751829, 2137803, 2331036, 1828469, 2018511, 1569753, 2542511, 2366076, 2349375, 2354605, 1793888, 1505629, 1457399, 2148666, 2042836, 2033522, 1493020, 1721897, 1733223, 1707317, 2187903, 2790095, 3160906]
6824C160906m90752O7547j21008l92529j31352J18994j594K73243K63419k18448
6814B528426M40539P95444K1956l43406N50389n11967m63490j086834j0489N45582
6804B466150K05159J199587R6573O92723O45373o90647P17662o79471n18642m01270
6794C733197k72054m18177O0583m36542L61044J060403R3778O72529m83180o94241
6784C677340m22959M06085m87874k41103J465079k06644k75541j84467J204633
6775D934549J2977J50385J92008L28187j4315K87198K25725m2638l87498K38026
6765E924604O79644K0637l1573Q07628J92864j858936p80432j02848J077044N04789
6755F433421J081679k63515M58932K53835k55624P35831N92619K80086M11861
$$ y = [3160906, 2670154, 2737701, 2616693, 2224164, 2092812, 2211806, 2210212, 2483455, 2746874, 2528426, 2968965, 3764409, 3786365, 3442959, 3993348, 3481381, 3017891, 1931057, 1920568, 2466150, 2671309, 3870896, 3967469, 4660192, 5305565, 4614918, 5332580, 4653109, 4134467, 3733197, 3461143, 3042966, 3103549, 2667007, 3028051, 4088454, 4182232, 4854761, 4371581, 3677340, 3254381, 3660466, 3172592, 2931489, 4396568, 4189924, 3914383, 3729916, 4934549, 4947526, 5097911, 5289919, 5618106, 5603791, 5890989, 6116714, 6074076, 5686578, 5924604, 6604248, 6624885, 6593312, 7400940, 7593804, 5734868, 4954436, 4851588, 5928632, 6433421, 7515100, 7251585, 7710517, 7964352, 7708728, 8444559, 9037178, 9317264, 9729125]
6746I729125J75325J066777R74850L43286k96364n33842j51758p16734k57497
6737A0333168N74060P31772N9435J52825j41446r23916n88307J13738n86385p33160
6727H991784J6585j89198k62521N73322q8683m23715N16067O379Q6240m4487m57586
6716H724187o2532P74225m72929k57061L38783Q84655L66175k66293J82651J13279
6706A0325140l80528J40464o6615J014990O72104L52869J033946N14813M58701
6697A4065884j29879M94672J126876O4891j26390m10855J054118Q28811Q47083
6688A7815211J087478Q56227O1825j64669n78257l43208P89255J64321l48131
6679A9340052O04882J60918J48123J142327N10457K53056J756711R37669L23225
$$ y = [9729125, 9904450, 10971227, 11946077, 12289363, 11992999, 11459157, 11307399, 10590665, 10333168, 10907228, 11639000, 11698435, 11851260, 11709814, 10785898, 10197591, 10311329, 9724944, 8991784, 9008369, 8819171, 8556650, 9129972, 9041289, 8617574, 9133641, 9140020, 9226260, 9181773, 8724187, 8661655, 9435880, 8962951, 8705890, 9044673, 9929328, 10295503, 10029210, 10211861, 10325140, 9944612, 10085076, 10018461, 11033451, 11705555, 12058424, 13092370, 13607183, 14065884, 13936005, 14430677, 15557553, 15622444, 15496054, 15085199, 16139317, 16968128, 17815211, 18902689, 19758916, 19820741, 19656072, 19077815, 18734607, 19523862, 19688183, 19340052, 19944934, 20105852, 20253975, 21396302, 21906759, 22159815, 23916526, 24854195, 25177420]
6670B5177420J078563R22522R79801J080061J250296J632606J751060Q89631J486379
6661C6248339Q72354J144537J970399K066628J965386K380164K572302L255764
6653E2475873L165448M098304M059411M465398N979331P252385Q177180R534144
6645I9207474J1216047J4202720J6334375J9395546K0632788K2946962K2527677
6638B26463589K0959488J6209605P250633j09659k081211k300226k481572j765905
6630B62144742m174865j1544725j7777973k0798600j9336060j7876121j7501383
6623A53135015j3149865j0508861r773001q447900o573704n309986n230978m607867
6615H9532853m061293k602612k807170k062869j508828j942741l77782K98688
$$ y = [25177420, 26255983, 27178505, 28158306, 29238367, 30488663, 32121269, 33872329, 34761960, 36248339, 37120693, 38265230, 40235629, 42302257, 44267643, 46647807, 49220109, 52475873, 55641321, 59739625, 63799036, 68264434, 74243765, 81496150, 89673330, 99207474, 110423521, 124626241, 140960616, 160356162, 180988950, 203935912, 226463589, 247423077, 263632682, 270883315, 270773656, 268692445, 266392219, 263910647, 262144742, 257969877, 246425152, 228647179, 207848579, 188512519, 170636398, 153135015, 139985150, 129476289, 119703288, 111255388, 104681684, 99371698, 94140720, 89532853, 85471560, 82868948, 80061778, 77998909, 76490081, 74547340, 74169558, 74468246]
6607G4468246M06658J006633K408498K378271J319412J968033L010359L118819
6599I0084929N005002O023861P532392R020957J1442503J3386561J5732167J6049334
6591A74277706J6937512J6602243J4637132R988648L911729N51171r75825k162273
6583B33768043k164461k765540p702677j5747826j8902702k0314167j8760869
6576A47409801j6098776j2277188j0783732r377822p041037p523440o344076n627294
6568G2336436n384868n844304l319540k594122j797144j953889k394080m155168
6560D4893321l173349j373406k164530j266209j244425r00951j77319j369779
6552C3223353j118494j131206j044647p34719j078175k45876j155663m73361m02083
$$ y = [74468246, 74874904, 75881537, 78290035, 80668306, 81987718, 83955751, 86966110, 90084929, 95089931, 101113792, 108646184, 117667141, 129109644, 142496205, 158228372, 174277706, 191215218, 207817461, 222454593, 232443241, 236354970, 236906141, 235930316, 233768043, 231603582, 228838042, 221135365, 205387539, 186484837, 166170670, 147409801, 131311025, 119033837, 108250105, 98872283, 91831246, 84307806, 77963730, 72336436, 66951568, 61107264, 57787724, 55193602, 53396458, 51442569, 49048489, 44893321, 41719972, 40346566, 38182036, 36915827, 35671402, 34770451, 34593132, 33223353, 32104859, 30973653, 29929006, 29194287, 28116112, 27870236, 26714573, 26241212, 25839129]
6543B5839129o35277o17306j403480j099551j357849n27729q82925j345825j034551
6534A6934636j036720k38682K46594M30518K37075j46782k62490j233469l46676
6525A4584004M71760j377378N44897k87179p56791k66418J68511J94249j37408
6516A3138247M10928n10682J32584j49860r81038K35246K17076k83086m29710
6507A1779705l46779J41125k31683p53417m236K03829n66366J52100k60679m86109
6497I627490k78489q00511P09336Q93975n04353N47143J95821L62195J33261l16072
6487A0569796k01734K41547l9756n97837j90070L85430M0737j076792O24424J023391
6477A0779136j84777P02784Q86080O88137J193079J289241Q62348J7905J360857
$$ y = [25839129, 25203852, 24586546, 23183066, 22083515, 20725666, 20197937, 19315012, 17969187, 16934636, 15897916, 15659234, 15905828, 16336346, 16573421, 16426639, 16164149, 14930680, 14584004, 15055764, 13678386, 14223283, 13936104, 13179313, 12912895, 13081406, 13275655, 13138247, 13549175, 13038493, 13171077, 13021217, 12040179, 12275425, 12492501, 12209415, 11779705, 11432926, 11574051, 11342368, 10588951, 10584715, 10788544, 10222178, 10374278, 10113599, 9627490, 9349001, 8548490, 9257826, 10151801, 9647448, 10194591, 10390412, 10752607, 10885868, 10569796, 10368062, 10609609, 10569853, 9972016, 9781946, 10167376, 10208113, 9131321, 9755745, 10779136, 10594359, 11297143, 12183223, 12871360, 14064439, 15353680, 16216028, 16233933, 17594790]
6468A7594790J533858J860189O95324J81200o23019r37465L58026r0197Q49235
6459B1421941K57683L31057J468083J660923J046610N05433p59300j158498o62542
6450B4111390j528653k197674j514693p94655n27668j462112k95068r96845j485650
6441A3308372M3625O64445J527870P47743Q41789J000568J81424p46273j234186
6432A6335377p79560o65846q74350q25251q51825O9543M02090K07363J116000
6423A4133541O64800J561991J390640K146251K192863J104544o64031j041536
6415B1489063n422j19157j48177K01759M18339j040157L8280K30867N58436q82773
6405B0741058j346082k750608j794334n12225m72557l9610R37788q81432o09758
$$ y = [17594790, 19128648, 20988837, 21684161, 21865361, 21242342, 20304877, 20662903, 20572706, 21421941, 21679624, 22010681, 23478764, 25139687, 26186297, 26691730, 25932430, 24773932, 24111390, 22582737, 20385063, 18870370, 18075715, 17548047, 16085935, 15790867, 14794022, 13308372, 13351997, 14016442, 15544312, 16292055, 17133844, 18134412, 18315836, 17569563, 16335377, 15555817, 14889971, 14015621, 13190370, 12338545, 12408088, 12810178, 13017541, 14133541, 14798341, 16360332, 17750972, 19897223, 22090086, 23194630, 22530599, 21489063, 21483641, 21364484, 21216307, 21418066, 21836405, 20796248, 20834528, 21065395, 21623831, 20741058, 19394976, 16644368, 14850034, 14337809, 13865252, 13825642, 14763430, 13881998, 13272240]
6396A3272240K98505j40360N22473o12010l68758j575619j385472j377260j566893
6387G066846j74192k40297l31425n321m54478l89776p27507n84406l85615O03212
6377D377041k94583M49774M51716n85505o7414l25955j156047N05511p9962k85427
6367B989149m11094j66736Q95004o00061l87403k70918l81787O1612M09153l9834
6357B097085p40139N9073M10742j04520o45216M17601m79694j6506J823j93535
6347H06714M23559j5380k64925k77778n023j89652J6177k26579M50545K59842
6337I77500j44053Q1671M91686p63913P42445K28565p41150l93213q61537l28155
6327g10154Q73892j60516J10247J48061m54515R70843j72999k19837L87982r45881
$$ y = [13272240, 13570745, 13430385, 13952858, 13340848, 12972090, 11396471, 10010999, 8633739, 7066846, 6892654, 6652357, 6320932, 6315611, 5861133, 5471357, 4743850, 4159444, 3773829, 4377041, 4082458, 4532232, 4983948, 4398443, 4331029, 4005074, 2849027, 3354538, 3274576, 2989149, 2578055, 2411319, 3306323, 2706262, 2318859, 2047941, 1666154, 1727766, 2136919, 2097085, 1356946, 1416019, 1826761, 1722241, 1077025, 1494626, 1014932, 998426, 1000249, 806714, 1230273, 1214893, 949968, 672190, 667167, 477515, 493692, 267113, 717658, 977500, 833447, 915118, 1406804, 642891, 1385336, 1613901, 872751, 479538, -381999, -710154, 163738, 3222, 113469, 261530, -192985, 777858, 604859, 385022, 773004, -172877]
6317a72877J85399j46078k10405L21102J037314N83147l15737k66713k00571j74278
6307F40303j73129k27550l02133L07778Q7953l21559l94926m09204r28680L86708
6297a334439M16674J5865L74517q657O0337R38204r8559O428m36665m28141O36728
6286A42292k25460R2063O9283q09301r524N17773l42095k55626q8609r06977m29690
6275b245871L55353M95977O79586M80442n94091J30629l96283m65673J61587P18805
6265f79539N0152Q0182L70304l16757Q13053J45148O7090L682J70273k25520j128034
6254f49966J65383j53443p47042O90339J01787P04668K48014l02308k60208p44305
6244i47081L87980N80188k98390P25365R54138k28810p94204q0435L58122J72
$$ y = [-172877, 12522, -133556, -343961, -22859, 1014455, 1597602, 1281865, 1015152, 814581, 640303, 467174, 239624, -62509, 245269, 333222, 11663, -383263, -792467, -1721147, -1334439, -917765, -901900, -527383, -536040, -475703, 462501, 363942, 370370, -66295, -494436, 142292, -83168, 8895, 78178, -731123, -740647, -222874, -564969, -820595, -909204, -1816181, -2245871, -1890518, -1394541, -714955, -234513, -828604, -697975, -1094258, -1559931, -1398344, -679539, -629387, -549205, -178901, -495658, 317395, 462543, 529633, 533315, 703588, 478068, -649966, -484583, -638026, -1385068, -694729, -592942, 111726, 359740, 57432, -202776, -947081, -559101, 21087, -277303, 448062, 1402200, 1173390, 379186, 298751, 656873, 657045]
6234F57045q17835M61973k57192l01915L87301o33504J77843K67320L6601K30201
6224B07838n05599m15140k68065m05476L36814m18607O85191O74733k17457M41292
6214A15524k02575o28046m78452k9214J46855L21467K18860k31111J45096n96102
6204a217698J10042N42014O166l1702m04265K55375K16031K96491L30364p19620
6194f16802j33347K63656M1708N51401K35479o310p5787o29715j87408o75044
6184a232169J88063Q7345J93517L95382M05813n22556m43133L7502M30470n63066
6174a022832q65047L41717L63312O7441j94665j063057R90150k35072o43231N86836
6164a674448N72331l96458j181667J029931K25016J23750m00557M10106Q7028
$$ y = [657045, -160790, 301183, 43991, -257924, 129377, -504127, -326284, -58964, -22363, 207838, -297761, -712901, -980966, -1386442, -1049628, -1468235, -783044, -108311, -325768, 115524, -87051, -715097, -1193549, -1222763, -1075908, -754441, -535581, -766692, -621596, -1217698, -1107656, -565642, -559476, -591178, -995443, -740068, -524037, -227546, 102818, -616802, -750149, -486493, -444785, 106616, 342095, 335785, 259998, -369717, -557125, -1232169, -1044106, -956761, -763244, -367862, 37951, -484605, -927738, -890236, -459766, -1022832, -1887879, -1546162, -1182850, -1115409, -1310074, -2373131, -1382981, -1618053, -2261284, -1674448, -1102117, -1498575, -2680242, -1650311, -1425295, -1301545, -1702102, -1291996, -1204968]
6155a204968K84186o81415Q02185L98768j299930q59364M87458M78128M30266
6146a164686K55502k19992r3936N3116j38313m66842j80614j8958J46378K08391
6136a619954L47959p15042o5054k9659R20244O810j7348K34022p06048q1580M07370
6125a318280P6276L39037p3548o74145J88468M40754L20540o33522j67516L52400
6115a149536l02079j32381k83462N76547O25646k88227J55443k40759m95451k74211
6105a808470O71448l03111J16004k05254P1391q25837p13991Q38997L34545J57096
6095a667182K24753L03293J15430O52200q09864n52179n92821J01834K34590j04793
6085b094739N05004P19774K75306k52271l98890q51487j033468k53914O14489
$$ y = [-1204968, -920782, -1602197, -800012, -401244, -1701174, -2560538, -2073080, -1594952, -1164686, -909184, -1129176, -1223112, -1169996, -1308309, -1775151, -1955765, -1974723, -1828345, -1619954, -1271995, -1987037, -2052091, -2081750, -1161506, -1154696, -1172044, -938022, -1644070, -1725650, -1318280, -1242004, -902967, -976515, -1650660, -1462192, -1021438, -700898, -1334420, -1501936, -1149536, -1451615, -1583996, -1867458, -1290911, -665265, -953492, -798049, -1038808, -1534259, -1808470, -1137022, -1440133, -1324129, -1529383, -1457992, -2283829, -2997820, -2158823, -1824278, -1667182, -1442429, -1139136, -1023706, -371506, -1181370, -1733549, -2326370, -2224536, -1989946, -2094739, -1589735, -869961, -594655, -846926, -1245816, -2097303, -3130771, -3384685, -2770196]
6076b770196P88504O48116M39314J45722L5514M99335o21771l55094J36033k60947
6066a315470J91418n49480K36567Q64489k80850r72171l61761K80619J27054l8758
6056a818343k52626M10549m23273O869P7118L52294k15610J15233L44597l36736
6046a739928m16334n65849o53506n4795J066783L44359R7932p2644N70646n92638
6036b015974o66238J56063j65697K86213P50696K27140L22031p3580J39119m06007
6026a446234K05342j04721k63087j66221L22512Q06192l10334l31384q2308l8372
6016a408615M15824O6882l31901p89368M27575J092027l45603k04435q13639M46359
6006a444894P78404l68524Q7510L16528l63399k13946m40963K86488K6272m8217
$$ y = [-2770196, -1981692, -1333576, -894262, -748540, -713026, -213691, -835462, -1190556, -1054523, -1315470, -1124052, -1673532, -1436965, -572476, -853326, -1825497, -2187258, -1906639, -1779585, -1818343, -2070969, -1660420, -2083693, -2076824, -1999706, -1647412, -1863022, -1747789, -1403192, -1739928, -2156262, -2722111, -3375617, -3430412, -2363629, -2019270, -1921338, -1993982, -1423336, -2015974, -2682212, -2526149, -2691846, -2405633, -1654937, -1427797, -1105766, -1179346, -1040227, -1446234, -1240892, -1345613, -1608700, -1774921, -1452409, -646217, -956551, -1287935, -1370243, -1408615, -992791, -925909, -1257810, -2047178, -1619603, -527576, -873179, -1077614, -1891253, -1444894, -666490, -1035014, -947504, -630976, -994375, -1208321, -1649284, -1362796, -1336524, -1384741]
5996a384741n45384J13227N48349M3977p0269j0858m13716j89803M63848K3692
5986a421678O32297O0158j220327l90296j17405q266L06342l6076N42458Q51451
5976h01342K58491j44398m60681n75720o16806k80887J98424J69650j29578J50888
5966b231959P7552M30170M60829o90986J01507K2615k21439l034n6077K93992
5956a816830J43459L24958M3736j89222q18000K41470N59867l37737J98963o25810
5946b275146j22882L01114l3049q72260K91219L66441j56561J01581N19466N02913
5936a377164L60565n54468k39329k04843k97201J49087K94551P0447m56935K95816
5926a959474P78705N5982r5648o82947r08391L99379O83114O15430q7276j30739
$$ y = [-1384741, -1930125, -1816898, -1268549, -1224572, -1294841, -1305699, -1719415, -1909218, -1445370, -1421678, -789381, -729223, -1949550, -2339846, -2457251, -2465517, -2159175, -2195251, -1652793, -801342, -542851, -687249, -1147930, -1723650, -2340456, -2621343, -2422919, -2253269, -2382847, -2231959, -2154407, -1724237, -1263408, -1954394, -1852887, -1830272, -2051711, -2054745, -2110822, -1816830, -1673371, -1348413, -1304677, -1493899, -2311899, -2070429, -1510562, -1848299, -1649336, -2275146, -2398028, -2096914, -2129963, -3002223, -2711004, -2344563, -2501124, -2399543, -1880077, -1377164, -1016599, -1571067, -1810396, -2015239, -2312440, -2163353, -1868802, -1798355, -2255290, -1959474, -1180769, -1124787, -1220435, -1903382, -2811773, -2412394, -1729280, -1113850, -1201126, -1331865]
5916a331865P8388k30575l70176n56221L41064M18589r0878P39632R4967n52468
5906a459543j67090J56160P29913Q39508p70221j74576n98017l56834L29478l86313
5896a857535k32845L43469O22136L46753P8233n98497m86751k84569q14181m1275
5886b925062J220657O39334O02172N81054j151808r00131k3643p03952Q43997
5877a817382n6959K38220J67341l38663J085907J32197r36969q5394m66574o88036
5867b766312J85891N34036O46344k77840J21086N03529L68796m80103m71280r22346
5857b558199J49127N07177k67060Q4231M77878J3449P6837N82710m22451K42951
5847a113350p5142n72872L6362M0563L87510L36674J46681O0110j08186k09704
$$ y = [-1331865, -1253477, -1484052, -1854228, -2410449, -2069385, -1650796, -1741674, -1002042, -907075, -1459543, -1626633, -1470473, -740560, 98948, -671273, -845849, -1443866, -1800700, -1471222, -1857535, -2090380, -1746911, -1124775, -778022, -699789, -1298286, -1785037, -2069606, -2883787, -2925062, -1704405, -1065071, -462899, 118155, -1033653, -1933784, -1957427, -2661379, -1817382, -1874341, -1636121, -1468780, -1807443, -721536, -589339, -1526308, -1611702, -2078276, -2766312, -2580421, -2046385, -1400041, -1677881, -1556795, -1053266, -684470, -1164573, -1635853, -2558199, -2409072, -1901895, -2168955, -2084724, -1606846, -1593397, -1516560, -933850, -1356301, -1113350, -1188492, -1761364, -1725002, -1684439, -1296929, -960255, -813574, -753464, -861650, -1071354]
5837a071354J50131r13734q53297m87098L22668N78262N12471K76350L4833n64238
5827b015006n01511k61163j3612L57906L7352M93257M22814J56757m40760o91226
5817b455192M98165j96222J06081J1235K58921j82309N69087L31990j78898n3743
5807a290885r09306P33745k58377m27562o68518J86633P85681J65648M27389P70493
5797d85059L04800k10309N8347j041196p05156L63741R20878l3533r9704J86044
5787g41147k0815j00803l81583J29746l61524q7290j053187k2666J84998J116764
5777a337507K40225P41624n60204r92275j42830k87595K32870K71408K11085L22332
5767a300867n20458O88148l37674O7692L05282J6425P09026K53115q4036l32313
$$ y = [-1071354, -921223, -1834957, -2688254, -3175352, -2852684, -2274422, -1761951, -1485601, -1450768, -2015006, -2516517, -2777680, -2791292, -2433386, -2396034, -1902777, -1479963, -1323206, -1763966, -2455192, -1957027, -2153249, -2047168, -2035933, -1777012, -1959321, -1390234, -1058244, -1237142, -1290885, -2200191, -1466446, -1724823, -2152385, -2820903, -2634270, -1848589, -1682941, -1255552, -485059, -180259, -390568, -332221, -1373417, -2078573, -1714832, -793954, -827487, -927191, -741147, -761962, -862765, -1244348, -1114602, -1476126, -1563416, -2616603, -2639269, -2454271, -1337507, -1097282, -355658, -915862, -1908137, -2050967, -2338562, -2105692, -1834284, -1623199, -1300867, -1821325, -1133177, -1470851, -1403159, -1097877, -1081452, -372426, -119311, -203347, -535660]
5757e35660l93002q72266j52473N11993j52326N39237Q03353l95156O71842K3839
5747D9381l7762o29726R5337m84612L83546L00429p78058n55276O34388p9711
5737a102064M14745j82697r6980n4569k20568L96507k87920K37814J72178j022877
5727a746431k14741N00349N21917J260114j33565r08735o95546N75799N91067
5718b49772q6650O91479q29647p21757L49782K59392P6870j95154k91874R02630
5708i4701R52928K43803m15054n46961o4559p29584K78848P1631l91334N43912
5698a51071P43077L14771K78467m21564N17366r41892n44554j95349j17247P55273
5688B37277l99267j43848Q0219O13149Q92058o26054k24262R9383p80024J184601
$$ y = [-535660, -928662, -1800928, -1953401, -1441408, -1593734, -1054497, -251144, -646300, 25542, 49381, 11619, -618107, -522770, -1007382, -623836, -323407, -1101465, -1656741, -1022353, -1102064, -687319, -870016, -966996, -1021565, -1242133, -845626, -1133546, -895732, -723554, -1746431, -1961172, -1460823, -938906, 321208, 187643, -721092, -1416638, -840839, -249772, -336422, 355057, -474590, -1196347, -846565, -587173, -510303, -705457, -997331, -94701, 858227, 1102030, 686976, 140015, 75456, -654128, -375280, -303649, -694983, -151071, 592006, 906777, 1185244, 763680, 1281046, 339154, -205400, -400749, -517996, 237277, -161990, -305838, -225619, 387530, 1279588, 653534, 429272, 528655, -251369, 933232]
5678I33232Q94235r61094K50483L50108o02027J45456o88713R0679O25036O84268
5668A721663J86932k57673M04333L35168Q9287M87593O64148m9159j68179n21598
5658B892515r22992J89014o74811J81924J614617N76854k7691J37392O36045J04147
5648D707014J58057J03789K58213R025L09291K65252P9115k30356l76059J05414
5638E388755m11128L14252M87864R11517M57959K06651K93713L42650P17563O97173
5628I406969L61907L97822Q99344J308197K01993J220329P85583N11240J93649
5619A5287033r8496M17135p36843O83865m29673j267741n72610J64779o04552
5610A2842897j45886L25691K94000L40293j64960K02535q3184l7085N54380M10827
$$ y = [933232, 1827467, 866373, 1116856, 1466964, 864937, 1010393, 321680, 412359, 1037395, 1721663, 1908595, 1650922, 2055255, 2390423, 2479710, 2967303, 3631451, 3582292, 3414113, 2892515, 1969523, 2158537, 1483726, 1665650, 3280267, 3857121, 3829430, 3966822, 4602867, 4707014, 4865071, 4968860, 5227073, 5236098, 5545389, 5810641, 5889756, 5659400, 5283341, 5388755, 4977627, 5291879, 5779743, 6691260, 7149219, 7355870, 7649583, 7992233, 8709796, 9406969, 9768876, 10166698, 11066042, 12374239, 12576232, 13796561, 14582144, 15093384, 15287033, 15188537, 15605672, 14868829, 15552694, 15123021, 13855280, 13282670, 13447449, 12842897, 12697011, 13022702, 13316702, 13656995, 13492035, 13694570, 13611386, 13574301, 14128681, 14539508]
5600A4539508M75259M3088J798940J395627P44158J137863J457148J407557J516411
5591B4515559J500137N83567J577364P45145j47174N395j289943j697987r27836
5582B4864227q33561k776748j066006p03239j653895k5834L7161n24430r14967
5573A6402708k90762R8404j76045n57961R64130N80521m61809l75655J47624M49909
5563A6781064P22891Q11086J372269R36611l00099K61640J86502K51147j20139
5554B0902972m06992p98357j59316o88910j350627k010073N9856l71184j161528
5545A4015841j97726l06558n95519k24079L23402p09360q6450l45218r8710L37390
5535A2113013M74120L19772L950o0093O45254l06677R0306o11801j222596L05213
$$ y = [14539508, 15014767, 15057855, 16856795, 18252422, 18996580, 20134443, 21591591, 22999148, 24515559, 26015696, 26599263, 28176627, 28921772, 28774598, 28779993, 27490050, 25792063, 24864227, 24030666, 21253918, 20187912, 19484673, 17830778, 17804944, 17842105, 17317675, 16402708, 16111946, 16210350, 16034305, 15476344, 16440474, 17020995, 16559186, 16183531, 16331155, 16781064, 17503955, 18315041, 19687310, 20623921, 20323822, 20585462, 20771964, 21023111, 20902972, 20495980, 19697623, 19538307, 18849397, 17498770, 15488697, 15548553, 15177369, 14015841, 13818115, 13511557, 12916038, 12691959, 13015361, 12306001, 12219551, 11874333, 11775623, 12113013, 12587133, 12906905, 12910855, 12850762, 13496016, 13189339, 13279645, 12667844, 11445248, 11750461]
5525A1750461J55039l46232J135785R45389l8199j43403J53084l12255p72210
5516A2527459l68453m84370j93382o45478m84344L3958p23164l20169L89987J86577
5506I918621J11439l75567m07429l03492j21167n33424M73081O20568K98047P0652
5496I751329J10308R45230Q1767k81788Q38095Q01158L04484J168596P103R83940
5486A4710222J632856P91979j84148n59065j296116l90111j004471r17222j374490
5477A1409434p99393j088130j229335k35955m44108O35907l01285o59831M19972
5468G707276P5973m85703n77569J31934J38182j791780q87071J308926J097700
5459F717868m13938R25033M35473J70601J97482O05767O6352J130572R18635J43902
$$ y = [11750461, 11905500, 11559268, 12695053, 13640442, 13602243, 13458840, 13611924, 13299669, 12527459, 12159006, 11674636, 11481254, 10835776, 10351432, 10385390, 9662226, 9342057, 9732044, 9918621, 10030060, 9654493, 9247064, 8943572, 8822405, 8288981, 8762062, 9382630, 9680677, 9751329, 9861637, 10806867, 10888634, 10606846, 11444941, 12246099, 12550583, 13719179, 13726282, 14710222, 16343078, 17135057, 16950909, 16391844, 15095728, 14705617, 13701146, 12783924, 11409434, 10610041, 9521911, 8292576, 8056621, 7612513, 8248420, 7947135, 7287304, 7707276, 7783249, 7297546, 6719977, 6851911, 6990093, 5198313, 4311242, 5620168, 6717868, 6303930, 7228963, 7664436, 7835037, 8032519, 8638286, 8704638, 9835210, 10753845, 10897747]
5449A0897747q4835q53108j169091j191867j31892p81445n29866m89032J57528
5440E824139K04724q07677p51656P72360J38084j006159q14486k76565k00343
5431C082421K6254N3693j84281N43349Q74701J80806j29757k30409l20100q53719
5421C042958j034582N77076k33715p54556L50169J221204L82366L74323L41098
5412D266341l64999j161157l67513M81225j64670M1695M1473O2969M68374m79145
5402B824593p38715K12921j25643j61288L63741q17190m20127L59436n06881m86072
5392E04775o3198O25817O46938N4144l52404j163972P08578L94875p87289o7325
5382E00939Q75137J19599N90041l29378J80674J94158p88334K70770L53221m08451
$$ y = [10897747, 10812912, 9959804, 8790713, 7598846, 7466954, 6685509, 6155643, 5666611, 5824139, 6028863, 5221186, 4469530, 5241890, 5379974, 4373815, 3559329, 3282764, 3082421, 3108675, 3162368, 2978087, 3521436, 4396137, 4576943, 4447186, 4216777, 3896677, 3042958, 2008376, 2585452, 2351737, 1597181, 1947350, 3168554, 3550920, 3925243, 4266341, 3901342, 2740185, 2372672, 2853897, 2689227, 2730922, 2772395, 2835364, 3303738, 2824593, 2085878, 2298799, 2173156, 2011868, 2375609, 1558419, 1138292, 1497728, 990847, 504775, 441577, 1067394, 1714332, 1768476, 1416072, 252100, 960678, 1355553, 568264, 500939, 1376076, 1495675, 2085716, 1756338, 1937012, 2131170, 1342836, 1613606, 1966827, 1558376]
5372A558376p33044J31034j60840l79280J58714p0985n13548q34982L65331J297123
5362H17899N05217K03473j83021l97647o67276J52967K96188l67656k4228M07164
5352G43080O58166O0324k33764J58502q36599l71895k64556J8343L87604P67214
5342A086419n02229m72753k57638N36407J25061R0266l12102j37659j26936Q4860
5332A13696J17250K47273M93754M31805N89846N89465j105330n20970J90646l1210
5322A116225k60017k63424J53482n01040K84946K83813R13355j37776k35055l70761
5312I83748o99821j92670K06471m03979o32320L00379R7051L03499N3054O88936
5302G04348j88774J72370N35315o1834Q1854p09250m7082j72560L61833M97856
$$ y = [1558376, 825332, 956366, 795526, 416246, 574960, 503975, -9573, -844555, -479224, 817899, 1323116, 1526589, 1343568, 945921, 278645, 431612, 727800, 360144, 335916, 743080, 1401246, 1461570, 1227806, 1386308, 549709, 177814, -86742, -68399, 319205, 1086419, 584190, 111437, -146201, 390206, 515267, 605533, 293431, 155772, 28836, 113696, 230946, 478219, 971973, 1403778, 1993624, 2583089, 1477759, 956789, 1147435, 1116225, 856208, 592784, 746266, 245226, 530172, 813985, 1727340, 1589564, 1354509, 983748, 283927, 91257, 297728, -106251, -738571, -438192, -341141, -37642, 15412, 704348, 515574, 687944, 1223259, 1161425, 1243279, 534029, 486947, 314387, 676220, 1174076]
5292A174076q7962M79236Q94458o10866l38244j138566o38140L424j3255M60081
5282A84242M20173K05871n37880J1514M26393M07729j77559M3824K84024k27679
5272A040652N78315M51408k16420K91486o22389m92165O61001n5514k93377R3570
5262A436567L78984j15189l31821l20422j228624O12136L44060j07875N48757
5253A216573L72225k2428o24450p03055k36500J85973k14387O82129P05819M15597
5243A777496j59112n6393r73178o89085L46000O44130q9568j38993p2456N81716
5233A170557k66046q389J057573J6244O74726j07161j245753r51060l17858r0169
5223f7336L53088P49059M82311K19676K44518p78513L68418J26638q63684j232993
$$ y = [1174076, 1086114, 1565350, 2459808, 1848942, 1510698, 372132, -266008, -262584, -275839, 184242, 604415, 810286, 272406, 283920, 710313, 1118042, 940483, 984307, 1268331, 1040652, 1618967, 2070375, 1853955, 2145441, 1523052, 1030887, 1691888, 1636374, 1342997, 1436567, 1815551, 1700362, 1368541, 1048119, -180505, 431631, 775691, 667816, 1216573, 1588798, 1566370, 941920, 238865, 2365, 188338, -26049, 656080, 1361899, 1777496, 1618384, 1561991, 588813, -100272, 245728, 889858, 800290, 661297, 588841, 1170557, 904511, 896122, 1953695, 1969939, 2644665, 2537504, 1291751, 340691, 22833, -67336, 285752, 1034811, 1517122, 1736798, 1981316, 1202803, 1571221, 1697859, 834175, -398818]
5213c98818M09569Q81670j05243o89735N95741M17208M10071L10755j33014k7991
5203A670213L43719p10223l44520K73210p96576k65193k25378O74773K5814m55443
5193A90396l52133L88126L63146k58019J32822K53073m75825K33857K651O31639
5183A109733O14569O88672j473112o32328n93073L24691L46242P58988K41093
5174A385475J303507l54092q94763m33410q43177K07541J31004L52632J1342l43799
5164E22260n06780k73898N20252J092440k93491l49630O8415n5172o00574L31215
5154D55037j350272J19443J147438l42922q24193J118545j18735k55895Q65792
5145H14238R3485k33420R88294K48158O73543l06826M97635P72754p48854j418902
$$ y = [-398818, 10751, 892421, 787178, 97443, 693184, 1110392, 1520463, 1831218, 1698204, 1670213, 2013932, 1303709, 959189, 1232399, 435823, 170630, -54748, 620025, 645839, 190396, -161737, 226389, 589535, 331516, 464338, 717411, 241586, 475443, 478094, 1109733, 1724302, 2412974, 939862, 307534, -285539, 39152, 385394, 1144382, 1385475, 2688982, 2334890, 1440127, 1006717, 163540, 371081, 502085, 854717, 866059, 522260, 15480, -258418, 261834, 1354274, 1060783, 711153, 779568, 724396, 123822, 455037, -895235, -775792, 371646, 28724, -795469, 323076, 204341, -51554, 814238, 907723, 674303, 1662597, 1910755, 2584298, 2277472, 2775107, 3547861, 2799007, 1380105]
5135A380105r18112J42108o5952R6213N52310j76145k62308l84283j84817P37378
5125I16497j91128k1847K40119m18849j94156l38086L58030k0331L14892R20950
5115A566091L97781J46753K24909m01711l88064p0583j19963O34736k33260J51756
5105A908445J080638R5599j55445l59197K15695M2993k48209J1537K72226m77536
5095B386746K8997m82092m04188M23044R23386L61799K82644K35062o44247N65956
5085C677107k54350M9906L28530P0555J35337R96728R11759J250125O39626R70426
5075H775749J238430K61567M02310m156j35244K65119m84497k98312j402517j03927
5065H514522q50238j9476p39255o19391K60289k48339j446J96662j67682J080959
$$ y = [1380105, 461993, 604101, 538149, 634362, 1186672, 1010527, 748219, 363936, 179119, 916497, 725369, 703522, 943641, 524792, 330636, -7450, 350580, 330249, 645141, 1566091, 1963872, 2110625, 2335534, 1933823, 1545759, 1475176, 1355213, 1989949, 1756689, 1908445, 2989083, 3084682, 2929237, 2570040, 2785735, 2828728, 2580519, 2592056, 2864282, 2386746, 2415743, 1933651, 1529463, 1952507, 2875893, 3237692, 3520336, 3755398, 3111151, 3677107, 3422757, 3472663, 3801193, 3871748, 4007085, 5003813, 5915572, 7165697, 7805323, 8775749, 10014179, 10275746, 10678056, 10673900, 10538656, 10803775, 10319278, 10020966, 8618449, 8514522, 7664284, 7644808, 6905553, 6286162, 6546451, 6298112, 6296666, 6493328, 6325646, 7406605]
5055G406605O82683P72116J66308M3191j15966m83986n32050L68249j09317K09094
5045H406927J087460N31549Q85047J305528J743602J161443J513323J346549J347255
5036A9328683J162990J543061P43102L7293r38361j943225j563314j095603j326811
5027A5947815j126738o06278j773363j088228K87313k62019q3923n62582K83373
5018A1015370M04970n1569K53215N3336p64976r83754l5279J106927n7165K6035
5008A0967110M00079J275117J259205Q22218P9577J188035J492336J473992J865999
4999B0823668K960812K447797K718441K975677K580807K32612k473754l263197
4991B9002863l988771k914973k167474j817818o65039l05958n22167K3408K88512
$$ y = [7406605, 8089288, 8861404, 9027712, 9070903, 8954937, 8470951, 7938901, 8307150, 8197833, 8406927, 9494387, 10025936, 10910983, 12216511, 13960113, 15121556, 16634879, 17981428, 19328683, 20491673, 22034734, 22777836, 22815129, 21876768, 19933543, 18370229, 17274626, 15947815, 14821077, 14214799, 12441436, 11353208, 11640521, 11378502, 11294579, 10731997, 11015370, 11420340, 11368771, 11621986, 11675322, 10910346, 9926592, 9891313, 10998240, 10941075, 10967110, 11367189, 12642306, 13901511, 14723729, 14803306, 15991341, 17483677, 18957669, 20823668, 23784480, 26232277, 28950718, 31926395, 34507202, 34739814, 32266060, 29002863, 25014092, 22099119, 19931645, 18113827, 17448788, 17142830, 16620663, 16644071, 16932583]
4982A6932583N55840O23748n25411j5823j69055m98131l80027N43322Q77343P79455
4972A8723844R80535N40538M65108R82898J318016K137706K619791L898932M971990
4963C6639358N769424P136676P324201N363326J838945n107988r083588q475453
4955D1404901p118500k625763k289893j489141j219603o72315o88604k27408R18724
4946B5992398Q69244Q75686K71704K43776p19782k772890j699909m4827j80125
4937B2835275k63129N0884L08650J406161J342102K984056K570379L447777N529140
4928D0211295O007063P174700P198349L730636k511059p402745r274558o734584
4920C8399097m670052k673684k759192k395418j388147j231744l94960K07054
$$ y = [16932583, 17488423, 18112171, 17586760, 17570937, 17401882, 16903751, 16523724, 17067046, 17944389, 18723844, 19704379, 20244917, 20710025, 21692923, 23010939, 25148645, 27768436, 31667368, 36639358, 42408782, 49545458, 56869659, 62232985, 64071930, 58963942, 49880354, 41404901, 34286401, 31660638, 29370745, 27881604, 26662001, 25989686, 25301082, 25073674, 25992398, 26861642, 27737328, 28009032, 28252808, 27533026, 24760136, 23060227, 23015400, 22835275, 22572146, 22623030, 22931680, 24337841, 25679943, 28663999, 31234378, 34682155, 40211295, 46218358, 53393058, 60591407, 64322043, 61810984, 54408239, 45133681, 38399097, 33729045, 31055361, 28296169, 25900751, 24512604, 23280860, 22885900, 23092954]
4912B3092954R0756P26534M19671n40221j243570k475613k294916j824855o09809
4903A5340931j318757p70978Q27648j31977N39575Q70962q3727M62269O26989
4894A6362935J652077K370520K793623K695550J60074j718569l284167l345855
4886A7686188k337021j852103j015114l36025j12830o42112M73835l40607j035798
4877A0488413m21445m45767n79975q17312l35932q01138j139864m22920J39060
4868E663120M92527j316026n33493J7345J13384p945l78758n32639K60129K07090
4858C984734j36588J19210j27709M0148j52888K5595j060447j112938o59516Q33013
4848A752614J5663K71178K16599r84804N70M00533j76412l87278q5436M07832
$$ y = [23092954, 23183710, 23910244, 24329915, 23789694, 22546124, 20070511, 17775595, 15950740, 15340931, 14022174, 13251196, 14078844, 13946867, 14486442, 15357404, 15273677, 15735946, 16362935, 18015012, 20385532, 23179155, 25874705, 26034779, 24316210, 21032043, 17686188, 15349167, 13497064, 12481950, 12145925, 12033095, 11390983, 11864818, 11524211, 10488413, 10066968, 9621201, 9041226, 8223914, 7887982, 7086844, 5946980, 5524060, 5663120, 6155647, 4839621, 4306128, 4323473, 4436857, 4428912, 4050154, 3517515, 3777644, 3984734, 3848146, 3967356, 3839647, 3879795, 3726907, 3752502, 2692055, 1579117, 919601, 1752614, 1768277, 2039455, 2256054, 1271250, 1271820, 1672353, 1495941, 1108663, 1023227, 1431059]
4838A431059j61446J026120l72300r7642n90401l99027L16525L5294k35597m54617
4828D97968Q66790o678l06675J14756k81274q27270P26677K40985q96321M36360
4818E65318J24385M36552L87240q92078j48870K3517m885j48179k08131L30207
4808D65076R72759P69222n98406n31732l32640r68838j87605k82677Q4508L38009
4798b72324M43863j74494M86170K8406m39099P6177K92625p87260o50678Q2660
4788i13954M16973P30503J5498L64913L15932l74398M90305j463k37655m74797
4778C31857j275667k27293K75550J77205O56943M28350M49955l47862p73940J09919
4768a94983j00546J93469k88197N6619N8674J070978M23847j49629m46693m11178
$$ y = [1431059, 1269613, 2295733, 1923433, 1825791, 1235390, 836363, 1152888, 1188182, 952585, 497968, 1364758, 1358080, 1051405, 1166161, 884887, 57617, 784294, 1025279, 128958, 565318, 689703, 1126255, 1513495, 621417, 472547, 496064, 491179, 343000, 134869, 465076, 1437835, 2207057, 1608651, 1076919, 744279, -224559, -412164, -694841, -610333, -272324, 171539, -2955, 483215, 511621, 72522, 148699, 441324, -345936, -996614, -913954, -496981, 233522, 249020, 613933, 929865, 555467, 1045772, 1044309, 806654, 331857, -943810, -1171103, -895553, -718348, -61405, 366945, 816900, 469038, -304902, -194983, -295529, -102060, -390257, -333638, -274964, 796014, 1219861, 1070232, 623539, 212361]
4758B12361K10030R8197P91476K46743n56825n50083q28525k88364K42931J10665
4748c11394P13289P89619J10754M32717K93207j0034r13490j64676q16129m32983
4738c09120N28235Q52383L49375P90907M32091l2434n60481o82174m65106k85687
4728F17989n59n44359P80066J168173M55043L57544j62123L73340K14954l56810
4718B903258k56485k58862m36188M29288Q86311N51968K81671l9176N04545L50159
4708D916489L64211J46547n23538o93407r49602J49120Q12409Q92530K78416o60790
4698D732385n5225p00220q15351l05355K65339K7940K55337L820K39817n04733
4688C143754N08897L89410L70815j01952N57732K84871J59495J75954o37521l2835
$$ y = [212361, 422391, 520588, 1312064, 1558807, 1001982, 451899, -376626, -664990, -422059, -311394, 401895, 1191514, 1302268, 1734985, 2028192, 2018158, 1104668, 939992, 123863, -309120, 219115, 1071498, 1420873, 2211780, 2643871, 2611437, 2050956, 1368782, 903676, 617989, 617430, 73071, 853137, 2021310, 2476353, 2833897, 2671774, 3045114, 3260068, 2903258, 2646773, 2387911, 1951723, 2381011, 3267322, 3819290, 4100961, 4061785, 4566330, 4916489, 5280700, 5427247, 4903709, 4210302, 3260700, 3409820, 4222229, 5114759, 5393175, 4732385, 4677160, 3976940, 3161589, 2856234, 3121573, 3149513, 3404850, 3408670, 3648487, 3143754, 3652651, 4042061, 4412876, 4310924, 4868656, 5153527, 5313022, 5488976, 4851455, 4818620]
4678D818620j63995l23291M54377N30990k12145m14969L11816j38212q35799q70452
4668C156940l5493P6144K3631m7609N67566O21584m09334O48216J58927p95015
4658C965557J70574m32622P0954P10049l52992P08507L50972n5450q535Q15465
4648E942479Q38548r20866N41233r2744p75514o00486n19040j216439O55707J803
4638C854681P3989Q88584l71811M7479k86113j335254q00668O0889N95950L34455
4628C062181M63282J37139p65660R1344j96125l3018M3669J364429R27678K40522
4618E335441j562835j615486M8744L40725M2088O37005L91552Q9670Q02546j2542
4608D496908p35740q32322j073702k30686o96844l87790K94852P70801N59486
$$ y = [4818620, 4654625, 4331334, 4785711, 5316701, 5104556, 4689587, 5001403, 4863191, 4027392, 3156940, 3121447, 3197591, 3221222, 3173613, 3741179, 4362763, 3953429, 4601645, 4760572, 3965557, 4136131, 3703509, 3774463, 4484512, 4131520, 4840027, 5190999, 5135549, 5127014, 5942479, 6781027, 5860161, 6401394, 6308650, 5533136, 4932650, 4413610, 3197171, 3852878, 3854681, 3928670, 4817254, 4445443, 4492922, 4206809, 2871555, 2070887, 2131776, 2727726, 3062181, 3525463, 3662602, 2896942, 2988286, 2792161, 2759143, 2802812, 4167241, 5094919, 5335441, 3772606, 2157120, 2205864, 2546589, 2588677, 3225682, 3617234, 3706904, 4509450, 4496908, 3761168, 2928846, 1855144, 1624458, 927614, 539824, 834676, 1605477, 2164963]
4599B164963J79834r7934J44194J74365N3069n56869k77022k43569P68601m24140
$$ y = [2164963, 2344797, 2246863, 2391057, 2565422, 2618491, 2061622, 1784600, 1541031, 2309632, 1885492]
$$ [...]
##END NTUPLES=NMR SPECTRUM
##END=
