##TITLE=1H_CG-1139-2
 CDCl3, 8 sc, 
 23.12.2020
##JCAMPDX= 6.0         $$ Bruker NMR JCAMP-DX V2.0
##DATA TYPE= NMR SPECTRUM
##DATA CLASS= NTUPLES
##ORIGIN= UXNMR, Bruker Analytische Messtechnik GmbH
##OWNER= root
$$ XWIN-NMR		Version 3.5
$$ Wed Dec 23 11:20:27 2020 Russian Standard Time (UT+4h)  she@DPX200
##.OBSERVE FREQUENCY= 200.1315066352
##.OBSERVE NUCLEUS= ^1H
##.ACQUISITION MODE= SIMULTANEOUS
##.ACQUISITION SCHEME= undefined
##.AVERAGES= 8
##.DIGITISER RES= 18
##SPECTROMETER/DATA SYSTEM= spect
##.PULSE SEQUENCE= zg30
##.SOLVENT NAME= CDCl3
##.SHIFT REFERENCE= (INTERNAL, CDCl3, 0, 15.9802)
##AUDIT TRAIL= $$ (NUMBER, WHEN, WHO, WHERE, WHAT)
$$ ##TITLE= Audit trail, XWIN-NMR		Version 3.5
$$ ##JCAMPDX= 5.01
$$ ##ORIGIN= Bruker BioSpin GmbH
$$ ##OWNER= she
$$ F:/spectra/data/she/nmr/H-F/1/pdata/1/auditp.txt
$$ ##AUDIT TRAIL=  $$ (NUMBER, WHEN, WHO, WHERE, WHAT)
(   1,<2020-12-23 11:18:55.25 +0400>,<she>,<DPX200>,
      <created by zg, POWCHK disabled, PULCHK disabled
       configuration hash MD5:
       00 E9 B6 7A A2 85 ED C7 34 08 36 98 17 FE 4E 26
       data hash MD5: 16K
       D2 C7 D7 5E 9C 5C 9D 81 F5 02 DA 44 28 8F 3F DE>)
(   2,<2020-12-23 11:18:58.10 +0400>,<she>,<DPX200>,
      <Start of raw data processing
       efp BC_mod = 2 LB = 0.24 FT_mod = 6 PKNL = 1 PHC0 = -10765.15 PHC1 = 11.20095 SI = 16K 
       data hash MD5: 16K
       38 CB 64 74 86 48 15 99 66 AA 36 41 DB 70 90 DC>)
(   3,<2020-12-23 11:19:20.67 +0400>,<she>,<DPX200>,
      <pk PHC0 = 4.64431 PHC1 = -2.8 
       data hash MD5: 16K
       08 D3 15 4D F0 EE 99 2E 3C 37 42 03 9E 3F DD 9C>)
(   4,<2020-12-23 11:19:24.15 +0400>,<she>,<DPX200>,
      <abs ABSG = 5 
       data hash MD5: 16K
       65 F6 2C 6E 14 71 4E 54 CC BB E2 C9 F1 77 C8 9B>)
$$ ##END=
$$ 
$$ hash MD5
$$ 85 4A 71 DD ED 9E 93 C2 48 BB 00 6E 73 95 2E 5E
##$RELAX= 
##$RELAX= 
##$RELAX= 
##$RELAX= 
##$RELAX= 
##$RELAX= 
$$ Bruker specific parameters
$$ --------------------------
##$DU= <F:/spectra>
##$EXPNO= 1
##$NAME= <H-F>
##$PROCNO= 1
##$TYPE= <nmr>
##$USER= <she>
##$AMP= (0..31)
100 100 100 100 100 100 100 100 100 100 100 100 100 100 100 100 100 100 
100 100 100 100 100 100 100 100 100 100 100 100 100 100 
##$AQSEQ= 0
##$AQ_mod= 1
##$AUNM= <au_zg>
##$AUTOPOS= <>
##$BF1= 200.13
##$BF2= 200.13
##$BF3= 200.13
##$BF4= 200.13
##$BF5= 200.13
##$BF6= 200.13
##$BF7= 200.13
##$BF8= 200.13
##$BYTORDA= 1
##$CFDGTYP= 0
##$CFRGTYP= 5
##$CHEMSTR= <none>
##$CNST= (0..31)
1 1 145 1 1 1 1 1 1 1 1 1 1 1 1 1 1 1 1 1 1 1 1 1 1 1 1 1 1 1 1 1 
##$CPDPRG= <>
##$CPDPRG1= <>
##$CPDPRG2= <>
##$CPDPRG3= <>
##$CPDPRG4= <mlev>
##$CPDPRG5= <mlev>
##$CPDPRG6= <mlev>
##$CPDPRG7= <mlev>
##$CPDPRG8= <mlev>
##$CPDPRGB= <>
##$CPDPRGT= <>
##$D= (0..31)
0 1.2 0 0 0 0 0 0 0 0.06 0 0.03 0 0 0 0 0.0002 0 0 0 0 0 0 0 0 0 0 0 0 
0 0 0 
##$DATE= 1608707934
##$DBL= (0..7)
120 120 120 120 120 120 120 120 
##$DBP= (0..7)
150 150 150 150 150 150 150 150 
##$DBP07= 0
##$DBPNAM0= <>
##$DBPNAM1= <>
##$DBPNAM2= <>
##$DBPNAM3= <>
##$DBPNAM4= <>
$$ [...]
##$SUBNAM3= <"">
##$SUBNAM4= <"">
##$SUBNAM5= <"">
##$SUBNAM6= <"">
##$SUBNAM7= <"">
##$SUBNAM8= <"">
##$SUBNAM9= <"">
##$SW= 16.9725356469052
##$SWIBOX= (0..15)
0 0 2 0 0 0 0 0 0 0 0 0 0 0 0 0 
##$SW_h= 3396.73913043478
##$TD= 16384
##$TD0= 1
##$TE= 0
##$TE2= 300
##$TE3= 300
##$TEG= 300
##$TL= (0..7)
0 120 120 120 120 120 120 120 
##$TP= (0..7)
150 150 150 150 150 150 150 150 
##$TP07= 0
##$TPNAME0= <>
##$TPNAME1= <>
##$TPNAME2= <>
##$TPNAME3= <>
##$TPNAME4= <>
##$TPNAME5= <>
##$TPNAME6= <>
##$TPNAME7= <>
##$TPOAL= (0..7)
0.5 0.5 0.5 0.5 0.5 0.5 0.5 0.5 
##$TPOFFS= (0..7)
0 0 0 0 0 0 0 0 
##$TUNHIN= 0
##$TUNHOUT= 0
##$TUNXOUT= 0
##$USERA1= <user>
##$USERA2= <user>
##$USERA3= <user>
##$USERA4= <user>
##$USERA5= <user>
##$V9= 5
##$VALIST= <valist>
##$VCLIST= <CCCCCCCCCCCCCCC>
##$VD= 0
##$VDLIST= <DDDDDDDDDDDDDDD>
##$VPLIST= <PPPPPPPPPPPPPPP>
##$VTLIST= <TTTTTTTTTTTTTTT>
##$WBST= 1024
##$WBSW= 4
##$XGAIN= (0..3)
0 0 0 0 
##$XL= 0
##$YL= 0
##$YMAX_a= 106580
##$YMIN_a= -44349
##$ZGOPTNS= <>
##$ZL1= 120
##$ZL2= 120
##$ZL3= 120
##$ZL4= 120
##$ABSF1= 15.98542
##$ABSF2= -0.9872417
##$ABSG= 5
##$ABSL= 3
##$ALPHA= 0
##$AQORDER= 0
##$ASSFAC= 0
##$ASSFACI= 0
##$ASSFACX= 0
##$ASSWID= 0
##$AUNMP= <proc_1d>
##$AZFE= 0.1
##$AZFW= 0.1
##$BCFW= 0
##$BC_mod= 2
##$BYTORDP= 0
##$COROFFS= 0
##$CY= -3
##$DATMOD= 1
##$DC= 0
##$DFILT= <>
##$DTYPP= 0
##$F1P= 0
##$F2P= 0
##$FCOR= 1
##$FTSIZE= 16384
##$FT_mod= 6
##$GAMMA= 0
##$GB= 0
##$INTBC= 1
##$INTSCL= 2.992141e-10
##$ISEN= 128
##$LB= 0.24
##$LEV0= 0
##$LPBIN= 0
##$MAXI= 10000
##$MC2= 0
##$MEAN= 0
##$ME_mod= 0
##$MI= 1.114404
##$NCOEF= 0
##$NC_proc= -9
##$NLEV= 6
##$NOISF1= 3.799351
##$NOISF2= 2.8
##$NSP= 0
##$NTH_PI= 0
##$NZP= 0
##$OFFSET= 15.98024
##$PC= 1
##$PHC0= -10760.51
##$PHC1= 8.400949
##$PH_mod= 1
##$PKNL= yes
##$PPARMOD= 0
##$PSCAL= 0
##$PSIGN= 0
##$REVERSE= no
##$SF= 200.130006879096
##$SI= 16384
##$SIGF1= 3
##$SIGF2= 2
##$SINO= 5.538805
##$SIOLD= 16384
##$SREGLST= <1H.CDCl3>
##$SSB= 0
##$STSI= 16384
##$STSR= 0
##$SW_p= 3396.73913043478
##$SYMM= 0
##$S_DEV= 0
##$TDeff= 16384
##$TDoff= 0
##$TI= <>
##$TILT= no
##$TM1= 0
##$TM2= 0
##$TOPLEV= 0
##$USERP1= <user>
##$USERP2= <user>
##$USERP3= <user>
##$USERP4= <user>
##$USERP5= <user>
##$WDW= 1
##$XDIM= 16384
##$YMAX_p= 477515327
##$YMIN_p= -4154990
$$ End of Bruker specific parameters
$$ ---------------------------------
##NTUPLES= NMR SPECTRUM
##VAR_NAME=  FREQUENCY,     SPECTRUM/REAL,   SPECTRUM/IMAG
##SYMBOL=    X,             R,               I
##VAR_TYPE=  INDEPENDENT,   DEPENDENT,       DEPENDENT
##VAR_FORM=  AFFN,          ASDF,            ASDF
##VAR_DIM=   16384,         16384,           16384
##UNITS=     HZ,            ARBITRARY UNITS, ARBITRARY UNITS
##FACTOR=    0.207333158178281, 1,           1
##FIRST=     3198.12551474528, 0,            0
##LAST=      -198.613615689502, 0,           0
##MIN=       -198.613615689502, -4154990,    0
##MAX=       3198.12551474528, 477515327,    0
$$ Real data points
##PAGE= N=1
##DATA TABLE= (X++(R..R)), XYDATA
$$ [...]
5844 -857258 -621999 -1301098 -1028252 -1009403 -1152980 -1660444 -1200088 -1037188 -978791 -1112696
5834 -1112696 -844230 -1338739 -1551978 -1193119 -883041 -491788 -2297789 -2164948 -1152499
5825 -1152499 -247374 -874094 -1271921 -649898 -979053 -1020648 -760758 -715860 -298853 -898783
5815 -898783 -1466277 -1401099 -1346870 -1350160 -816342 -948321 -1282527 -1489802 -2216457 -1174511
5805 -1174511 -182968 -850246 -1295279 -784559 -347186 -599808 -1517927 -1376544 -614635 -676027
5795 -676027 -1822410 -2068337 -1090354 -135657 -781659 -1490432 -1219923 -698626 -771514 -486332
5785 -486332 -485017 -43389 -538374 -1460315 -782249 -475669 -235794 150244 369405 -255181
5775 -255181 -435763 -772027 -439282 -767380 -654317 -1068249 -517568 416016 -326993 -623126
5765 -623126 277219 813318 130493 -821460 -501895 79561 -226697 -1209770 -1188806 -155666
5755 -155666 162967 197116 -534308 -246044 -163655 -602487 -433658 -828727 -291987 -600033
5745 -600033 -463615 -658127 536 547262 1044111 1142317 378716 71026 929615 658926
5735 658926 455165 445684 789046 975870 510925 350025 536678 1179047 881468 -556713
5725 -556713 23371 1771633 1993104 1340865 1665755 1888815 1959295 2444371 2212230 2798500
5715 2798500 2441995 2288800 2270167 2816375 3726314 3182601 2991315 2934904 4134600 4635840
5705 4635840 4276118 3476815 3534233 4641965 4426027 4144281 4702865 5486319 5776979 5100827
5695 5100827 4613741 5170295 5234492 4440744 4239028 4864650 5633288 5519790 5127946 5656362
5685 5656362 5964010 6157608 5297956 5394729 6205251 7260463 7217604 6530269 6637792 7735931
5675 7735931 7604271 7871464 8067906 8400781 9112071 9966936 9530436 10321092 10308391 11244898
5665 11244898 11369317 10997849 12136183 12431808 12933973 13630988 13649210 15131035 15674050
5656 15674050 14933590 15617006 16519800 17541844 17171005 16970743 18569333 19652679 20632137
5647 20632137 21185203 21483325 21793815 21806811 21249309 21135869 20503655 19812813 20594889 19753069
5637 19753069 19286808 18660029 17536353 18030031 19292116 19605366 19886302 19399433 20219646
5628 20219646 21104925 21620207 22324363 22647821 23060876 23081951 23572772 24892920 26324144
5619 26324144 27653461 28649115 29927412 31536269 32989671 33553746 34194490 34002407 33167205
5610 33167205 31478538 29785120 28065996 25836408 24435680 22607445 21470435 20212928
5602 20212928 18922983 18254070 17885480 17766826 16959282 16583525 16784753 16254723 15660804
5593 15660804 15577837 16035150 16102602 15854862 16922381 17945143 17855692 17654354 18901278
5584 18901278 19914750 19862986 20112261 20451688 21436572 21452380 19991702 19773524 19639650
5575 19639650 18395653 16779669 17058930 16048320 15470627 14912476 14809473 14284732 13619787
5566 13619787 13380670 12032611 12516755 12570936 10996513 10087562 10710009 12054130 11368625
5557 11368625 10826120 10645011 10545537 10748194 9921675 10213797 10028421 10646566 11308944 11287230
5547 11287230 11241804 11899428 13331730 12878208 11901998 12703314 13185832 13378191 12567761
5538 12567761 12546722 13265706 13680792 13046967 12356866 11974607 12401536 12412282 12293094 11774243
5528 11774243 11814244 11910899 10917542 10124513 9320005 8881142 9048817 8682459 8094824 8332467
5518 8332467 8274541 7721324 7687142 8416479 8215366 7846004 7067954 7864772 9197637 9980072
5508 9980072 9815999 8513260 8292838 9090834 10045667 9281961 8989435 9673989 9925662
5499 9925662 9807610 9809894 10885126 10754089 10851660 11020544 11100704 11238900 10132410 8891567
5489 8891567 8678108 9167373 8602423 6641650 6359119 6329098 6260010 5549427 4308541 5365353
5479 5365353 5857515 5013810 4504430 4526417 4776067 5094972 4380379 4389387 3761228 3294637
5469 3294637 4434866 4264561 4175688 3706712 4590286 4253616 3426828 3948536 5494137
5460 5494137 6448246 5309094 5009076 5663380 5696685 4434638 3730317 4392213 4318835 3299255
5450 3299255 3134212 3208306 4014473 2955928 1502046 1732068 2806635 2763037 1699883
5441 1699883 1620038 2876204 3774929 3102589 2755106 2831797 3810519 2822810 2595405 3099188
5431 3099188 3344804 3852028 3729819 4306381 4202805 3391692 3043635 3074375 2959061 2345823
5421 2345823 2101976 2824075 2958601 2811751 2942361 3967217 3759936 3209402 2730875
5412 2730875 2907098 3089485 3163791 2879595 2794814 2618341 2907291 2765825 2581709 3019656
5402 3019656 2963225 2379190 3152202 3770237 2783259 2427554 2622565 3579704 2662760 1597728
5392 1597728 2094748 1981861 1560317 1563125 992445 1437420 1247287 1410534 1005918 1270143
5382 1270143 1327105 1394084 808645 625521 1352627 621048 1101568 456319 452438 935851
5372 935851 1358558 1514681 916639 1134339 2044512 1308129 1109004 852980 1788265 1912625
5362 1912625 932055 1538841 2018579 3084293 2266193 1562870 703477 552115 677333
5353 677333 618606 797993 1558774 2008483 2039495 1011608 1137353 1225760 678327 1195330
5343 1195330 1328349 1190178 490528 -185123 421218 597394 684595 1194945 1343885 1904960
5333 1904960 1122767 1155400 796753 -37928 -217070 -294268 -655371 522680 1013726 445179
5323 445179 -58172 535944 368197 400843 56429 670145 1416926 491945 954631 349285
5313 349285 421031 1253748 821147 1020491 890859 834707 964295 902004 1471945 1263033
5303 1263033 -133404 234244 262504 578440 -48436 -662025 66442 382516 -587606 -1226243
5293 -1226243 -543767 208175 560804 -249944 -94882 771583 908165 -50911 -851201 -189453
5283 -189453 703217 471495 -233029 -162310 481575 335373 190741 -1028872 -995296 -1173325
5273 -1173325 -776426 -670989 -814881 -499038 -20092 -331329 -974613 -710652 98403 -557662
5263 -557662 -1550811 -1379638 -742109 -296005 -1338974 -1035297 -509882 -50906 504032 -265350
5253 -265350 -937453 -106828 424139 -449541 217450 357445 -584746 -306661 358487 614751
5243 614751 79797 -53757 537136 46497 147111 -92405 -690012 -578974 -703833 -1863333
5233 -1863333 -1166196 -1536759 -795914 147237 -1276675 -758436 -197283 417778 -396687
5224 -396687 -1720225 -818201 630995 452678 -813156 -824879 -580179 518256 -498150
5215 -498150 -1874007 -1093472 -90507 -90064 -756387 -983813 -332477 6293 -304734 -398834
5205 -398834 -302569 -313877 -162087 -993164 -1796467 -926695 -18378 230416 -162038 -723886
5195 -723886 15901 34135 24291 -322024 -1086497 -624379 8997 13894 -1268502 270301
5185 270301 933792 -256692 -1085794 -824303 -486701 154545 -405475 -1618175 -1622314 -1491578
5175 -1491578 -1695901 -1386971 -1474851 -1234363 -690251 -926833 -1526682 -1379809 -1277373 -449254
5165 -449254 -1086613 -1417335 -1198474 -1063890 -641570 -248627 -36133 -385278 -491885 -777319
5155 -777319 -1425535 -783465 15754 -1037901 -1333413 -803140 -849067 -979637 -591446 45275
5145 45275 -511254 -671400 -1120291 -174475 391444 426155 -377193 -430303 135111 429302
5135 429302 335651 -116578 110789 1246886 338875 -680925 79946 199649 855191 141049
5125 141049 203261 504782 81804 1266614 89652 -883904 449516 915564 383548
5116 383548 -63673 -597476 -540106 -801887 -1152223 -708040 -324393 -405085 -1116974 -1363579
5106 -1363579 -1552164 -365909 -7407 39265 -566003 -537139 278787 410827 -268255 -142399
5096 -142399 -300012 296549 -296245 -913872 -771474 18943 -32740 -477098 -815108 -339867
5086 -339867 -550837 -71678 37299 -411426 296608 416693 602450 748770 -108451 -275622
5076 -275622 308946 411358 -268991 -938818 -575135 138278 487392 -200065 -1141 354157
5066 354157 450129 486151 140837 -3854 881420 1091792 694198 -171623 -630625 -54571
5056 -54571 310793 172162 223026 11270 25971 749305 -6523 196978 -29077 254710
5046 254710 -8411 -385305 206806 436663 644290 527678 56141 -96193 247013 909524
5036 909524 1113684 1126034 923822 1979014 2266369 2084981 2309104 2419974 3187789 3024219
5026 3024219 1926889 1702348 2322589 2201037 2614530 2396724 3225607 3420388 3824275
5017 3824275 3368836 3370097 4555200 4242232 3470726 3803840 4486272 5378790 5398307 4934179
5007 4934179 4750067 4614530 5739706 6506133 6764031 7211281 8594005 10268351 10263385
4998 10263385 11099068 12299910 14137158 16064966 17422803 19486724 21054901 21314964
4990 21314964 19786045 16950451 15094081 14000535 12457311 11847480 10888925 10464877 11494187
4981 11494187 11951576 11432611 11375539 11689052 12918321 12733815 12218988 12144031 12298796 12793149
4971 12793149 13079518 14296701 15961101 17982028 18610188 19561836 21992621 24494042 28479191
4962 28479191 32669792 36766232 42381883 47141294 50927272 53321800 51298921 44410708
4954 44410708 37360169 31310042 27881231 25609423 23274032 21031114 20790382 20144501
4946 20144501 19245204 18116415 18813097 20360832 19919481 18702791 18839170 18795173 17875668
4937 17875668 17124616 17815859 18121705 18175409 19426642 21405646 23715834 25025961 28591517
4928 28591517 32387998 38090956 42986417 46574998 51231191 55470354 54227244 47719720
4920 47719720 39440619 33047288 29326460 25097660 22334075 20813786 19673057 18500110
4912 18500110 17135054 17066369 17658391 17519433 16534009 15522173 14697436 14006861 12836361
4903 12836361 11517432 11674196 11689774 11856565 11434432 10642765 11679337 12838265 13339024
4894 13339024 13474027 15369604 17812999 19230627 20211552 21180502 22374220 21706130 18430774
4885 18430774 15857339 13899772 11984795 9893409 8489620 8336705 8079757 7518030 6885552
4876 6885552 6953225 7638439 7555720 6101945 5667340 5733770 4633188 3363670 3793151 4365786
4866 4365786 4050211 2829657 2099037 2114087 2503331 1964692 1204910 3364441 3884350
4857 3884350 3347260 2566128 3372185 3347640 2290688 1574445 2194173 3202351 2651406
4848 2651406 1476514 1429369 2048372 2060726 897774 345647 1636105 1356800 47463
4839 47463 91638 809197 1080589 1160490 707289 444093 1331703 286617 -237885 583661
4829 583661 1052257 947794 78649 -222656 54284 531793 -219102 -788728 -592513 -217790
4819 -217790 301928 248240 1118369 1628202 949603 -125547 712589 1784846 1101684 86991
4809 86991 426244 247937 160681 -223456 -1158604 -728936 -253744 174780 -556313 -840242
4799 -840242 479843 1336680 -553041 -1108165 -426410 890372 950018 -279201 -808409
4790 -808409 411688 1139859 1094110 -568152 464854 1382384 782905 1145 -549768
4781 -549768 456373 866448 472107 -142179 589486 2086256 1244529 355935 285427 353375
4771 353375 832240 191484 -324524 345417 1102669 1330674 329148 -8747 -136951 357780
4761 357780 353414 -149350 -958188 -179500 1147477 251849 -828725 -410098 416965 -217419
4751 -217419 -465412 -897162 -583085 -166097 81147 114670 470821 632921 797250 -106587
4741 -106587 177501 671039 494698 206470 208488 606132 1560985 834857 -228688 -364950
4731 -364950 269052 875318 210476 151474 1885531 1236923 390806 768594 1597039 2099884
4721 2099884 1710729 1719406 2496883 2646552 2161528 1733988 1527595 1458747 1211852 1507478
4711 1507478 2038325 2340077 1543205 1987739 2242498 2627425 2231647 1551329 2007373 2201808
4701 2201808 1741228 1334637 1713144 3218284 3077471 2622310 2642760 3222170 2948275 2830051
4691 2830051 2785740 3764361 5091365 4797377 4237267 4539753 4972042 5244101 3967875
4682 3967875 4519200 5436387 5021593 3691074 2432819 3204829 3920908 3802733 2411478
4673 2411478 2137017 2408723 2302360 2166008 2001799 1939082 3134996 2890436 1907816 1777975
4663 1777975 1934099 1744293 2151481 1637561 2009680 3028189 3296832 3443762 4396765
4654 4396765 5482305 6270827 5034969 4364169 4533886 3377215 3102564 2405232 1895526
4645 1895526 2092237 1644343 1712829 1664480 1790434 2066194 1736869 1804597 2335405 2662957
4635 2662957 2220420 2428506 2550668 1638343 1577901 1145144 1730276 2611126 2501480 3652403
4625 3652403 4169815 4307737 4141529 3062573 3049964 2827260 1733973 1428423 910966
4616 910966 881749 1634845 1419023 1402706 1437973 1601905 1248392 476410 1269890 2024512
4606 2024512 1596266 1151684 797109 698461 1034704 190886 357237 718697 792629 778957
4596 778957 362659 234227 304432 487153 -230212 207684 -151140 -529582 -850716 -472174
4586 -472174 -367692 -557551 -712301 -873434 -1092361 -710521 286212 202920 94683 -209051
4576 -209051 785 296864 -31582 -656486 427140 194234 782200 810339 942716 864216
4566 864216 751559 -247506 -494370 662681 819622 242336 311358 1173742 1915363 1289201
4556 1289201 491881 472198 1619 583433 1173592 1116395 221792 185590 1133841 1224641
4546 1224641 99556 -495145 802539 768815 -22824 4662 177775 1964393 1671358
4537 1671358 221460 351004 1054070 1137782 439825 -764183 -152190 1114419 -91424
4528 -91424 -460949 -68046 541506 459999 -675150 -69553 1961045 1395013 791587 -15264
4518 -15264 509947 679018 -197776 221709 663383 766565 835337 656584 1389634 1140053
4508 1140053 651520 810058 1213751 1083475 759547 415742 -178283 530810 604923 1140611
4498 1140611 790487 1068428 876009 512651 -22445 618694 488784 116039 -810430 -1077181
4488 -1077181 -572333 -348362 -85461 -352721 -1024056 -633120 -310701 -512345 -651682 -416113
4478 -416113 -114732 -156415 -1035459 -1767983 -1072490 -471359 -589456 -1116596 -1211439 -1044579
4468 -1044579 -1273843 -659458 -932775 -519232 -711495 -417849 -738379 -1042961 -539265 -327271
4458 -327271 -1296044 -1781193 -471882 508310 929757 -645009 -600763 530830 778882
4449 778882 82405 -586984 -805410 648467 1575870 338769 -768661 213181 1147742
4440 1147742 1291668 155116 845890 2662680 2529323 1393552 482248 904067 2645352
4431 2645352 2439494 1175099 1427157 3040544 3120086 1756405 2520710 3040369 4225817
4422 4225817 3702828 2495244 1993858 1779851 2451419 2957493 2400183 2026654 2668969
4413 2668969 3092583 2128433 953284 1940199 2221698 2418216 2216714 2252074 2034809 3215981
4403 3215981 3370382 2345428 2391525 3660731 4520298 4280759 3546630 4828057 6723538
4394 6723538 6361999 5459979 5607442 5740354 5317651 4295320 2775752 2591784 3237946
4385 3237946 3037411 2360927 2015465 2366744 3147599 3165063 2714451 2734792 3054034 2593701
4375 2593701 1832787 2142344 1812265 1965784 2093991 2946645 3644366 4209900 4080289 4045892
4365 4045892 3952512 4252135 5584726 5629397 5736302 6067329 6124953 6311991 5923527 5414537
4355 5414537 6364432 6893221 7613856 6746943 5993217 6435308 7324077 6256627 6587630
4346 6587630 7227587 7443944 6706243 5674559 5800496 6071153 6349670 6450259 6490421 6019775
4336 6019775 6473355 6547481 6528890 6871408 6985272 7037252 6392524 7813852 8925837 9165384
4326 9165384 9514873 10412779 11258052 11193868 11994682 13195660 14121386 14659072 14567098 13671769
4316 13671769 13772794 14685505 13985275 13043233 11953677 11412903 11797838 11123939 10084468
4307 10084468 9609876 9469547 10032521 9573635 9399848 10697672 11031495 10755592 10026569
4298 10026569 9879544 10470889 10474024 10414365 11452322 12863724 13211976 13948641 14581120 14775376
4288 14775376 16120479 17658160 18888311 19200493 18862636 19587876 19947973 19811762 19104805
4279 19104805 17397345 17393480 16625414 15123356 13936488 13228259 13634222 13954280 12120094
4270 12120094 11485084 12680858 13228707 12421752 11392173 11131896 12242565 12098500 11270311
4261 11270311 11562274 12442953 13491791 12790184 12816656 14936678 16045386 16449454 16128647
4252 16128647 16504519 18968052 20356953 20790838 20713504 20751689 21061379 19129850 16639673
4243 16639673 15852847 16062595 15583287 14794327 14897068 14166271 13533826 12824315 11810844
4234 11810844 11737992 11944413 12642199 11831248 11575067 12044579 12058066 12043369 11697889 12511516
4224 12511516 12245751 12185613 11756170 13159691 13632625 13775980 15032057 15884480 16868120
4215 16868120 17283253 17878154 17867166 18058780 17388439 16014128 15699269 15066382 13928033
4206 13928033 12740375 11969539 11392938 10759734 10956889 10447265 9761471 9496884 8900915
4197 8900915 8371302 8727567 8287009 7891218 7684404 7570956 7863043 8276621 8645639 8029082
4187 8029082 8475307 8893333 9696375 9584764 9437628 9809266 9217419 10074746 10686000 10946080
4177 10946080 11517689 10708182 9887048 9553624 9779193 9887075 9175334 9092061 9483215 8561642
4167 8561642 7851897 8028159 8140565 7502683 6857308 6117056 6213120 7291351 6768348 6638660
4157 6638660 6382406 6687581 6557690 5693144 6144879 6487569 6073332 7021586 7484952 8107352
4147 8107352 7257182 7211370 8044496 7563085 7153994 7343076 7185541 7117992 7042800 6923137
4137 6923137 7371053 7448225 7360050 7213996 6817170 6729511 7706880 7510557 7565776 7390594
4127 7390594 7217370 7648150 6761210 6145390 5718009 6463352 6654011 6680536 7159923 6710441
4117 6710441 6738387 6776149 6611280 6351580 6974388 7100963 6601446 7654818 7755292 7363248
4107 7363248 6877682 6208504 7362439 7491249 7211387 6803864 6812558 7438019 7286111 7708260
4097 7708260 7609826 7048840 7918663 7758779 7554535 8149173 7586959 7377264 8506186 8362328
4087 8362328 8939347 9047947 9334296 9755046 9785888 9623312 10725858 11813873 11669023
4078 11669023 11125559 11488468 13114821 12983139 12576831 13914864 13332324 14187872 15888286
4069 15888286 15420549 16834682 17826050 18764506 19117304 18703339 19026757 19221391 19227437 19452103
4059 19452103 19265856 19550670 21025055 21361047 20951790 20921739 21914711 23515632 24075539
4050 24075539 24280331 25513781 27815864 28692894 28908542 29510607 31648737 34307865 35336501
4041 35336501 34767816 35403860 37765794 40096806 41181479 41261949 42520384 43889204 44420671
4032 44420671 43919563 44264516 45330340 44798898 44247972 41618189 40410589 40312695 39471454
4023 39471454 37536009 35668013 37127694 38686853 38112814 37893907 39507367 41656244
4015 41656244 43171241 43535425 45152912 49293077 51912240 53999520 57297340 59884506
4007 59884506 63560827 64842360 64457824 64570079 64628563 63602780 61575660 60197789 58521344
3998 58521344 56940552 56193083 54811819 53406708 51174144 49237863 46673628 44373120
3990 44373120 41635532 39691360 39236271 37507020 36876542 36299018 37070227 37283418 36330643
3981 36330643 36729775 38277286 39165316 40864974 42904847 43798797 45242732 47400792 48621109
3972 48621109 49756639 50729114 49494375 47491512 44917510 42885044 40511997 37414642
3964 37414642 35154114 33236691 31752783 30966033 28312376 26941627 25768191 25215958
3956 25215958 23510915 21481739 20655581 20362489 20531412 18851068 18090020 17937378 18955909
3947 18955909 18573035 17865152 17731572 18161621 18238344 17319812 16585764 16783119 17697404 17927152
3937 17927152 17350968 17773905 17497269 17875785 17127289 16611212 15397389 14896969 14244538
3928 14244538 12552971 11709159 10255553 10331801 10390448 9519219 9375092 9211606 8775834
3919 8775834 8280430 8221344 9155871 9199247 9670602 9800666 8835205 8568706 9359742 8773738
3909 8773738 8631748 9299442 9996139 10305628 8914445 9392474 9774138 9676410 9777722 9176163
3899 9176163 9488691 9054787 8593988 9172814 9187112 9589057 8821155 8584908 8158162 7330876
3889 7330876 6688352 6660240 7099954 6448336 6705650 5604934 5417530 6477046 5560132
3880 5560132 5008665 6227447 5396207 5417890 5206452 6050502 6244643 6192765 6452031 6108642
3870 6108642 5348744 5395533 6599108 6959894 7713858 8004278 7472893 8101843 8235000 7489090
3860 7489090 6520768 6592533 7849373 7377074 7023047 7149441 7380040 7703688 6834290 5927144
3850 5927144 5636892 6536335 5976790 5368149 5782277 6326219 6692113 5292396 4340596
3841 4340596 3910292 5458829 6276838 5057464 4687616 5232705 6029905 5823824 4891212
3832 4891212 4564707 6016731 5765005 4352537 4618494 5644730 6061732 5141719 4883172
3823 4883172 5070727 6521920 6407182 6409916 6834771 6656752 6202281 5612939 5056671 4936886
3813 4936886 5293599 5807031 5996147 6817149 7131737 7874139 8323440 8146478 7916877 7298904
3803 7298904 6684849 6501583 6088013 5901384 5562311 5377094 5555964 5043556 5040093 4099935
3793 4099935 4183245 3959557 4438881 5656728 6576678 5622979 5647792 6751276 6301724 5862843
3783 5862843 5442090 6000378 6469467 6554065 6405102 7588459 8575640 8779394 8540269 8462817
3773 8462817 9781918 9404577 10291417 9819843 9257430 8896685 6640698 5581070 6022947
3764 6022947 6108339 5211126 4070300 4317557 5402080 4608731 4135333 4363283 4618666
3755 4618666 4347671 3665093 3165560 3354177 3671702 3493832 3524829 3373514 4070050 3011926
3745 3011926 2151592 2031517 3274448 4440500 4043929 4825878 4594756 5070322 5065258 4599001
3735 4599001 4182528 4264528 3746870 2909548 3718466 4518371 3504586 3174033 1952768
3726 1952768 1885141 2350411 1323447 1075990 1580488 2364607 2044539 1103706 1703744 2224813
3716 2224813 2160364 1800256 1363400 1986671 2589340 2702904 1866279 1505172 1542195 1491445
3706 1491445 1298633 1367653 1461964 2168634 1625315 1032340 1797736 2073001 1678089 919361
3696 919361 1142703 2717757 3421664 2685646 3164367 4144455 4056463 3332191 3002084 3857587
3686 3857587 4936590 4069940 3184487 4048849 5113350 5170112 4784390 4561140 4494523 4023159
3676 4023159 2946999 2719486 2371571 2752465 2577147 1593455 1590729 2585536 2766681 1622256
3666 1622256 729631 613411 1925130 2300720 897527 -979463 739093 1432310 136237
3657 136237 -1046938 -377238 1605587 2003280 163767 -649041 -188017 298479 87403
3648 87403 -267835 134825 1108491 1907013 1453891 515519 81247 1219973 1000203 106565
3638 106565 -193336 678879 915917 372699 70527 362955 356821 10709 -130337 559439
3628 559439 889803 1182476 589152 -49321 224123 -367859 25862 206462 -316714 -414982
3618 -414982 -333450 -408471 -803701 -881923 -245274 902249 1315861 875078 -51778 -114924
3608 -114924 737856 518402 -180397 -49451 5842 820909 674524 553504 710842 632857
3598 632857 1264476 846953 -412189 -308884 -154854 -495747 -1173234 -1389959 -1593185 -810846
3588 -810846 -890691 -1325323 -1619097 -1089398 -1215369 -2028250 -2550039 -1771629 -844496 -1046652
3578 -1046652 -1045395 -1765939 -1211485 -413279 -1009210 -988175 -1013327 -1294748 -953389 -936464
3568 -936464 -424223 -179747 199177 455714 238679 92085 382450 132820 -790442 -647077
3558 -647077 -979190 -1599465 -972198 -1061617 -1134437 -343412 -1154745 -1300669 -747746 -831759
3548 -831759 -1016066 -683045 -1137780 -1708154 -2016029 -1212819 -743573 -825241 -1084217 -1452167
3538 -1452167 -1224029 -1617627 -792797 -1054508 -1925754 -1752671 -481760 -493325 -1073276 -1021176
3528 -1021176 -1051449 -1314085 -1141279 -1642185 -1302958 -1048428 -1669503 -1603294 -1485019 -1230250
3518 -1230250 -374639 -496306 -1098570 -1837657 -1641267 -1789135 -1484997 -1597355 -966284 -1165694
3508 -1165694 -1667299 -2054767 -1584490 -918487 -1117764 -1690978 -709691 -144 -518085 -1528744
3498 -1528744 -835513 -566981 -631798 -1361829 -1920670 -1337140 -1089255 -601956 38905 -109419
3488 -109419 -453483 -1424034 -844318 -306315 -921016 -989748 -1282444 -931137 -562872 -641083
3478 -641083 -981514 -93046 -411838 -755215 -1089886 -344980 380451 -29869 -539311 -72022
3468 -72022 -852146 -1710656 -1847548 -931453 -235489 -346952 -880893 -327639 -527268 -1550085
3458 -1550085 -1046174 -598766 -1337369 -1454954 -1611484 -827958 -470783 -647260 -1203011 -253012
3448 -253012 105557 -1494926 -2390344 -2118905 -1778685 -1391361 -739105 -909800 -916565 -1599873
3438 -1599873 -2014059 -1219727 -1367032 -1436297 -2391307 -3273992 -1857111 -1270798 -979148 -921005
3428 -921005 -1033480 -1280108 -2078918 -1782922 -1398004 -1732668 -1352253 416989 104359 -1105465
3418 -1105465 33814 -7348 -225760 -110098 -624600 212092 -274837 -176734 -35738 268595
3408 268595 220018 61082 -725582 -972407 -1269631 -891859 -965370 -1243490 -1002281 -1412771
3398 -1412771 -1064690 -1028117 -1893840 -1795511 -1819680 -1696405 -1363041 -1706899 -1534243 -1104861
3388 -1104861 -817922 -1809974 -2573034 -2092327 -1611535 -1774841 -1948320 -1728796 108992
3379 108992 56299 -424476 -895850 -1305697 -1801101 -1885665 -1449645 -1578756 -1764362 -1561724
3369 -1561724 -1845889 -1970110 -2605845 -1931275 -1426286 -896453 -1511876 -2185732 -777576
3360 -777576 -702514 -1164523 -677475 -469498 -799243 -882942 -1621136 -1814824 -815764 -335381
3350 -335381 104239 -635072 -728207 -726406 -511746 -901727 -1151008 -818555 845874 719745
3340 719745 -492836 -373863 -251484 -210651 -605355 -1429755 122931 1017004 213252 54952
3330 54952 394642 1371671 36249 -1339108 -932920 203886 335556 64367 -21985 9069
3320 9069 455884 -188786 -1442688 -45609 451906 -241761 -838643 -967679 -381058 -441184
3310 -441184 -79792 553471 -745917 -1268925 -974997 -468725 -237917 -1247272 -312309
3301 -312309 1832743 1548507 -3420 343436 2005658 2423716 1111945 -130972 1060766
3292 1060766 1253688 325578 -660851 479500 611039 -254698 -1061697 -799048 -533135
3283 -533135 -1191883 -789928 -409024 -642380 -841336 -1618161 -1531062 -1148631 -1256449 -931698
3273 -931698 -952891 -1156982 -2065953 -1328935 -1231437 -964356 -841857 -941932 -1002994 -245389
3263 -245389 354650 -164345 -859951 -241699 755805 711823 510206 518269 -144448 -417484
3253 -417484 135480 252130 347876 357254 903674 713117 537037 -805372 -301873 371227
3243 371227 -511683 -613349 51832 421662 130165 -263721 -54485 -201753 -453520 269672
3233 269672 153383 86824 -83719 -226914 -1619003 -1586186 -1167439 -304990 241796 -611532
3223 -611532 -1443611 -1290844 -562485 66975 -503599 96839 355283 327891 -27503 -481597
3213 -481597 -168860 1072535 738996 -562878 -231031 -375754 -242488 -798218 -341016
3204 -341016 547393 641846 -507877 -809275 -504259 397968 -348274 -1982213 -1504382 -160910
3194 -160910 -100612 -708505 -577393 -35109 -70825 -1615054 -2264317 -1548305 -842340 -1478337
3184 -1478337 -1504942 -1131618 -943083 -668277 -1585355 -1719443 -1313092 -999688 -553787 -493792
3174 -493792 -517123 -152623 -519288 -425179 -40391 310584 -250891 -1419007 -1153881 -1840669
3164 -1840669 -1318451 -104284 308220 204239 -155484 602013 1453846 1363772 378314 280051
3154 280051 440828 874912 49581 -63028 -495893 78092 -77098 -1052128 -563527 547716
3144 547716 1147972 289117 -10707 1259874 1579726 1393633 362089 -425166 697356
3135 697356 895898 641419 113498 947526 1345962 776651 232182 -745586 -153343 457154
3125 457154 242915 1361509 1174830 649543 483655 422958 -183523 -872767 -863530 -471850
3115 -471850 -887489 -991293 -527949 39712 545041 341412 -309870 -543263 218094 396666
3105 396666 74295 -145192 -155245 258510 662796 530418 852635 1403723 197847 141590
3095 141590 982746 789724 307339 622953 905510 1149902 941882 234600 858579 972767
3085 972767 829620 788880 1119722 1202263 1786822 1347798 1283771 1845808 2321636 2776052
3075 2776052 1939760 1407516 1630260 1269082 1498883 1407530 2241724 2564274 1626823 1340597
3065 1340597 1550991 2633076 3177082 3077399 2960499 3812523 3709649 2519579 1339584
3056 1339584 1924251 1789596 2223450 1296165 1715213 238937 -83082 1416913 875046
3047 875046 1393264 1431202 1380535 1264391 1305959 1221059 1596209 810091 946998 1607953
3037 1607953 2182813 2166278 3108372 3073513 2842013 3544736 2917670 3072670 3768020 3472857
3027 3472857 3958861 4153476 4321821 5207338 6373958 6061909 5294664 5261053 4972690 4707164
3017 4707164 3831580 3984822 2629631 2929937 3568849 4671308 4049374 4162543 4426751
3008 4426751 4395912 5089823 4833422 5964197 6368279 6455903 6433696 7228729 8111788 8398199
2998 8398199 8873999 9680728 9503577 9966313 9988537 10488494 10608120 10023610 9554918 9511613
2988 9511613 8667900 7956352 7343178 8228016 9181342 9696078 10372284 11108696 11231392 10101764
2978 10101764 9045520 10089113 10965722 10570437 10683079 12134300 13421774 13470301 13522018
2969 13522018 14364369 15888714 16112000 16495288 17707931 19736316 20287394 20533515 21081354
2960 21081354 22618886 23517521 23880926 25047898 27146835 29961464 31326850 32723107
2952 32723107 35797202 39121251 42078664 45873104 50909577 57093538 64351828 74775104
2944 74775104 88340817 104766015 124458467 146626158 169794672 191500064 205216581
2937 205216581 193858369 161137738 125873233 98627712 79974156 67014938 56517975
2930 56517975 48305652 42268636 37078855 32814097 29136975 25690660 24457704 23000679
2922 23000679 20105252 18566266 17577317 16442111 14338701 13388790 13351437 12963872 11617027
2913 11617027 10870259 10551803 10517895 9548532 8087328 7901545 8856056 7276581 6835588
2904 6835588 7341760 6869959 5973102 5381982 5359460 5345350 5274246 4760313 4740582 5348169
2894 5348169 5877531 5047809 3920665 4001483 4119171 3479583 3121134 3571385 4040015 3901958
2884 3901958 4028659 3375791 3739126 3546591 3262984 2811366 2046681 1996541 2375040 2517908
2874 2517908 2341853 1720369 1769592 3061903 2436235 1477245 1409925 1832748 1969463 1873711
2864 1873711 1639987 1366957 1279573 845658 529058 1434570 1636182 882085 664923 991934
2854 991934 886931 1011846 487120 96014 347309 -45901 432961 674155 -2346 -72507
2844 -72507 319040 174872 433465 606324 -491515 11406 206846 265293 507698 -903666
2834 -903666 16199 1062019 1121240 451960 -479535 922075 2118090 1297311 372221
2825 372221 707291 1820112 1681812 101568 -845361 198422 1075728 82567 -1167368
2816 -1167368 -298422 1202258 642715 -517147 -121782 302457 476502 -72203 -52359
2807 -52359 220208 1019910 520620 -560137 -323051 494997 1012361 596431 -757593 -565963
2797 -565963 940639 779787 -99128 -641088 120167 701204 378362 82490 -761298 57091
2787 57091 187145 -1106402 -1720117 -139307 440743 -57326 -629298 -405664 -501482 -885943
2777 -885943 76173 -482795 -676057 -1228336 -565287 -255914 -622252 -970289 -759818 322278
2767 322278 492744 -680094 -540593 11372 891389 661927 14879 554913 781409 -298481
2757 -298481 -970401 -408819 626271 975025 129553 -30162 172380 -292386 209456 -568064
2747 -568064 -106796 748093 -5356 -89190 34913 696507 711730 282876 -318756 134492
2737 134492 223586 -749447 -790711 -565575 378302 849333 591390 16759 40351 171609
2727 171609 462776 185789 1249837 1094568 330867 1041911 1163350 1605065 660307 189511
2717 189511 -366449 1064389 1110519 807116 241468 672443 151195 -421835 -407961 -375569
2707 -375569 698070 472495 -435186 -463889 616873 212913 -214763 -22688 -88020 932374
2697 932374 958749 -223073 -108107 -240732 283563 859373 397113 657734 1574280 736322
2687 736322 504076 567209 -144733 551369 558609 900310 56822 680809 1202865 525410
2677 525410 172965 82911 1052442 1203518 726794 600977 979819 1088217 1228297 830911
2667 830911 1691154 1500736 1960152 1943893 1519122 1876362 2061405 2738738 3207866 2277342
2657 2277342 1704203 3370842 3633494 2447410 2494571 2148014 2198352 2632822 2282202 1999457
2647 1999457 1409847 2081763 3530968 3131756 3303546 3070526 3512597 3224762 2507143
2638 2507143 3086521 3796006 3359359 2895757 3252671 3036355 2451512 2193282 2566130 3481144
2628 3481144 3513666 3477669 4076784 4473638 3706944 3052319 3800192 3430228 2653377 3023119
2618 3023119 3160427 3138082 3628759 2961557 2092076 2362284 2216096 1705988 2501146 2982419
2608 2982419 2907403 3291601 2577803 2666274 2811068 2457756 2669186 3002498 3040168 3141372
2598 3141372 2965558 3058935 3167777 3265528 3714192 3278213 3099796 2919825 2994846 2851049
2588 2851049 2928913 3188101 3155884 3518530 4291765 4404967 3693108 2987163 3116793 1886766
2578 1886766 2148302 2209535 2739370 3732877 4009002 3326578 2414457 1955523 2049035 2553026
2568 2553026 2391469 1639767 1655582 2152861 2475374 1894981 1481395 2367811 2615683 2451956
2558 2451956 2172575 1680164 3117264 3364883 2630200 3061747 3991569 4915489 4865246 3885589
2548 3885589 3592032 4443597 5129823 4183301 3215377 3561973 4988154 4715315 4124792
2539 4124792 4203559 3998667 4218688 3806085 3189153 3769551 4834304 4852937 3661777 3385469
2529 3385469 3502230 3942692 3771510 3051556 3908821 4668241 4664322 3733280 3540755 4644751
2519 4644751 5278406 4746936 4773552 5140301 5474094 4870796 4232426 3694931 3599370 4515744
2509 4515744 4565293 4264853 5004780 5004946 5672417 5731707 4399180 4198123 4333587 4171513
2499 4171513 3952720 4093805 4511095 5222980 5063020 5022901 5161578 4906648 5421698 5491804
2489 5491804 5433060 5135199 5473937 5200469 5798235 5658407 5562308 6205679 7018073 6896467
2479 6896467 6748717 6714989 7031949 7830873 7749009 6888412 7019136 7351613 7875525 7353009
2469 7353009 7471938 7737964 7410057 7719474 8178081 7978346 7498162 6760657 6078204 6683524
2459 6683524 6735232 6547722 7155011 7161763 6729030 6665772 7253846 6211448 6054787 6612588
2449 6612588 6746533 6910291 6235801 6195111 7132697 7188800 7406285 7432927 6951979 7664598
2439 7664598 6944450 6774483 6640961 6697550 7078879 6961542 6494273 6920417 7805580 7790981
2429 7790981 8435960 8439380 8555716 8293509 7828065 8492336 8822540 8825820 7928429 8575429
2419 8575429 8778247 8828010 9976523 10705559 10513205 10556215 10401259 9619867 9900228 10396992
2409 10396992 10486363 9939577 9726900 10589932 10791992 10863391 10727918 10763759 10682864 10842105
2399 10842105 10947074 11418864 12053359 12291301 11809258 11924148 12673295 12397659 11178668
2390 11178668 11471725 12953640 14040598 14353152 14785288 14860005 15074693 14893530 15169767
2381 15169767 15359676 16132053 16379769 16375591 17114555 17805906 18208578 19422125 20727076
2372 20727076 22267056 24029295 24675649 26208430 29542609 31661371 34129830 37539687
2364 37539687 41424627 45476994 47834266 49554642 50508567 50585541 48038025 43997198 41141245
2355 41141245 39148952 36319559 34626218 33655600 32786236 32494175 31861674 30976432 30832373
2346 30832373 30644124 30766254 30881679 31682027 32511434 32754288 34413485 36186668 37091113
2337 37091113 38650564 41512985 43835373 46304160 49774480 54220324 58978623 64809632
2329 64809632 71566246 78826920 85297443 89368990 90372379 88049827 81183315 72341355
2321 72341355 65315284 59592709 55260170 50608190 46818569 43340060 41956444 40927316
2313 40927316 38875207 36890859 36250215 35197890 34340637 33009551 33047303 33212612 32725783
2304 32725783 32002439 31563197 32530363 33100236 34104274 34761473 36597267 38988798 40846954
2295 40846954 42755150 45002891 47012270 49826028 51703600 52409612 51209202 50035759
2287 50035759 47176992 42239343 38731020 36429221 34278713 32311356 30285580 28634504
2279 28634504 27946454 27078500 25691537 24701033 25049584 24769735 23999747 22507371 23294984
2270 23294984 23277669 22129437 21028504 21542047 22806177 22344914 20989598 20642885 22045869
2261 22045869 21799197 21367892 21820977 21659689 22486184 21910404 21433955 22110974 21904512
2252 21904512 21760128 22896455 22891858 22596306 22702523 22707012 22962805 22146882 21401778 22198860
2242 22198860 22752012 22223513 23137648 23718499 24769843 25231624 25506663 25929650 26578210
2233 26578210 26884397 27510657 27944416 28211778 28991584 29033589 29965369 31111707 32309310
2224 32309310 33111087 33397762 35127238 36746514 38800109 40623057 42402018 44289166
2216 44289166 46120176 49307782 53823400 58825042 64307220 71223926 78925678 84349646
2208 84349646 85737669 80379740 72238510 65240030 59183430 56146630 54109092 52530563
2200 52530563 50656260 49743124 50031790 50716366 51766849 52138009 52443568 53468268 55111897
2191 55111897 56427256 57774198 58851836 62004497 65062625 66964955 70644389 74199992
2183 74199992 78855878 84160720 89336749 96984889 108163962 121039535 133403272 145463764
2175 145463764 159900628 171546357 167710647 150621439 134794700 124043151 115085383
2168 115085383 107768366 100798089 95440572 89768233 83718960 79166774 75299186 72722549
2160 72722549 69834088 67644426 66134012 65573579 64282203 63219516 61569007 60098073
2152 60098073 58924262 58714152 59623272 60220136 60926601 62101323 64554512 68560918 72255380
2143 72255380 77011659 84281106 89297704 92617903 90932600 84660056 75588209 66647422
2135 66647422 60283047 56815639 54820206 52951460 51335780 49784227 50795211 52218193
2127 52218193 51916481 52793389 53495946 54558855 56311199 56554457 56391974 56464578 57245908
2118 57245908 57161080 55793750 54788518 54912432 56429705 55145489 53514657 53337484 54179421
2109 54179421 54007954 52905006 52151888 50596625 47615841 44761967 42153005 41694599 41311775
2100 41311775 39277187 39064098 39299846 39778689 39759036 39887065 40360276 41189665 41890546
2091 41890546 42784081 43136420 43851081 44204704 44686301 45094369 45611935 46611048 46496677
2082 46496677 46755844 47166969 48159430 47823870 47100724 46763553 44310531 41559895 39995951
2073 39995951 39637118 38522132 36032597 33042331 32149422 30214175 28656731 28075703 26978393
2064 26978393 26293605 26109844 25955467 25403532 25289314 24649925 24938194 25346686 25346872 25441639
2054 25441639 24074148 23433212 23910906 23580370 23069816 23982461 24411105 24452263 24320706
2045 24320706 24014541 24346154 23882890 22489172 21090581 19800186 19409272 17892502 15813234
2036 15813234 15414533 15130694 15070384 13684616 12219126 12883926 13510768 12369084 11531910
2027 11531910 11039805 11431115 12108151 9749625 9126751 10268477 10348931 11440745 10029891
2018 10029891 8910110 9659079 9826406 9333286 8370650 8739824 9452559 9867156 8034688
2009 8034688 7701521 8653732 8616812 8194739 8635474 9706756 9395208 8450789 8338873 7838562
1999 7838562 7733465 8155372 7758128 7183194 7421021 7477001 7106842 7355420 6748473 6728367
1989 6728367 6033781 5468048 5706680 5782068 5402320 6332582 6286815 5744732 5372285 5239707
1979 5239707 5916989 6800946 5813169 5235142 5708292 5683240 5772263 5624999 5918771 6208123
1969 6208123 5755947 5478792 5226724 4790500 4605113 3733173 3807104 5079656 4407217 3566353
1959 3566353 4294944 3985658 4042122 4335632 4378012 4616824 4256039 4468094 4969845 3924816
1949 3924816 4602632 5080569 4321476 4733439 4174684 4218267 4712995 4285494 4703704 4454898
1939 4454898 4818293 5416471 5729975 4871305 5317880 5371876 5819287 5458468 4350801 5254619
1929 5254619 4996042 4725562 3977998 4117135 5601563 5971873 5327725 5411284 6306826 6563686
1919 6563686 5965976 5060185 5785273 6755647 6542954 7085119 7464157 8377365 8861786 8567513
1909 8567513 8419844 8674579 9244964 8796871 7458020 7320134 8510760 9302797 8007146
1900 8007146 8387128 8899046 9231406 8813956 8469709 8569421 9334053 10438515 10471257 9289303
1890 9289303 8974254 9849684 10886562 10915570 11528852 12412586 12611510 12337702 12255971 12518973
1880 12518973 12813897 14123130 13484057 12720258 13451865 13524316 13188094 13901739 14454769
1871 14454769 14540071 14941070 14557141 13611627 13711038 13645181 14272535 14114295 12596699 13371550
1861 13371550 14312430 14333671 14288597 13548088 14877369 16048327 15543638 14667845 14715511 15695793
1851 15695793 17088891 16011299 16010353 16915680 16508806 16174224 16457850 16865395 17435343 17324219
1841 17324219 16816657 16989988 16877995 17466844 17272459 17159562 17740105 18564319 18431257
1832 18431257 18400065 18026328 17370084 17265107 16242468 16267633 16783486 16259593 16434341 16684641
1822 16684641 16493915 16764627 16703767 15991888 16711083 17888480 17603741 17638096 17246007 18936363
1812 18936363 19245510 18413460 18233135 18077903 18642250 18570807 17494409 18728368 17713020
1803 17713020 16704062 16721001 15405199 16460827 16330869 14916536 14679457 14915943 14852606
1794 14852606 15368428 14490630 14511904 14176179 14231220 12752203 13836556 14207761 14488042
1785 14488042 14242445 13311667 13918151 13845768 14768209 13781982 13494675 13562719 13666298 13151022
1775 13151022 13101940 12321507 12438172 12700819 11295660 10724442 10350396 9531010 9579582 9454276
1765 9454276 9469136 9514148 8583326 8347692 8192424 8019099 7907656 7776433 7042011 7057663
1755 7057663 6997898 7465637 6529275 6429178 6663999 6035864 6048592 5513049 5533085 5810058
1745 5810058 5579905 5370986 4978958 4312953 4013503 3231640 2683980 2296505 2787818 2606978
1735 2606978 2902930 3361812 4636041 3819612 2388879 2788613 3223164 3109989 3099979
1726 3099979 2973065 3617910 3951031 3514549 2977063 3179605 3012225 2893886 2753911 2300864
1716 2300864 2904117 3120416 2166594 1631950 2721193 2550138 2054340 1416139 2073775
1707 2073775 2609549 3145710 2256973 2327935 2516513 1264483 568681 510516 1939169 1643886
1697 1643886 106089 256012 1037566 1189204 905453 292041 1268163 992051 378103
1688 378103 -453277 -1039356 258143 -244553 -950848 -834320 -661957 -405697 -202175 -9876
1678 -9876 296175 225514 -148798 -372620 -409399 -44867 713556 -9477 -1042250 -559945
1668 -559945 -1419321 -1533715 -255020 -1301959 -270050 208045 -1005610 -1592769 -653870
1659 -653870 -858265 -1336454 -1571645 -2099128 -1182630 -1313624 -1408390 -1145669 -1044594 -655590
1649 -655590 -1385795 -2097093 -1700006 -1022202 -1295644 -1569812 -838876 -375961 -628836 -1297447
1639 -1297447 -1069470 -866290 -903142 -1242862 -1504797 -1468005 -842498 -778080 -754779 -707059
1629 -707059 -281076 -606261 -1736379 -1613030 -1028611 -1373439 -2547491 -2309338 -1189309
1620 -1189309 -280079 -477879 -497007 -2113286 -1973832 -635333 -91249 -437803 -981800
1611 -981800 -1071893 -1376617 -1251093 -1676916 -1578919 -1046021 -1377404 -2078297 -1381207 -1273726
1601 -1273726 -497256 -969885 -809706 -434001 -722747 -1163123 -1343473 -520436 -149378 -757219
1591 -757219 -1840406 -2126274 -1437302 -574276 -873786 -1819111 -980788 -317000 -1282673 -298343
1581 -298343 -264664 -554075 -750747 -763100 -577977 -717443 -623860 -700504 -382361 -441576 -480149
1570 -480149 -485703 -436324 -971209 -615674 -655639 -221942 -349275 -58624 -837619 -601070
1560 -601070 -400090 -479270 -473054 -936415 -942287 -580658 -587054 -1042865 -899299 -858087 -1223901
1549 -1223901 -1626426 -1607438 -2073358 -1252787 -569242 -449387 -678182 -201017 247226 -1467833
1539 -1467833 -2312293 -1442754 -1092906 -1296295 -2660615 -2449656 -894611 -811543 -1316266
1530 -1316266 -2003583 -1859743 -929407 -1400846 -1842398 -1296971 -600807 -589470 -1609325 -1921386
1520 -1921386 -1129494 -1063855 -1368934 -1009991 -1206276 -1028425 11393 -568543 -581715 -929609
1510 -929609 452492 347840 -198740 403841 153244 1325045 975955 157550 164144 1017413
1500 1017413 1566009 486175 214734 637402 1290377 1304076 159837 343605 965247
1491 965247 689763 80154 -199636 498865 1073803 425937 654162 1114319 505435 306307
1481 306307 -297918 -307228 -214101 -254379 -177063 195338 303692 485832 -104942 292563 326780
1470 326780 -397723 -555341 -435727 110048 -763711 -1699412 -1131989 -1196266 -1892578 -1291629
1460 -1291629 -231033 -783951 -1208852 -797244 -385130 -283736 -1231547 -1279060 -162365
1451 -162365 308571 -866808 -35460 385568 804703 991552 387700 -222094 94548 -547358
1441 -547358 -763212 -637289 -459761 565915 532756 46408 291968 252392 524504 407376
1431 407376 -630832 -1014066 -997089 -742466 -1080902 -1008185 -1392893 -865473 -559665 -1036242
1421 -1036242 -989611 -361206 -202644 -1390392 -1752585 -1016810 -368643 -698107 -1321545 -1164727
1411 -1164727 -662763 -1785496 -2394610 -2317390 -1844786 -1161670 -1015204 -698311 -581428 -805598
1401 -805598 -777159 -1063037 -1132281 -1039856 -739107 -609226 -1083467 -1012934 -636169 -101578
1391 -101578 -1400064 -1735784 -435410 58524 -3534 -567318 -215777 969987 160521
1382 160521 -501036 -509001 151767 575024 -400730 -802630 -136603 -242794 -671780 -898730
1372 -898730 -639519 -686045 -1603542 -1972244 -570223 -1110004 -540037 -1200255 -2468827 -1765314
1362 -1765314 -2258449 -1707410 -1616758 -1380712 -749083 -399016 -1135142 -1180488 -1536193 -1353812
1352 -1353812 -1003217 -2069309 -2494636 -1898231 -1383653 -648067 -1318433 -2159245 -1166040
1343 -1166040 -1431168 -1957462 -1519034 -261842 -539762 -1528835 -2284675 -1706439 -1219760
1334 -1219760 -1334268 -1487948 -662523 -1001009 -1163870 -282109 -586681 -870591 -1243486 -848656
1324 -848656 -771779 -894455 -1133285 -808413 -648715 -1277878 -2291091 -1825331 -789349 -139355
1314 -139355 -1162970 -1786937 -816675 -232624 -1072261 -1226234 -752582 -927309 -1487654 -1562616
1304 -1562616 -1507797 -567645 -255594 -1504125 -1235714 -760720 -497719 -1323317 -2096332 -1352526
1294 -1352526 -934782 -579511 -1283050 -1656788 -1139835 -1038285 -947419 -936243 -1362552 -1366399
1284 -1366399 -502032 33424 -882423 -1777741 -949242 -155749 -406899 -499915 133648 -511785
1274 -511785 -1507158 -2255569 -2347780 -1385540 -473178 -913643 -727210 -459012 -549239 -1108064
1264 -1108064 -2255052 -1440728 -472881 -791755 -1398053 -938238 -1157567 -573974 -1005141
1255 -1005141 -732652 134156 -143144 -426589 -926086 -374042 1084245 1248695 578146
1246 578146 907449 1478432 1636689 1322601 1245966 674121 682309 1607732 1464426 552495
1236 552495 291711 1282233 917630 -173686 -42032 178561 321672 208328 -19839 866410
1226 866410 939387 453896 158565 -497714 -7004 282867 246862 -49666 786206 661146
1216 661146 -44039 25190 164114 610178 437132 216788 -135928 187405 500396 -67928
1206 -67928 -718256 -971872 -532067 787364 164214 -685908 -152562 1337093 1247650 -1028564
1196 -1028564 -1291339 -10908 1258036 1102764 -858724 -797525 1043000 1033748 -342861
1187 -342861 -1534079 -183894 462300 -286428 -1502017 -1362030 651463 659919 -842392
1178 -842392 -1253385 -395586 463098 -986466 -2282260 -1669090 196827 710569 -140665
1169 -140665 -1037371 -770868 -97890 485291 -525870 -171974 560833 1059520 328653 -1597272
1159 -1597272 -892315 532669 -344083 -888894 -1291547 -73727 445823 -129480 -164883
1150 -164883 -494792 397664 419239 463758 112406 246747 315110 275033 1523 -553824
1140 -553824 294777 930798 794831 224451 181968 1847611 3014288 1817896 518031
1131 518031 1950891 3073020 3088500 1930180 1510653 1841250 2638507 1973641 1933113 3842930
1121 3842930 4127764 4024164 4139175 4811216 4808776 4639723 3969365 3535456 2674827 2104866
1111 2104866 2539391 2907295 2254531 1727225 2253183 3022926 3776474 2500045 1618226
1102 1618226 2383691 2956264 2991039 2476778 2397943 3467530 2282121 1679345 2011588 1772560
1092 1772560 1408505 1594399 1368608 1832856 2123412 2382544 2357816 1663707 2483493 3236125
1082 3236125 2745607 2832761 3270940 3403575 2585228 1948172 2161635 3035421 3470636 3879303
1072 3879303 3447131 3119598 3620596 3177433 3499572 3665111 3421707 2940852 2393834 3121318
1062 3121318 4196089 3781992 3050634 3714555 4161880 3507756 3326419 4004603 5076501
1053 5076501 5581146 5530580 5209897 5184241 5193576 5058568 3769516 3662564 5189564 5279446
1043 5279446 5553098 5392194 6416642 7218331 7102318 6233155 6158671 7450018 7070912
1034 7070912 7327415 7429868 7013366 7927560 8814692 9116950 8768011 9935605 10243628
1025 10243628 10681198 11483571 10923282 11406222 12127717 11526398 11778810 12003450 12836954
1016 12836954 12792322 13242110 12852902 13565465 15268373 15837284 15695258 16577017 18029906
1007 18029906 17998040 17800803 18082032 18407996 19087087 19848111 20546547 21452833 23045655
998 23045655 23377345 23496449 24221400 24873554 26619034 28123226 28888108 30068817 31733228
989 31733228 32494018 34095461 35451159 37806873 39645424 42221460 44498314 47144472
981 47144472 50922120 54047825 56040126 59624518 64185164 68240370 74101193 80595325
973 80595325 85583164 90232744 95263750 102306008 111632242 124001432 138009363 155618957
965 155618957 178664248 209851072 248927736 292384805 338357562 392751511 444831748
958 444831748 477515327 431229478 342331924 266135982 210077684 174427362 148114167
951 148114167 128694637 110395256 95964930 84985007 77440996 70091733 65258127 61754981
943 61754981 59512854 56294517 51886537 46035341 41457384 37357004 34929174 32500963
935 32500963 29896849 28246002 27527155 26601544 25003810 23148952 21264285 19772595 19141216
926 19141216 17794263 17149077 16651976 17188580 16337171 15961470 14613954 13840201 12907918
917 12907918 12331284 11238235 10882969 11495416 11725490 11218041 10588806 9298548 10469024
908 10469024 10205399 9696772 9282128 9670350 9768457 8751506 8857340 9596078 8470155
899 8470155 7356650 6655272 6688942 6644885 6252982 6571006 7023795 7593496 6523370 5632188
889 5632188 5805220 5710700 4774716 4764839 5446499 5927895 4564505 3066389 3434323 4185292
879 4185292 3746761 2747652 2357084 2898929 2882161 2093520 2245887 2518722 2440872 1366638
869 1366638 862891 1260143 1221645 692460 1013234 956757 858614 692924 1073671 567478
859 567478 389815 474806 42556 340850 174358 -587999 -182634 849739 317580 925251
849 925251 757380 1444887 792043 -25446 413231 1088158 2001558 1108926 416583 641326
839 641326 1458491 981861 781557 506807 -67174 171833 554240 748475 1419744 935218
829 935218 135792 -52436 458986 167347 343490 946333 692788 1141312 626664 235111
819 235111 63405 442917 414863 997588 529265 57358 67553 736188 922764 1051445
809 1051445 308566 -516001 -977267 -430539 -377201 411635 1013724 1291418 1433413 1190765
799 1190765 -435258 -959111 -149449 83579 203031 127989 523958 384760 646675 555697
789 555697 1152526 481324 597089 415182 531068 762717 724248 437893 332186 694271
779 694271 217598 819841 85781 -962235 -691498 352455 730953 167360 -752424 187143
769 187143 -199542 62696 -252215 -483202 -61199 -347391 -556941 -723017 -906209 -448714
759 -448714 -33625 -120143 -707034 -315437 156982 395783 -553714 -717284 -781184 -1367795
749 -1367795 -1190373 -1691345 -1737427 -1089268 -1097464 -1059364 -1735394 -1414603 168616 -416374
739 -416374 -1371231 -750000 631994 1317076 767437 -504037 123572 852085 786520 639877
729 639877 -316327 -523182 181212 207071 321918 -93865 290224 456622 474490 38614
719 38614 -68859 458089 702144 48589 -388131 -559898 352120 -112667 -705969 -869278
709 -869278 -473260 -107062 -457951 -429789 -315004 182974 868484 -431773 -1317367 -705759
699 -705759 -215100 -450391 -1378401 -1364596 -184833 691745 331320 -230764 474737 1172560
689 1172560 1101956 168070 118149 1143651 1698307 1063814 -61406 -175408 480973 575772
679 575772 829681 859190 1410946 1801648 2107938 2422604 2511454 2376374 2944341 2679720
669 2679720 1987836 1240587 1015549 1643599 1249323 827503 268757 525991 197026 -830984
659 -830984 -171707 943173 1438202 996321 -241691 -544205 -509983 -144553 -602385 -1515741
649 -1515741 -1607520 -758644 -280526 -334377 -1145237 -414289 183431 110686 -1375675 -1436365
639 -1436365 -1063541 -1101204 -1756250 -2484789 -1704148 -337245 -498634 -924622 -753356 -1284232
629 -1284232 239196 -404698 -1110494 -771725 -517334 -150444 95299 -547958 -995421 -669555
619 -669555 -416493 443948 951518 -3213 -98088 149859 456301 778428 336893 657465
609 657465 259757 -155060 296226 525949 937505 662076 169533 43365 -99241 20042
599 20042 439402 10672 -77663 356856 -385957 -734879 -139911 248696 625227 462322
589 462322 165445 -914378 -137170 -154486 -541999 -991267 -380193 -13944 -676836 -855459
579 -855459 -1637286 -250668 -112211 -1117850 -1185047 -1157542 -838958 -317343 -1046825 -1544205
569 -1544205 -1757818 -319911 -207265 -297862 -202576 83485 235947 -160428 -129876 6299
559 6299 389296 186280 -626722 -778817 -588539 -504610 -240762 166139 -465992 -452199 -584310
548 -584310 -492781 -413964 -713984 252067 1416009 663140 366881 240749 -166628 336761
538 336761 -510722 -820500 -179764 -28735 457011 -312433 -593771 -81691 -751939 -1494711
528 -1494711 -1147783 -896420 -17305 -179578 -869519 -104954 312547 271476 -871729 -1709537
518 -1709537 -899385 -758677 -1382202 -1768430 -1220408 -325139 2787 -966823 -1626494 -491637
508 -491637 -768441 -1748810 -1805577 -898637 203737 -267630 -1418143 -1518325 -863697 -1024480
498 -1024480 -1561329 -1587397 -1445242 -846628 258203 -227444 -1220661 -592271 -351284 -850471
488 -850471 -1916325 -955727 313859 -477105 -546233 -372209 -274757 -258551 -521737 -1263976
478 -1263976 -1199521 -354690 -265280 -604851 -1164047 -421227 -264661 -126211 -1838272 -1182112
468 -1182112 -51591 -776641 -763132 -488436 -54438 -271038 -497161 -662243 -335177 333159
458 333159 -98910 -605615 12917 539490 740543 876755 845311 1242648 -84547 -398458
448 -398458 -58956 671160 1146568 1647428 1371040 1005618 902755 475459 -327345 -247356
438 -247356 470505 -866740 -62205 470607 -173006 660022 45501 -587328 333930 -686236
428 -686236 -1443552 -1334659 -1643559 -1558976 -1000828 -478696 55959 -62668 343085 43629
418 43629 -785432 -578563 -548550 -908195 -355534 100844 -665760 -1192998 -725144 -548398
408 -548398 -1433144 -1626093 -945923 -173419 -524216 -1230493 -799918 -613626 -881969 -1799798
398 -1799798 -2158020 -1771014 -774063 -1047777 -1699360 -1156930 79055 -407527 -2085492
389 -2085492 -2566008 -869659 -109749 -549207 -834158 -1411917 -479454 245745 -1028023
380 -1028023 -1847991 -187510 484250 -97458 -1083798 -699789 83300 901967 -925582
371 -925582 -2003350 -1550083 -257159 -539497 -1630614 -982575 546066 276949 -1640975
362 -1640975 -2024759 -1365636 -605063 -1198988 -2020810 -1271160 -622854 -1104581 -1567691 -2250308
352 -2250308 -1427347 -65424 -1012170 -2207678 -1762644 -864118 -94813 -835003 -1020643
343 -1020643 -127185 -135911 -505128 -1086760 -1777520 -1040552 -520414 -1263432 -2020100 -1673836
333 -1673836 -460255 809581 -911524 -1108421 406896 511460 417345 -882854 -864643
324 -864643 526994 121548 -675145 -972242 -445619 -38946 -860876 -1861888 -943405 -328618
314 -328618 -176270 -386339 73329 -333203 -1157301 -1651525 -1516574 -1908909 -1554511 -1237108
304 -1237108 -2092167 -1489948 -1427311 -1360945 -553599 -1444874 -1736309 -2128794 -2243278 -2101804
294 -2101804 -2389027 -1808076 -1491488 -1823104 -2956090 -2666404 -2481381 -2489835 -1893487 -1684966
284 -1684966 -2114576 -1795414 -1715097 -1804546 -1439947 -884207 -1352994 -1989928 -1520520 -2229504
274 -2229504 -2957271 -3096107 -1454810 -1226709 -1252953 -1645292 -919685 321012 -537237 -1485919
264 -1485919 -749992 55505 -307879 -467534 -800488 -1150621 -481500 -652471 -1094744 122011
254 122011 207279 159328 -719894 -509189 412219 175841 -637167 -522487 -112740 222614
244 222614 -427222 -575418 -1000346 -734914 -746299 -1066869 -570186 15667 -706583 -1130123
234 -1130123 -1458665 -983902 -1117456 -1148225 -631949 -1400507 -1382508 -937601 -919157 -964111
224 -964111 -1346611 -1116548 -1229741 -1572425 -1991224 -1559066 -814459 -1519571 -2174277 -2270138
214 -2270138 -1932733 -1586205 -2399734 -2236839 -1684956 -1669689 -1954739 -2208576 -2626295 -1826734
204 -1826734 -918074 -705355 -1519984 -1787911 -913618 -1452924 -1816128 -2173587 -1732196 -1610564
194 -1610564 -1337942 -1581620 -1403449 -1057393 -1566375 -940673 -588623 -1018886 -1292354 -1253620
184 -1253620 -1283736 -1206138 -1602502 -1262860 -674756 -937970 -1157568 -966710 -1522064 -1392985
174 -1392985 -1766332 -2246087 -1282291 -1207188 -1256393 -807521 -937785 -1266916 -952225 -1249114
164 -1249114 -831456 -1063833 -1139421 -1116951 -997245 -1480222 -1022527 -1183581 -1168360 -905761
154 -905761 -1437188 -1066691 -1379130 -1041330 -461495 -262345 -497938 -1262472 -1209922 -1096027
144 -1096027 -183552 -379479 -1334263 -1092028 -295877 -690662 -1443245 -1347421 -1274650 -1441329
134 -1441329 -1611871 -1239902 -965298 -1130313 -1890116 -2034742 -1760546 -1333910 -1625520 -2027952
124 -2027952 -1128200 -295135 -876480 -2178163 -1573415 -1151143 -1285254 -1591634 -1718704 -1053291
114 -1053291 -510835 -1843079 -1802861 -1328259 -1585179 -1318175 -1983633 -2152255 -1816490 -1041858
104 -1041858 -1119808 -1256245 -1443742 -1302736 -2007107 -1839539 -1543772 -2251397 -2374734 -2254270
94 -2254270 -1910409 -1843184 -2216827 -2466477 -1464179 -1694122 -2078567 -1934746 -1384339 -1505190
84 -1505190 -2114617 -1733723 -916739 -872668 -1245275 -1552635 -1414224 -714571 -1373101 -1156622
74 -1156622 -450063 -208295 -786620 -619166 -1147176 -1503651 -1023329 -412197 -181824 -1732534
64 -1732534 -1869399 -993953 -47351 -1342765 -1999115 -806512 -1054038 -942176 -1627739 -2022476
54 -2022476 -2264094 -2058916 -1758146 -1831755 -1309970 -1274707 -1727207 -1637919 -1081941 -1145910 -1145782
43 -1145782 -1343165 -2127967 -1796060 -1050151 -1598213 -1200540 -1708894 -2299134 -2227458 -2166335
33 -2166335 -2769857 -2960870 -2709252 -1395964 -1660701 -1787267 -1372083 -1100181 -1191676 -1254987
23 -1254987 -1610778 -1064614 -1304839 -1883055 -1506615 -1736065 -1554675 -1750749 -1935771 -1786500
13 -1786500 -1465638 -1535173 -1499638 -1365557 -1423320 -1363716 -1417970 -1095521 -384707 -1293682 -1493372
2 -1493372 -1881113 -1236541
0 -1236541
$$ Imaginary data points
##PAGE= N=2
##DATA TABLE= (X++(I..I)), XYDATA
16383 -3949250 -4194080 -3191467 -2798195 -3411961 -4047734 -3429689 -3075612 -2970930 -3177221
16374 -3177221 -2922490 -2344361 -2162634 -2773578 -3892243 -3363784 -2925736 -3046462 -3192691
16365 -3192691 -2349583 -1683983 -1404767 -1996037 -2342638 -1557201 -1149487 -2249018 -2545052
16356 -2545052 -1754295 -951348 -921235 -1847167 -2091184 -1574528 -1130527 -1381098 -2170134 -1519225
16346 -1519225 -89823 248374 -604716 -931450 -385521 -97540 -357797 -902330 -816243
16337 -816243 -768848 -814852 -876604 -1013530 -306614 313600 -464219 -965336 1485 729518
16327 729518 1150234 708994 750568 1546521 1178805 541326 282688 430539 640556 -220909
16317 -220909 115299 1117980 951401 419706 601983 174791 1672084 1270578 1313977
16308 1313977 1520499 1042471 1380677 1599675 1336625 1553937 1806567 1950031 1944618 1563374
16298 1563374 1696863 2410414 2212180 2035373 2656736 2462939 2402830 1896939 1822874 2021266
16288 2021266 2103870 2248827 3021697 3059845 3549296 3358304 2545897 3186684 3263064 2917790
16278 2917790 2884796 3043503 3387947 3188349 3061285 3773017 3411655 3639406 3502299 3283883
16268 3283883 3288992 3422456 3532544 3852781 4453835 3737511 3311379 3211982 3532283 4031293
16258 4031293 3143728 2514323 3063543 3002827 3655645 3296022 3723592 4373276 4802945 4304432
16248 4304432 3700400 3918339 3922878 4335914 4312249 4262378 4688385 4828706 4313845 4200200
16238 4200200 4166509 4230237 3900134 4284019 5030393 4946430 4536937 4344813 4368774 4524622
16228 4524622 4542648 4597941 4810070 4560286 4681984 4206894 4247354 4921577 4721156 4703854
16218 4703854 5165843 5460179 5502736 5290129 4466281 4945970 5911509 4593722 4687989 5032943
16208 5032943 5900966 5830912 4602942 4807197 6089026 6820029 6414897 6252221 6493331
16199 6493331 6557751 6380171 6283491 7410600 6769722 5893915 6652684 7047723 6796201 5570170
16189 5570170 5880345 6735972 6197127 6240551 6851724 7557325 7282933 6455178 6130510 6277427
16179 6277427 6193983 5770291 6214965 6590973 5716891 5607425 5801845 6543466 5583794 5723017
16169 5723017 6756980 6171525 6121588 5724265 6326367 6556787 5968631 5286711 5769110
16160 5769110 6519906 6688858 5793291 5294618 6055536 6015225 5998924 6093447 6631540 7261343
16150 7261343 5881422 5587759 5845213 6064832 5612290 5611501 6821495 6678914 6032455 6500001
16140 6500001 6715773 6124764 6280230 6872159 6803253 6364728 5997061 6268026 6916801 6613126
16130 6613126 5999223 6621904 7936192 6953864 5921501 6723607 7687636 7880447 6942660
16121 6942660 6586224 7144364 7310759 6434007 5947152 6771964 7459500 7732051 7045282
16112 7045282 6723730 7717373 7300710 6985006 6535080 7281114 7993497 6978144 6637239
16103 6637239 6526689 6884779 7207293 7069335 6386909 6399148 6566546 8307038 8635318
16094 8635318 7708393 7217884 7739120 7561302 6694831 6430074 7756801 8391954 7251843
16085 7251843 6636021 6601293 8420184 7890955 6955537 7181724 7936784 7781039 7562701
16076 7562701 7357771 7805123 8293649 8113160 6757318 7659017 7786650 8050884 7159913
16067 7159913 6600743 7240272 7481099 8829384 8301756 8272868 7719120 6846143 6538623
16058 6538623 7189470 7081152 6257725 6222670 6377615 6949029 6483225 5921993 6801443 6909083
16048 6909083 6813157 6656315 6513797 7922953 6932215 6188565 5942691 6445031 7132293
16039 7132293 6661541 5937569 6613102 7447577 7450584 6613694 5902241 6659433 7282523 7227255
16029 7227255 7012177 6247442 6657484 7243101 6242099 5496842 5866535 7073460 6707290
16020 6707290 6642726 6900141 7582381 8022575 7228774 6367030 6375333 7599762 7900244 7543750
16010 7543750 7085382 7139972 8004555 7324237 6504348 7319460 8088838 7973869 8081797 8073341
16000 8073341 8746358 9015952 8069632 7330517 7520507 8399248 9567166 8598664 8151031
15991 8151031 8015837 8098340 7863281 7849164 7405411 6955683 7670788 8732448 7286619
15982 7286619 7281391 7587724 7805823 7154785 7587469 7876057 7888018 7707146 7766233 7591270
15972 7591270 7663548 8057925 6897179 6747851 6941786 7140570 6765268 6594767 7020325
15963 7020325 6497701 6149183 5610338 5762913 7052657 6749554 6900344 6488162 6297611
15954 6297611 6128771 5918741 6488931 6631764 6226529 5742030 6062935 6623560 6451852
15945 6451852 5953937 6560398 6509242 5949144 5555609 6040514 7526200 7327680 7349713 7691099
15935 7691099 7355027 6915040 6747766 7057184 7565796 7628188 7741313 7541546 7323436 7673701
15925 7673701 7743751 7095535 7045076 7250094 7386354 7710854 8396788 8316141 8112703 7609307
15915 7609307 8038518 8199489 7778758 6957871 7048979 7305578 7626856 7797355 7525410 7751301
15905 7751301 8481649 7914332 7472798 7811613 7517986 8025957 8248188 7033152 7600113
15896 7600113 8556551 7842813 6550117 7031105 7339693 8224485 7365976 6128605 6525100
15887 6525100 7414750 8672355 8247632 7563701 7235783 7413592 6692912 6769411 6818649 7252494
15877 7252494 8237199 8408262 8105053 7477639 7933283 8142678 7900891 7633897 8414408
15868 8414408 8597943 8324050 8637802 8551767 8022374 8644952 8196870 6808319 7163527
15859 7163527 8213176 7962239 7680655 8038464 8287129 7942093 7445323 7661141 8077639
15850 8077639 7825226 7329479 7549614 7640870 7317865 6207049 6804028 7577345 7479450 7819101
15840 7819101 8591395 8067691 7650539 6794156 7241640 6733336 7020316 6864901 6569078
15831 6569078 6063251 5545806 6817998 7668308 7921308 6962078 7305216 7859056 7621204
15822 7621204 7174484 6770227 6929783 7138548 6849547 6780658 7100917 7987260 7821904 6856866
15812 6856866 7363647 7754546 7893287 7614194 7589335 7429173 7885487 7965569 8194562 8109573
15802 8109573 7709162 8206078 8422426 8568510 7562185 7789687 8426670 8052298 7836371
15793 7836371 8277609 8773794 9210243 8822144 8346695 8600579 8489712 8069743 7769509
15784 7769509 7429745 6727329 7734880 7883973 7805680 7681516 7724153 8560001 7475533
15775 7475533 6779981 7841359 8199763 7184992 6849574 6717176 7861303 8111193 7211178
15766 7211178 7034239 7063117 7185276 8257731 7906535 7004595 7651419 8040034 7435778
15757 7435778 6735808 6571244 7225209 7695784 6881889 6970675 7675848 7907790 7544197 7190687
15747 7190687 7768137 7932405 7795242 6876802 6729779 7653084 7013584 5905977 6450650
15738 6450650 6940446 6892160 6354256 5871318 6267196 6615863 6272753 6700902 7401355 7940842
15728 7940842 8971902 8403869 7735110 7414923 7617182 7978293 7525200 6960075 7557098
15719 7557098 7790788 8398598 8320017 8503090 9264114 9194295 8066825 8127061 8954347 8876690
15709 8876690 7499302 7077271 7629110 7892117 7286522 6073485 7063834 8445211 8224955
15700 8224955 7311341 7571759 8271289 7624404 7168187 7551376 8520747 8230606 7544786
15691 7544786 7047054 6935049 7734475 8003381 7049519 6103407 6882637 7888260 8172443
15682 8172443 7412027 7858871 8368758 8327691 6956973 6605771 6980975 7535766 6847739
15673 6847739 6757100 6788428 7632622 7569719 7513851 7052879 7061247 7635518 7847676 7243049
15663 7243049 6294039 6978200 6650004 7275350 8000681 7687852 7854681 8096290 8424503
15654 8424503 8340853 7950874 8742329 8755111 8874295 8227045 7005679 6380908 8129148
15645 8129148 7815121 6646927 7309788 8548119 9219892 8475942 8035941 9239307 9765112
15636 9765112 8822849 7586661 7614787 8800468 9218657 8173100 7698233 8241134 8849502
15627 8849502 8520841 7900840 7413380 7886603 8479572 7887833 7596218 7160659 8184559
15618 8184559 8396787 7458771 6630056 7065415 7463901 7279041 7156172 7566482 8713565
15609 8713565 8857367 8258177 7548240 7323289 7416993 7002675 6968252 6601266 7620569 7947951
15599 7947951 7060997 7046612 7176085 7591411 6769343 6994085 7414475 7563447 7235837 6948399
15589 6948399 8109750 8160770 8017358 8111523 7769248 7573447 7572163 7828567 7863153 7781125
15579 7781125 7826581 7994387 7350449 7805532 7967823 6860740 7655512 8258862 8421974
15570 8421974 7647094 7761109 7662683 7840624 8459591 7401211 7333633 7786236 7857795 8261072
15560 8261072 7422380 7922699 9219761 8018500 7426311 7732927 7925428 8524241 7433127
15551 7433127 7875331 8630561 8515393 8086413 6732641 7279993 8592432 8059227 6702006
15542 6702006 7549962 8478733 8499498 8663753 7869125 8153430 8881220 8644280 8400161 7622642
15532 7622642 7714433 7254159 6685505 7362728 8397925 8306958 7823888 7021186 7932170 7723183
15522 7723183 7243695 7258731 7085935 7358709 7983215 7648691 6747029 6414509 6877017 7601512
15512 7601512 7134494 7270743 7714251 7639245 7248488 7369404 8365285 9092743 9150158 8782019
15502 8782019 8225315 8074217 7320527 7998700 8551856 7828719 7880114 7764192 8858557
15493 8858557 9071859 8456139 8170621 7450557 8055801 8277992 8286234 8275330 8402379 7872934
15483 7872934 7493367 8237548 8100604 7709473 7730108 9018490 8944561 8406517 7739924 9323805
15473 9323805 10057471 8365554 7465913 7741175 8568610 7308635 6383797 7031030 7708623
15464 7708623 7762200 6842256 6322551 7654539 9084559 7162876 6911577 7605871 7500456
15455 7500456 7544126 6230622 5883939 6671069 6748706 6636734 6567233 7570747 8160276 6948216
15445 6948216 7533416 7975009 8412798 8299630 8123878 7350987 7675893 7369187 7903507
15436 7903507 8038577 7695902 7918449 8758275 9307249 8891442 7568125 7985514 8743197
15427 8743197 7980387 8751175 8442489 8253382 8960780 8911524 9408050 9606555 8261217
15418 8261217 8095747 8754222 8745636 8557683 7684269 8629373 9419094 8497111 8034066 8144542
15408 8144542 8778436 8389867 7070747 7342300 8514430 8458477 7779343 7827680 8273706
15399 8273706 9199812 8588114 8097100 8207128 8006286 7668347 7059652 7624564 7514476
15390 7514476 7359609 7777541 7691083 7575069 6842492 7047401 6639986 6519282 6959820 7278450
15380 7278450 7750346 7687432 7622252 6880046 6978991 7128155 5976843 5406836 6684201 7666306
15370 7666306 8621103 7537134 7052492 7569029 7932301 8824561 8499220 7997995 8254542
15361 8254542 7675740 8662661 8015513 7637187 7992527 8135024 8258178 7156522 6482115
15352 6482115 8287507 8911275 7393915 6985502 7403516 8728893 8915676 7251129 7472481
15343 7472481 9275389 8684214 8278883 7510453 7710150 9531218 8658854 7695673 7744886
15334 7744886 7904354 8464183 8499644 8321220 7768177 7809730 7764882 7351486 6923761 7553877
15324 7553877 8733443 8914160 8570078 8068444 8580727 8784639 7998743 7104418 7810996
15315 7810996 8269302 8720108 7966958 6790292 6978615 7671388 7719923 7306427 7588523
15306 7588523 7521856 8106617 7622754 7912120 8253243 9641595 10022782 8799886 7946590
15297 7946590 7347577 7165442 7922174 7782740 7409725 8080873 7859086 7476424 6958821
15288 6958821 7849858 8490363 8795520 8002031 7758027 8100847 8195501 8076801 7684630 8028974
15278 8028974 8514681 7779642 7909829 7746574 7607673 7599951 7628986 8038949 8203820 7543361
15268 7543361 7317233 8163596 8135474 7683423 7241350 8053654 8116780 7862385 6674409 7171381
15258 7171381 7013515 7579601 7735618 7247184 8015240 9195848 8561134 7940140 7458669
15249 7458669 8332115 8666910 7634989 7442410 7000299 8197244 9019785 8007099 6581443
15240 6581443 7702275 8582927 9664924 8663983 7651410 8846096 9073732 8872391 7876628
15231 7876628 7654514 7965127 7497509 6914633 6759644 7381938 7963621 8062780 8233846 8692971
15221 8692971 9638766 8687066 7553261 8157164 7727887 7790972 8350772 7921576 8490034
15212 8490034 8170184 9159787 8726043 7866571 8138163 8499705 8408304 7463446 7695286 8743246
15202 8743246 9186102 7836987 7940099 7485706 7632081 7607040 7994228 7292023 7504020
15193 7504020 7702439 8531518 8627628 7856423 7955549 7915329 8017171 8475275 8642441 7991009
15183 7991009 7914779 7493455 7624847 7968558 8259408 8941978 8130613 8087085 9210861 8584995
15173 8584995 8988455 8588267 8416457 9087804 8623138 8198083 8149722 7530767 7121774 7791022
15163 7791022 8660962 8676509 8104419 8462761 7788183 8056064 8046547 7942553 8797980 9221544
15153 9221544 8651927 7299543 7618079 7491032 7178324 7997213 8490826 7999273 7888787
15144 7888787 7494514 8291772 9033321 8536186 8005593 8035124 7789250 7715390 7656996 7904443
15134 7904443 8364629 8279114 8066601 8834195 8240768 8363937 7982651 7839273 8901466
15125 8901466 8277881 8175881 8137084 8518481 7739823 6781847 6955743 7459929 7723554 7914574
15115 7914574 8619723 8809404 7874140 8182859 8144395 8122259 8070346 7061986 7293597 7502542
15105 7502542 7967249 7531831 7263996 8106139 8046397 8008172 8347237 8685877 9039370 8957413
15095 8957413 8679341 9584104 9093317 8462779 8999720 8866766 8273057 8275633 8462255 9451598
15085 9451598 9498340 8973630 9071591 10111775 10258767 9505566 8941846 9091680 9208718 8576788
15075 8576788 8694810 9630824 9257349 8437488 8248398 8999157 8954808 8424075 9021757 10138456
15065 10138456 10349089 8909703 8757787 8739219 8780313 7528881 7565511 8337650 8581369
15056 8581369 8271363 7502682 6783061 8193782 8068140 7602512 7779316 8856305 9241995
15047 9241995 9106903 9014960 7970369 8602311 8341187 7605792 6961332 7759277 7977278
15038 7977278 7994448 7334620 7556354 7748079 7970264 8743393 8230309 7707147 8318292 8177079
15028 8177079 7659204 8028916 8249707 8136156 7287345 7701223 7634233 7971056 8287435 8536082
15018 8536082 8767162 9285924 8694197 8707487 8643313 8624455 9093426 9042315 9630475 9728311
15008 9728311 8718446 8250885 8810665 9347983 8793454 8187847 8240951 8842361 8953826
14999 8953826 8117887 8204847 8490208 8309167 7797025 7258438 7611844 8059757 8806580 9227834
14989 9227834 8143703 8274012 8500835 8773845 8659848 8317716 7651609 8257333 8568002
14980 8568002 8534610 8422968 8645422 8146610 8192382 8229592 8691421 9514160 9155610 9275492
14970 9275492 8917448 8593022 8560369 8040463 8377203 8947119 9340283 9192842 8769384 9061016
14960 9061016 9162395 8257569 8045254 8708979 8932036 8131691 7997670 8686284 8795481
14951 8795481 7728898 8034251 8121115 8352017 8078241 8240472 8452727 8033482 7953563 8277862
14941 8277862 9086981 8647125 8039334 8511550 9403875 9497493 9016581 8953809 8878265 7818841
14931 7818841 8161944 7461357 8169850 9041682 9053823 8952789 8743041 8538825 8687635 8788322
14921 8788322 9361033 9152224 8699722 8783846 10093561 9895216 9927447 9851186 9141126 9118550
14911 9118550 8349964 8132765 8712272 9242333 9535217 9565151 10715634 10005478 9378404
14902 9378404 9835230 9274356 9274075 8674951 8475356 8931894 9661277 9370263 8313592 8645821
14892 8645821 9429582 9236776 8822087 8543439 8435734 8357287 8219434 8066369 8407578 8112583
14882 8112583 7474506 7380384 7527364 7978928 8330755 8575769 8515002 8229963 8523457 8772956
14872 8772956 9038520 8036064 7812783 8469268 9064129 8557168 8299636 7767597 8327391
14863 8327391 9059972 7957074 7572898 8995800 10171321 9968331 9411230 10226936 10861276
14854 10861276 9866082 8527881 9035797 9231973 8782559 9104995 8592112 8343322 8054234
14845 8054234 8807977 9399223 9288158 8677853 8387067 8814904 9634259 8764719 9074081
14836 9074081 9704357 9696805 8223526 7418833 8079899 8531098 8105031 7124852 8340377
14827 8340377 9828116 9249743 8875445 8411454 8939568 9285852 8076876 8080294 8081648 8237591
14817 8237591 8417880 7805305 8157834 8777184 8435003 8111457 8748687 9793546 8870704
14808 8870704 8757002 9498369 9921957 9827712 9525127 9178497 8836065 8591351 8820132 8983121
14798 8983121 8056773 8538802 8661098 9039314 9560479 9677998 10144959 10309234 9452857
14789 9452857 9008544 9732627 8986112 8925982 8424530 7556730 7540895 8104111 8412478 7974506
14779 7974506 7592346 8177614 8070246 8535826 8323339 8612159 7999561 7705912 8072362
14770 8072362 7494540 7253074 7765473 8244444 8137596 7864477 8107573 8424335 7956156
14761 7956156 8136297 8888175 8606547 7623823 7452845 7835877 8960730 9782697 8861415
14752 8861415 8246506 8335387 8763185 8024736 7744734 9267310 9557789 9130700 8214597
14743 8214597 7832736 7953777 8414298 7824186 7707299 9292624 9408134 9541794 8421344
14734 8421344 8719117 9711444 9993309 8726687 7758998 8991787 9678032 8935702 8706455
14725 8706455 9545899 9636207 9046516 8536678 8937881 8749192 8689405 7987289 8328455 8141248
14715 8141248 9102587 8647015 8460144 8470327 8639624 8518344 8943329 9225887 9295797 9215150
14705 9215150 8780977 8104456 8768608 8425708 8029934 8387445 8327371 9420717 9036829
14696 9036829 10376327 10041479 9469491 9133164 8180792 8885906 8636802 8187049 8327018
14687 8327018 9705357 9594803 8434995 9504519 9429648 9217086 10116267 10008724 10572101
14678 10572101 9883714 9241063 9272590 9026877 8661846 8223695 8028414 7686404 8101322
14669 8101322 8612524 9163751 8471018 8261802 8573001 7918257 7475819 7047560 7059769 8007945
14659 8007945 8198056 8018906 8064211 8064832 8158734 8598783 7828694 7765473 8612030 8761914
14649 8761914 8942012 7929567 7418611 8424805 8268935 8910403 9396039 9295557 8369434
14640 8369434 8335675 8083305 8631294 9380136 8388684 9283223 9873062 9905808 9187670 8002370
14630 8002370 8763639 9591078 9338280 9764363 10059376 10137183 9598243 8751160 8320837 9041822
14620 9041822 9164651 9162576 8950748 8856244 9276702 8952849 9406862 9879668 8546054 8290248
14610 8290248 8453465 8432981 8711473 8441863 8767419 7954426 8259323 8571265 9184833 9428581
14600 9428581 8900993 9089510 10010774 10382498 9375637 8186544 8267942 9098704 9139479
14591 9139479 7661181 8473276 9780840 10031785 9366740 9243120 9779041 9462859 9282014
14582 9282014 8917370 8318590 8819760 10309445 10517255 9488040 9141643 9863570 10112300
14573 10112300 9714196 9233253 9103261 9555580 10334404 9472502 9434197 10351615 10077838
14564 10077838 9080620 8732774 9628271 9495209 8472152 8395007 8927764 9867831 9430692
14555 9430692 8737783 8486297 9280855 8991250 9258167 9179452 8287055 9008539 9531887 8629089
14545 8629089 8523517 8819385 8517440 9231558 9270837 8688360 8510395 9038380 9504820 8683800
14535 8683800 8570315 9062097 8869434 8639571 7922331 7242292 8220429 8390199 8648055
14526 8648055 8276656 7883718 9279332 9033326 8942802 8985795 9361278 9857783 9725251 9037735
14516 9037735 8824392 9789641 9503794 8625628 8046655 8956852 9518183 9150027 9637352
14507 9637352 9650454 9550727 8812976 9002346 9346100 9358141 9239743 8839842 9400394 10360523
14497 10360523 10424917 9525360 8831795 8298322 8940628 8337908 8021855 8717106 9454672
14488 9454672 10033529 9795064 9740318 10632109 11455451 10316998 8770771 8968630 9386738
14479 9386738 8949841 9085595 9042362 9777345 9625923 8822052 8836583 9971071 9439948 8554194
14469 8554194 8347674 8660191 8946545 8698012 7985925 8216671 8708098 8938121 9562033
14460 9562033 9644015 9275711 9681740 10100785 10200533 9549730 9088753 9518950 8620631 8897534
14450 8897534 9163139 9407603 9437340 9699057 9875667 9756470 9475660 8498275 8521996 9122511
14440 9122511 8874000 9342414 9642069 9714547 10201708 9895558 9161386 9280044 9408284 9289230
14430 9289230 9480704 9227674 10096971 9935322 8857088 9123809 9743338 9741332 9036286 9127882
14420 9127882 9728287 10554880 10897401 10205036 10312904 10654837 10343435 9566621 8966851
14411 8966851 9369389 9624819 9780821 9469960 9332512 9591290 9445345 9418071 9319323 8571273
14401 8571273 8433804 9171834 9339591 9243213 8742055 8754351 9084109 8267757 8255299 8526718
14391 8526718 9202974 8752189 8891278 8243072 8653948 9433544 9358857 9659942 9223404 8438450
14381 8438450 8529288 9230963 10174725 9911317 9118142 9894830 9539308 8817932 8112179 8600537
14371 8600537 9005158 9175613 8711453 9064535 10020491 9268879 8985214 8500118 8806528
14362 8806528 10221914 9926798 9528672 9810876 10099496 10551709 10044823 8669078 9261787
14353 9261787 9630149 9560279 8992466 9664794 10269241 10529466 9769936 9144295 10015092 10254014
14343 10254014 9707345 9384263 9225510 9325639 10081861 10227028 10195318 9770085 9603110
14334 9603110 10367285 8800301 8719607 9793893 10062989 10722973 10178200 10456362 9897743
14325 9897743 9853743 10019598 8562690 8572166 10321554 10330639 9261047 8985354 9253854 10088967
14315 10088967 9828863 9396021 9226397 10207338 9703790 9511616 9730631 9140664 10008809
14306 10008809 8997470 8684376 8833326 8746544 8941503 9086297 8767504 8866966 8977052
14297 8977052 8650234 8886535 8254149 8304533 8479374 8079551 8288699 7813777 9199621
14288 9199621 9924057 8349566 7502075 8181342 8928291 8751582 8137823 8369704 9189487
14279 9189487 9097966 8098202 8429983 10159719 10201997 8939536 8900569 9890548 9691414 9499157
14269 9499157 9627475 9804045 10409512 9814677 9373541 10170929 9866063 9366157 9202114
14260 9202114 11054028 11259817 9992591 9464972 9220876 10353026 10508228 10214030 10210771
14251 10210771 10965803 10556406 10060115 10494748 10540331 10181724 9515149 9086620 9536060
14242 9536060 10005552 8836290 8366538 9049239 9115792 9349285 9642419 9057309 9096293 8942496
14232 8942496 9152407 9823721 8771071 8865079 9016573 10194951 10018761 9230510 9581627
14223 9581627 9932858 8936516 8408765 9106048 9367507 9351122 9524857 9752225 10306846 9987165
14213 9987165 8954489 9278381 9672959 9510249 9749148 9687309 9479682 9240390 8922200
14204 8922200 9477459 9682313 8852877 8892569 9266009 10463642 10320695 9459961 9362102 9984203
14194 9984203 10282948 8555215 8293908 9352007 10488534 9778644 9270316 9922532 10350628
14185 10350628 10001976 9281442 8894778 9480140 9491016 9908271 9411836 9206113 9492518
14176 9492518 9491455 9338258 9623967 9428970 8924013 9907874 9602651 8889163 9664696 10148618
14166 10148618 10759692 9253413 9207795 10175695 10972737 10143887 9205175 10315810 11406879
14157 11406879 11035563 9884722 9364422 9744443 10314866 9166036 9098607 9678417 9595441
14148 9595441 9161412 9150136 9320777 10314417 11093827 10647834 10303252 9721307 10242796 10919189
14138 10919189 10248902 9320160 9539057 9767674 9296526 9169161 8980256 9526413 10039599
14129 10039599 9733207 9408184 9701873 10174325 10105143 9260201 8466735 8690388 9152813
14120 9152813 9381642 9503905 8553403 8880794 9393893 8992143 8760037 9122550 10503504
14111 10503504 9837145 9426788 9729186 10423722 10257855 9611208 9307326 9951005 10532333
14102 10532333 10205516 10415825 10340725 10341405 10880130 10689885 9931391 10473421 10457755 10727988
14092 10727988 10611968 11390453 11273132 10491114 9384280 10269566 10537491 10143313 10372840
14083 10372840 10194343 10157887 10523078 10247383 10566072 10177075 10144846 10224533 10201529 10179048
14073 10179048 9079243 10142911 11329299 10924982 9977738 9569362 10088481 10436517 9598355
14064 9598355 8631932 9524066 10329703 10143142 9293362 8731087 9535095 9831620 8608395
14055 8608395 8099350 8623255 10015293 10564743 10336269 10525683 10454461 10236863 9649105
14046 9649105 9876321 9176418 9940890 10010832 9508514 9040883 9126728 10778990 10313109 9486240
14036 9486240 8767905 9039038 10508828 9940463 9664840 9715837 10785865 10623092 9267515
14027 9267515 9274975 8934858 9216795 9086527 9111510 9751584 9758629 9872581 9652604 10176072
14017 10176072 9762268 9385626 9765288 10260855 10289515 9227299 9747719 10034435 9497227
14008 9497227 9155271 10412208 11325507 10688728 9799981 9597122 11207037 11587896 10928276
13999 10928276 10533537 10528035 11224203 10449047 9654295 9858176 10379012 11475807 10288192
13990 10288192 10100126 11099098 11263293 11173168 10464228 9614732 10665830 11035347 11028282 10501065
13980 10501065 9741930 10274370 10900049 10460154 10529337 10740878 11010407 11230302 10426058
13971 10426058 10299414 10843548 10490549 10211467 10408603 10637626 10368103 10977372 10521372
13962 10521372 11084209 11235046 9980455 10378685 10396245 10129906 9295187 8963788 10178132
13953 10178132 11668560 11396305 9882115 9398258 10615414 10365536 9429328 9626891 10779965
13944 10779965 10580775 10189043 9120224 9053436 10995220 10924894 9686953 9479240 9386211
13935 9386211 10070969 10548051 10326966 9841874 10309090 10745176 10078604 9143598 9722341
13926 9722341 10499317 9738927 9526095 9962176 10971430 10664733 9755940 9508413 9862171
13917 9862171 10424027 10182619 9915907 9911591 10772972 11507617 10538893 11161531 11040770 10719446
13907 10719446 10526361 9529672 10275120 10965439 11903789 10710051 10767912 10771149 11679189 11089355
13897 11089355 9596770 10060421 10604290 10865533 10341660 8723896 10112033 10276295 10489701
13888 10489701 10130753 9766165 10534829 10491541 11585552 11229713 10869624 11131260 11061204
13879 11061204 10544035 10252673 11290601 11089224 10442875 10272598 10780482 11534384 10748395
13870 10748395 10457078 10065545 11050371 11675211 10055068 9269732 9909039 10272754 10790961
13861 10790961 10765044 11081077 10793723 11047228 10848735 10203475 10281876 10546015 10839773 10787354
13851 10787354 10594817 11039039 11022959 10459527 9869540 10268725 11087833 11466738 10861998
13842 10861998 11346144 11171889 10933081 10499481 9680581 10587822 11389821 10543996 9195275
13833 9195275 9456365 10273365 10469262 10504269 10338362 10992416 10370880 10795439 10904976 10857067
13823 10857067 11087414 9495469 8807433 9345924 9736198 9659897 8519152 8922318 10264622
13814 10264622 10052783 9093260 9539739 9871611 9710715 9358546 8826843 9926178 11399593
13805 11399593 10972737 10421844 9818982 10645573 11482598 10555911 10181102 10302077 9929560
13796 9929560 8724158 9751727 9964401 9863211 10859089 11117669 10900873 10715757 10458527
13787 10458527 10550478 10194306 10556427 10109117 10709932 11350015 11894934 11740038 10761089
13778 10761089 10973010 10762558 10509801 10503764 10768352 10682167 10760043 11002811 11751561 11647779
13768 11647779 11473782 11680699 11637298 10977737 11454377 12265850 12466481 11255751 10613058
13759 10613058 11843386 12423895 12131629 11268200 11315969 11599904 11862801 11153135 10349575
13750 10349575 10642504 11374917 10912353 10728958 11122589 11107111 10986205 10479513 10016189
13741 10016189 10591760 10833763 10658775 9303959 9221659 10256364 10765723 10214814 9756810
13732 9756810 10023087 9961627 10183866 9843710 9665393 10346710 10016468 9204451 9377165 9990975
13722 9990975 11048691 10808754 10441136 11193357 10831373 11547874 11162807 10998340 11300810
13713 11300810 11275690 11074160 10336846 9902363 10411583 9895780 9842275 10589290 10194938 10240677
13703 10240677 10594857 10890271 10421291 11027674 10363720 10741472 10579580 10656041 10226402
13694 10226402 9880534 10599155 11213548 10981233 10638177 11323423 11708440 11627109 11610371 11592856
13684 11592856 11372407 11719176 11670817 11428672 11186861 11180823 11654404 12379487 11438135 11121743
13674 11121743 10751982 11508319 12185055 11825229 11356291 11609384 11478147 10723016 10734146
13665 10734146 11365589 11634129 11556428 11425524 11560884 10931085 10667205 11044701 10844513
13656 10844513 10609335 10901685 11810342 11507005 11141880 10979405 11036492 11032722 11343142 10935601
13646 10935601 11098219 11189200 10786501 10503423 10625564 10347083 10651032 11076261 10224550
13637 10224550 11030698 11582504 11518080 11654853 11494747 11772663 12308115 11581139 10755774
13628 10755774 11381104 11796483 11769634 11872913 12136798 12442897 12338951 11635272 12268241
13619 12268241 12355939 11653163 12000239 12028584 11515314 12009524 12090082 11136702 11027318 11429642
13609 11429642 12221110 11783289 10331673 11457637 11971470 12016748 11476457 10831987 10682212
13600 10682212 11049269 11187252 11675177 11745504 11976019 11607848 11223708 10802880 11465463
13591 11465463 12100021 11287506 11147646 11620008 11755785 11063496 10606062 11049201 10778475
13582 10778475 10648445 10532551 10511056 10792169 10561583 10983274 10677755 10850138 10360273
13573 10360273 10874382 11870116 11623112 10598471 10258931 11058164 10979861 10116639 9494921
13564 9494921 10277762 11517026 11189377 11017071 11575346 11864635 12328139 11124748 10349915
13555 10349915 11193591 11126338 10785216 10010468 10845279 11703740 11498083 11162906 11225345 12135435
13545 12135435 12851057 11740197 11416385 11839518 12156453 12145901 11931462 11288557 12090465
13536 12090465 12546915 11357126 11176949 11049946 10781186 11115299 11099498 11411026 12037065
13527 12037065 11952255 11747509 11424443 11276399 11055130 11370074 12063442 10907691 10696786
13518 10696786 10786724 11377745 12253486 11713636 10700673 11080420 12320393 12503298 12126758
13509 12126758 11314491 12029020 12625021 12178157 10665836 10481434 12254542 12287242 11524588
13500 11524588 11627054 12298626 12944378 12604530 11291428 11528103 11700133 11677868 11733902
13491 11733902 11088726 12460838 12332182 11833225 11680344 11338858 11419736 11207167 10790182
13482 10790182 10278062 10788365 10925485 10805837 10692085 10667939 10385692 10068489 10339994
13473 10339994 10146578 9115460 9883118 10470057 10278568 9631571 8956610 9887269 10553492
13464 10553492 10374194 9909297 10229313 10765787 10480622 9969862 10251537 10863234 9952157
13455 9952157 9419324 10143690 10436752 10577114 10100462 10180916 11183294 11556323 11770727
13446 11770727 12258840 11598915 11795887 12213836 11664235 11893707 11822575 11602336 11355796
13437 11355796 12185761 12930326 12607187 12580453 12739076 13617484 12919556 12275830 12176440 12435587
13427 12435587 12018603 11895110 12279398 11932228 12012567 11490565 11614048 11278622 11694041
13418 11694041 11827167 11951780 12454460 12794283 12802771 12128268 11886336 11808867 11759511 11369345
13408 11369345 11415953 11010125 11332398 11082933 10777067 10804670 11396783 11357103 11590391 11724879
13398 11724879 12575122 12966052 12146985 11358709 11567349 11049652 10362835 10414623 10203448
13389 10203448 11720670 11756066 11571912 11973022 12190630 12200427 11826261 11593722 12088930 11666411
13379 11666411 11254798 11039655 11342838 11621541 11394118 11619685 10857182 11137915 11837168
13370 11837168 12003045 10879867 11369418 12105573 12743168 11750276 10284720 11293494 11516984
13361 11516984 11436219 11502050 11165536 11276297 11004130 10915104 10968985 11743785 11797437 11161080
13351 11161080 11632893 11881630 12190004 11180855 10107002 10360159 11175313 11604429 12002764
13342 12002764 10722764 10843082 12015095 12196920 11670226 11311390 11733755 12625338 11915906
13333 11915906 11132370 11045930 12024798 12347578 12025452 11860079 11675512 12168576 11874510
13324 11874510 11980471 12089003 12801200 13219634 13341796 13413613 13339247 13263664 12466920 11695375
13314 11695375 12383268 12506670 12414787 12733936 11949121 11990338 11765357 11949890 11992388 12325714
13304 12325714 11888183 11739722 12237226 12085109 11596827 11379274 11832456 11474407 11469918 11429568
13294 11429568 12266217 12525283 11556326 10496248 10857493 11851743 11480456 11279238 10840284
13285 10840284 11445612 11802378 11685615 11559770 11624087 12528180 11715396 11127627 11738776
13276 11738776 11456156 11503349 12163410 11504771 11070213 11382656 11492922 12028609 12218218
13267 12218218 11952012 11328126 11354489 11307919 10501232 11319203 12806159 12365949 12028276
13258 12028276 12329293 12043159 12180139 12541362 12430793 12053430 11694587 12003800 11561229
13249 11561229 10865264 10950238 11553120 12403082 11547792 11992346 13052634 13160269 13428272
13240 13428272 13017292 12667089 12265021 12053457 11630595 11344311 11767388 11719534 11941243
13231 11941243 11439826 11649219 11823491 12534946 12814310 12173777 12363096 12367126 12451390 12405430
13221 12405430 11448961 10312981 11272699 12024325 11597413 10380059 11297789 12621092 13131108
13212 13131108 12307438 12145429 12628138 12687226 11738538 10644431 10634199 11618393 12151203
13203 12151203 11135598 10875750 11652371 12449885 12345939 11540615 11251878 11573814 11055452
13194 11055452 11424023 11366488 11476691 11321831 11090658 10797287 10149656 10374732 11138346
13185 11138346 11976808 11443308 11023239 10803511 11351013 12014052 11642279 12362509 11874863
13176 11874863 12068689 12290777 11652243 11186963 12327027 12946085 12507672 11602852 11225413
13167 11225413 12335433 12755042 12577708 12750660 12538591 14000685 14120561 13324470 13421392
13158 13421392 13141295 13581190 12853070 12636769 13798393 14592527 14369333 13884675 13246496
13149 13246496 14017009 15292402 14176047 12671879 12331804 12697763 12689155 12218156 11237920
13140 11237920 12822408 12993891 12337555 11426535 11070250 12749962 13144013 13112272 12867588
13131 12867588 12843913 13653671 12379760 11324569 10868190 12240668 12550511 10226838 9947497
13122 9947497 10570933 12070895 12330366 11803945 11328494 11905293 11774224 11468024 11622877
13113 11622877 11522337 12157988 11857902 11164947 11445760 12233614 12285082 11572752 11812656
13104 11812656 12256106 12588496 12111941 12428735 12581081 13308711 13324241 12574850 12255273
13095 12255273 12949067 13484175 12689286 12406809 13397243 13451690 12723675 11898098 13018219
13086 13018219 13286786 13159514 12730029 12930752 14135189 13466497 12949759 12678311 12750592
13077 12750592 14320717 12543644 11615176 12897122 14124057 13400873 13088912 13512515 13624851
13068 13624851 13927362 13278833 13132585 12337214 12644992 12811699 12311050 12086905 12558569
13059 12558569 12933315 13233447 12292305 12700392 13529007 12406781 12435559 12507450 13234184
13050 13234184 13067081 13022334 12568834 12689231 12895212 12120113 12122216 12544588 12913318 12782612
13040 12782612 12886751 13030909 13308279 12841980 12483078 12448608 13460870 13358578 13202122
13031 13202122 12044079 12443012 12760571 12662169 12657567 12390330 12278487 12805244 12827344 12188356
13021 12188356 12342278 12626003 12946933 13109699 13437523 13249245 12861825 12871641 12777535 12888615
13011 12888615 13198215 12259026 12906639 13011909 12843413 13118927 12835827 12708543 12810014
13002 12810014 13637748 13326983 12703957 13360028 13452497 12908333 12551678 12895762 13529538
12993 13529538 13267028 13655250 13121718 13471247 13032267 12370225 12396564 12591647 13235590
12984 13235590 13719304 12870646 13004980 13268764 13969276 14194319 13802257 13321088 14031852
12975 14031852 14265996 13982493 13768504 13665233 15102207 14315222 12711050 13180814 13307415
12966 13307415 13935863 14017170 13020700 14055305 14038588 13291732 12307961 12629678 13237679
12957 13237679 13812821 13509570 12708779 13282359 13700019 13803881 13046151 13269810 14059795
12948 14059795 12997692 13841965 13926130 13314805 14092007 14216453 14760257 14849495 14401134
12939 14401134 14721536 14222000 13848158 13773368 14441922 13822691 13311616 13500356 14300514
12930 14300514 14187258 13070645 13404150 14594057 14873186 14960069 14301671 13776852 14197939
12921 14197939 14157786 13927172 14022376 14245595 14773650 13784753 12700185 12862655 13008739
12912 13008739 13221601 13001243 13229833 12660248 13146060 13820813 14036629 13756985 13687252
12903 13687252 14090341 13768364 13371262 13354543 13709567 14143365 13709828 12975957 13494641
12894 13494641 14206009 13364115 13488480 13772125 14265878 14614994 14076748 13759294 14316662
12885 14316662 14060716 13917429 13559925 14303296 15400081 15058809 14373534 14329893 15303813
12876 15303813 16082911 15275472 13771228 14150049 15048703 14783889 13944999 13998158 15031474
12867 15031474 15054821 14346042 14735505 14731745 15306758 15179652 14871696 14935814 14426810 14705835
12857 14705835 15274796 14979032 14435373 13983257 14062281 15114588 14544661 13464900 14367266
12848 14367266 14753879 14222529 13312955 14291591 15130279 14673968 13521245 13171514 13655091
12839 13655091 13689878 12961368 12570050 13980819 14718670 13421684 13131596 13799049 14134899
12830 14134899 14135435 14046685 14227897 14548225 13960776 14182703 14134858 14153198 13595003 13356008
12820 13356008 13615654 13280147 13131020 13168852 14134739 14865020 14349768 14178720 14145276 14615402
12810 14615402 14194156 13465077 13049090 13192019 13743597 14122841 14901222 14464564 14177345
12801 14177345 14635627 15424523 15368714 14550290 15209890 16054983 14544155 14667333 14540163
12792 14540163 14701387 14492139 14176774 14005820 15216570 15380843 15138653 14561118 14234731
12783 14234731 15998407 14928169 13890593 14778500 15110389 14838718 14335159 14403684 16299853
12774 16299853 16122010 15207728 14725449 15574464 16081430 14583130 14420662 15189529 15395756
12765 15395756 15549050 16104759 14921945 15126044 15068935 14298009 13988241 14310362 14541260
12756 14541260 15209192 14936765 14930979 14516295 14970214 15885646 14974819 14668762 15843806
12747 15843806 15860029 14953626 14435185 14251561 14490582 14659943 14338993 13680117 13150389
12738 13150389 13240355 13854126 13581450 13854777 14312505 14020526 13955072 13833666 13634227 14095127
12728 14095127 13841489 13616758 12886570 13191625 14586393 14674601 13658110 13374365 14182496
12719 14182496 15139770 14671536 13341176 13671883 14746085 14897122 14855114 14852862 15425393
12710 15425393 15030261 14441491 14576684 15295930 15582864 15632375 15667255 14446264 14717553
12701 14717553 15738294 15702157 15689276 14656113 14239815 15806934 16241566 15637042 15232001
12692 15232001 16108600 16519412 15367566 14371142 14527391 15331994 14524941 14168483 15050524
12683 15050524 15398020 15303813 13937694 13863486 15098984 14822896 14898522 14560237 15058695
12674 15058695 15366824 14902625 15437398 15650994 14377207 14384224 14583004 15751000 15730329
12665 15730329 15017048 15446498 15918081 15619484 14508783 14535129 14617724 15135607 14718555
12656 14718555 13864955 14339742 15590692 15542167 14537038 15018754 15687561 16065822 15335615
12647 15335615 14547252 15138580 15490120 15478662 16080124 15906446 15238174 15530665 16318134
12638 16318134 15480515 14797757 16180468 17569701 17171551 15082151 15375066 16012389 15707369
12629 15707369 14697195 14672537 16280625 16172290 15618437 15001565 15764597 15941791 15414068
12620 15414068 14963002 14777141 16485267 16868654 15863627 15487850 16654788 16977414 16372244
12611 16372244 15675873 16361190 16132698 15332511 15532441 16463294 16295363 15933385 16186835
12602 16186835 16350522 16837777 16087870 15916506 16861604 16905405 16050051 16222291 16486630
12593 16486630 17013653 16808393 15887008 16758083 15950965 15744134 15766823 15750028 15993824 15764183
12583 15764183 15416978 14863008 15245332 15046188 15303639 15886674 16193780 16184237 15523376 15252321
12573 15252321 15981923 15992608 15658178 15606416 16206215 16047909 16507896 16650737 16195577 15377991
12563 15377991 14793126 15944753 15502764 16109659 15980273 15676775 16595823 17042523 16561776
12554 16561776 15168096 15730840 16787439 16457802 16151771 16089657 16368451 17190624 16750071
12545 16750071 16958919 16872337 17037315 17093325 16970205 16590342 16072665 16302328 16876534 16669967
$$ [...]
##END NTUPLES=NMR SPECTRUM
##END=
