##TITLE=1H_CG-1139-1
 CDCl3, 8 sc, 
 23.12.2020
##JCAMPDX= 6.0         $$ Bruker NMR JCAMP-DX V2.0
##DATA TYPE= NMR SPECTRUM
##DATA CLASS= NTUPLES
##ORIGIN= UXNMR, Bruker Analytische Messtechnik GmbH
##OWNER= root
$$ XWIN-NMR		Version 3.5
$$ Wed Dec 23 10:44:28 2020 Russian Standard Time (UT+4h)  she@DPX200
##.OBSERVE FREQUENCY= 200.1315066352
##.OBSERVE NUCLEUS= ^1H
##.ACQUISITION MODE= SIMULTANEOUS
##.ACQUISITION SCHEME= undefined
##.AVERAGES= 8
##.DIGITISER RES= 18
##SPECTROMETER/DATA SYSTEM= spect
##.PULSE SEQUENCE= zg30
##.SOLVENT NAME= CDCl3
##.SHIFT REFERENCE= (INTERNAL, CDCl3, 0, 15.9782)
##AUDIT TRAIL= $$ (NUMBER, WHEN, WHO, WHERE, WHAT)
$$ ##TITLE= Audit trail, XWIN-NMR		Version 3.5
$$ ##JCAMPDX= 5.01
$$ ##ORIGIN= Bruker BioSpin GmbH
$$ ##OWNER= she
$$ F:/spectra/data/she/nmr/H-F/1/pdata/1/auditp.txt
$$ ##AUDIT TRAIL=  $$ (NUMBER, WHEN, WHO, WHERE, WHAT)
(   1,<2020-12-23 10:42:57.34 +0400>,<she>,<DPX200>,
      <created by zg, POWCHK disabled, PULCHK disabled
       configuration hash MD5:
       00 E9 B6 7A A2 85 ED C7 34 08 36 98 17 FE 4E 26
       data hash MD5: 16K
       A5 67 53 61 91 1A 3C 96 B3 5E 42 38 74 C2 ED C4>)
(   2,<2020-12-23 10:43:00.25 +0400>,<she>,<DPX200>,
      <Start of raw data processing
       efp BC_mod = 2 LB = 0.24 FT_mod = 6 PKNL = 1 PHC0 = -10770.95 PHC1 = 23.40095 SI = 16K 
       data hash MD5: 16K
       AC AC B0 4C 50 DB 2D 1E 32 8C 12 61 19 CB 7F A5>)
(   3,<2020-12-23 10:43:23.23 +0400>,<she>,<DPX200>,
      <pk PHC0 = -5.707993 PHC1 = 4.199999 
       data hash MD5: 16K
       97 3E 5C 7F 50 56 CB 18 88 70 9C AD F3 D6 13 44>)
(   4,<2020-12-23 10:43:26.95 +0400>,<she>,<DPX200>,
      <abs ABSG = 5 
       data hash MD5: 16K
       56 AB E3 14 E0 02 7F 6E F9 EA 13 D9 70 C4 A6 29>)
(   5,<2020-12-23 10:43:57.40 +0400>,<she>,<DPX200>,
      <abs ABSG = 5 
       data hash MD5: 16K
       1B C3 96 5A D4 D0 60 BD 16 AD 90 ED A9 E3 8B 5D>)
$$ ##END=
$$ 
$$ hash MD5
$$ 8C 85 23 84 3C 97 D6 16 AB 5A 99 DE 35 23 02 93
##$RELAX= 
##$RELAX= 
##$RELAX= 
##$RELAX= 
##$RELAX= 
##$RELAX= 
$$ Bruker specific parameters
$$ --------------------------
##$DU= <F:/spectra>
##$EXPNO= 1
##$NAME= <H-F>
##$PROCNO= 1
##$TYPE= <nmr>
##$USER= <she>
##$AMP= (0..31)
100 100 100 100 100 100 100 100 100 100 100 100 100 100 100 100 100 100 
100 100 100 100 100 100 100 100 100 100 100 100 100 100 
##$AQSEQ= 0
##$AQ_mod= 1
##$AUNM= <au_zg>
##$AUTOPOS= <>
##$BF1= 200.13
##$BF2= 200.13
##$BF3= 200.13
##$BF4= 200.13
##$BF5= 200.13
##$BF6= 200.13
##$BF7= 200.13
##$BF8= 200.13
##$BYTORDA= 1
##$CFDGTYP= 0
##$CFRGTYP= 5
##$CHEMSTR= <none>
##$CNST= (0..31)
1 1 145 1 1 1 1 1 1 1 1 1 1 1 1 1 1 1 1 1 1 1 1 1 1 1 1 1 1 1 1 1 
##$CPDPRG= <>
##$CPDPRG1= <>
##$CPDPRG2= <>
##$CPDPRG3= <>
##$CPDPRG4= <mlev>
##$CPDPRG5= <mlev>
##$CPDPRG6= <mlev>
##$CPDPRG7= <mlev>
##$CPDPRG8= <mlev>
##$CPDPRGB= <>
##$CPDPRGT= <>
##$D= (0..31)
0 1.2 0 0 0 0 0 0 0 0.06 0 0.03 0 0 0 0 0.0002 0 0 0 0 0 0 0 0 0 0 0 0 
0 0 0 
##$DATE= 1608705776
##$DBL= (0..7)
$$ [...]
##$SUBNAM3= <"">
##$SUBNAM4= <"">
##$SUBNAM5= <"">
##$SUBNAM6= <"">
##$SUBNAM7= <"">
##$SUBNAM8= <"">
##$SUBNAM9= <"">
##$SW= 16.9725356469052
##$SWIBOX= (0..15)
0 0 2 0 0 0 0 0 0 0 0 0 0 0 0 0 
##$SW_h= 3396.73913043478
##$TD= 16384
##$TD0= 1
##$TE= 0
##$TE2= 300
##$TE3= 300
##$TEG= 300
##$TL= (0..7)
0 120 120 120 120 120 120 120 
##$TP= (0..7)
150 150 150 150 150 150 150 150 
##$TP07= 0
##$TPNAME0= <>
##$TPNAME1= <>
##$TPNAME2= <>
##$TPNAME3= <>
##$TPNAME4= <>
##$TPNAME5= <>
##$TPNAME6= <>
##$TPNAME7= <>
##$TPOAL= (0..7)
0.5 0.5 0.5 0.5 0.5 0.5 0.5 0.5 
##$TPOFFS= (0..7)
0 0 0 0 0 0 0 0 
##$TUNHIN= 0
##$TUNHOUT= 0
##$TUNXOUT= 0
##$USERA1= <user>
##$USERA2= <user>
##$USERA3= <user>
##$USERA4= <user>
##$USERA5= <user>
##$V9= 5
##$VALIST= <valist>
##$VCLIST= <CCCCCCCCCCCCCCC>
##$VD= 0
##$VDLIST= <DDDDDDDDDDDDDDD>
##$VPLIST= <PPPPPPPPPPPPPPP>
##$VTLIST= <TTTTTTTTTTTTTTT>
##$WBST= 1024
##$WBSW= 4
##$XGAIN= (0..3)
0 0 0 0 
##$XL= 0
##$YL= 0
##$YMAX_a= 25117
##$YMIN_a= -11161
##$ZGOPTNS= <>
##$ZL1= 120
##$ZL2= 120
##$ZL3= 120
##$ZL4= 120
##$ABSF1= 15.97817
##$ABSF2= -0.9944916
##$ABSG= 5
##$ABSL= 3
##$ALPHA= 0
##$AQORDER= 0
##$ASSFAC= 0
##$ASSFACI= 0
##$ASSFACX= 0
##$ASSWID= 0
##$AUNMP= <proc_1d>
##$AZFE= 0.1
##$AZFW= 0.1
##$BCFW= 0
##$BC_mod= 2
##$BYTORDP= 0
##$COROFFS= 0
##$CY= -3
##$DATMOD= 1
##$DC= 0
##$DFILT= <>
##$DTYPP= 0
##$F1P= 0
##$F2P= 0
##$FCOR= 1
##$FTSIZE= 16384
##$FT_mod= 6
##$GAMMA= 0
##$GB= 0
##$INTBC= 1
##$INTSCL= 2.992141e-10
##$ISEN= 128
##$LB= 0.24
##$LEV0= 0
##$LPBIN= 0
##$MAXI= 10000
##$MC2= 0
##$MEAN= 0
##$ME_mod= 0
##$MI= 1.114404
##$NCOEF= 0
##$NC_proc= -8
##$NLEV= 6
##$NOISF1= 3.799351
##$NOISF2= 2.8
##$NSP= 0
##$NTH_PI= 0
##$NZP= 0
##$OFFSET= 15.97817
##$PC= 1
##$PHC0= -10776.66
##$PHC1= 27.60095
##$PH_mod= 1
##$PKNL= yes
##$PPARMOD= 0
##$PSCAL= 0
##$PSIGN= 0
##$REVERSE= no
##$SF= 200.130007292365
##$SI= 16384
##$SIGF1= 3
##$SIGF2= 2
##$SINO= 5.538805
##$SIOLD= 16384
##$SREGLST= <1H.CDCl3>
##$SSB= 0
##$STSI= 16384
##$STSR= 0
##$SW_p= 3396.73913043478
##$SYMM= 0
##$S_DEV= 0
##$TDeff= 16384
##$TDoff= 0
##$TI= <>
##$TILT= no
##$TM1= 0
##$TM2= 0
##$TOPLEV= 0
##$USERP1= <user>
##$USERP2= <user>
##$USERP3= <user>
##$USERP4= <user>
##$USERP5= <user>
##$WDW= 1
##$XDIM= 16384
##$YMAX_p= 316368301
##$YMIN_p= -1401191
$$ End of Bruker specific parameters
$$ ---------------------------------
##NTUPLES= NMR SPECTRUM
##VAR_NAME=  FREQUENCY,     SPECTRUM/REAL,   SPECTRUM/IMAG
##SYMBOL=    X,             R,               I
##VAR_TYPE=  INDEPENDENT,   DEPENDENT,       DEPENDENT
##VAR_FORM=  AFFN,          ASDF,            ASDF
##VAR_DIM=   16384,         16384,           16384
##UNITS=     HZ,            ARBITRARY UNITS, ARBITRARY UNITS
##FACTOR=    0.207333158178281, 1,           1
##FIRST=     3197.71135764948, 0,            0
##LAST=      -199.0277727853, 0,             0
##MIN=       -199.0277727853, -1401191,      0
##MAX=       3197.71135764948, 316368301,    0
$$ Real data points
##PAGE= N=1
##DATA TABLE= (X++(R..R)), XYDATA
$$ [...]
$$ plain form
4001 4384866 4710086 4799965 4920697 4822442 4988078 5293115 5008626 5030341 5016723 5090050
3991 5090050 4906880 4791294 4462078 4197919 4495367 4003100 3863521 3984653 4059545 3882024
3981 3882024 3962867 4231747 3975771 4379143 4420298 4496175 4486315 4864428 5046851 4753307
3971 4753307 4841733 4941759 4799351 5063164 4961677 4941118 4318043 4356789 4245014 4563534
3961 4563534 4629216 4726962 4574927 4139068 3988445 3940992 4225589 4094607 4219935 4003741
3951 4003741 3702099 3614168 3390564 3298240 3377685 3477979 3399287 2554780 2944368 3270573
3941 3270573 3632868 3495573 3728928 3996150 3787985 3651996 3744354 3856716 3543767 3369215
3931 3369215 3233285 3569366 3465162 2800181 2548485 2581877 2873338 2638945 2543411 2442959
$$ packed form
4001D384866L25220Q9879J20732r8255J65636L05037k84489K1715j3618P3327
3991E090050j83170j15586l29216k64159K97448m92267j39579J21132P4892j77521
3981C882024Q0843K68880k55976M03372M1155P5877r860L78113J82423k93544
3971D753307Q8426J00026j42408K63813j01487k0559o23075L8746j11775L18520
3961D563534O5682R7746j52035m35859j50623m7453K84597j30982J25328k16194
3951D003741l01642q7931k23604r2324P9445J00294p8692q44507L89588L26205
3941C270573L62295j37295K33355K67222k08165j35989R2358J12362l12949j74552
3931C369215j35930L36081j04204o64981k51696L3392K91461k34393r5534j00452
$$ plain form
3921 2442959 2437894 2351707 2244726 2505072 2431099 2634924 2461980 2264382 2350730 2297270 2457066
3910 2457066 1804668 1613751 1388992 1801056 2118319 1836158 1628805 1580366 1802234 1611296
3900 1611296 1674004 1578074 1184220 1505706 1826433 1975899 1629620 1465883 1653015 1335094
3890 1335094 1084228 830482 1157398 992148 901327 1106290 1159157 1190766 1047196 986445
3880 986445 831017 1363085 1270672 639064 861923 974523 1001815 1011096 1020244 816079 1054172
3869 1054172 1091874 965737 975928 1087197 1090532 661632 657999 959679 961605 733117 513543
3858 513543 390992 660233 742567 576483 320469 198680 421698 953298 943075 841681
3848 841681 637113 436803 374336 717099 694341 451489 625553 471983 1010206 1390930
$$ packed form
3921B442959n065q6187j06981K60346p3973K03825j72944j97598Q6348n3460J59796
3910B457066o52398j90917k24759M12064L17263k82161k07353m8439K21868j90938
3900A611296O2708r5930l93854L21486L20727J49466l46279j63737J87132l17921
3890A335094k50866k53746L26916j65250r0821K04963N2867L1609j43570o0751
3880I86445j55428N32068r2413o31608K22859J12600K7292R281R148k04165K38093
3869A054172L7702j26137J0191J11269L335m28900l633L01680J926k28488k19574
3858E13543j22551K69241Q2334j66084k56014j21789K23018N31600j0223j01394
3848H41681k04568k00310o2467L42763k2758k42852J74064j53570N38223L80724
$$ plain form
3838 1390930 1028261 742500 366743 308085 308402 389350 286130 24083 407481 533345
3828 533345 995712 809036 735364 538991 195719 -34008 377235 92774 687394 848399
3818 848399 546117 685801 734323 688724 329744 91416 112837 91836 482131 768522
3808 768522 741525 733581 752020 842358 738123 546276 556180 837956 724972 725959 354760
3797 354760 355741 516348 227771 146312 188278 41903 295069 114149 288189 584272 1031158
3786 1031158 453698 214204 481720 1092823 955094 976855 852609 794644 263409 411795
3776 411795 155479 -115496 127662 103819 307689 509257 81912 -189424 -304928 -146332
3766 -146332 445483 374864 550160 426172 364899 577550 867876 533767 390702 -95227
$$ packed form
3838A390930l62669k85761l75757n8658L17Q0948j03220k62047L83398J25864
3828E33345M62367j86676p3672j96373l43272k29727M11243k84461N94620J61005
3818H48399l02282J39684M8522m5599l58980k38328K1421k1001L90295K86391
3808G68522k6997p944J8439R0338j04235j91847R904K81776j12984R87l71199
3797C54760R81J60607k88577q1459M1966j46375K53166j80920J74040K96083M46886
3786A031158n77460k39494K67516O11103j37729K1761j24246n7965n31235J48386
3776D11795k56316k70975K43158k3843K03870K01568m27345k71336j15504J58596
3766a46332N91815p0619J75296j23988o1273K12651K90326l34109j43065m85929
$$ plain form
3756 -95227 -47007 298738 553531 443387 356969 300195 398721 681388 525900 97780 156724
3745 156724 -94621 -23290 460966 566520 402513 279365 269684 387344 606124 308775
3735 308775 89273 -438295 -649485 -20014 667944 470859 315148 532549 274685 371253
3725 371253 645680 352371 -209264 -52352 -16550 463330 368862 263914 320722 385144
3715 385144 744132 876183 473034 -44922 110101 514743 533783 515214 67205 89994
3705 89994 41168 108456 23421 422513 400162 114456 -59408 61748 344596 213237 419837
3694 419837 361456 520981 445226 372648 87810 262057 490931 344652 -58321 -18498
3684 -18498 -51220 315237 369950 -385882 -539583 -296428 -240297 -255392 -326029 -93551 628395
$$ packed form
3756i5227M8220L45745K54793j10144q6418n6774R8526K82667j55488m28120N8944
3745A56724k51345P1331M84256J05554j64007j23148r681J17660K18780k97349
3735C08775k19502n27568k11190O29471O87958j97085j55711K17401k57864R6568
3725C71253K74427k93309n61635J56912L5802M79880r4468j04948N6808O4422
3715C85144L58988J32051m03149n17956J55023M04642J9040j8569m48009K2789
3705H9994m8826O7288q5035L99092k2351k85706j73864J21156K82848j31359K06600
3694D19837n8381J59525p5755p2578k84838J74247K28874j46279m02973L9823
3684a8498l2722L66457N4713p55832j53701K43155N6131j5095p0637K32478P21946
$$ plain form
3673 628395 490839 94577 267254 391735 530487 212014 -598105 -498819 -31677 -27480
3663 -27480 -114392 210807 267498 269075 484445 426276 645167 -49915 -219831 -155048 71924
3652 71924 358663 485980 330495 243788 40055 194889 197332 -141015 -444746 -229559
3642 -229559 -163383 37982 47585 -270432 -566843 -349702 739 113315 394781 465028
3632 465028 380917 276377 294844 175408 270253 -201429 -297989 -413699 -256446 -3745
3622 -3745 -484427 -711989 -35143 212697 -274942 -101224 429152 405114 345256 -33626
3612 -33626 286961 -202534 -95735 349784 -120418 -179551 -150121 -8678 -47068 33575 -334872
3601 -334872 -393328 -451744 -742989 -495420 -276448 17736 -189027 -653669 131827 308288
$$ packed form
3673F28395j37556l96262J72677J24481J38752l18473q10119R9286M67142M197
3663b7480q6912L25199N6691J577K15370n8169K18891o95082j69916O4783K26972
3652G1924K86739J27317j55485q6707k03733J54834K443l38347l03731K15187
3642b29559O6176K01365R603l18017k96411K17141L50441J12576K81466P0247
3632D65028q4111j04540J8467j19436R4845m71682r6560j15710J57253K52701
3622c745m80682k27562O76846K47840m87639J73718N30376k4038n9858l78882
3612c3626L20587m89495J06799M45519m70202n9133K9430J41443l8390Q0643l68447
3601c34872n8456n8416k91245K47569K18972K94184k06763m64642P85496J76461
$$ plain form
3591 308288 -19007 -179170 -133720 -154414 -436152 -301558 -499685 -278353 266988 -115593
3581 -115593 -262630 50883 230823 -140221 -573339 -680149 -516167 -191117 -108529 -18223
3571 -18223 -84889 -203624 -335993 -315792 12558 -99685 -560780 -420455 -172731 -47526
3561 -47526 262643 -238185 -516460 -388187 -422043 -269406 -69684 -379240 -400129 -113634
3551 -113634 -227262 -113023 118656 -71505 -475354 -386327 -730649 -1008126 -283515 -179271
3541 -179271 -427998 -707572 -693788 219107 -60446 -246860 -67234 -115173 -412891 -423238
3531 -423238 -399765 -245889 -437517 -368567 -227761 -7193 5559 -231668 -701687 -757850
3521 -757850 -454234 -510430 -272516 92288 -377413 -331254 31413 -176810 -108213 204265
$$ packed form
3591C08288l27295j60163M5450k0694k81738J34594j98127K21332N45341l82581
3581a15593j47037L13513J79940l71044m33118j06810J63982L25050Q2588R0306
3571a8223o6666j18735j32369K0201L28350j12243m61095J40325K47724J25205
3561d7526L10169n00828k78275J28273l3856J52637J99722l09556k0889K86495
3551a13634j13628J14239K31679j90161m03849Q9027l44322k77477P24611J04244
3541a79271k48727k79574J3784R12895k79553j86414J79626m7939k97718j0347
3531d23238K3473J53876j91628O8950J40806K20568J2752k37227m70019n6163
3521g57850L03616n6196K37914L64804m69701M6159L62667k08223O8597L12478
$$ plain form
3511 204265 86742 -331583 -159063 -488990 -177662 102774 394300 -200956 -185127 -550233
3501 -550233 -362358 -39049 140026 -162900 -509197 -502869 -457260 -298775 -606135 -727508
3491 -727508 -826302 -380619 -483594 -489706 -306593 -119150 -255730 39549 -117281 -150903
3481 -150903 -281641 -638103 -771603 -388991 -178542 -289829 -428377 -75126 -213230 -635010
3471 -635010 -622965 74046 444210 -104724 -320085 -253224 -385081 -446679 -210935 -120004
3461 -120004 -83150 -118697 -404401 -340022 436918 -29115 -497214 -191647 -33266 -300291
3451 -300291 -107446 54453 -285251 -278575 -254764 38353 81927 494657 443371 -513873 -378309
3440 -378309 -475845 -295506 123154 -244284 -185127 -202552 -521707 -411849 -113027 -191299
$$ packed form
3511B04265j17523m18325J72520l29927L11328K80436K91526n95256J5829l65106
3501e50233J87875L23309J79075l02926l46297O328M5609J58485l07360j21373
3491g27508r8794M45683j02975o112J83113J87443j36580K95279j56830l3622
3481a50903j30738l56462j33500L82612K10449j11287j38548L53251j38104m21780
3471f35010J2045O97011L70164n48934k15361O6861j31857o1598K35744R0931
3461a20004L6854l5547k85704O4379P76940m66033m68099L05567J58381k67025
3451c00291J92845J61899l39704O676K3811K93117M3574M12730n1286r57244J35564
3440c78309r7536J80339M18660l67438N9157j7425l19155J09858K98822p8272
$$ plain form
3430 -191299 -202286 -221887 -511898 -216766 -147768 -232984 -659025 -419425 -308641 -240663 -342762
3419 -342762 -820912 -849659 -616063 -497576 -296121 -107793 -316041 -803978 -930375 -415028
3409 -415028 -46563 -176892 -368931 -863776 -750977 -506745 -773798 72979 -49657 -497388
3399 -497388 -315305 -205065 -328723 -440466 -728134 -767331 -626514 -297308 -233664 -205390
3389 -205390 -164242 -325344 -362013 -183762 -191861 -94283 -297384 -394141 -484021 -184691 -111591
3378 -111591 161154 140184 -799495 -575614 -530155 -396041 -217055 -153782 -381044 -606922
3368 -606922 -306442 -338472 -609380 -42154 -284901 -740177 -696824 -164846 -146220 97281
3358 97281 -232499 -1198692 -799248 -162873 -125392 -304569 -147923 -695885 -706983 -426762
$$ packed form
3430a91299j0987j9601k90011K95132O8998q5216m26041K39600J10784O7978j02099
3419c42762m78150k8747K33596J18487K01455J88328k08248m87937j26397N15347
3409d15028L68465j30329j92039m94845J12799K44232k67053Q46777j22636m47731
3399d97388J82083J10240j23658j11743k87668l9197J40817L29206O3644K8274
3389b05390M1148j61102l6669J78251q099R7578k03101r6757q9880K99330P3100
3378a11591K72745k0970r39679K23881M5459J34114J78986O3273k27262k25878
3368f06922L00480l2030k70908N67226k42747m55276M3353N31978J8626K43501
3358I7281l29780r66193L99444O36375L7481j79177J56646n47962j1098K80221
$$ plain form
3348 -426762 -106866 -307747 -290678 -496554 -897327 -613817 -259968 -291240 -326303 -338055
3338 -338055 329515 408487 57977 296273 97244 -71897 -290864 -179534 -894052 -1020557
3328 -1020557 -678957 -814111 -901371 -63873 91021 -472033 -378343 -330658 -316156 -67529
3318 -67529 -197280 50072 64967 -227800 -409939 89412 310434 -233774 -182771 -336734
3308 -336734 -1100574 -517963 85930 -283028 -212613 333375 -390423 -614798 -379405 -694351
3298 -694351 -701043 -726385 -302735 -436208 339470 151265 -373400 -439869 -741749 -499930
3288 -499930 -344172 -177480 -350445 -443356 -496834 -783671 -95283 17657 -270809 -514679
3278 -514679 -699770 -578467 -387373 -332008 -413087 -313273 -465317 -482099 -150182 133811
$$ packed form
3348d26762L19896k00881J7069k05876m00773K83510L53849l1272l5063j1752
3338c38055O67570P8972l50510K38296j99029j69141k18967J11330p14518j26505
3328a020557L41600j35154q7260Q37498J54894n63054R3690M7685J4502K48627
3318f7529j29751K47352J4895k92767j82139M99351K21022n44208N1003j53963
3308c36734p63840N82611O03893l68958P0415N45988p23798k24375K35393l14946
3298f94351o692k5342M23650j33473P75678j88205n24665o6469l01880K41819
3288d99930J55758J66692j72965r2911n3478k86837O88388J12940k88466k43870
3278e14679j85091J21303J91094N5365q1079R9814j52044j6782L31917K83993
$$ plain form
3268 133811 -316020 -279997 96741 30840 224280 307045 113001 -308662 -518914 -472594
3258 -472594 -250848 -135359 -423290 -757777 -572673 -629969 -97436 -22698 -245116 -374814
3248 -374814 -186434 -172302 98635 -47998 -444087 -803750 -564653 -278095 -247203 253659
3238 253659 365948 -434706 -540788 -398336 -386724 -565724 -861566 -963654 -993459 -90093
3228 -90093 -441053 -366208 -332954 -180568 -291085 -787705 -457945 20623 29137 -257246 82106
3217 82106 493618 427631 322339 44197 -668860 -790611 -212405 -479242 -563332 -229293
3207 -229293 -502147 -515139 -182683 8275 44427 384189 30477 -645661 -252710 -33113
3197 -33113 59138 -12208 -436690 -909692 -593614 -186721 -394880 -315084 -500861 -731132
$$ packed form
3268A33811m49831L6023L76738o5901J93440Q2765j94044m21663k10252M6320
3258d72594K21746J15489k87931l34487J85104n7296N32533P4738k22418j29698
3248c74814J88380J4132K70937j46633l96089l59663K39097K86558L0892N00862
3238B53659J12289q00654j06082J42452J1612j79000k95842j02088k9805R03366
3228i0093l50960P4845L3254J52386j10517m96620L29760M78568Q514k86383L39352
3217H2106M11512o5987j05292k78142p13057j21751N78206k66837q4090L34039
3207b29293k72854j2992L32456J90958L6152L39762l53712o76138L92951K19597
3197c3113R2251p1346m24482m73002L16078M06893k08159P9796j85777k30271
$$ plain form
3187 -731132 -584318 -372196 -242130 -84362 -172520 -424887 -403808 -423141 -297714 -91865
3177 -91865 -250213 -634054 -833225 -545699 -402096 -406813 -45399 -369846 -369497 -235632 -305092
3166 -305092 -606995 -153904 -80609 -310970 53069 -107307 -280016 -188731 -204837 -497786
3156 -497786 -215862 -643702 -1398009 -504071 -427029 -547257 -578224 -788080 -631500 -682790
3146 -682790 -458024 -617494 -235932 -392643 -648302 -451977 -176140 -19775 2721 -132735
3136 -132735 -309858 -135294 -47261 -270730 -430658 179748 249004 136317 -355630 -616235
3126 -616235 -545910 -389562 -791644 -687059 -264782 -228008 -866243 -484346 -200739 -328376
3116 -328376 359564 230264 60248 327931 -8313 -90092 -126521 -388635 -683847 -627371
$$ packed form
3187g31132J46814K12122J30066J57768q8158k52367K1079j9333J25427K05849
3177i1865j58348l83841j99171K87526J43603m717L61414l24447L49J33865o9460
3166c05092l01903M53091P3295k30361L64039j60376j72709R1285j6106k92949
3156d97786K81924m27840p54307Q93938P7042j20228l0967k09856J56580n1290
3146f82790K24766j59470L81562j56711k55659J96325K75837J56365K2496j35456
3136a32735j77123J74564Q8033k23469j59928O10406O9256j12687m91947k60605
3126f16235P0325J56348m02082J04585M22277L6774o38235L81897K83607j27637
3116c28376O87940j29300j70016K67683l36244q1779l6429k62114k95212N6476
$$ plain form
3106 -627371 -486402 -477589 -149049 -141908 -269232 -349345 -350661 -626909 -174908 223009 -91783
3095 -91783 -197738 -175998 -639515 -389169 -817 -188655 -429503 47681 -87783 -408020
3085 -408020 -131816 101403 -233281 43751 182423 31064 417669 417131 -214507 -335491
3075 -335491 -53030 -161680 181792 263383 49531 -140425 -153019 -117004 71775 131811
3065 131811 -258584 -201535 -64082 400321 631116 621856 109118 -244820 1130 -38972
3055 -38972 -395521 -263775 -140710 -59308 -95637 -382741 -251370 102462 -30709 -369359
3045 -369359 -94013 328072 627671 1012121 271109 -163500 123514 321067 -53583 282931
3035 282931 -169317 -183892 167006 11542 142777 238680 -295888 -508220 -382532 -331564
$$ packed form
3106f27371J40969Q813L28540P141j27324q0113j316k76248M52001L97917l14792
3095i1783j05955K1740m63517K50346L88352j87838k40848M77184j35464l20237
3085d08020K76204K33219l34684K77032J38672j51359L86605n38o31638j20984
3075c35491K82461j08650L43472Q1591k13852j89956j2594L6015J88779O0036
3065A31811l90395N7049J37453M64403K30795r260n12738l53938K45950m0102
3055c8972l56549J31746J23065Q1402l6329k87104J31371L53832j33171l38650
3045c69359K75346M22085K99599L84450p41012m34609K87014J97553l74650L36514
3035B82931m52248j4575L50898j55464J31235R5903n34568k12332J25688N0968
$$ plain form
3025 -331564 -287769 11817 276835 111697 140486 389853 60526 318253 225370 -466080
3015 -466080 -539924 -353211 -206572 164018 378477 -445615 -605757 -647435 -92190 356838
3005 356838 606507 68594 -440406 478302 1074116 542046 317151 -230892 -357152 -57533
2995 -57533 334006 118377 460281 26532 -490663 -302530 28288 442872 533828 -131929
2985 -131929 -434536 -49172 772087 707482 754637 767331 427758 294853 562387 560716 693074
2974 693074 471442 -449893 102892 833898 471828 204454 39395 -39870 483777 1254272
2964 1254272 1033770 802714 1365487 1052586 542324 972097 851157 1130949 1232126 1194512
2954 1194512 1144477 1402102 1527482 1369106 1606774 2148263 2235526 2964813 3924339 3769415
$$ packed form
3025c31564M3795K99586K65018j65138K8789K49367l29327K57727r2883o91450
3015d66080p3844J86713J46639L70590K14459q24092j60142m1678N55245M49028
3005C56838K49669n37913n09000R18708N95814n32070k24895n48043j26260K99619
2995e7533L91539k15629L41904m33749n17195J88133L30818M14584R0956o65757
2985a31929l02607L85364Q21259o4605M7155J2694l39573j32905K67534j671J32358
2974F93074k21632r21335N52785P31006l62070k67374j65059p9265N23647P70495
2964A254272k20502k31056N62773l12901n10262M29773j20940K79792J01177l7614
2954A194512n0035K57625J25380j58376K37668N41489Q7263P29287R59526j54924
$$ plain form
2944 3769415 4977633 5881017 6627037 8064493 10618861 12016933 12454290 11299476 8837504
2935 8837504 6702188 5557442 4277413 3597219 2965951 2133224 1456552 1604483 1709307
2926 1709307 1877093 2017207 1525290 1403186 1581200 1445853 741492 879525 652134 456108
2916 456108 606503 395109 246053 306344 299166 -57713 209442 527305 204409 434402
2906 434402 40495 -381410 -127828 512440 154019 -101748 277409 255778 121471 32607
2896 32607 -334622 69944 260603 52400 -551645 -358253 84671 -142880 -23618 -535420
2886 -535420 -580786 -110474 -287445 -534285 -168196 -381172 -599460 -330939 -379995 -279566
2876 -279566 44127 -107498 -616235 -344876 -102506 -27906 490567 274829 448708 338406
$$ packed form
2944C769415J208218R03384P46020J437456K554368J398072M37357j154814k461972
2935H837504k135316j144746j280029o80194o31268q32727o76672J47931J04824
2926A709307J67786J40114m91917j22104J78014j35347p04361J38033k27391j96026
2916D56108J50395k11394j49056O0291p178l56879K67155L17863l22896K29993
2906D34402l93907m21905K53582O40268l58421k55767L79157k1631j34307q8864
2896C2607l67229M04566J90659k08203o04045J93392M42924k27551J19262n11802
2886e35420m5366M70312j76971k46840L66089k12976k18288K68521m9056J00429
2876b79566L23693j51625n08737K71359K42370P4600N18473k15738J73879j10302
$$ plain form
2866 338406 112323 -576531 -156993 327369 -807 -411935 -454214 -183712 89718 -44253
2856 -44253 -484980 -811708 -385739 -584837 -501683 -395923 -256705 30983 223486 7039
2846 7039 34879 160886 -108086 -408172 -543748 -287205 -191801 -593120 -891818 -694790
2836 -694790 -226128 -515723 -767386 -352778 -770311 -815388 -757348 -521237 -97114 520073
2826 520073 222654 -57497 192350 323995 160307 -104855 -819252 -870029 -745962 -530266
2816 -530266 -580505 -485050 -481701 -771250 -721108 -245503 -346549 -31357 -67059 -354862 11732
2805 11732 77423 -164613 -146458 -239921 -634571 -605454 -522972 -603197 -649772 -386825 -674753
2794 -674753 -635961 -561466 -457818 -521493 -561478 -763438 -484358 -50592 -49937 159476 -224228
$$ packed form
2866C38406k26083o88854M19538M84362l28176m11128m2279K70502K73430j33971
2856d4253m40727l26728M25969j99098Q3154J05760J39218K87688J92503k16447
2846G039K7840J26007k68972l00086j35576K56543R5404m01319k98698J97028
2836f94790M68662k89595k51663M14608m17533m5077N8040K36111M24123O17187
2826E20073k97419k80151K49847J31645j63688k65162p14397n0777J24067K15696
2816e30266n0239R5455L349k89549N0142M75605j01046L15192l5702k87803L66594
2805A1732O5691k42036J8155r3463l94650K9117Q2482q0225m6575K62947k87928
2794f74753L8792P4495J03648o3675l9985k01960K79080M33766O55K09413l83704
$$ plain form
2783 -224228 -274131 -316836 -62748 -299320 -690405 -439266 -489057 -609871 -618331 -355258 -88430
2772 -88430 -310496 -255786 29403 430218 562842 280040 128001 -235069 -424880 -299873
2762 -299873 299960 281247 1496 80113 -171662 -153588 104618 -201509 -692638 -854966
2752 -854966 -859350 -600529 76738 128152 -63969 -151730 -426026 -355064 -24141 149141 292927
2741 292927 367546 -143718 -240723 -544618 -349055 63673 157690 -414817 -834532 -469106
2731 -469106 -25286 -123840 -497382 -563310 -333666 179211 415493 242886 124382 421305
2721 421305 201572 75016 -80885 -135683 -333313 -823788 -755890 -85744 -89609 -918068
2711 -918068 -937838 -315719 -378222 -691194 -519734 57327 -396426 -417718 -147010 132059
$$ packed form
2783b24228m9903m2705K54088k36572l91085K51139m9791j20814q460K63073K66828
2772h8430k22066N4710K85189M00815J32624k82802j52039l63070j89811J25007
2762b99873N99833j8713k79751P8617k51775J8074K58206l06127m91129j62328
2752h54966m384K58821O77267N1414j92121q7761k74296P0962L30923J73282J43786
2741B92927P4619n11264r7005l03895J95563M12728R4017n72507m19715L65426
2731d69106M43820r8554l73542o5928K29644N12877K36282j72607j18504K96923
2721D21305k19733j26556j55901n4798j97630m90475O7898O70146l865q28459
2711i18068j9770O22119o2503l12972J71460N77061m53753k1292K70708K79069
$$ plain form
2701 132059 -228173 -486760 -460008 -662410 -563618 -329283 -548166 -685787 -422183 -575235
2691 -575235 -701312 -660981 -551140 -238929 -60323 -50703 -49540 -85224 26233 -416203 -114854
2680 -114854 33248 118436 -243214 -173868 -133718 184990 212048 -156241 -171738 -9128 280951
2669 280951 84654 -145103 -733181 -596114 -434244 -674161 -26898 367595 7206 -158846
2659 -158846 -272341 -448893 -423277 -215013 -611294 -511274 -440859 -717651 -403847 -125657
2649 -125657 152339 159297 -149482 -381052 -83990 -67661 -249532 -109167 -204096 -183445 -23039
2638 -23039 -301072 -257904 -453330 -496434 -454942 -543387 -757482 -460670 -334758 -147081 216249
2627 216249 -243316 18911 -40693 -319886 -190665 -668290 -1149588 -723648 -569066 -483135
$$ packed form
2701A32059l60232k58587K6752k02402R8792K34335k18883j37621K63604j53052
2691e75235j26077M0331J09841L12211J78606R620J163l5684J11457m42436L01349
2680a14854J48102Q5188l61650O9346M0150L18708K7058l68289j5497J62610K90079
2669B80951j96297k29757n88078J37067J61870k39917O47263L94493l60389j66052
2659a58846j13495j76552K5616K08264l96281J00020P0415k76792L13804K78190
2649a25657K77996O958l08779k31570K97062J6329j81871J40365r4929K0651J60406
2638b3039k78033M3168j95426m3104M1492q8445k14095K96812J25912J87677L63330
2627B16249m59565K62227n9604k79193J29221m77625m81298M25940J54582Q5931
$$ plain form
2617 -483135 -73917 -5256 -340485 -263635 -20240 -161298 -533741 -294602 -158820 412037
2607 412037 822351 366928 -55595 73179 -80906 -34625 192030 -561892 -928657 -433036
2597 -433036 -297432 -158711 -72111 -48693 -20175 -8961 -306384 -208577 27827 -130279 -93916
2586 -93916 126494 87927 45667 221463 33256 -576484 -443199 -306187 -611432 -678519
2576 -678519 -677058 -656018 -487635 -215286 -163158 448299 314515 279991 380693 200167 -54547
2565 -54547 -116436 -109683 -81699 -281141 -305594 -728897 -1044970 -593414 -626098 -581315 -632697
2554 -632697 -634625 -400551 153494 -118028 -370783 30481 94491 -190002 174542 115353
2544 115353 -451706 -307580 -429354 -590816 123953 45141 -162354 25962 -191413 -564780
$$ packed form
2617d83135M09218O8661l35229P6850K43395j41058l72443K39139J35782N70857
2607D12037M10314m55423m22523J28774j54085M6281K26655p53922l66765M95621
2597d33036J35604J38721Q6600K3418K8518J1214k97423R7807K36404j58106L6363
2586i3916K20410l8567m2260J75796j88207o09740J33285J37012l05245o7087
2576f78519J461K1040J68383K72349N2128O11457j33784l4524J00702j80526k54714
2565e4547o1889O753K7984j99442k4453m23303l16073M51556l2684M4783n1382
2554f32697j928K34074N54045k71522k52755M01264O4010k84493L64544n9189
2544A15353n67059J44126j21774j61462P14769p8812k07495J88316k17375l73367
$$ plain form
2534 -564780 -590190 -641133 -529242 -340608 -231837 -91277 -215839 -90075 -193200 -360448
2524 -360448 -479126 -583069 -481759 -497070 -511778 -231323 -252049 -48215 -37253 23205 19359
2513 19359 -54266 39385 286499 181370 311001 -264028 -358098 344239 -33445 -286863
2503 -286863 143276 135740 -104457 -5854 -226067 -362391 90880 185683 400458 331446 604813
2492 604813 672093 462804 -1001 10060 68403 -50012 -372825 47373 293961 175380
2482 175380 395211 171753 -88897 -270932 78676 -113202 -79467 64466 163907 -32969
2472 -32969 177708 369257 59401 281992 -373756 -468858 -243442 -515431 -234703 -321232
2462 -321232 -173791 298813 450181 -2283 -70461 -112089 137692 516579 469280 376193
$$ packed form
2534e64780k5410n0943J11891J88634J08771J40560j24562J25764j03125j67248
2524c60448j18678j03943J01310j5311j4708K80455k0726K03834J0962O0458l846
2513A9359p3625R3651K47114j05129J29631n75029r4070P02337l77684k53418
2503b86863M30139p536k40197R8603k20213j36324M53271R4803K14775o9012K73367
2492F04813O7280k09289m63805J1061N8343j18415l22813M20198K46588j18581
2482A75380K19831k23458k60650j82035L49608j91878L3735J43933R9441j96876
2472c2969K10677J91549l09856K22591o55748r5102K25416k71989K80728q6529
2462c21232J47441M72604J51368m52464o8178m1628K49781L78887m7299r3087
$$ plain form
2452 376193 303461 343414 568628 204352 77587 55321 47481 -206909 127280 335740 1337
2441 1337 37382 -221349 -85489 -193076 -231530 62135 31666 140992 278719 224676 74618
2430 74618 192952 635209 293785 254990 205559 -34945 106461 87483 -47248 -213266
2420 -213266 -21906 -107892 136009 293205 378273 471702 458387 321017 346954 756344 772433
2409 772433 285684 133655 111708 -84456 542143 856862 531172 399271 347854 592045
2399 592045 523177 532256 788901 675124 800684 689361 763664 1034935 765289 485151
2389 485151 574472 623721 760931 620166 215359 411503 467865 447354 920752 1325330
2379 1325330 1069027 893483 758161 767689 975119 1262841 1244634 1189691 1131272 1267535
$$ packed form
2452C76193p2732L9953K25214l64276j26765k2266p840k54390L34189K08460l34403
2441A337L6045k58731J35860j07587l8454K93665l0469J09326J37727n4043j50058
2430G4618J18334M42257l41424l8795m9431k40504J41406j8978j34731j66018
2420b13266J91360q5986K43901J57196Q5068R3429j3315j37370K5937M09390J6089
2409G72433m86749j52029k1947j96164O26599L14719l25690j31901n1417K44191
2399E92045o8868R079K56645j13777J25560j11323P4303K71271k69646k80138
2389D85151Q9321M9249J37210j40765m04807J96144N6362k0511M73398M04578
2379A325330k56303j75544j35322R528K07430K87722j8207n4943n8419J36263
$$ plain form
2369 1267535 1713760 2098174 2338167 2634063 2464729 2678902 2831169 2852205 2724429 2340583
2359 2340583 2234608 2225491 1987540 1820944 1829397 1296122 1447581 1609360 935479 1188463
2349 1188463 1915096 1256971 1285356 1420274 1137861 1655687 1579960 1326574 1698406 2155259
2339 2155259 1937272 2181538 2484284 2951457 3446299 3197652 3447248 3784953 4045028 4668164
2329 4668164 4846165 5292815 5579720 4966963 4161028 3835036 3289325 2734299 2748929 2135759
2319 2135759 2079976 2098602 2250240 2066157 1640265 1484586 2104176 2087331 1774342 1359712
2309 1359712 1088653 1131468 1691468 1867750 1615955 1557811 1910329 1988805 2248457 2455674
2299 2455674 2066561 1760553 1506404 2084104 2599437 2681405 2976374 2949386 3079363 2184983
$$ packed form
2369A267535M46225L84414K39993K95896j69334K14173J52267K1036j27776l83846
2359B340583j05975r117k37951j66596Q453n33275J51459J61779o73881K52984
2349A188463P26633o58125K8385J34918k82413N17826p5727k53386L71832M56853
2339B155259k17987K44266L02746M67173M94842k48647K49596L37705K60075O23136
2329D668164J78001M46650K86905o12757q05935l25992n45711n55026J4630o13170
2319B135759n5783J8626J51638j84083m25892j55679O19590j6845l12989m14630
2309A359712k71059M2815N60000J76282k51795n8144L52518P8476K59652K07217
2299B455674l89113l06008k54149N77700N15333Q1968K94969k6988J29977q94380
$$ plain form
2289 2184983 1948895 2424206 2011440 1972090 1704227 1380615 1225907 1646264 1449032 1508977
2279 1508977 1739241 1239318 855567 1291105 1244805 909796 876073 877466 990339 1278325
2269 1278325 681547 476918 657001 553909 456361 481801 652779 880417 653151 694600
2259 694600 1023890 1162370 1384319 1025789 1016965 1399317 1247981 953456 1041336 1142093
2249 1142093 879314 598887 777396 1215558 1548855 1158801 891332 446170 1242616 1428541
2239 1428541 1070218 1006696 1102818 1668300 1549681 1270256 1679450 2283757 1888995 1226775
2229 1226775 1655199 1588013 1770304 1855293 1392297 1663786 1886686 1630043 1727788 2225790
2219 2225790 2173452 2328138 2394908 3125767 3852193 4385073 4838170 4547331 4439180 4317740
$$ packed form
2289B184983k36088M75311m12766l9350k67863l23612j54708M20357j97232N9945
2279A508977K30264m99923l83751M35538m6300l35009l3723J393J12873K87986
2269A278325n96778k04629J80083j03092r7548K5440J70978K27638k27266M1449
2259F94600L29290J38480K21949l58530q824L82352j51336k94525Q7880J00757
2249A142093k62779k80427J78509M38162L33297l90054k67469m45162P96446J85925
2239A428541l58323o3522R6122N65482j18619k79425M09194O04307l94762o62220
2229A226775M28424o7186J82291Q4989m62996K71489K22900k56643R7745M98002
2219B225790n2338J54686O6770P30859P26426N32880M53097k90839j08151j21440
$$ plain form
2209 4317740 3618666 2906445 2440233 2552710 2615956 2702606 2498291 2605041 3143226 2708272
2199 2708272 2761051 2737985 2987644 2989526 3090958 2951262 3346260 3589826 3176826 3331385
2189 3331385 2911953 3472365 3668910 3835300 4361248 4603081 5025841 5941462 6817896 7679263
2179 7679263 8456592 9234586 9041577 8084750 6757964 6111299 5567305 5078210 4754389
2170 4754389 4083053 3878542 3767030 3715710 3310480 2817281 3041640 2457461 2322130 2091800
2160 2091800 2352557 2470191 2196727 2183636 2388051 2547035 2770746 2914098 2012111 1955058
2150 1955058 2385319 2407948 3093314 3387354 3727331 3807000 3914215 4464987 4393278 3932454
2140 3932454 2945082 2283199 2216081 2694986 2293411 2009762 2196780 2110782 2104955 1749417
$$ packed form
2209D317740o99074p12221m66212J12477O3246Q6650k04315J06750N38185m34954
2199B708272N2779k3066K49659J882J01432j39696L94998K43566m13000J54559
2189C331385m19432N60412J96545J66390N25948K41833M22760R15621Q76434Q61367
2179G679263P77329P77994j93009r56827j326786o46665n43994m89095l23821
2170D754389o71336k04511j11512n1320m05230m93199K24359n84179j35331k30330
2160B091800K60757J17634k73464j3091K04415J58984K23711J43352r01987n7053
2150A955058M30261K2629O85366K94040L39977P9669J07215N50772p1709m60824
2140C932454r87372o61883o7118M78905m01575k83649J87018q5998n827l55538
$$ plain form
2130 1749417 1364348 1139950 1330992 1339181 945768 1798968 2065955 1946211 1563116 1103057
2120 1103057 1393346 1684885 1600374 1413832 1517813 1768040 2004924 1792267 1460298 1288326
2110 1288326 855551 786274 711923 1020314 997381 997033 1161298 1480827 1614133 1572343 1724654
2099 1724654 1132433 1538574 1742231 1900592 1693851 1112486 1733003 1590402 1128580 1082587
2089 1082587 1263324 1165043 1257315 1255239 1033303 907990 668126 1001084 1013193 839988
2079 839988 1513017 1691929 1333059 1359011 1357633 1535146 1280181 1103439 1174313 695524
2069 695524 851096 737800 806505 1284555 1368731 1057783 1057130 1167852 1507470 1350491 1355611
2058 1355611 1238775 797912 783364 1158290 909041 848444 523972 727390 661312 209572
$$ packed form
2130A749417l85069k24398J91042Q189l93413Q53200K66987j19744l83095m60059
2120A103057K90289K91539q4511j86542J03981K50227K36884k12657l31969j71972
2110A288326m32775o9277p4351L08391k2933l48J64265L19529J33306m1790J52311
2099A724654n92221M06141K03657J58361k06741n81365O20517j42601m61822m5993
2089A082587J80737r8281R2272k076k21936j25313k39864L32958J2109j73205
2079H39988O73029J78912l58870K5952j378J77513k54965j76742P0874m78789
2069F95524J55572j13296O8705M78050Q4176l10948o53J10722L39618j56979N120
2058A355611j16836m40863j4548L74926k49249o0597l24472K03418o6078m51740
$$ plain form
2048 209572 255026 178520 535099 730698 802695 816376 1228055 619331 937017 1055436
2038 1055436 842670 1020282 1204526 1120053 1170954 945698 210159 484258 406694 255161
2028 255161 76384 -513206 -326180 405717 753323 996729 700952 398663 954754 1165239
2018 1165239 486072 818133 991941 601047 702102 165211 -176286 -226736 -390359 -554990
2008 -554990 -214603 50470 57536 -145172 -412936 56716 470094 349712 668311 675773
1998 675773 367640 667122 538116 -138039 519905 208510 4402 18213 -16581 279726
1988 279726 273355 -1490 298986 445510 71581 17001 -416636 48040 455250 -45679
1978 -45679 96312 -18017 -14770 347336 -269540 -453884 -194469 179984 160821 72529 -178062
$$ packed form
2048B09572M5454p6506L56579J95599P1997J3681M11679o08724L17686J18419
2038A055436k12766J77612J84244q4473N0901k25256p35539K74099p7564j51533
2028B55161j78777n89590J87026P31897L47606K43406k95777l02289N56091K10485
2018A165239o79167L32061J73808l90894J01055n36891l41497n0450j63623j64631
2008e54990L40387K65073P066k02708k67764M69652M13378j20382L18599P462
1998F75773l08133K99482j29006o76155O57944l11395k04108J3811l4794K96307
1988B79726o371k74845L00476J46524l73929n4580m33637M64676M07210n00929
1978d5679J41991j14329L247L62106o16876j84344K59415L74453j9163q8292k50591
$$ plain form
1967 -178062 167715 111823 86606 346969 310122 636984 656316 493661 114847 51736 352884
1956 352884 -172175 -285821 340457 218675 273501 -365166 -586475 82950 516375 -16954
1946 -16954 26082 -109517 172185 -24657 254976 914442 349168 6880 9662 -170266
1936 -170266 53654 392228 96119 81988 34132 -269957 -657863 -289217 -226822 -312683
1926 -312683 -92351 191394 -53100 290849 129551 -80867 115391 14542 -6121 105685
1916 105685 -41666 -248712 -420679 -186740 -187521 104311 -135314 -241925 95246 160748
1906 160748 525041 186657 397648 394782 37367 94625 69532 400253 693514 226603
1896 226603 249691 292913 114951 501358 338480 -144473 -351021 -444734 -76943 95116
$$ packed form
1967a78062L45777n5892k5217K60363l6847L26862J9332j62655l78814o3111L01148
1956C52884n25059j13646O26278j21782N4826o38667k21309O69425M33425n33329
1946a6954M3036j35599K81702j96842K79633O59466n65274l42288K782j79928
1936a70266K23920L38574k96109j4131m7856l04089l87906L68646O2395q5861
1926c12683K20332K83745k44494L43949j61298k10418J96258j00849k0663J11806
1916A05685j47351k07046j71967K33939p81K91832k39625j06611L37171O5502
1906A60748L64293l38384K10991k866l57415N7258k5093L30721K93261m66911
1896B26603K3088M3222j77962L86407j62878m82953k06548r3713L67791J72059
$$ plain form
1886 95116 429812 603392 454159 547023 751991 421545 346969 -237 -387498 232534
1876 232534 127643 205322 -63336 -301140 478668 555120 126548 120163 138113 257907 -178399
1865 -178399 15079 451185 629043 76695 -416847 -261484 -135291 -365579 -597951 -196336
1855 -196336 151954 177731 238359 661163 860361 335234 226683 276417 518967 708405
1845 708405 411283 589189 468285 374751 390618 346188 221473 448097 486143 -38818
1835 -38818 263960 -31274 -377727 -215478 -162675 406508 675286 132433 177278 513953
1825 513953 315018 366763 430199 578855 476451 18572 157763 404263 413048 391550 298470
1814 298470 288529 885666 937906 723043 1487512 985266 854077 668551 370215 591157
$$ packed form
1886I5116L34696J73580j49233R2864K04968l30446p4576l47206l87261O20032
1876B32534j04891P7679k68658k37804P79808P6452m28572o385J7950J19794m36306
1865a78399J93478M36106J77858n52348m93542J55363J26193k30288k32372M01615
1855a96336L48290K5777O0628M22804J99198n25127j08551M9734K42550J89438
1845G08405k97122J77906j20904r3534J5867m4430j24715K26624L8046n24961
1835c8818L02778k95234l46453J62249N2803N69183K68778n42853M4845L36675
1825E13953j98935N1745O3436J48656j02404m57879J39191K46500Q785k1498r3080
1814B98470r941N97137N2240k14863P64469n02246j31189j85526k98336K20942
$$ plain form
1804 591157 1250188 1152396 118468 127529 308779 77412 47788 250160 384941 638813
1794 638813 576452 69427 740873 855634 865341 632504 254646 706640 617245 569070 718309
1783 718309 427914 415220 232278 42728 -32101 -356533 -350530 -316574 -261188 295223 821610
1772 821610 3604 -90646 324437 832722 1010703 629293 202264 416774 943631 621097
1762 621097 277030 81495 -219250 -311939 -492081 -608706 -493816 -364266 -493536 -193747
1752 -193747 534882 846013 602471 260020 477695 690087 726625 827532 756035 429455
1742 429455 101264 -479249 -259788 108000 -443716 -697338 -746830 -488443 -132411 184024
1732 184024 -251744 -437749 -326156 -374312 257668 -47958 -504517 -72134 -112429 -179164
$$ packed form
1804E91157O59031r7792j033928R061J81250k31367k9624K02372J34781K53872
1794F38813o2361n07025O71446J14761R707k32837l77858M51994q9395m8175J49239
1783G18309k90395j2694j82942j89550p4829l24432O003L3956N5386N56411N26387
1772H21610q18006r4250M15083N08285J77981l81410m27029K14510N26857l22534
1762F21097l44067j95535l00745r2689j80142j16625J14890J29550j29270K99789
1752a93747P28629L11131k43542l42451K17675K12392L6538J00907p1497l26580
1742D29455l28191n80513K19461L67788n51716k53622m9492K58387L56032L16435
1732A84024m35768j86005J11593m8156O31980l05626m56559M32383m0295o6735
$$ plain form
1722 -179164 -214389 -160507 -243823 -723535 -628074 -195986 -245168 -359573 -126004 -197638 -180785
1711 -180785 -325104 -521075 -74083 94638 -436763 -70028 -87353 -98130 275343 95442
1701 95442 -78383 -381182 -598253 -495878 -430419 -581163 -667362 -809217 -418969 -255805
1691 -255805 -31352 -64353 -681413 -684395 -497200 -328209 -12305 85380 -4963 276108 191789
1680 191789 49123 -9026 203380 -377774 -608262 -376712 -257461 133992 255443 -344320
1670 -344320 -548862 -332766 -405687 232309 224119 -551599 -518548 -210379 214259 602748
1660 602748 267443 105299 -105722 -68649 -40645 -499933 -398487 -651076 -974852 -369385
1650 -369385 -342544 -373407 -264249 -579867 -1336629 -1027945 -327998 -527577 -570840 -357874
$$ packed form
1722a79164l5225N3882q3316m79712R5461M32088m9182j14405K33569p1634J6853
1711a80785j44319j95971M46992J68721n31401L66735j7325j0777L73473j79901
1701I5442j73825l02799k17071J02375O5459j50744q6199j41855L90248J63164
1691b55805K24453l3001o17060k982J87195J68991L15904R7685r0343K81071q4319
1680A91789j42666n8149K12406n81154k30488K31550J19251L91453J21451n99763
1670c44320k04542K16096p2921O37996q190p75718L3051L08169M24638L88489
1660F02748l35305j62144k11021L7073K8004m59288J01446k52589l23776O05467
1650c69385K6841l0863J09158l15618p56762L08684O99947j99579m3263K12966
$$ plain form
1640 -357874 -221965 13766 309689 16429 -128803 -60196 -522768 -228397 -271646 -210749
1630 -210749 -223186 -347321 -230495 -87122 -221445 -280155 -188862 -578784 -449722 -400901
1620 -400901 -247074 -72519 -657158 -446443 -210270 25449 239947 515461 183439 -56708
1610 -56708 179076 -170222 -369258 -527051 -212173 87375 -57849 -292063 77669 -199633
1600 -199633 -539072 -375805 -441750 -467842 -213357 -81062 104260 -230865 -284985 -188769
1590 -188769 162814 216778 -539028 -759229 -697721 -228007 1893 168030 -56917 -361137
1580 -361137 -494542 -321300 -401302 -469908 -683818 -541836 -209517 9861 474404 622850
1570 622850 232980 -536025 -200841 -285372 -848463 -483632 -108709 -425739 -272169 -81625
$$ packed form
1640c57874J35909K35731K95923k93260j45232O8607m62572K94371m3249O0897
1630b10749j2437j24135J16826J43373j34323n8710R1293l89922J29062M8821
1620d00901J53827J74555n84639K10715K36173K35719K14498K75514l32022k40147
1610e6708K35784l49298j99036j57793L14878K99548j45224k34214L69732k77302
1600a99633l39439J63267o5945k6092K54485J32295J85322l35125n4120R6216
1590a88769L51583N3964p55806k20201O1508M69714K29900J66137k24947l04220
1580c61137j33405J73242q0002o8606k13910J41982L32319K19378M64543J48446
1570F22850l89870p69005L35184q4531n63091L64831L74923l17030J53570J90544
$$ plain form
1560 -81625 -119952 162489 -179868 -645109 -999795 -809112 -318278 -224929 -42731 -91128
1550 -91128 55483 -17817 -184177 -13048 115213 -243643 -469215 -482599 -402607 -387215 -304339
1539 -304339 -586740 -507247 -191319 -97228 -70707 -238849 -115238 196464 54111 -142069
1529 -142069 -40309 230252 -196003 -477663 -81988 -66062 -36873 60798 -2089 -416103
1519 -416103 -290020 -18829 -438117 -532110 -292151 -191872 -328838 -112700 -229904 -575278
1509 -575278 -609866 -611255 -34133 374651 -260549 98985 238193 -151313 8901 -371459
1499 -371459 -715998 -632556 -197456 -253952 -652124 -153382 -34232 -168468 -285760 -791107
1489 -791107 -304435 317827 170007 -75674 58956 -12293 172980 74277 142296 99301
$$ packed form
1560h1625l8327K82441l42357m65241l54686J90683M90834R3349J82198m8397
1550i1128J46611p3300j66360J71129J28261l58856k25572j3384P9992J5392Q2876
1539c04339k82401P9493L15928R4091K6521j68142J23611L11702j42353j96180
1529a42069J01760K70561m26255k81660L95675J5926K9189R7671o2887m14014
1519d16103J26083K71191m19288r3993K39959J00279j36966K16138j17204l45374
1509e75278l4588j389N77122M08784o35200L59534J39208l89506J60214l80360
1499c71459l44539Q3442M35100n6496l98172M98742J19150j34236j17292n05347
1489g91107M86672O22262j47820k45681J34630p1249J85273r8703O8019m2995
$$ plain form
1479 99301 -310956 -648329 -213666 -20799 -197613 -429852 -278864 259920 168797 4606
1469 4606 428007 157489 102731 165250 119207 427586 765691 445671 206310 109839 75148
1458 75148 -264652 -630807 -620821 -577440 -201941 -248173 110317 164657 -63290 280912 207771
1447 207771 -257176 -138247 -50389 107698 256944 -91241 114752 -312967 -666445 -205505
1437 -205505 -132464 172120 250284 -363725 -524132 -27454 -530606 -554205 -433250 -430441 -94988
1426 -94988 -53003 -407039 -221931 -26818 -197812 -640181 -367714 -158427 -26675 36595
1416 36595 35362 -258314 -131169 -219946 -382327 -299491 -708225 -427022 -281608 -89946 80267
1405 80267 224782 480221 460363 -85835 -404145 -436991 -136772 -12315 -60741 -255170
$$ packed form
1479I9301m10257l37373M34663J92867j76814k32239J50988N38784r1123j64191
1469D606M23401k70518n4758O2519m6043L08379L38105l20020k39361r6471l4691
1458G5148l39800l66155R986M3381L75499m6232L58490N4340k27947L44202p3141
1447B07771m64947J18929Q7858J58087J49246l48185K05993m27719l53478M60940
1437b05505P3041L04584P8164o14009j60407M96678n03152k3599J20955K809L35453
1426i4988M1985l54036J85108J95113j70994m42369K72467K09287J31752O3270
1416C6595j233k93676J27145q8777j62381Q2836m08734K81203J45414J91662J70213
1405H0267J44515K55439j9858n46198l18310l2846L00219J24457m8426j94429
$$ plain form
1395 -255170 -152405 -136291 116605 245650 -217130 -313567 -143274 -452031 -251447 -355997
1385 -355997 -639339 -556262 -180153 59038 -143913 -239582 -237946 63008 198038 475741
1375 475741 455120 561872 78805 -151192 -203455 -624888 -340384 -216702 -664020 -616964
1365 -616964 -518989 -39872 152557 -44691 -261843 -191408 -171173 -343930 278571 292655
1355 292655 359941 322164 287117 72547 -134867 5625 93448 -563088 -770107 -198724
1345 -198724 -552166 -676716 -164438 -129284 226058 338014 315535 734673 748796 573830
1335 573830 456341 122508 382344 964974 583060 123088 327052 86696 70900 269679
1325 269679 -402267 -298580 4108 -329167 -327060 -148445 143907 40209 -384079 270628
$$ packed form
1395b55170J02765J6114K52896J29045m62780r6437J70293l08757K00584j04550
1385c55997k83342Q3077L76109K39191k02951r5669J636L00954J35030K77703
1375D75741k0621J06752m83067k29997n2263m21433K84504J23682m47318M7056
1365f16964R7975M79117J92429j97248k17152P0435K0235j72757O22501J4084
1355B92655O7286l7777l5047k14570k07414J40492Q7823o56536k07019N71383
1345a98724l53442j24550N12278L5154L55342J11956k2479M19138J4123j74966
1335E73830j17489l33833K59836N82630l81914m59972K03964k40356j5796J98779
1325B69679o71946J03687L02688l33275K107J78615K92352j03698m24288O54707
$$ plain form
1315 270628 864343 460632 -108435 -120852 -142527 419747 16372 -365506 -212452 -55374
1305 -55374 100771 40790 -129248 -253537 394206 220700 34769 347359 469432 585906
1295 585906 406084 161814 433206 385038 389735 135947 -155549 -45027 94815 251831
1285 251831 457085 345718 -20954 -17548 -23256 149716 -111882 278332 200022 604507 678860
1274 678860 90642 326086 -56692 146946 560312 364282 -90589 -67164 -169080 255914
1264 255914 279150 226037 438806 478492 761079 1153938 355587 243905 657449 917269
1254 917269 1101552 1003726 795552 572326 489327 231312 744916 1306941 1627421 2167205
1244 2167205 2001787 1618090 1754303 1399180 759520 1024753 1045028 1122557 936635 319061
$$ packed form
1315B70628N93715m03711n69067j2417k1675N62274m03375l81878J53054J57078
1305e5374J56145n9981j70038j24289O47743j73506j85931L12590J22073J16474
1295E85906j79822k44270K71392m8168M697k53788k91496J10522J39842J57016
1285B51831K05254j11367l66672L406n708J72972k61598L90214p8310M04485P4353
1274F78860n88218K35444l82778K03638M13366j96030m54871K3425j01916M24994
1264B55914K3236n3113K12769L9686K82587L92859p98351j11682M13544K59820
1254I17269J84283r7826k08174k23226q2999k58015N13604N62025L20480N39784
1244B167205j65418l83697J36213l55123o39660K65233K0275P7529j85922o17574
$$ plain form
1234 319061 735361 1420953 970774 115700 140845 468509 1010782 565807 474250 728773
1224 728773 865851 309578 292629 19190 581639 736913 612705 567117 793932 617495
1214 617495 355106 -89945 -473795 -33444 304464 -28347 -110118 108911 78364 294498
1204 294498 367284 667854 900976 591278 583118 814303 874706 1170233 726447 621794
1194 621794 826922 1265180 637685 600413 227828 129968 403372 472092 430312 576116
1184 576116 591618 431848 542523 604763 736142 1122117 1021039 792554 325188 255609
1174 255609 534081 99233 42532 457312 426091 384389 458146 342839 513264 897263
1164 897263 1071696 1004955 1114484 1411916 1374366 1273845 962806 1160162 1229057 785221
$$ packed form
1234C19061M16300O85592m50179q55074K5145L27664N42273m44975r1557K54523
1224G28773J37078n56273j6949k73439N62449J55274j24208m5588K26815j76437
1214F17495k62389m45051l83850M40351L37908l32811q1771K19029l0547K16134
1204B94498P2786L00570K33122l09698q160K31185O0403K95527m43786j04653
1194F21794K05128M38258o27495l7272l72585r7860K73404O8720m1780J45804
1184E76116J5502j59770J10675O2240J31379L85975j01078k28485m67366o9579
1174B55609K78472m34848n6701M14780l1221m1702P3757j15307J70425L83999
1164H97263J74433o6741J09529K97432l7550j00521l11039J97356O8895m43836
$$ plain form
1154 785221 846697 338196 1012417 1017674 398539 402190 862747 1178202 1253517 1258178 891131
1143 891131 1062406 1076543 1486756 1714333 1551142 1453181 1439713 954332 1104331 1845430
1133 1845430 1827362 1228187 1116207 1652509 1928523 2157000 1895056 1829238 1663345 1665405
1123 1665405 1735503 2112373 2156371 2096842 2299559 2607097 3200086 3179393 2908183 2353709
1113 2353709 1952218 1805030 1912252 2319378 2552225 2613681 2537795 2181144 2010224 2048753
1103 2048753 2632057 2248265 1861722 1543923 1704527 2011752 1828026 1451020 1531737 2031420
1093 2031420 1914465 1924822 2272428 2508412 2577584 2823330 2591302 2878142 3153293 2854204
1083 2854204 2906240 2911681 2820177 3200999 3120493 3116890 2772223 2244134 2438244 2967014 3178247
$$ packed form
1154G85221O1476n08501O74221N257o19135L651M60557L15455P5315M661l67047
1143H91131J71275J4137M10213K27577j63191r7961j3468m85381J49999P41099
1133A845430j8068n99175j11980N36302K76014K28477k61944o5818j65893K060
1123A665405P0098L76870M3998n9529K02717L07538N92989k0693k71210n54474
1113B353709m01491j47188J07222M07126K32847O1456p5886l56651j70920L8529
1103B048753N83304l83792l86543l17799J60604L07225j83726l77006Q0717M99683
1093B031420j16955J0357L47606K35984O9172K45746k32028K86840K75151k99089
1083B854204N2036N441r1504L80822q0506l603l44667n28089J94110N28770K11233
$$ plain form
1072 3178247 3444509 3405880 3184732 2974657 3360358 3888762 4202260 4095669 3961643 3756470
1062 3756470 3879029 4175874 4236620 3907532 3595211 4289960 4594823 4427856 4473043 4281109
1052 4281109 4534009 4963726 4610325 5158890 5330552 5163541 4902009 4989139 5287031 5664064
1042 5664064 5514067 5231781 5434902 5031871 5063590 4941217 5095027 5737825 5759496 5611956
1032 5611956 5957568 6196109 6547076 6445231 6271512 6137750 6461571 6898596 7122915 7106396
1022 7106396 7157101 7017952 7010073 7312062 7307051 7660328 7479593 7675383 8529152 9114347
1012 9114347 9324516 9786926 9773481 10330026 10454616 10454469 11270065 11431794 11855450 11823221
1002 11823221 11779261 12426610 12994481 13216846 14045334 14844895 15627601 16346682 17126337 17920726
$$ packed form
1072C178247K66262l8629k21148k10075L85701N28404L13498j06591j34026k05173
1062C756470J22559K96845O0746l29088l12321O94749L04863j66967M5187j91934
1052D281109K52900M29717l53401N48565J71662j67011k61532Q7130K97892L77033
1042E664064j49997k82286K03121m03031L1719j22373J53810O42798K1671j47540
1032E611956L45612K38541L50967j01845j73719j33762L23821M37025K24319j6519
1022G106396N0705j39149p879L01989n011L53277j80735J95790Q53769N85195
1012I114347K10169M62410j3445N56545J24590j47Q15596J61729M23656l2229
1002A1823221m3960O47349N67871K22365Q28488P99561P82706P19081P79655P94389
$$ plain form
992 17920726 19195258 20024766 20814403 22191596 23737653 25142367 26381186 27400668 28803009
983 28803009 30179114 31466579 33294341 35443051 38102964 40612142 43748418 46668166
975 46668166 49480782 51573411 54981485 59838378 66348190 75335740 86358434 98688971
967 98688971 113994290 132153158 154079229 181386897 215868904 259483672 304897470
960 304897470 316368301 274705865 215391613 169767412 136279560 111820636 94319539
953 94319539 81417252 71831294 63654155 57207012 51721262 47732286 44650109 42252051
945 42252051 40545256 38074943 33883205 29779232 27064910 24864066 22299727 20593491
937 20593491 18860188 17909608 17253915 16871349 16257207 15662544 15149993 14648649 14033741
$$ packed form
992A7920726J274532Q29508P89637J377193J546057J404714J238819J019482J402341
983B8803009J376105J287465J827762K148710K659913K509178L136276K919748
975D6668166K812616K092629L408074M856893O509812Q987550J1022694J2330537
967I8688971J5305319J8158868K1926071K7307668L4482007M3614768M5413798
960C04897470J1470831m1662436n9314252m5624201l3487852k4458924j7501097
953I4319539j2902287r585958q177139o447143n485750l988976l082177k398058
945D2252051j706795k470313m191738m103973k714322k200844k564339j706236
937B0593491j733303r50580o55693l82566o14142n94663n12551n01344o14908
$$ plain form
928 14033741 13420681 13178793 12815546 12696986 11813483 10725779 10818587 10766503 10191669 9864906
918 9864906 9376976 9075886 8774333 8118198 7944396 8288446 8045421 7708526 7644472 7626371
908 7626371 7228148 6747329 6498259 6353243 6412769 6386429 6742806 5868979 5717245 5742656
898 5742656 6148796 6263913 5768246 4874907 4216430 5034933 4946359 4871651 4387730 4435995
888 4435995 5121907 4285238 4010111 3840511 3668787 4260667 4169960 3929318 3747541 3846588
878 3846588 3851177 3661900 3662509 3963072 4043489 3651106 3673419 3242134 3020492 2885095 2674465
867 2674465 3378963 3527678 3210951 2482746 2346199 2233699 2305651 2591513 2361155 2190810
857 2190810 2611228 2502792 2459758 2398879 2367775 2648197 2260828 1705921 2065836 1967097
$$ packed form
928A4033741o13060k41888l63247j18560q83503j087704R2808n2084n74834l26763
918I864906m87930l01090l01553o56135j73802L44050k43025l36895o4054j8101
908G626371l98223m80819k49070j45016N9526k6340L56377q73827j51734K5411
898E742656M06140J15117m95667q93339o58477Q18503q8574p4708m83921M8265
888D435995O85912q36669k75127j69600j71724N91880r0707k40642j81777R9047
878C846588M589j89277O09L00563Q0417l92383K2313m31285k21642j35397k10630
867B674465P04498J48715l16727p28205j36547j12500P1952K85862k30358j70345
857B190810M20418j08436m3034o0879l1104K80422l87369n54907L59915r8739
$$ plain form
847 1967097 1630121 1473757 1281877 1575377 1655128 1425865 1457731 1665204 1446958 1195155
837 1195155 1044020 1462356 2102213 1358621 1022797 1175226 1405980 1326656 1024021 754845
827 754845 631610 1132193 850066 482953 868913 1130432 1362158 1521650 1309368 1295215
817 1295215 1476620 1050300 665356 622755 668356 669638 352014 560054 372618 206364
807 206364 367335 153864 42397 -84308 -641307 -31568 603320 952648 1217003 1525774
797 1525774 1225025 1154996 1100124 770129 385041 -43933 -183354 -9198 500270 248997
787 248997 19561 370669 374629 580706 466528 650508 801228 1029408 438267 143707
777 143707 440634 200136 708108 559061 511608 456712 -4132 -218737 -521592 -231610
$$ packed form
847A967097l36976j56364j91880K93500P9751k29263L1866K07473k18246k51803
837A195155j51135M18336O39857p43592l35824J52429K30754p9324l02635k69176
827G54845j23235N00583k82127l67113L85960K61519K31726J59492k12282j4153
817A295215J81405m26320l84944m2601M5601J282l17624K08040j87436j66254
807B06364J60971k13471j11467j26705n56999O09739O34888L49328K64355L08771
797A525774l00749p0029n4872l29995l85088m28974j39421J74156N09468k51273
787B48997k29436L51108L960K06077j14178J83980J50720K28180n91141k94560
777A43707K96927k40498N07972j49047m7453n4896m60844k14605l02855K89982
$$ plain form
767 -231610 -49427 230577 533434 208859 229208 336817 649203 600859 715087 464216
757 464216 801886 809803 614726 524423 716552 1055702 730427 533510 501027 457326 -14978
746 -14978 297620 386684 464528 672271 601371 485903 468952 139321 188691 38938 291002
735 291002 269533 171251 25612 -4710 279380 190570 225216 -47385 -146889 -298330 -230044
724 -230044 -269835 -124820 -249481 -277103 -301815 -239776 99980 426018 31628 -71408 -207719
713 -207719 129850 4464 -215366 -494240 -60967 377645 239850 72924 -270116 -144167
703 -144167 -332885 -409219 -28340 363316 217790 -180783 -581492 -487421 -107600 -279809
693 -279809 -76664 19000 -177242 117264 219644 620751 847366 731439 800994 362328
$$ packed form
767b31610J82183K80004L02857l24575K0349J07609L12386m8344J14228k50871
757D64216L37670P917j95077r0303J92129L39150l25275j96917l2483m3701m72304
746a4978L12598Q9064P7844K07743p0900j15468j6951l29631M9370j49753K52064
735B91002k1469r8282j45639l0322K84090q8810L4646k72601r9504j51441O8286
724b30044l9791J45015j24661k7622k4712O2039L39756L26038l94390j03036j36311
713b07719L37569j25386k19830k78874M33273M38612j37795j66926l43040J25949
703a44167j88718p6334L80879L91656j45526l98573m00709R4071L79821j72209
693b79809K03145R5664j96242K94506J02380M01107K26615j15927O9555m38666
$$ plain form
683 362328 127644 417098 513020 88193 339268 848037 1032407 1040872 899266 1030264
673 1030264 1289284 1003924 426621 691870 722198 371985 394513 310666 466056 469900 856155
662 856155 561376 518 301781 -92124 -153820 -156243 85829 -192752 -323032 -116325
652 -116325 102873 266768 -64640 -352965 -326312 -419254 275913 496677 480038 108010
642 108010 -19466 158619 375986 580351 -248480 -661783 -436010 91982 -103400 -41272
632 -41272 17787 -169906 137212 221311 -3534 403722 356233 -155441 -458268 146611 793913
621 793913 581946 -16072 -134037 -109403 91459 526579 -36917 -198707 -287095 -554951
611 -554951 -551460 -209826 -285149 -63307 -262880 -181454 141694 313969 240637 -200384 -527331
$$ packed form
683C62328k34684K89454R5922m24827K51075N08769J84370Q465j41606J30998
673A030264K59020k85360n77303K65249L0328l50213K2528q3847J55390L844L86255
662H56155k94779n60858L01263l93905o1696k423K42072k78581j30280K06707
652a16325K19198J63895l31408k88325K6653r2942O95167K20764j6639l72028
642A08010j27476J78085K17367K04365q28831m13303K25773N27992j95382O2128
632d1272N9059j87693L07118Q4099k24845M07256m7489n11674l02827O04879O47302
621G93913k11967n98018j17965K4634K00862M35120n63496j61790q8388k67856
611e54951L491L41634p5323K21842j99573Q1426L23148J72275p3332m41021l26947
$$ plain form
600 -527331 -394695 -513660 -410885 26635 -125941 -304054 -689217 -687042 -455459 -426608
590 -426608 -476876 -239593 19567 -36030 111010 416843 304130 147643 -97789 -582207
580 -582207 -52546 257486 236129 89131 -372920 10057 394275 -123918 -238361 -418646
570 -418646 -287811 -292920 -339207 -287209 -268924 -302971 -772189 -216980 129044 245002 -12069
559 -12069 -520963 -569478 -542763 -166346 -324672 -358992 143948 362958 257590 -159523 91304
548 91304 -261737 -483749 -556747 -312251 109785 -109285 -419056 -772824 -9415 400272
538 400272 -15483 60586 -420014 -405510 -250564 -478137 -371197 -160933 -333712 -317189
528 -317189 -76546 8949 -261274 -458111 -374764 -51164 75483 -195248 -374138 -91329
$$ packed form
600e27331J32636j18965J02775M37520j52576j78113l85163K175K31583K8851
590d26608n0268K37283K59160n5597J47040L05833j12713j56487k45432m84418
580e82207N29661L10032k1357j46998m62051L82977L84218n18193j14443j80285
570d18646J30835n109m6287N1998J8285l4047m69218N55209L46024J15958k57071
559a2069n08894m8515K6715L76417j58326l4320N02940K19010j05368m17113K50827
548I1304l53041k22012p2998K44496M22036k19070l09771l53768P63409M09687
538D00272m15755P6069m80600J4504J54946k27573J06940K10264j72779J6523
528c17189K40643Q5495k70223j96837Q3347L23600J26647k70731j78890K82809
$$ plain form
518 -91329 -457897 -706546 -1166518 -624104 32778 146027 52798 -96618 -61610 -192530
508 -192530 97197 124651 1613 -152268 -536567 -1075998 -931216 -596769 -466417 -681368
498 -681368 -468993 10180 52615 68526 25042 -100525 210375 251858 -143611 173401 544803
487 544803 15751 -329004 -210527 -569024 -416652 -456496 -887008 -690324 -661689 -586110
477 -586110 -41464 -142795 -24210 5751 -47190 54044 86138 -40036 -502337 -933748
467 -933748 -903483 -365053 -492765 -796345 -768793 -879247 -957143 -477601 -825194 -868375 -467644
456 -467644 -224366 354172 439240 13114 -116838 96451 65462 -481080 -663358 -727030
446 -727030 -47683 -492127 -653831 -526097 -15267 20718 -368374 -699823 -583184 -456173
$$ packed form
518i1329l66568k48649m59972N42414O56882J13249r3229j49416L5008j30920
508a92530K89727K7454j23038j53881l84299n39431J44782L34447J30352k14951
498f81368K12375M79173M2435J5911m3484j25567L10900M1483l95469L17012L71402
487E44803n29052l44755J18477l58497J52372l9844m30512J96684K8635P5579
477e86110N44646j01331J18585K9961n2941J01234L2094j26174m62301m31411
467i33748L0265N38430j27712l03580K7552j10454p7896M79542l47593m3181M00731
456d67644K43278N78538Q5068m26126j29952K13289l0989n46542j82278o3672
446g27030O79347m44444j61704J27734N10830L5985l89092l31449J16639J27011
$$ plain form
436 -456173 -258342 -131349 86413 279542 103734 90462 4739 283106 -181836 -642768
426 -642768 -848930 -683044 -630334 -380548 -702731 -232355 -45202 -228650 -194583 -593749
416 -593749 -337319 -307623 -560664 -455513 -135174 551628 354550 -284079 -615446 -208316
406 -208316 -466494 -563421 -294705 -781568 -706751 -478201 11946 278568 273198 -6616 -572829
395 -572829 -342627 146110 -5235 42858 -158860 -259446 -225559 -292140 -593062 -801081
385 -801081 -471067 -365551 -482670 -283187 34682 94613 -47888 -480332 -305824 436300
375 436300 315781 -260975 -280198 -533979 -437884 -521230 -758454 -709428 -682197 -683771 -656032
364 -656032 -465742 -358417 -325381 -199001 162112 -82407 -167078 -79413 259014 20247
$$ packed form
436d56173J97831J26993K17762J93129j75808j3272q5723K78367m64942m60932
426f42768k06162J65886N2710K49786l22183M70376J87153j83448L4067l99166
416e93749K56430K9696k53041J05151L20339O86802j97078o38629l31367M07130
406b08316k58178r6927K68716m86863P4817K28550M90147K66622n370k79814n66213
395e72829K30202M88737j51345M8093k01718j00586L3887o6581l00922k08019
385h01081L30014J05516j17119J99483L17869N9931j42501m32444J74508P42124
375D36300j20519n76756j9223k53781R6095q3346k37224M9026K7231j574K7739
364f56032J90290J07325L3036J26380L61113k44519q4671Q7665L38427k38767
$$ plain form
354 20247 -160267 -161304 64310 -74079 -639063 -1053461 -766072 -435009 -479853 -543224 -560696
343 -560696 -381069 -223908 -64331 -219786 -329252 16929 -21527 -628835 -740624 -904711
333 -904711 -174701 -669835 -1254194 -732047 -640340 -789085 -630056 -450455 -289652 -417827
323 -417827 -687758 -622756 -32289 69104 -379190 -314067 -146802 -366864 -423705 -769354
313 -769354 -898117 -617857 -530308 -553946 -111371 -213545 -615209 -762454 -985351 -423933
303 -423933 376739 263728 -123772 -342869 -272345 25941 -129411 3422 -338891 -555576
293 -555576 -416747 -485442 -587231 -340015 -704239 -704250 -389470 -186711 13955 -642039 -786635
282 -786635 -772591 234356 184227 -74131 -119231 -690402 -911504 -1019305 -638418 -547012
$$ packed form
354B0247j80514j037K25614j38389n64984m14398K87389L31063m4844o3371j7472
343e60696J79627J57161J59577j55455j09466L46181l8456o07308j11789j64087
333i04711P30010m95134n84359N22147R1707j48745J59029J79601J60803j28175
323d17827k69931O5002N90467J01393m48294O5123J67265k20062n6841l45649
313g69354j28763K80260Q7549k3638M42575j02174m01664j47245k22897N61418
303d23933Q00672j13011l87500k19097P0524K98286j55352J32833l42313k16685
293e55576J38829o8695j01789K47216l64224j1L14780K02759K00666o55994j44596
282g86635J4044J006947n0129k58358m5100n71171k21102j07801L80887R1406
$$ plain form
272 -547012 -742297 -761453 -966577 -687052 -477603 -385953 -332169 -587715 -493320 -384398 -187589
261 -187589 -502442 -311235 23766 -299383 -682298 -536855 -842690 -968400 -637581 -745513
251 -745513 -838132 -642557 -601586 -114565 -45680 -655488 -821778 -268052 85612 252623
241 252623 49820 -324006 -440193 -715611 -720647 -750898 -973781 -1260236 -1087781 -901518
231 -901518 -669981 -274524 -591494 -595368 -633082 -424259 -300632 -898336 -557671 -457767 -765982
220 -765982 -240140 138652 -66720 -787016 -808394 -1050300 -1172434 -741484 -677957 -834646
210 -834646 -944693 -842518 -498047 -185835 -71114 -676134 -828247 -315895 -335842 -148372
200 -148372 147265 -292730 -203258 -289926 -414764 -519360 -837030 -1227766 -1529607 -1024743
$$ packed form
272e47012j95285j9156k05124K79525K09449R1650N3784k55546R4395J08922J96809
261a87589l14853J91207L35001l23149l82915J45443l05835j25710L30819j07932
251g45513r2619J95575M0971M87021O8885o09808j66290N53726L53664J67011
241B52623k02803l73826j16187k75418n036l0251k22883k86455J72455J86263
231i01518K31537L95457l16970l874l7714K08823J23627n97704L40665R9904l08215
220g65982N25842L78792k05372p20296k1378k41906j22134M30950O3527j56689
210h34646j10047J02175L44471L12212J14721o05020j52113N12352j9947J87470
200a48372K95637m39995Q9472q6668j24838j04596l17670l90736l01841N04864
$$ plain form
190 -1024743 -454809 3693 55918 -100626 -667292 -208426 -403349 -686460 -797969 -400597
180 -400597 -28575 -368562 -909573 -578664 -563891 -1122683 -1204201 -1091678 -950438 -1116823
170 -1116823 -514164 -522327 -609869 -306446 -417152 -769879 -539254 -487989 -645073 -467738
160 -467738 -615014 -911246 -894471 -1175041 -1445540 -845905 -286206 -432088 -488207 -592446
150 -592446 -375068 -349033 -612978 -370089 -212377 -223285 -588767 -514801 -691862 -839300
140 -839300 -689466 -983686 -1015891 -921360 -1141503 -1260735 -905605 -826898 -708534 -662261 -550819
129 -550819 -279607 -459214 -541698 -528264 -569407 -407559 -715073 -982763 -891931 -978706 -1328279
118 -1328279 -995757 -813817 -566243 -428337 -688642 -532554 -669103 -461540 -446630 -399647
$$ packed form
190a024743N69934M58502N2225j56544n66666M58866j94923k83111j11509L97372
180d00597L72022l39987n41011L30909J4773n58792q1518J12523J41240j66385
170a116823O02659q163q7542L03423j10706l52727K30625N1265j57084J77335
160d67738j47276k96232J6775k80570k70499N99635N59699j45882n6119j04239
150e92446K17378K6035k63945K42889J57712j0908l65482P3966j77061j47438
140h39300J49834k94220l2205R4531k20143j19232L55130P8707J18364M6273J11442
129e50819K71212j79607q2484J3434m1143J61848l07514k67690R0832q6775l49573
118a328279L32522J81940K47574J37906k60305J56088j36549K07563J4910M6983
$$ plain form
108 -399647 -437984 -552088 -1030438 -879899 -783735 -661801 -508464 -655683 -789933 -657468
98 -657468 -818380 -994364 -1072090 -1068891 -859571 -708650 -615805 -543347 -663931 -594632 -610103
87 -610103 -972897 -1336659 -1120164 -1012782 -1016799 -1039374 -975092 -739463 -1033139 -1001535 -1202196
76 -1202196 -1119667 -824860 -716811 -599857 -318293 -333977 -675289 -662965 -557584 -945377
66 -945377 -737295 -416916 -480521 -575231 -895668 -1217881 -819116 -1180776 -1124821 -874342 -897878
55 -897878 -612908 -658953 -836637 -928396 -756992 -521592 -684872 -860123 -463531 -610732
45 -610732 -1103124 -742730 -565538 -774534 -473617 -633452 -733755 -670289 -598870 -814185
35 -814185 -912599 -979682 -755620 -884852 -800927 -605459 -498085 -643867 -1098505 -1024461 -848143
$$ packed form
108c99647l8337j14104m78350J50539R6164J21934J53337j47219j34250J32465
98f57468j60912j75984p7726L199K09320J50921R2845P2458j20584O9299j5471
87f10103l62794l63762K16495J07382m017k2575O4282K35629k93676L1604k00661
76a202196Q2529K94807J08049J16954K81564j5684l41312J2324J05381l87793
66i45377K08082L20379o3605r4710l20437l22213L98765l61660N5955K50479k3536
55h97878K84970m6045j77684r1759J71404K35400j63280j75251L96592j47201
45f10732m92392L60394J77192k08996L00917j59835j00303O3466P1419k15315
35h14185r8414o7083K24062j29232Q3925J95468J07374j45782m54638P4044J76318
$$ plain form
24 -848143 -979939 -1000995 -883512 -1270127 -1020694 -1058082 -1069964 -1183772 -941985 -1095867 -1255916
13 -1255916 -1012983 -579917 -692346 -708599 -769967 -753336 -608831 -695612 -688698 -1060831 -947991
2 -947991 -1013784 -1006428
0 -1006428
$$ packed form
24h48143j31796k1056J17483l86615K49433l7388j1882j13808K41787j53882j60049
13a255916K42933M33066j12429j6253o1368J6631J44505q6781O914l72133J12840
2i47991o5793P356
0a006428
$$ Imaginary data points
##PAGE= N=2
##DATA TABLE= (X++(I..I)), XYDATA
$$ plain form
16383 -1037346 -855463 -1108886 -1176118 -1297552 -1175318 -871230 -625081 -502718 -804608 -1088720
16373 -1088720 -1042185 -1206060 -1251983 -1019405 -1291787 -1156779 -1037865 -1021206 -842405 -888623
16363 -888623 -847615 -476141 -715035 -898038 -934337 -828947 -454541 -547768 -693103 -558249
16353 -558249 -547529 -681863 -1076844 -951523 -647670 -926306 -1161998 -1088445 -662605 -547411
16343 -547411 -441156 -642953 -548945 -450320 -780977 -486023 -505157 -217299 -58921 -349071
16333 -349071 -616269 -604435 -486478 -686950 -954738 -701282 -345464 -645113 -702396 -599377
16323 -599377 -807797 -623053 -410326 -218466 -356811 -388022 -111337 -82570 -358621 -303469
16313 -303469 -279238 -487678 -540585 -421923 -245897 -398522 -354726 -332554 -428679 -119275
$$ packed form
16383a037346J81883k53423o7232j21434J22234L04088K46149J22363l01890k84112
16373a088720M6535j63875m5923K32578k72382J35008J18914J6659J78801m6218
16363h88623M1008L71474k38894j83003l6299J05390L74406r3227j45335J34854
16353e58249J0720j34334l94981J25321L03853k78636k35692P3553M25840J15194
16343e47411J06255k01797R4008R8625l30657K94954j9134K87858J58378k90150
16333c49071k67198J1834J17957k00472k67788K53456L55818k99649n7283J03019
16323e99377k08420J84744K12727J91860j38345l1211K76685K8767k76051N5152
16313c03469K4231k08440n2907J18662J76026j52625M3796K2172r6125L09404
$$ plain form
16303 -119275 91968 -41978 -75800 -218635 69644 -243605 -61246 172668 -243242 -13090
16293 -13090 368300 -405102 -516954 -278459 -460391 -124076 34423 258714 49157 -430339
16283 -430339 -300654 -78523 -304318 -34261 -184664 119072 231419 186068 137699 143103
16273 143103 -41230 -218958 9291 -201449 -330522 -213818 -20314 -11397 -233576 -227405
16263 -227405 60035 30095 243562 40796 166698 -40405 234233 284042 185444 297963
16253 297963 -165861 167916 523899 410472 192300 137008 -41822 24020 574580 594016
16243 594016 765004 232802 523458 739059 13036 57653 -16892 -22911 37916 207315
16233 207315 -238877 16347 465744 322719 256048 513323 208186 -1142 445161 499462
$$ packed form
16303a19275K11243j33946l3822j42835K88279l13249J82359K33914m15910K30152
16293a3090L81390p73402j11852K38495j81932L36315J58499K24291k09557m79496
16283d30339J29685K22131k25795K70057j50403L03736J12347m5351m8369N404
16273A43103j84333j77728K28249k10740j29073J16704J93504Q917k22179O171
16263b27405K87440k9940K13467k02766J25902k07103K74638M9809r8598J12519
16253B97963m63824L33777L55983j13427k18172n5292j78830O5842N50560J9436
16243E94016J70988n32202K90656K15601p26023M4617p4545o019O0827J69399
16233B07315m46192K55224M49397j43025o6671K57275l05137k09328M46303N4301
$$ plain form
16223 499462 179614 500932 541962 379349 427383 264389 492676 433639 471135 383614
16213 383614 504873 396438 260562 71633 322644 678205 432109 469944 384043 490773
16203 490773 757543 650546 964889 495004 178123 444389 601726 702609 823796 580751
16193 580751 68328 200190 157977 378249 752263 730767 571788 318564 675656 705763
16183 705763 484336 742206 368089 334924 148637 770707 1021215 774513 590316 412694
16173 412694 324526 192663 588442 291909 457758 176151 183584 499882 641075 941241
16163 941241 1114079 809729 620012 566214 457970 967015 697012 451393 470704 330798
16153 330798 679203 656810 614912 647516 263782 603220 921911 964240 765710 163553
$$ packed form
16223D99462l19848L21318M1030j62613M8034j62994K28287n9037L7496q7521
16213C83614J21259j08435j35876j88929K51011L55561k46096L7835q5901J06730
16203D90773K66770j06997L14343m69885l16881K66266J57337J00883J21187k43045
16193E80751n12423J31862m2213K20272L74014k1496j58979k53224L57092L0107
16183G05763k21427K57870l74117l3165j86287O22070K50508k46702j84197j77622
16173D12694q8168j31863L95779k96533J65849k81607P433L16298J41193L00166
16163I41241J72838l04350j89717n3798j08244N09045k70003k45619J9311j39906
16153C30798L48405k2393m1898L2604l83734L39438L18691M2329j98530o02157
$$ plain form
16143 163553 192039 583201 528122 516409 468246 881286 436519 580904 649071 391672
16133 391672 98157 795021 997148 662979 1260607 1133876 1175559 891467 625115 775781
16123 775781 787661 292461 306166 -26229 432484 1150866 803136 579481 643330 365997
16113 365997 786974 946090 603169 816134 876775 493303 278896 463791 1013242 1113409
16103 1113409 750571 1092160 745390 666262 718278 657903 597314 809846 590862 380505
16093 380505 975860 970222 581900 563069 308027 676353 1445423 1510049 725001 513265
16083 513265 688286 630671 738437 737636 579579 303882 31485 161981 629135 857429
16073 857429 1252302 644325 629094 499176 538626 895281 718330 566681 611116 439205
$$ packed form
16143A63553K8486L91162n5079j1713m8163M13040m44767J44385O8167k57399
16133C91672k93515O96864K02127l34169N97628j26731M1683k84092k66352J50666
16123G75781J1880m95200J3705l32395M58713P18382l47730k23655O3849k77333
16113C65997M20977J59116l42921K12965O0641l83472k14407J84895N49451J00167
16103A113409l62838L41589l46770p9128N2016o0375o0589K12532k18984k10357
16093C80505N95355n638l88322j8831k55042L68326P69070O4626p85048k11736
16083E13265J75021n7615J07766q01j58057k75697k72397J30496M67154K28294
16073H57429L94873o07977j5231j29918L9450L56655j76951j51649M4435j71911
$$ plain form
16063 439205 642815 749003 493954 406435 111876 165056 630133 980108 600299 888805
16053 888805 691387 763403 520638 1046691 1294473 811035 230412 175516 958043 1421479
16043 1421479 1312101 821328 847823 695331 622034 404483 1052739 987811 684287 267190
16033 267190 711157 863465 1256976 1085581 390990 329036 936906 973303 1305072 1006094
16023 1006094 863312 763399 316571 407202 776489 971948 584667 24757 401471 1018898
16013 1018898 1204038 768422 -45157 399196 427469 619595 760733 842767 648281 747132
16003 747132 803964 874248 604822 659030 463379 530814 915444 1061202 523905 770674
15993 770674 847608 825367 648759 667417 1070663 1256713 946567 667474 528828 982483
$$ packed form
16063D39205K03610J06188k55049q7519k94559N3180M65077L49975l79809K88506
16053H88805j97418P2016k42765N26053K47782m83438n80623n4896P82527M63436
16043A421479j09378m90773K6495j52492p3297k17551O48256o4928l03524m17097
16033B67190M43967J52308L93511j71395o94591o1954O07870L6397L31769k98978
16023A006094j42782r9913m46828R0631L69287J95459l87281n59910L76714O17427
16013A018898J85140m35616q13579M44353K8273J92126J41138Q2034j94486R8851
16003G47132N6832P0284k69426N4208j95651O7435L84630J45758n37297K46769
15993G70674P6934k2241j76608J8658M03246J86050l10146k79093j38646M53655
$$ plain form
15983 982483 1485988 981691 501688 638839 1104361 1097212 860934 507606 378239 208438
15973 208438 611096 615365 734170 915410 229785 233958 717193 1031515 856827 735353
15963 735353 695271 327946 447697 764047 1129946 859085 660354 83066 20245 809392
15953 809392 928407 459078 -196551 -261809 281307 624378 309656 475884 763963 839312
15943 839312 772043 252439 711946 1258630 1049667 528465 608247 1124340 1243304 906704
15933 906704 370541 449402 493121 363579 409341 386962 652818 630441 576682 874230 828218
15922 828218 767143 689472 753549 687475 1040594 1074718 744772 736718 667582 669086 1127416
15911 1127416 707100 1011308 1374813 848246 602026 744270 844018 531347 172114 120731
$$ packed form
15983I82483N03505n04297m80003J37151M65522p149k36278l53328j29367j69801
15973B08438M02658M269J18805J81240o85625M173M83235L14322j74688j21474
15963G35353m0082l67325J19751L16350L65899k70861j98731n77288o2821P89147
15953H09392J19015m69329o55629o5258N43116L43071l14722J66228K88079P5349
15943H39312o7269n19604M59507N46684k08963n21202P9782N16093J18964l36600
15933I06704n36163P8861M3719j29542M5762k2379K65856k2377n3759K97548m6012
15922H28218o1075p7671O4077o6074L53119L4124l29946q054o9136J504M58330
15911A127416m20316L04208L63505n26567k46220J42244R9748l12671l59233n1383
$$ plain form
15901 120731 707931 305639 201839 421923 698074 475855 419864 530536 402167 654013
15891 654013 921374 831950 1058768 1023473 1140995 1089250 852355 800747 912116 545820
15881 545820 379348 392096 271770 300848 234172 444890 711381 686335 735763 1019114
15871 1019114 994452 1262079 970104 797613 741741 1068316 751179 678962 635008 741124
15861 741124 585398 402091 607349 910237 1017341 640725 379097 706290 1187791 1024575
15851 1024575 820196 1061098 1627428 1185947 1178034 971549 1082991 914304 808868 742537
15841 742537 872031 1102271 870910 518004 665962 1315332 1354348 904263 725223 1282615
15831 1282615 1330021 1026770 1166535 1053180 833988 683153 653276 1302827 1316376 968871
$$ packed form
15901A20731N87200m02292j03800K20084K76151k22219n5991J10672j28369K51846
15891F54013K67361q9424K26818l5295J17522n1745k36895n1608J11369l66296
15881E45820j66472J2748j20326K9078o6676K10718K66491k5046M9428K83351
15871A019114k4662K67627k91975j72491n5872L26575l17137p2217m3954J06116
15861G41124j55726j83307K05258L02888J07104l76616k61628L27193M81501j63216
15851A024575k04379K40902N66330m41481p913k06485J11442j68687j05436o6331
15841G42537J29494K30240k31361l52906J47958O49370L9016m50085j79040N57392
15831A282615M7406l03251J39765j13355k19192j50835k9877O49551J3549l47505
$$ plain form
15821 968871 554279 499049 970676 1161302 518973 522491 676166 700505 1002031 965743
15811 965743 844510 912147 759477 694660 930164 953713 976229 932090 703472 159564
15801 159564 561572 852667 262860 395882 586857 791960 1122000 1011279 991841 1159283
15791 1159283 769057 709301 689876 613100 1166161 931777 824277 729698 115081 170571
15781 170571 520525 706668 924137 614415 -38606 669959 1129057 1223241 1208779 770236
15771 770236 680235 478965 392703 556679 791151 826809 506085 604089 701811 885196
15761 885196 442035 102880 591514 1408519 1523755 928744 919894 1321811 1528934 747660
15751 747660 663955 972219 840307 672762 556589 490035 771314 842476 430166 401757
$$ packed form
15821I68871m14592n5230M71627J90626o42329L518J53675K4339L01526l6288
15811I65743j21233O7637j52670o4817K35504K3549K2516m4139k28618n43908
15801A59564M02008K91095n89807J33022J90975K05103L30040j10721j9438J67442
15791A159283l90226n9756j9425p6776N53061k34384j07500r4579o14617N5490
15781A70571L49954J86143K17469l09722o53021P08565M59098R4184j4462m38543
15771G70236r0001k01270q6262J63976K34472L5658l20724R8004R7722J83385
15761H85196m43161l39155M88634Q17005J15236n95011q850M01917K07123p81274
15751G47660q3705L08264j31912j67545j16173o6554K81279P1162m12310k8409
$$ plain form
15741 401757 1033930 993043 1000967 844558 1013342 1215400 832248 608196 1117107 1095948
15731 1095948 851684 427208 259413 719562 761365 223806 556247 1083150 877252 664043
15721 664043 541596 470264 828141 1145138 711387 724776 600457 907721 915390 912722 709542
15710 709542 302600 -35154 163799 955386 1259687 1197835 807877 347951 999910 874449
15700 874449 811904 781503 429182 1218460 1841182 1162185 792683 911559 620736 650406
15690 650406 429871 359446 690094 760516 618422 421475 599811 676678 412425 653863
15680 653863 449067 547086 1051729 1294474 1108534 962051 1254267 1301024 1197370 997965
15670 997965 803213 365532 724225 1032512 713467 496878 184957 831676 803689 652893
$$ packed form
15741D01757O32173m0887P924j56409J68784K02058l83152k24052N08911k1159
15731A095948k44264m24476j67795M60149M1803n37559L32441N26903k05898k13209
15721F64043j22447p1332L57877L16997m33751J3389j24319L07264P669k668k03180
15710G09542m06942l37754J98953P91587L04301o1852l89958m59926O51959j25461
15700H74449o2545l0401l52321P89278O22722o78997l69502J18876k90823K9670
15690F50406k20535p0425L30648P0422j42094j96947J78336P6867k64253K41438
15680F53863k04796R8019N04643K42745j85940j46483K92216M6757j03654j99405
15670I97965j94752m37681L58693L08287l19045k16589l11921O46719k7987j50796
$$ plain form
15660 652893 665557 740748 689568 792176 1184781 859880 763842 602509 154348 957496
15650 957496 982404 677338 597668 635614 865498 685036 710386 674772 1114318 1019325 773995
15639 773995 439665 959740 1261645 912334 566427 638618 1133838 1107967 592316 266481
15629 266481 547326 1075191 1052633 1034449 1070306 900019 534898 419633 661063 779034
15619 779034 860200 485641 763696 874163 638365 844319 624138 747867 882873 1087850
15609 1087850 606356 580141 980437 763043 986666 571215 713189 1175128 1000972 888822
15599 888822 551050 625107 910502 1077900 1270670 1110565 724761 573466 853278 709855
15589 709855 868737 824365 302033 371239 867478 1202033 759058 841499 510013 551366
$$ packed form
15660F52893J2664P5191n1180J02608L92605l24901r6038j61333m48161Q03148
15650I57496K4908l05066p9670L7946K29884j80462K5350l5614M39546r4993k45330
15639G73995l34330N20075L01905l49311l45907P2191M95220k5871n15651l25835
15629B66481K80845N27865k2558j8184L5857j70287l65121j15265K41430J17971
15619G79034Q1166l74559K78055J10467k35798K05954k20181J23729J35006K04977
15609A087850m81494k6215M00296k17394K23623m15451J41974M61939j74156j12150
15599H88822l37772P4057K85395J67398J92770j60105l85804j51295K79812j43423
15589G09855J58882m4372n22332O9206M96239L34555m42975Q2441l31486M1353
$$ plain form
15579 551366 706758 641132 733931 492153 125033 98066 592774 638311 965229 955476 255953
15568 255953 279802 353920 820839 1417805 1172895 1048334 794718 1067448 966285 1387192
15558 1387192 875083 582693 824606 939208 905345 791638 1023469 780879 606959 633033
15548 633033 730943 952095 1029815 905567 643737 1043494 1052446 863129 1312414 1037583
15538 1037583 1035377 1172387 717264 468692 1095156 929181 562970 645970 899432 1076505
15528 1076505 875797 362182 307250 742249 1044535 1071902 741033 312969 503994 793528
15518 793528 788428 1051829 1168382 1162545 1003170 1068222 618246 281672 583445 672184 773326
15507 773326 752122 717039 348323 232952 673313 1001763 952559 1006839 1366898 1198363
$$ packed form
15579E51366J55392o5626R2799k41778l67120k6967M94708M5537L26918r753o99523
15568B55953K3849P4118M66919N96966k44910j24561k53616K72730j01163M20907
15558A387192n12109k92390K41913J14602l3863j13707K31831k42590j73920K6074
15548F33033R7910K21152P7720j24248k61830L99757Q952j89317M49285k74831
15538A037583k206J37010m55123k48572O26464j65975l66211Q3000K53462J77073
15528A076505k00708n13615n4932M34999L02286K7367l30869m28064J91025K89534
15518G93528n100K63401J16553n837j59375O5052m49976l36574L01773Q8739J01142
15507G73326k1204l5083l68716j15371M40361L28450m9204N4280L60059j68535
$$ plain form
15497 1198363 1017638 745212 954837 1286102 1185904 1012113 805949 536764 433428
15488 433428 909283 1153550 1050332 981865 786963 889639 928791 800874 942106 1042669
15478 1042669 932520 720377 567036 311234 629808 516097 875629 809983 462533 1002335
15468 1002335 952217 700474 724420 225745 385704 835631 817017 892396 988798 843453
15458 843453 1163456 934812 815092 1088749 1103720 1167609 880817 1005728 606522 406203
15448 406203 587788 980075 938431 529822 385826 262992 523847 680292 183263 694206
15438 694206 1312532 1495788 767529 865287 1137607 965173 1149956 834508 498084 718642
15428 718642 793043 618692 744096 673328 948305 647755 291557 653196 871191 908383
$$ packed form
15497A198363j80725k72426K09625L31265j00198j73791k06164k69185j03336
15488D33428M75855K44267j03218o8467j94902J02676L9152j27917J41232J00563
15478A042669j10149k12143j53341k55802L18574j13711L59532o5646l47450N39802
15468A002335n0118k51743K3946m98675J59959M49927j8614P5379R6402j45345
15458H43453L20003k28644j19720K73657J4971O3889k86792J24911l99206k00319
15448D06203J81585L92287m1644m08609j43996j22834K60855J56445m97029N10943
15438F94206O18326J83256p28259R7758K72320j72434J84783l15448l36424K20558
15428G18642P4401j74351J25404p0768K74977l00550l56198L61639K17995L7192
$$ plain form
15418 908383 1262000 1390119 1730912 1611093 1122772 937143 1328850 1558265 1108823 1005459
15408 1005459 1141541 990811 907534 843576 733182 637075 840969 493149 324255 577008
15398 577008 1101020 1132149 524706 974818 875611 557614 507316 496152 1124042 1059202
15388 1059202 584894 270543 508264 1060163 766404 467303 606871 623115 1151396 1098595
15378 1098595 819915 619109 633907 887815 994427 543810 526153 1023687 791066 572112
15368 572112 1334918 1515882 783519 262832 74060 30564 344176 724711 612083 640104
15358 640104 249716 323876 855934 1082061 712879 387109 252840 365149 708292 700988
15348 700988 581617 617071 519249 200818 183262 829528 556679 429797 573806 727205
$$ packed form
15418I08383L53617J28119L40793j19819m88321j85629L91707K29415m49442j03364
15408A005459J36082j50730q3277o3958j10394r6107K03894l47820j68894K52753
15398E77008N24012L1129o07443M50112r9207l17997n0298j1164O27890o4840
15388A059202m74308l14351K37721N51899k93759k99101J39568J6244N28281n2801
15378A098595k78680k00806J4798K53908J06612m50617j7657M97534k32621k18954
15368E72112P62806J80964p32363n20687j88772m3496L13612L80535j12628K8021
15358F40104l90388P4160N32058K26127l69182l25770j34269J12309L43143p304
15348G00988j19371L5454r7822l18431j7556O46266k72849j26882J44009J53399
$$ plain form
15338 727205 773967 1114763 1216736 1264162 1014034 998545 704273 898417 1292765 949897
15328 949897 687507 607861 726399 1085059 778628 337355 311203 345844 460421 314061
15318 314061 680000 656466 418128 628671 696065 1096887 1717508 693400 -396413 120183
15308 120183 274933 447841 748093 737792 898686 461635 640928 1033025 852999 581979
15298 581979 409937 590561 580470 669600 1049197 1081820 624240 482261 708320 1023278
15288 1023278 1233437 698128 540691 484504 886004 1174729 926257 860371 478278 187910
15278 187910 792209 1246600 1261006 1297159 1089503 767472 1169135 1210623 975883 575305
15268 575305 291265 107070 260001 1276272 1540999 1324715 946393 889697 853214 694114
$$ packed form
15338G27205M6762L40796J01973M7426k50128j5489k94272J94144L94348l42868
15328I49897k62390p9646J18538L58660l06431m41273k6152L4641J14577j46360
15318C14061L65939k3534k38338K10543O7394M00822O20621j024108j089813N16596
15308A20183J54750J72908L00252j0301J60894m37051J79293L92097j80026k71020
15298E81979j72042J80624j0091Q9130L79597L2623m57580j41979K26059L14958
15288A023278K10159n35309j57437n6187M01500K88725k48472o5886l82093k90368
15278A87910O04299M54391J4406L6153k07656l22031M01663M1488k34740m00578
15268E75305k84040j84195J52931J016271K64727k16284l78322n6696l6483j59100
$$ plain form
15258 694114 855293 518301 584092 702030 507998 1085746 1208488 481796 407368 477202
15248 477202 456537 1016620 1281650 971725 961426 622724 775954 1073288 484432 519345
15238 519345 724999 100362 205414 586475 768312 884258 660983 620319 462127 727451
15228 727451 887562 799269 792179 483455 590713 1234797 1221489 1093764 786133 709092
15218 709092 977818 1026136 1138060 760987 629986 920359 778847 873931 704243 244669
15208 244669 383212 324311 627824 1369081 1584462 940344 775622 928692 1030063 853187
15198 853187 685942 546584 1196749 1193733 1277662 1254891 839138 622675 459930 754072
15188 754072 674288 939316 1194281 834038 1105848 1719102 1561130 979350 968110 934212
$$ packed form
15258F94114J61179l36992O5791J17938j94032N77748J22742p26692p4428O9834
15248D77202k0665N60083K65030l09925j0299l38702J53230K97334n88856L4913
15238E19345K05654o24637J05052L81061J81837J15946k23275m0664j58192K65324
15228G27451J60111q8293p090l08724J07258O44084j3308j27725l07631p7041
15218G09092K68726M8318J11924l77073j31001K90373j41512R5084j69688m59574
15208B44669J38543n8901L03513P41257K15381o44118j64722J53070J01371j76876
15198H53187j67245j39358O50165l016Q3929k2771m15753k16463j62745K94142
15188G54072p9784K65028K54965l60243K71810O13254j57972n81780j1240l3898
$$ plain form
15178 934212 927117 911945 597588 763956 774120 797645 543211 695316 644790 902933 1287878
15167 1287878 1211030 678830 614269 750934 850128 691291 891155 842592 516160 430882
15157 430882 438153 383376 842149 932233 506700 678302 810105 1054940 1402201 808347
15147 808347 650742 911323 678554 663413 1090419 1263302 761260 629257 938403 884543
15137 884543 735296 388496 -45759 75903 496980 631524 903341 1048302 765936 576784
15127 576784 1002795 1108993 1034592 1087049 1017225 1262385 1070903 731152 492511 602283
15117 602283 336838 481906 1048770 1045770 753896 529719 435230 389961 684922 318904
15107 318904 420097 861449 851527 593680 517366 921837 1021993 728692 587999 577752
$$ packed form
15178I34212p095j5172l14357J66368J0164K3525k54434J52105n0526K58143L84945
15167A287878p6848n32200o4561J36665R9194j58837J99864m8563l26432q5278
15157D30882P271n4777M58773R0084m25533J71602J31803K44835L47261n93854
15147H08347j57605K60581k32769j5141M27006J72883n02042j32003L09146n3860
15137H84543j49247l46800m34255J21662M21077J34544K71817J44961k82366j89152
15127E76784M26011J06198p4401N2457o9824K45160j91482l39751k38641J09772
15117F02283k65445J45068N66864l000k91874k24177r4489m5269K94961l66018
15107C18904J01193M41352r922k57847p6314M04471J00156k93301j40693j0247
$$ plain form
15097 577752 458165 611653 602234 333495 318371 444311 658728 670346 550860 933101
15087 933101 623561 294643 553938 812798 858746 669495 1002228 873941 385668 677400
15077 677400 1010381 822856 858344 1220495 1108423 1004524 954223 1241323 961362 484724
15067 484724 456253 1126353 1399768 974895 683407 631147 489871 527276 273417 311821
15057 311821 678387 604984 857567 658942 803210 895142 879345 873384 585448 547839 757118
15046 757118 843138 699302 811903 765110 1132732 907585 723135 501492 342044 693095
15036 693095 605185 1041406 920488 1219619 1437401 824090 974020 1432099 1347465 459198
15026 459198 783992 628811 455577 778683 735932 693315 123371 84075 646867 746218
$$ packed form
15097E77752j19587J53488r419k68739j5124J25940K14417J1618j19486L82241
15087I33101l09540l28918K59295K58860M5948j89251L32733j28287m88273K91732
15077F77400L32981j87525L5488L62151j12072j03899n0301K87100k79961m76638
15067D84724k8471O70100K73415m24873k91488n2260j41276L7405k53859L8404
15057C11821L66566p3403K52583j98625J44268R1932j5797n961k87936l7609K09279
15046G57118Q6020j43836J12601m6793L67622k25147j84450k21643j59448L51051
15036F93095q7910M36221j20918K99131K17782o13311J49930M58079q4634q88267
15026D59198L24794j55181j73234L23106m2751m2617n69944l9296N62792R9351
$$ plain form
15016 746218 790706 1363921 1487508 820247 1044704 1067875 1405792 1345603 978811 452566
15006 452566 311298 798525 849190 796740 404221 785946 995802 1089524 1205823 1076128
14996 1076128 979759 1203987 1045667 547047 1136602 1059993 835689 663202 276969 702594
14986 702594 717716 507859 640695 751048 1009898 766152 552157 568113 481457 603572
14976 603572 836155 1089557 681177 1109973 950483 542441 968604 1014023 1297831 1476215
14966 1476215 1205519 1069252 642367 628094 719473 979806 875445 1430728 1162454 1083121
14956 1083121 669293 765276 648346 438449 780188 791326 989615 510486 476147 415812
14946 415812 677923 720829 591540 708487 1040973 1172041 779742 1025683 868393 904804
$$ packed form
15016G46218M4488N73215J23587o67261K24457K3171L37917o0189l66792n26245
15006D52566j41268M87227N0665n2450l92519L81725K09856R3722J16299j29695
14996A076128r6369K24228j58320m98620N89555p6609k24304j72487l86233M25625
14986G02594J5122k09857J32836J10353K58850k43746k13995J5956q6656J22115
14976F03572K32583K53402m08380M28796j59490m08042M26163M5419K83808J78384
14966A476215k70696j36267m26885j4273R1379K60333j04361N55283k68274p9333
14956A083121m13828R5983j16930k09897L41739J1138J98289m79129l4339o0335
14946D15812K62111M2906j29289J16947L32486J31068l92299K45941j57290L6411
$$ plain form
14936 904804 1172006 920853 883827 1008956 1036582 691796 555319 610607 897114 1102227
14926 1102227 1005315 1255742 997797 1070610 1231917 1118814 698907 932028 1251239 964348
14916 964348 674086 739363 666335 832053 569910 621417 885310 802410 1051575 1030263
14906 1030263 937437 957894 1392257 1373087 1503698 1015155 685220 865935 482733 623778
14896 623778 913617 438122 436942 604038 654124 754158 884826 881634 655769 462580
14886 462580 747804 288435 425827 787563 946139 1397731 1275631 881162 985563 954390
14876 954390 826411 629905 239803 199656 750697 765595 667532 480261 601760 755558
14866 755558 820305 1055953 733238 610133 965919 508807 545275 765531 858468 867972
$$ packed form
14936I04804K67202k51153l7026J25129K7626l44786j36477N5288K86507K05113
14926A102227r6912K50427k57945P2813J61307j13103m19907K33121L19211k86891
14916I64348k90262O5277p3028J65718k62143N1507K63893q2900K49165k1312
14906A030263r2826K0457M34363j9170J30611m88543l29935J80715l83202J41045
14896F23778K89839m75495j180J67096N0086J00034J30668l192k25865j93189
14886D62580K85224m59369J37392L61736J58576M51592j22100l94469J04401l1173
14876I54390j27979j96506l90102m0147N51041J4898r8063j87271J21499J53798
14866G55558O4747K35648l22715j23105L55786m57112L6468K20256R2937R504
$$ plain form
14856 867972 551838 597811 843704 480561 771714 1057899 1286833 1115866 538499 1016515
14846 1016515 808159 541492 1115324 940208 1191902 1373456 932757 532999 1096905
14837 1096905 1020408 822462 855787 363262 784023 919811 1225698 942620 655490 1213649
14827 1213649 990746 732777 813738 710834 924272 676241 513851 709799 1176728 649179
14817 649179 362633 634727 907623 1368213 1248019 817855 765626 1116558 727368 552270
14807 552270 1043853 1063289 1206257 763953 763165 1160566 801857 765074 1123064 786676
14797 786676 484537 650798 849063 898508 549336 73356 811018 952609 929737 1532387
14787 1532387 1027222 291343 527159 646925 833511 991943 723761 859994 1090485
$$ packed form
14856H67972l16134M5973K45893l63143K91153K86185K28934j70967n77367M78016
14846A016515k08356k66667N73832j75116K51694J81554m40699l99758N63906
14837A096905p6497j97946L3325m92525M20761J35788L05887k83078k87130N58159
14827A213649k22903k57969Q0961j02904K13438k48031j62390J95948M66929n27549
14817F49179k86546K72094K72896M60590j20194m30164n2229L50932l89190j75098
14807E52270M91583J9436J42968m42304p88L97401l58709l6783L57990l36388
14797G86676l02139J66261J98265M9445l49172m75980P37662J41591k2872O02650
14787A532387n05165p35879K35816J19766J86586J58432k68182J36233K30491
$$ plain form
14778 1090485 818389 717052 505401 352277 452017 853003 1385274 1665603 1512569 1210704
14768 1210704 1109422 801176 837540 896117 654184 523435 375906 419974 659041 862747
14758 862747 796563 765458 928462 1099091 887331 875958 1054189 1026400 778695 965038
14748 965038 896631 911238 1512744 846990 400763 703751 903454 714536 653585 707929
14738 707929 853296 1028582 1087503 1130516 1385085 1343914 925250 734747 638700 1378858
14728 1378858 1280005 653895 406443 832852 1006892 1155682 1311803 873258 1078290 863697
14718 863697 572129 500562 542469 775306 517142 469667 824505 911824 658017 723183
14708 723183 401667 547415 959979 668755 799731 696937 677877 493858 681801 634099
$$ packed form
14778A090485k72096j01337k11651j53124R9740M00986N32271K80329j53034l01865
14768A210704j01282l08246L6364N8577k41933j30749j47529M4068K39067K03706
14758H62747o6184l1105J63004J70629k11760j1373J78231k7789k47705J86343
14748I65038o8407J4607O01506o65754m46227L02988J99703j88918o0951N4344
14738G07929J45367J75286N8921M3013K54569m1171m18664j90503r6047P40158
14728A378858r8853o26110k47452M26409J74040J48790J56121m38545K05032k14593
14718H63697k91568p1567M1907K32837k58164m7475L54838Q7319k53807O5166
14708G23183l21516J45748M12564k91224J30976j02794j9060j84019J87943m7702
$$ plain form
14698 634099 854854 1099425 1010540 696784 856124 808255 961383 1200140 1044591 894592
14688 894592 920567 1231049 1360950 945585 998201 509221 522353 1108781 1032040 983758
14678 983758 769686 714381 892557 969723 868431 907124 511148 554652 931266 1064011
14668 1064011 1084886 1448131 1291508 743945 453759 484228 649967 757350 926057 781671
14658 781671 480361 661349 688191 409894 423190 413185 540129 706734 1036496 992598
14648 992598 722267 764250 1003300 852048 828402 1338828 1377758 1160080 877535 1026129
14638 1026129 609715 729467 722683 865974 978875 1025257 1211031 964543 526912 523483
14628 523483 669156 683990 902878 1126800 988848 871279 748503 790229 1158042 636336
$$ packed form
14698F34099K20755K44571q8885l13756J59340m7869J53128K38757j55549j49999
14688H94592K5975L10482J29901m15365N2616m88980J3132N86428p6741m8282
14678I83758k14072n5305J78176P7166j01292L8693l95976M3504L76614J32745
14668A064011K0875L63245j56623n47563k90186L0469J65739J07383J68707j44386
14658G81671l01310J80988K6842k78297J3296j0005J26944J66605L29762m3898
14648I92598k70331M1983K39050j51252k3646N10426L8930k17678k82545J48594
14638A026129m16414J19752o784J43291J12901M6382J85774k46488m37631l429
14628E23483J45673J4834K18888K23922j37952j17569j22776M1726L67813n21706
$$ plain form
14618 636336 352233 282837 645374 741217 322575 631608 1032408 1001631 883129 837322
14608 837322 833571 1124704 1038326 534464 1088603 979479 1022165 880664 955983 1025970 830583
14597 830583 917152 720715 542657 1033174 1168181 1239259 1214842 1149069 1138588 1051196 735536
14586 735536 474297 633435 649075 1313301 969169 994069 1277224 759403 912673 1143768
14576 1143768 942812 1155777 1089118 835289 905178 862529 698995 664991 921344 799388
14566 799388 747891 904320 991324 897572 1098267 766401 592149 548738 638618 409086
14556 409086 563399 1613585 1244349 1196456 1369483 1373626 1456363 730669 488701 844537
14546 844537 834969 636605 1028478 848411 331065 549750 739757 1257272 1124321 1384379
$$ packed form
14618F36336k84103o9396L62537R5843m18642L09033M00800l0777j18502m5807
14608H37322l751K91133q6378n03862N54139j09124M2686j41501P5319O9987j95387
14597H30583Q6569j96437j78058M90517J35007P1078k4417o5773j0481q7392l15660
14586G35536k61239J59138J5640O64226l44132K4900K83155n17821J53270K31095
14576A143768k00956K12965o6659k53829O9889m2649j63534l4004K56353j21956
14566G99388n1497J56429Q7004r3752K00695l31866j74252m3411Q9880k29532
14556D09086J54313J050186l69236m7893J73027M143Q2737p25694k41968L55836
14546H44537r568j98364L91873j80067n17346K18685J90007N17515j32951K60058
$$ plain form
14536 1384379 1373707 687009 512855 1057612 1011046 1208861 779335 533718 907721 1178379
14526 1178379 767583 790680 776310 738528 482982 863014 1151658 966655 662851 678144
14516 678144 523450 612746 849560 1202591 1442054 817438 1140865 1276399 1120631 1053413
14506 1053413 984234 402005 752462 1044351 1028750 641314 570649 608930 861671 962431
14496 962431 1121963 742325 825035 1040196 1012315 955810 1047733 1204457 916987 736115
14486 736115 649204 1095461 667019 316352 334675 418919 152933 435211 749374 820289
14476 820289 1162469 1492588 1163392 1217771 1054739 872634 778762 514859 981876 850696
14466 850696 918491 758445 330678 348622 412195 525735 923918 805261 913986 787366
$$ packed form
14536A384379j0672o86698j74154N44757m6566J97815m29526k45617L74003K70658
14526A178379m10796K3097j4370l7782k55546L80032K88644j85003l03804J5293
14516F78144j54694Q9296K36814L53031K39463o24616L23427J35534j55768o7218
14506A053413o9179n82229L50457K91889j5601l87436p0665L8281K52741J00760
14496I62431J59532l79638Q2710K15161k7881n6505R1923J56724k87470j80872
14486G36115q6911M46257m28442l50667J8323Q4244k65986K82278L14163P0915
14476H20289L42180L30119l29196N4379j63032j82105r3872k63903M67017j31180
14466H50696O7795j60046m27767J7944O3573J13540L98183j18657J08725j26620
$$ plain form
14456 787366 1071155 1551617 1986119 1280131 1180643 1017710 1147510 789226 559656 381500
14446 381500 134210 462955 556038 809609 491235 962568 1022530 1081218 1000348 728012
14436 728012 993344 1177211 805822 963577 758131 1088304 1077354 1179673 928931 860238
14426 860238 771675 533634 439385 350373 769068 601006 814506 824195 771250 766094 1076998
14415 1076998 856503 737882 987747 1216115 894575 838272 1137441 1442951 979617 394506
14405 394506 135187 316175 298962 600905 628847 809171 1080298 804379 663106 492508
14395 492508 952160 1177035 1048711 821255 1142476 1379854 1273791 1381010 1154111 552040
14385 552040 420309 303995 539940 455785 743061 319644 167308 901051 1154537 1445172
$$ packed form
14456G87366K83789M80462M34502p05988r9488j62933J29800l58284k29570j78156
14446C81500k47290L28745R3083K53571l18374M71333N9962N8688q0870k72336
14436G28012K65332J83867l71389J57755k05446L30173j0950J02319k50742o8693
14426H60238q8563k38041r4249q9012M18695j68062K13500R689n2945n156L10904
14415A076998k20495j18621K49865K28368l21540n6303K99169L05510m63334n85111
14405C94506k59319J80988j7213L01943K7942J80324K71127k75919j41273j70598
14395D92508M59652K24875j28324k27456L21221K37378j06063J07219k26899o02071
14385E52040j31731j16314K35945q4155K87276m23417j52336P33743K53486K90635
$$ plain form
14375 1445172 804606 779511 826553 496993 532412 868268 1127684 888237 905819 1330533
14365 1330533 1307062 1052918 649170 622644 433725 1104204 1106578 600140 1078158 1237161
14355 1237161 972066 563434 563064 794058 881091 516487 533496 653225 719664 759916 1060375
$$ packed form
14375A445172o40566k5095M7042l29560L5419L35856K59416k39447J7582M24714
14365A330533k3471k54144m03748k6526j88919O70479K374n06438M78018J59003
14355A237161k65095m08632l70K30994Q7033l64604J7009J19729O6439M0252L00459
$$ [...]
##END NTUPLES=NMR SPECTRUM
##END=
