##TITLE=1H_CG-1138
 CDCl3, 8 sc, 
 17.12.2020
##JCAMPDX= 6.0         $$ Bruker NMR JCAMP-DX V2.0
##DATA TYPE= NMR SPECTRUM
##DATA CLASS= NTUPLES
##ORIGIN= UXNMR, Bruker Analytische Messtechnik GmbH
##OWNER= root
$$ XWIN-NMR		Version 3.5
$$ Thu Dec 17 11:27:07 2020 Russian Standard Time (UT+4h)  she@DPX200
##.OBSERVE FREQUENCY= 200.1315066352
##.OBSERVE NUCLEUS= ^1H
##.ACQUISITION MODE= SIMULTANEOUS
##.ACQUISITION SCHEME= undefined
##.AVERAGES= 8
##.DIGITISER RES= 18
##SPECTROMETER/DATA SYSTEM= spect
##.PULSE SEQUENCE= zg30
##.SOLVENT NAME= CDCl3
##.SHIFT REFERENCE= (INTERNAL, CDCl3, 0, 15.9844)
##AUDIT TRAIL= $$ (NUMBER, WHEN, WHO, WHERE, WHAT)
$$ ##TITLE= Audit trail, XWIN-NMR		Version 3.5
$$ ##JCAMPDX= 5.01
$$ ##ORIGIN= Bruker BioSpin GmbH
$$ ##OWNER= she
$$ F:/spectra/data/she/nmr/H-F/1/pdata/1/auditp.txt
$$ ##AUDIT TRAIL=  $$ (NUMBER, WHEN, WHO, WHERE, WHAT)
(   1,<2020-12-17 11:25:24.29 +0400>,<she>,<DPX200>,
      <created by zg, POWCHK disabled, PULCHK disabled
       configuration hash MD5:
       00 E9 B6 7A A2 85 ED C7 34 08 36 98 17 FE 4E 26
       data hash MD5: 16K
       78 70 25 6A C8 46 93 7C 34 53 73 65 41 C2 CD 0A>)
(   2,<2020-12-17 11:25:27.68 +0400>,<she>,<DPX200>,
      <Start of raw data processing
       efp BC_mod = 2 LB = 0.24 FT_mod = 6 PKNL = 1 PHC0 = -10762.67 PHC1 = 15.00094 SI = 16K 
       data hash MD5: 16K
       E5 9C F4 C1 1F A0 DD C7 51 4A 22 24 30 28 6F 1F>)
(   3,<2020-12-17 11:25:46.79 +0400>,<she>,<DPX200>,
      <pk PHC0 = 1.837986 PHC1 = -3.4 
       data hash MD5: 16K
       38 3B B4 E9 E2 90 9B 59 55 F9 01 DF 3F 76 45 A3>)
(   4,<2020-12-17 11:25:50.92 +0400>,<she>,<DPX200>,
      <abs ABSG = 5 
       data hash MD5: 16K
       A6 4E 45 90 5E BC 5C 77 3A 56 E8 19 8F 40 B2 89>)
$$ ##END=
$$ 
$$ hash MD5
$$ 8A F1 49 90 5F 6C 6E D1 C7 16 6A 3A 79 F4 A8 EE
##$RELAX= 
##$RELAX= 
##$RELAX= 
##$RELAX= 
##$RELAX= 
##$RELAX= 
$$ Bruker specific parameters
$$ --------------------------
##$DU= <F:/spectra>
##$EXPNO= 1
##$NAME= <H-F>
##$PROCNO= 1
##$TYPE= <nmr>
##$USER= <she>
##$AMP= (0..31)
100 100 100 100 100 100 100 100 100 100 100 100 100 100 100 100 100 100 
100 100 100 100 100 100 100 100 100 100 100 100 100 100 
##$AQSEQ= 0
##$AQ_mod= 1
##$AUNM= <au_zg>
##$AUTOPOS= <>
##$BF1= 200.13
##$BF2= 200.13
##$BF3= 200.13
##$BF4= 200.13
##$BF5= 200.13
##$BF6= 200.13
##$BF7= 200.13
##$BF8= 200.13
##$BYTORDA= 1
##$CFDGTYP= 0
##$CFRGTYP= 5
##$CHEMSTR= <none>
##$CNST= (0..31)
1 1 145 1 1 1 1 1 1 1 1 1 1 1 1 1 1 1 1 1 1 1 1 1 1 1 1 1 1 1 1 1 
##$CPDPRG= <>
##$CPDPRG1= <>
##$CPDPRG2= <>
##$CPDPRG3= <>
##$CPDPRG4= <mlev>
##$CPDPRG5= <mlev>
##$CPDPRG6= <mlev>
##$CPDPRG7= <mlev>
##$CPDPRG8= <mlev>
##$CPDPRGB= <>
##$CPDPRGT= <>
##$D= (0..31)
0 1.2 0 0 0 0 0 0 0 0.06 0 0.03 0 0 0 0 0.0002 0 0 0 0 0 0 0 0 0 0 0 0 
0 0 0 
##$DATE= 1608189923
##$DBL= (0..7)
120 120 120 120 120 120 120 120 
##$DBP= (0..7)
150 150 150 150 150 150 150 150 
##$DBP07= 0
##$DBPNAM0= <>
##$DBPNAM1= <>
##$DBPNAM2= <>
##$DBPNAM3= <>
##$DBPNAM4= <>
$$ [...]
##$SUBNAM3= <"">
##$SUBNAM4= <"">
##$SUBNAM5= <"">
##$SUBNAM6= <"">
##$SUBNAM7= <"">
##$SUBNAM8= <"">
##$SUBNAM9= <"">
##$SW= 16.9725356469052
##$SWIBOX= (0..15)
0 0 2 0 0 0 0 0 0 0 0 0 0 0 0 0 
##$SW_h= 3396.73913043478
##$TD= 16384
##$TD0= 1
##$TE= 0
##$TE2= 300
##$TE3= 300
##$TEG= 300
##$TL= (0..7)
0 120 120 120 120 120 120 120 
##$TP= (0..7)
150 150 150 150 150 150 150 150 
##$TP07= 0
##$TPNAME0= <>
##$TPNAME1= <>
##$TPNAME2= <>
##$TPNAME3= <>
##$TPNAME4= <>
##$TPNAME5= <>
##$TPNAME6= <>
##$TPNAME7= <>
##$TPOAL= (0..7)
0.5 0.5 0.5 0.5 0.5 0.5 0.5 0.5 
##$TPOFFS= (0..7)
0 0 0 0 0 0 0 0 
##$TUNHIN= 0
##$TUNHOUT= 0
##$TUNXOUT= 0
##$USERA1= <user>
##$USERA2= <user>
##$USERA3= <user>
##$USERA4= <user>
##$USERA5= <user>
##$V9= 5
##$VALIST= <valist>
##$VCLIST= <CCCCCCCCCCCCCCC>
##$VD= 0
##$VDLIST= <DDDDDDDDDDDDDDD>
##$VPLIST= <PPPPPPPPPPPPPPP>
##$VTLIST= <TTTTTTTTTTTTTTT>
##$WBST= 1024
##$WBSW= 4
##$XGAIN= (0..3)
0 0 0 0 
##$XL= 0
##$YL= 0
##$YMAX_a= 628732
##$YMIN_a= -352553
##$ZGOPTNS= <>
##$ZL1= 120
##$ZL2= 120
##$ZL3= 120
##$ZL4= 120
##$ABSF1= 15.9761
##$ABSF2= -0.996562
##$ABSG= 5
##$ABSL= 3
##$ALPHA= 0
##$AQORDER= 0
##$ASSFAC= 0
##$ASSFACI= 0
##$ASSFACX= 0
##$ASSWID= 0
##$AUNMP= <proc_1d>
##$AZFE= 0.1
##$AZFW= 0.1
##$BCFW= 0
##$BC_mod= 2
##$BYTORDP= 0
##$COROFFS= 0
##$CY= -3
##$DATMOD= 1
##$DC= 0
##$DFILT= <>
##$DTYPP= 0
##$F1P= 0
##$F2P= 0
##$FCOR= 1
##$FTSIZE= 16384
##$FT_mod= 6
##$GAMMA= 0
##$GB= 0
##$INTBC= 1
##$INTSCL= 2.992141e-10
##$ISEN= 128
##$LB= 0.24
##$LEV0= 0
##$LPBIN= 0
##$MAXI= 10000
##$MC2= 0
##$MEAN= 0
##$ME_mod= 0
##$MI= 1.114404
##$NCOEF= 0
##$NC_proc= -6
##$NLEV= 6
##$NOISF1= 3.799351
##$NOISF2= 2.8
##$NSP= 0
##$NTH_PI= 0
##$NZP= 0
##$OFFSET= 15.98439
##$PC= 1
##$PHC0= -10760.83
##$PHC1= 11.60094
##$PH_mod= 1
##$PKNL= yes
##$PPARMOD= 0
##$PSCAL= 0
##$PSIGN= 0
##$REVERSE= no
##$SF= 200.130006049974
##$SI= 16384
##$SIGF1= 3
##$SIGF2= 2
##$SINO= 5.538805
##$SIOLD= 16384
##$SREGLST= <1H.CDCl3>
##$SSB= 0
##$STSI= 16384
##$STSR= 0
##$SW_p= 3396.73913043478
##$SYMM= 0
##$S_DEV= 0
##$TDeff= 16384
##$TDoff= 0
##$TI= <>
##$TILT= no
##$TM1= 0
##$TM2= 0
##$TOPLEV= 0
##$USERP1= <user>
##$USERP2= <user>
##$USERP3= <user>
##$USERP4= <user>
##$USERP5= <user>
##$WDW= 1
##$XDIM= 16384
##$YMAX_p= 274899826
##$YMIN_p= -421998
$$ End of Bruker specific parameters
$$ ---------------------------------
##NTUPLES= NMR SPECTRUM
##VAR_NAME=  FREQUENCY,     SPECTRUM/REAL,   SPECTRUM/IMAG
##SYMBOL=    X,             R,               I
##VAR_TYPE=  INDEPENDENT,   DEPENDENT,       DEPENDENT
##VAR_FORM=  AFFN,          ASDF,            ASDF
##VAR_DIM=   16384,         16384,           16384
##UNITS=     HZ,            ARBITRARY UNITS, ARBITRARY UNITS
##FACTOR=    0.207333158178281, 1,           1
##FIRST=     3198.9561191966, 0,             0
##LAST=      -197.783011238179, 0,           0
##MIN=       -197.783011238179, -421998,     0
##MAX=       3198.9561191966, 274899826,     0
$$ Real data points
##PAGE= N=1
##DATA TABLE= (X++(R..R)), XYDATA
$$ [...]
6192B536337k5131n0867J10178r3412J83039N6320P5189J1774K929K28K6266M1450
6180B874300K6396j3631o9329J52711m8851O1476J79575O2911k14855Q1595N6874
6169C149172J0575J98901o175j40727j82297Q2598m7001N3129j69849K57164K6360
6158C231850j25324Q461J56436r2131N6874n4782O5995N2574l32516K39338M4502
6147C251277N8796j36056r025j34711Q9452n1185K9510l8399L7943K3904O2361
6136C183867N1931P7941k6120j42347J31690l337J16057j34741n2336j02442j23800
6125B976363Q4763J4282O8239K24216l4680O318j47154p107K43626K9813K2225
6114C480904K0417O5093n9316J07890m1659j0301n8969R8259r3249j50505L6488
$$ y = [2536337, 2511206, 2460339, 2570517, 2477105, 2660144, 2716464, 2791653, 2803427, 2806356, 2806584, 2832850, 2874300, 2900696, 2887065, 2817736, 2970447, 2921596, 2983072, 3162647, 3225558, 3010703, 3092298, 3149172, 3159747, 3358648, 3352473, 3211746, 3029449, 3112047, 3065046, 3118175, 2948326, 3205490, 3231850, 3106526, 3114987, 3271423, 3179292, 3236166, 3181384, 3247379, 3299953, 2967437, 3206775, 3251277, 3310073, 3174017, 3164992, 3030281, 3119733, 3068548, 3098058, 3059659, 3097602, 3121506, 3183867, 3235798, 3313739, 3287619, 3145272, 3276962, 3273625, 3389682, 3254941, 3202605, 3100163, 2976363, 3061126, 3075408, 3143647, 3367863, 3333183, 3339501, 3192347, 3185240, 3428866, 3458679, 3480904, 3501321, 3566414, 3507098, 3614988, 3573329, 3563028, 3504059, 3602318, 3509069, 3358564, 3395052]
6103C395052j3667p8108K00408q5002l12673P5802O9926J07864o1279K5731n6883
6092C267171J63960L6095Q3550n7245j51714r6957L869J87930M9064j2322o0765
6081C412636j43591K44478K12489N8943Q0314r724J23464K3118n5830j82663m4359
6070C719275K19207J35754J20869O5457j24628J56716J42715J16799J15954L81041
6060E049159l3569p2765N0600j36343j19154k88078q1913o0102O4837L5285J81286
6049D589243j74808K2608N9409J14381J08992j38200j6954J18166J02268j13219
6039D671886O6334R9337O9249O4269K81470n4468K39092M4561J68106N8583K12448
6028E920867K25406J02528J27929M60210L56038L19862K99194J43217L31677L11547
$$ y = [3395052, 3381385, 3303277, 3503685, 3418683, 3106010, 3181812, 3251738, 3359602, 3298323, 3324054, 3267171, 3431131, 3467226, 3550776, 3493531, 3341817, 3244860, 3248729, 3436659, 3485723, 3473401, 3412636, 3269045, 3513523, 3726012, 3784955, 3865269, 3855545, 3979009, 4002127, 3946297, 3763634, 3719275, 3938482, 4074236, 4195105, 4260562, 4135934, 4292650, 4435365, 4552164, 4668118, 5049159, 5015590, 4942825, 4993425, 4857082, 4737928, 4449850, 4367937, 4307835, 4372672, 4407957, 4589243, 4414435, 4437043, 4496452, 4610833, 4719825, 4581625, 4564671, 4682837, 4785105, 4671886, 4738220, 4837557, 4906806, 4971075, 5252545, 5198077, 5437169, 5481730, 5649836, 5708419, 5920867, 6146273, 6248801, 6376730, 6836940, 7192978, 7512840, 7812034, 7955251, 8286928, 8598475]
6018H598475K26793J32318L2150J44931O8303P0896K89181O7418P2588Q6793Q7980
6007I877826J06160l24454l92892l39289j60601q7000j17612k05240k97310k37214
5997G822374k49338j85667k76722l19760j51119J15557j00751J55181j80010n6332
5987F573413l2816Q3885j9621n1835p5891q2369L9400R7012K03344K13964O8390
5976G016876J08659J43488J66366J44652J1257Q7276P5712K82551J64745J36966
5966H338548L61720J48671J67796J42840K14168J36644K88521J63099L16528L87217
5956A0665752M95767K74534K42956L36871N50981L48742K97494K56908L19686
5947A3789691L45205K40930M70334M48134N65066M01543M87735K62639N03315
$$ y = [8598475, 8825268, 8957586, 8989736, 9134667, 9202970, 9273866, 9563047, 9630465, 9703053, 9789846, 9877826, 9983986, 9659532, 9266640, 8927351, 8766750, 8679750, 8562138, 8356898, 8059588, 7822374, 7573036, 7387369, 7110647, 6790887, 6639768, 6755325, 6654574, 6809755, 6629745, 6573413, 6540597, 6624482, 6604861, 6553026, 6477135, 6394766, 6434166, 6531178, 6734522, 6948486, 7016876, 7125535, 7269023, 7435389, 7580041, 7591298, 7678574, 7754286, 8036837, 8201582, 8338548, 8700268, 8848939, 9016735, 9159575, 9373743, 9510387, 9798908, 9962007, 10278535, 10665752, 11161519, 11436053, 11679009, 12015880, 12566861, 12915603, 13213097, 13470005, 13789691, 14134896, 14375826, 14846160, 15294294, 15859360, 16260903, 16748638, 17011277, 17514592]
5938A7514592K76612J89272N36810O29303N20269L72428o9078j92442j708Q4747
5928A9860805J08827r0591o8562N1795K3042K5356j02358l82174j69381j71841
5918A9084918J81953J06479m4846j85468K03885J81782L49767L26652L15368M72709
5908B0993199O09581P04286M51403L39297K663J90534J54101O36705M24862M69320
5898B4975951N2178m114m66898p47121l62035p654K48912m38006n59277p23529
5888B1968407q31474p08889p30093j41728j55431m02125o11140n14883l38778
5879A7533866m07980p1859j9003o7139K30747n3598M8555j00477n656K64032M00315
5868A7751803M69447O18773M08205L53532L12644L15551K90182M17902N86844
$$ y = [17514592, 17791204, 17980476, 18517286, 19146589, 19666858, 20039286, 19970208, 19777766, 19776058, 19860805, 19969632, 19879041, 19810479, 19862274, 19885316, 19910672, 19808314, 19426140, 19256759, 19084918, 19266871, 19373350, 19328504, 19143036, 19346921, 19528703, 19878470, 20205122, 20520490, 20993199, 21602780, 22307066, 22758469, 23097766, 23100429, 23290963, 23445064, 24081769, 24506631, 24975951, 25028129, 25024015, 24557117, 23809996, 23447961, 23440307, 23689219, 23251213, 22691936, 21968407, 21136933, 20428044, 19697951, 19556223, 19400792, 18998667, 18387527, 17872644, 17533866, 17125886, 17054027, 17035024, 16967885, 17198632, 17145034, 17193589, 17093112, 17087456, 17351488, 17751803, 18221250, 18840023, 19248228, 19601760, 19914404, 20229955, 20520137, 20938039, 21524883]
5859B1524883P91562P19348N73503K30656m04853j75501k21376Q321k5428j27961
5849B2893154k65530k17877p96715j191087j011348n81791k55852m57840r14393
5840A7200721j048735r12679j071105r63611p46551n76041l91250l21548p77201
5831A0392000q16681n07725k29708m43325k62533j57531l91753l22967j00041
5822G159736n2544p2210L0798j59389j15310q7442J02178j79613J4672J46246
5812F787122Q4363R2640J61450P8275l0376m0488J88524L31734J33072k2377k87521
5801G476418j60631l2873o7076M5692n3787J24795R6046r42j63601k17027l08997
5790F738017j98015o3161K65449k171K2940Q8590Q8224k0124l53578j87628j37846
$$ y = [21524883, 22316445, 23035793, 23609296, 23839952, 23435099, 23259598, 23038222, 23046543, 23021115, 22893154, 22627624, 22409747, 21613032, 20421945, 19410597, 18828806, 18572954, 18115114, 17200721, 16151986, 15239307, 14168202, 13204591, 12458040, 11881999, 11490749, 11169201, 10392000, 9575319, 9067594, 8837886, 8394561, 8132028, 7974497, 7582744, 7259777, 7159736, 7107192, 7034982, 7065780, 6906391, 6791081, 6703639, 6805817, 6626204, 6640876, 6787122, 6871485, 6964125, 7125575, 7203850, 7173474, 7132986, 7321510, 7653244, 7786316, 7763939, 7476418, 7315787, 7282914, 7215838, 7261530, 7207743, 7332538, 7428584, 7427642, 7264041, 7047014, 6738017, 6540002, 6476841, 6742290, 6740119, 6763059, 6851649, 6939873, 6919749, 6566171, 6378543, 6240697]
5779F240697K7926m5471J22053R2314K15102P9350q0057k61383j71354m7039o3429
5768F108709j74239Q4380J7896j04152k3425J947o814k5163j11855p5452j81416
5757E510416K56545K64421J12239j97993p3227k51623l06987O1273j27011O3854
5747E311907j82865L1907j99725k02474k90981j5450k49655l8067j16632j91719
5737C856246m4010J757M2221n0257j14161q6644J856j56612n6234O9884N3952
5726C517998p9533k8725o6658p8435J1167J14002j32095j70098J98307n4839n0643
5715C180448P8720L2807R1435j9938r3332O8342R5014o1797m2477K7649K2456
5704C379327L4353k01612J13170J55218n3376j1712k8693L2029j9725J94316J2101
$$ y = [6240697, 6268623, 6223152, 6345205, 6437519, 6652621, 6731971, 6651914, 6390531, 6219177, 6172138, 6108709, 5934470, 6018850, 6036746, 5932594, 5909169, 5911116, 5904302, 5879139, 5767284, 5691832, 5510416, 5766961, 6031382, 6143621, 5945628, 5872401, 5620778, 5313791, 5375064, 5248053, 5311907, 5129042, 5160949, 4961224, 4758750, 4467769, 4452319, 4202664, 4164597, 4047965, 3856246, 3812236, 3813993, 3856214, 3805957, 3691796, 3605152, 3607008, 3450396, 3394162, 3464046, 3517998, 3438465, 3409740, 3343082, 3264647, 3275814, 3389816, 3257721, 3087623, 3285930, 3231091, 3180448, 3259168, 3291975, 3383410, 3363472, 3270140, 3338482, 3433496, 3371699, 3329222, 3356871, 3379327, 3413680, 3212068, 3325238, 3480456, 3427080, 3415368, 3386675, 3418704, 3398979, 3593295, 3605396]
5693C605396N7782j43267J09268o0536J23133K59803J71785j18039O2959J70373
5683D238657k6216P5716Q6082J49129m0144J34599P6616J80962K10431J41637
5673E227469N8402L04865M31400M42147M19666M97866N23935N34934L43896J71952
5663H956532M63815O45535P12013M45942N98228N61741M04468k36088l27602k10681
5653A2013903J59776L63945j5234m58409o43144n06951o83965o40142m91111k67681
5643H830987j63289l08354o75401o23089m66531k75002k33515l07882l76698k56858
5633E144368l9359P753j50327k03490P6396p4533j34039n2796p9289N9045Q8273
5622D642002j27758O0818M4743k11370k4415R949K33671P8302o4495o5283Q8753
$$ y = [3605396, 3663178, 3519911, 3629179, 3568643, 3691776, 3951579, 4123364, 4005325, 4068284, 4238657, 4212441, 4288157, 4374239, 4523368, 4483224, 4617823, 4694439, 4875401, 5085832, 5227469, 5285871, 5590736, 6022136, 6464283, 6883949, 7381815, 7905750, 8440684, 8784580, 8956532, 9420347, 10065882, 10777895, 11223837, 11822065, 12383806, 12788274, 12552186, 12224584, 12013903, 12173679, 12537624, 12522390, 12063981, 11420837, 10913886, 10229921, 9589779, 9098668, 8830987, 8667698, 8359344, 7683943, 7060854, 6594323, 6319321, 6085806, 5777924, 5401226, 5144368, 5105009, 5112762, 4962435, 4758945, 4835341, 4760808, 4626769, 4573973, 4494684, 4553729, 4642002, 4514244, 4575062, 4619805, 4408435, 4384020, 4393969, 4627640, 4705942, 4641447, 4576164, 4664917]
5611D664917O9586j343N3310J86116j12951J30395J38537L1447J91999K34388
5601E586401K23670J07577J08870J65783J01999O9393K60425Q268K95946K7027
5591F955359J42712J90401K82169K56535M43386N62337M95390M70115K60251L62986
5581A0421641J40985L76810N91498N48191N81515O15336O16814J16801j96665
5572A3812926l78945J56232K74518L4894k40477m55237l56165n47265n58519o91964
5562A1049998l38974j30564j07761o46248n91393n49518n53889m64648k52923
5553G414080j48956k30796j80707j02322q8499j25367K6263r6845o748J20882
5543F580985L7158j79171k6255j36557J21669j5088m4772R443P6582N6228l8726
$$ y = [4664917, 4734503, 4733160, 4786470, 4972586, 4859635, 4990030, 5128567, 5160014, 5352013, 5586401, 5810071, 5917648, 6026518, 6192301, 6294300, 6363693, 6624118, 6632386, 6928332, 6955359, 7098071, 7288472, 7570641, 7827176, 8270562, 8832899, 9328289, 9798404, 10058655, 10421641, 10562626, 10939436, 11530934, 12079125, 12660640, 13275976, 13892790, 14009591, 13812926, 13433981, 13590213, 13864731, 13899625, 13659148, 13203911, 12847746, 12300481, 11741962, 11049998, 10711024, 10580460, 10472699, 9826451, 9235058, 8685540, 8131651, 7667003, 7414080, 7265124, 7034328, 6853621, 6751299, 6662800, 6537433, 6563696, 6466851, 6460103, 6580985, 6618143, 6438972, 6412717, 6276160, 6397829, 6382741, 6337969, 6347412, 6423994, 6480222, 6441496]
5532F441496J44709O2234j1481O8418J32305r001J10989K7006P6018N4454J78179
5521G275326J35107P2603J34147J32636Q756J78248J47768O8341O4585n5604K40605
5510H402518J37833K65094K53302M8336N5192K02229J86065J81354K02641J28407
5500A0062971K11926J97690L25852J64242K24846J88163M91738L13982L88383
5491A2569793J84092M22711K95299K09443K10655L12369L33120L28227K01902
5482A5067611K51349J01989J87385L66391Q5332M94043J87689L85762J80101L47604
5472A7655256L07138L71373L08128K43102N48792O11963O61787R64637J044171
5463B2716347J187813J520690J673055K070284K400827K621583K573148K548577
$$ y = [6441496, 6586205, 6648439, 6636958, 6705376, 6837681, 6828680, 6939669, 6966675, 7042693, 7097147, 7275326, 7410433, 7483036, 7617183, 7749819, 7758575, 7936823, 8084591, 8152932, 8217517, 8161913, 8402518, 8540351, 8805445, 9058747, 9107083, 9162275, 9364504, 9550569, 9731923, 9934564, 10062971, 10274897, 10472587, 10798439, 10962681, 11187527, 11375690, 11867428, 12181410, 12569793, 12753885, 13176596, 13471895, 13681338, 13891993, 14204362, 14537482, 14865709, 15067611, 15318960, 15420949, 15608334, 15974725, 16060057, 16554100, 16741789, 17127551, 17307652, 17655256, 17962394, 18333767, 18641895, 18884997, 19433789, 20045752, 20707539, 21672176, 22716347, 23904160, 25424850, 27097905, 29168189, 31569016, 34190599, 36763747, 39312324]
5455C9312324J776268Q72039M07476L07987K20999L86726L78175m94037j047578
5446D2120379j729555k089428k401555k361421k227056j956801j691439j502917
5438B6160207j151638j072333j051282n27441m92658m93472n45209l78356n08105
5429A9939713o93182q33835o44409m18595m08548k60710l25833r8659J55755o8888
5419A6342809o9879J98630L56880N88176N78049Q16671R40578J174118J378189
5410B2304221J381358R53221L48258j67139j91118M31506J026694J532579J637631
5401B9257211J241426L30579j005076j780280j414849r42874l69330J54902O09318
5392B6081027M39094J8293k41459j39708l903O7145k29572q12337p56302k74537
$$ y = [39312324, 41088592, 41960631, 42368107, 42676094, 42897093, 43283819, 43661994, 43167957, 42120379, 40390824, 38301396, 35899841, 33538420, 31311364, 29354563, 27663124, 26160207, 25008569, 23936236, 22884954, 22357513, 21864855, 21371383, 20826174, 20447818, 19939713, 19246531, 18412696, 17768287, 17349692, 16941144, 16680434, 16354601, 16255942, 16411697, 16342809, 16272930, 16471560, 16828440, 17416616, 17994665, 18811336, 19751914, 20926032, 22304221, 23685579, 24638800, 24987058, 24819919, 24628801, 25060307, 26087001, 27619580, 29257211, 30498637, 30829216, 29824140, 28043860, 26629011, 25686137, 25316807, 25471709, 26081027, 26520121, 26538414, 26296955, 26157247, 26153344, 26220489, 25990917, 25178580, 24422278, 24147741]
5382B4147741J41302M74995J259111J123197Q60847m59023j701215k182377j825589
5373B1838989j479248p38556l58429k86431n43223r39590j344356j730754j179830
5364A3238572j048584p79868q08235o29046m90269l27756l89712l22799l70421
5355H071882j96955k13305k52304k01914k28060j38123j51973j4978k14212j81628
5345F278430j27149m2378l3130k2238k1396j13158k0817k4683L4273j5616r2891
5334E799247o7936j25654n5587j491Q268J30872Q6838K0513m021p5742j47267
5323E568040j3403J47418L3458L3169L7536j34750R9364N9215o7386N8554o2788
5312E758427K3792J15655J62696O6757l8375m1726O6868j54580Q8492k2408O9901
$$ y = [24147741, 24289043, 24764038, 26023149, 27146346, 28007193, 27548170, 25846955, 23664578, 21838989, 20359741, 19621185, 19262756, 18976325, 18433102, 17493512, 16149156, 14418402, 13238572, 12189988, 11410120, 10601885, 9972839, 9482570, 9154814, 8765102, 8442303, 8071882, 7874927, 7661622, 7409318, 7207404, 6979344, 6841221, 6689248, 6674270, 6460058, 6278430, 6151281, 6108903, 6075773, 6053535, 6032139, 5918981, 5898164, 5873481, 5907754, 5892138, 5799247, 5731311, 5605657, 5550070, 5548579, 5556847, 5687719, 5774557, 5795070, 5791049, 5715307, 5568040, 5554637, 5702055, 5735513, 5768682, 5806218, 5671468, 5770832, 5830047, 5762661, 5821215, 5758427, 5782219, 5897874, 6060570, 6127327, 6088952, 6047226, 6114094, 5959514, 6048006, 6025598, 6095499]
5301F095499M8858Q7897m2617R2330J56882k07733R600p6291Q1862J01535N4684
5290F402506j78157k36810j0623K1346J71372m6132l7434N947n7402O7011J14946
5279F216570j12132k07959j546J64072R7218J70021J247o8166J27359R9286J10082
5268F596052O4178K7005m1418J40931n3127M0845n2266j2249l8819P2420l4137
5257F709415n7736O6779M3787J24273j37751J11653r9990O0592N0636k6165K20170
5246G065663r2966j14413L3595J99507K28694R8963M9629n3240j1254J27746O3158
5235G595082Q9831J14364K9716o7353J31147J86216r0898j41737m8435o2188M3028
5224G778773l1936J17422L0498N2549n8683J24507O0258Q8578j31928J12693J46655
$$ y = [6095499, 6144357, 6232254, 6189637, 6281967, 6438849, 6231116, 6240716, 6164425, 6246287, 6347822, 6402506, 6224349, 5987539, 5976916, 5998262, 6169634, 6123502, 6086068, 6092015, 6034613, 6101624, 6216570, 6104438, 5896479, 5894933, 6059005, 6156223, 6326244, 6327491, 6259325, 6386684, 6485970, 6596052, 6660230, 6687235, 6645817, 6786748, 6733621, 6774466, 6722200, 6709951, 6671132, 6743552, 6709415, 6651679, 6718458, 6762245, 6886518, 6748767, 6860420, 6760430, 6821022, 6871658, 6845493, 7065663, 6972697, 6858284, 6891879, 7091386, 7320080, 7419043, 7468672, 7415432, 7404178, 7531924, 7595082, 7684913, 7799277, 7828993, 7761640, 7892787, 8079003, 7988105, 7846368, 7797933, 7735745, 7778773, 7746837, 7864259, 7894757, 7947306, 7888623, 8013130, 8073388, 8161966, 8030038, 8142731, 8289386]
5213H289386O9205o2221k8564R1787J95918J26807R3216J61661J7493J76043Q0269
5202I211000K31862j6548R2484K17928K90341L064R7393K46522J70391J03286
5192A0647723K00536J90242J73155J50853L15011K66471M32188N09670L98814
5183A3284663O83708P30242R45011J144760J440734J645023J864761J631949O2242
5174B3433093j591466k146448j710543j117851o17344n02275k95333k52672p8624
5165A5120537o8248K81892K31304J64545K26277J90969M38177M84181P79761Q88231
5155A8737626R08031J066453J579693K216137K700804L011692L100060K413326
5147C5733822M54713k245460l548766l556137l125024k135709j478120r71177
$$ y = [8289386, 8358591, 8296370, 8267806, 8359593, 8555511, 8682318, 8775534, 8937195, 8954688, 9130731, 9211000, 9442862, 9426314, 9518798, 9736726, 10027067, 10030131, 10127524, 10374046, 10544437, 10647723, 10848259, 11038501, 11211656, 11362509, 11677520, 11943991, 12376179, 12885849, 13284663, 13968371, 14698613, 15643624, 16788384, 18229118, 19874141, 21738902, 23370851, 23433093, 21841627, 19695179, 17984636, 16866785, 16249441, 15747166, 15451833, 15199161, 15120537, 15052289, 15334181, 15565485, 15730030, 15956307, 16147276, 16585453, 17069634, 17849395, 18737626, 19645657, 20712110, 22291803, 24507940, 27208744, 30220436, 33320496, 35733822, 36188535, 33943075, 30394309, 26838172, 23713148, 21577439, 20099319, 19128142]
5139A9128142q17573n43861l42611K9847m6088M0768L43404K54738L25693L20838
5129A8693297O33299N05837O33703N49612Q34692R50078J077526J104150J525279
5120B6507473J505555P04401j517881k962635k497132j828559j004460q51025
5112A8055737o24248o67125m50494k67218j8227n0344j27255n0900K62215K12698
5102A6274839J87815M32018L61393L70679N01837P11307P65310P47181M51639
5093B0804018K54893m5740j09386m40948o23288m01466o79722n73298l08467l19963
5083A7556633l20704l37668j21226m2273j00039j80360j84495J46384J96759p990
5073A6605021O7773K08812n4606R5800J08085J46491K42906J04110M6525N9809
$$ y = [19128142, 18310569, 17766708, 17424097, 17453944, 17407856, 17448624, 17792028, 18046766, 18372459, 18693297, 19326596, 19832433, 20466136, 21015748, 21850440, 22800518, 23878044, 24982194, 26507473, 28013028, 28717429, 27199548, 24236913, 21739781, 19911222, 18906762, 18055737, 17431489, 16764364, 16313870, 16046652, 16028425, 15978081, 15850826, 15799926, 16062141, 16274839, 16462654, 16894672, 17256065, 17626744, 18128581, 18839888, 19605198, 20352379, 20804018, 21058911, 21013171, 20903785, 20462837, 19839549, 19438083, 18758361, 18185063, 17876596, 17556633, 17235929, 16898261, 16777035, 16734762, 16634723, 16454363, 16269868, 16416252, 16613011, 16605021, 16672794, 16881606, 16827000, 16922800, 17030885, 17177376, 17420282, 17524392, 17570917, 17630726]
5063A7630726K14330L58889K63222K07855n2390j78226k10591m19224j33753k38859
5053A7441979M8109p0916Q5649k33821Q3064L49643L50550K20138K11246K52568
5043A8738209J04635K55370J85757K10730N3036J16901k81308L3213j36530K9351
5033A9309364k79965k82396q0601J15061m8363R1155J41717J02830K46929L41389
5023A9657120L38969L34204N69587L28144K27192J99307L82579M19907N46115
5014B3003124L65027N89155P46934P33333Q15172R91233J200340J088085J315962
5005C0848365J604006J637112J837524J992220J866025J669316R62582j78694
4997D2238456j075010j532121j510439j200648j019190p47818l22490L4464k87571
$$ y = [17630726, 17845056, 18203945, 18467167, 18675022, 18622632, 18444406, 18233815, 17814591, 17680838, 17441979, 17490088, 17419172, 17504821, 17271000, 17354064, 17703707, 18054257, 18274395, 18485641, 18738209, 18842844, 19098214, 19283971, 19494701, 19547737, 19664638, 19383330, 19416543, 19280013, 19309364, 19029399, 18747003, 18666402, 18781463, 18733100, 18824255, 18965972, 19068802, 19315731, 19657120, 19996089, 20330293, 20899880, 21228024, 21455216, 21654523, 22037102, 22457009, 23003124, 23368151, 23957306, 24704240, 25437573, 26252745, 27243978, 28444318, 29532403, 30848365, 32452371, 34089483, 35927007, 37919227, 39785252, 41454568, 42417150, 42238456, 41163446, 39631325, 38120886, 36920238, 35901048, 35153230, 34830740, 34865204, 34577633]
4988C4577633m86648m43805j58626k62140j0303M22929O53378P65013Q66040J218145
4978C7141616J385066J613342J763175K209277K478207K741010K979083L796275
4970E6107051M308339M638307M407940L643545J936069l24657k268015k820593
4962F9627986k514344j558287n71208N5888J34689n97503k011529k875580k884748
4953E6805364k390039j741344j134854p46722m13119k00058l89746l21518n7335
4944D9410629o6013L17717M80718P48054J529739K002050K783172L397780M061964
4935F4665810M299933M347283M081047L444701J963915K45924j970838l340862
4927G7736913m515944n172448n314271m693543l707739k833035k050852k165354
$$ y = [34577633, 34090985, 33647180, 33488554, 33226414, 33216111, 33639040, 34292418, 35057431, 35923471, 37141616, 38526682, 40140024, 41903199, 44112476, 46590683, 49331693, 52310776, 56107051, 60415390, 65053697, 69461637, 73105182, 75041251, 74716594, 72448579, 69627986, 67113642, 65555355, 64984147, 65040035, 65174724, 64577221, 62565692, 59690112, 56805364, 54415325, 52673981, 51539127, 50792405, 50379286, 50179228, 49789482, 49467964, 49410629, 49344616, 49662333, 50143051, 50891105, 52420844, 54422894, 57206066, 60603846, 64665810, 68965743, 73313026, 77394073, 80838774, 82802689, 83048613, 81077775, 77736913, 73220969, 68048521, 62734250, 58040707, 54332968, 51499933, 49449081, 47283727]
4919D7283727j981791k068585j965362j998362j401917j147236r15347n23169
4911C5281958P291J80722M74724Q93258J197605J382732J669163J886512J666258
4902D4640223J510291r888j614401l073300l076912k800690k142113j831210j418731
4893C0183269j080388j047411q92776j057786j184681r20459p43282p47996n04134
4884B2004356l40591m4203k79733j30944r6333j21672j05984j02333M8693j48701
4874B0682555k68659j46897k37083j41870k24490p5307k23262k09042k20408j5073
4864A8920464n333K3274R8526M5425L24419J52940M56852M86471O99175M49902
4854B1652115N34188K31226K9446k42050l18811o01102l43603k39111l27054j29524
$$ y = [47283727, 45301936, 43233351, 41267989, 39269627, 37867710, 36720474, 35805127, 35281958, 35289249, 35469971, 35944695, 36837953, 38035558, 39418290, 41087453, 42973965, 44640223, 46150514, 46140626, 44526225, 41452925, 38376013, 35575323, 33433210, 31602000, 30183269, 29102881, 28055470, 27162694, 26104908, 24920227, 23999768, 23256486, 22508490, 22004356, 21663765, 21619562, 21339829, 21208885, 21112552, 20990880, 20884896, 20782563, 20831256, 20682555, 20413896, 20266999, 20029916, 19888046, 19663556, 19588249, 19364987, 19155945, 18935537, 18920464, 18915131, 18938405, 19036931, 19082356, 19406775, 19559715, 20016567, 20503038, 21202213, 21652115, 22186303, 22417529, 22446975, 22204925, 21886114, 21285012, 20941409, 20702298, 20375244, 20245720]
4844B0245720j57702K91476L13960O17480L27391O22877N57959R68890P51181
4835B4539232Q39403K77405r5006m40538n70706o90988q76853q06079r01030n47103
4825B0727737p77959o50880j006750p01662r41382o73245o79220o47288m62037
4816A4187314m76953k83538k07892k7324j79541j23257o5535J64468J2540j19719
4806A2880563J05122R9077q4577K22196J13833R8994j89965k65134m01135m19008
4796A2159966l94749n04848l88311n9551l48635m36388k15998l09172k79469k15381
4786I007464m4284k91219l3886k85445j8777o4379q5016j75783P9937M604j05833
4775G987383N2268O0060l6892J49908q2075j81944L0239o6431q3052m4850R7262
$$ y = [20245720, 20088018, 20379494, 20693454, 21310934, 21638325, 22261202, 22819161, 23788051, 24539232, 25378635, 25656040, 25561034, 25120496, 24549790, 23858802, 22981949, 22175870, 21274840, 20727737, 19949778, 19298898, 18292148, 17590486, 16649104, 15975859, 15296639, 14649351, 14187314, 13710361, 13426823, 13218931, 13191607, 13012066, 12888809, 12823274, 12987742, 13000282, 12880563, 12985685, 13084762, 13000185, 13222381, 13336214, 13435208, 13245243, 12980109, 12578974, 12159966, 11765217, 11260369, 10872058, 10812507, 10463872, 10027484, 9811486, 9502314, 9222845, 9007464, 8963180, 8671961, 8638075, 8352630, 8333853, 8269474, 8184458, 8008675, 8088612, 8093216, 7987383, 8039651, 8099711, 8062819, 8212727, 8130652, 7948708, 7978947, 7912516, 7829464, 7784614, 7881876]
4764G881876M5998J70789q4589o3003m1647q5761O1478J15508J3073P9085J3231
4753H106038M4477Q5171m066P0577R3526m1067j87941k1910J47567k8925r6997
4742H166450J75320l3895j22566k36810L735r3773R9480j84759m292K45341q8608
4731G925623J13097P95R3934j09020K7368k17834J90573L4936R3593k55839J34918
4720H032144J14325K4673J38033j44397o0820K5961M612n6004J44366O0461K20866
4709H504220p4459L6697o009m5421l3719N979j25621J08627Q9729k70549K36728
4698H426202o2947J26436p766L7098q7914j55018j55113P6672J94073L5485j8697
4687H408511r3130n2632j00957J63203M2042n2195k07455P8404r9802L0994J53198
$$ y = [7881876, 7927874, 8098663, 8014074, 7951071, 7909424, 7823663, 7885141, 8000649, 8013722, 8092807, 8106038, 8150515, 8235686, 8231620, 8302197, 8395723, 8354656, 8166715, 8144805, 8292372, 8263447, 8166450, 8341770, 8307875, 8185309, 7948499, 7952234, 7858461, 7957941, 7773182, 7768890, 8014231, 7925623, 8038720, 8039515, 8133449, 8024429, 8051797, 7833963, 8024536, 8059472, 8153065, 7897226, 8032144, 8146469, 8171142, 8309175, 8164778, 8103958, 8129919, 8134531, 8078527, 8222893, 8283354, 8504220, 8429761, 8466458, 8460449, 8415028, 8381309, 8387288, 8261667, 8370294, 8460023, 8189474, 8426202, 8363255, 8489691, 8481925, 8519023, 8431109, 8276091, 8120978, 8197650, 8391723, 8427208, 8408511, 8315381, 8262749, 8161792, 8324995, 8367037, 8314842, 8107387, 8185791, 8085989, 8116983, 8270181]
4676H270181K5132j50344j62693j07046N7876J4283q8787j48803M5992Q1694K5172
4665G862657l8795k0303Q8643j0585j46277n2163n5975j61242n6895p6908K0864
4654G353021p0202q0104j6159p6131P5319r0672L9195k01754n3777N5082O0694
4643F994512J1284r9582R7037j91667k2300j43852m3586o6370J78766k7893p8171
4632F608178k3917O142k2589j30434J64624n2897R2051k24085p3482J7882J45174
4621F506647l5530M377k3248j8876j19289m5189P7464Q4990O1800j76253Q8433
4610F405326j17268K9316Q7946P9863r015J48603r4249R9398p750r8358Q8610
4599F612422q8419P7447o9376J36602l8726m1446K4152K9211j22155J44971m8196
$$ y = [8270181, 8295313, 8144969, 7982276, 7875230, 7933106, 7947389, 7858602, 7709799, 7755791, 7837485, 7862657, 7823862, 7803559, 7892202, 7881617, 7735340, 7683177, 7627202, 7465960, 7409065, 7332157, 7353021, 7282819, 7202715, 7186556, 7110425, 7185744, 7095072, 7134267, 6932513, 6878736, 6933818, 6994512, 7005796, 6906214, 7003251, 6811584, 6789284, 6645432, 6601846, 6535476, 6714242, 6686349, 6608178, 6584261, 6590403, 6567814, 6437380, 6602004, 6549107, 6641158, 6417073, 6343591, 6361473, 6506647, 6471117, 6475494, 6452246, 6433370, 6314081, 6268892, 6346356, 6431346, 6493146, 6316893, 6405326, 6288058, 6317374, 6405320, 6485183, 6476168, 6624771, 6530522, 6629920, 6622170, 6523812, 6612422, 6524003, 6601450, 6532074, 6668676, 6629950, 6588504, 6612656, 6641867, 6519712, 6664683, 6616487]
4588F616487L1907j5271N7384j26521Q887J46875k27339R1505j27852J95821m6214
4577F605669R2551J5892Q0658J8924J17421k07358M4790J28340L5141N2767j66093
4566F818702K16949K28101M5288l8892R2698K7444L5932k8031L980o8373q840
4555G324958N4462P8379J01360R2599p8023j56190K30332O6951L6578n5670J26738
4544G822474J14083J47960q0173K14790L02321R5009J14263K22997J78617Q6615
4534I218956N8213k0884M0405j55406q0475j04117J47514q187R3204P536M8605
4523I245364l7858p9154J46997J80861J86837p9802J02510J50733O0246K2918
4513I899652n1035K12061J25902J04942P7405L36301J93849L91931K81024L77401
$$ y = [6616487, 6648394, 6633123, 6690507, 6563986, 6572873, 6719748, 6492409, 6583914, 6456062, 6651883, 6605669, 6698220, 6714112, 6794770, 6813694, 6931115, 6723757, 6768547, 6896887, 6932028, 6984795, 6818702, 7035651, 7263752, 7309040, 7270148, 7362846, 7390290, 7426222, 7398191, 7402171, 7333798, 7324958, 7379420, 7457799, 7559159, 7651758, 7573735, 7417545, 7647877, 7714828, 7751406, 7695736, 7822474, 7936557, 8084517, 8004344, 8219134, 8521455, 8616464, 8730727, 8953724, 9132341, 9218956, 9277169, 9256285, 9296690, 9141284, 9060809, 8956692, 9104206, 9096019, 9189223, 9196759, 9245364, 9207506, 9128352, 9275349, 9456210, 9643047, 9563245, 9665755, 9816488, 9876734, 9899652, 9848617, 10060678, 10186580, 10291522, 10368927, 10705228, 10899077, 11291008, 11572032, 11949433]
4503A1949433M60389K76468J20987l65124j50010l67080O6148j48612N8238J98234
4493A2099071J8117J14497J98194J48844K8536K34535J06044M34852K33440K72336
4483A3888466J58519L44075K66367M97934L56253M95945N20755M54029O78951
4474A7661294M66972O65824P00989Q64376Q68768J064302Q46262Q03065N33482
4465B4475334P97518R65503J067243J209017J189435J736963J645433K142707
4457C5229153K357296K547775K748063L016307K969303K952031L139550L069215
4449E8028693L086123L063729K980518K378123J688991P66732L75253K3334p2148
4440G2319348K91774P82403J300975J530287J846608K026701K113563J993340
$$ y = [11949433, 12409822, 12686290, 12807277, 12442153, 12292143, 11925063, 11991211, 11842599, 11900837, 12099071, 12117188, 12231685, 12429879, 12578723, 12607259, 12841794, 12947838, 13382690, 13616130, 13888466, 14046985, 14391060, 14657427, 15155361, 15511614, 16007559, 16528314, 16982343, 17661294, 18128266, 18794090, 19495079, 20359455, 21228223, 22292525, 23138787, 23941852, 24475334, 25272852, 26238355, 27305598, 28514615, 29704050, 31441013, 33086446, 35229153, 37586449, 40134224, 42882287, 45898594, 48867897, 51819928, 54959478, 58028693, 61114816, 64178545, 67159063, 69537186, 71226177, 71992909, 72368162, 72391496, 72319348, 72611122, 73393525, 74694500, 76224787, 78071395, 80098096, 82211659, 84204999]
4432H4204999K333810J899831J856099Q43385m06448j845308l408108l834955
4424H1643305m156562l851903l752840l321608l062595k559164k330582j723206
4416E6884845j275587j145524j805004k464247k973829l270315l348709l152728
4408C7448902k755124k285613j897496j808788j333207j229017j239068j269472
4400B3631117j076318r67424o71402p46642o12337n84226m69197m41760n98324
4391A7463487m28064l73299k13955m13917k65308m88825k59347l18240j98480
4382A4504052l41382k85044j80417j96181k15832j10515o1975k28458l04238l51532
4372A2228478L7210j49904k9181j89508j05611j63259n5216j36838j97231k5018
$$ y = [84204999, 86538809, 88438640, 90294739, 91138124, 90731676, 88886368, 85478260, 81643305, 77486743, 73634840, 69882000, 66560392, 63497797, 60938633, 58608051, 56884845, 55609258, 54463734, 52658730, 50194483, 47220654, 43950339, 40601630, 37448902, 34693778, 32408165, 30510669, 28701881, 27368674, 26139657, 24900589, 23631117, 22554799, 21587375, 20915973, 20169331, 19556994, 18972768, 18503571, 18061811, 17463487, 17035423, 16662124, 16448169, 16034252, 15768944, 15280119, 15020772, 14702532, 14504052, 14162670, 13877626, 13697209, 13501028, 13285196, 13174681, 13112706, 12884248, 12580010, 12228478, 12265688, 12115784, 12086603, 11897095, 11791484, 11628225, 11573009, 11436171, 11238940, 11213922]
4362A1213922j4885q9818j17519l7931j3530o8907l92070p747j15320M2361k24222
4351A0174334O7264N2560K6068r9697k4730L7143j37422m8589j88672J5509j10025
4340I763743Q7188p8714o8303j64189k06894K7928O6106J6574L9776j10296O704
4329I379623o6560R72j25285R0998J62845J3556J39268n0415J87217J89791K32619
4318A0154629p1666j46933M8262n2799Q1931j28686k52683l56292p9047j07166
4308I089550j34984r1461q9267k25405j98020m9130j93645L239K1566P2707J7856
4297H223006m2206p9082p7059J99628J96749P8491k6712p9266j92973j84906m0854
4286G974816O073j3442r9505l9821k05008j27108l375J2655L9733J27076J1704
$$ y = [11213922, 11199037, 11109219, 10991700, 10953769, 10940239, 10871332, 10479262, 10471515, 10356195, 10398556, 10174334, 10241598, 10294158, 10320226, 10220529, 10195799, 10232942, 10095520, 10046931, 9858259, 9873768, 9763743, 9850931, 9772217, 9703914, 9539725, 9332831, 9360759, 9426865, 9443439, 9483215, 9372919, 9379623, 9313063, 9314035, 9188750, 9279748, 9442593, 9456149, 9595417, 9545002, 9732219, 9922010, 10154629, 10082963, 9936030, 9984292, 9931493, 10013424, 9884738, 9632055, 9275763, 9196716, 9089550, 8954566, 8863105, 8773838, 8548433, 8350413, 8301283, 8107638, 8110877, 8132443, 8205150, 8223006, 8180800, 8101718, 8024659, 8224287, 8421036, 8499527, 8472815, 8393549, 8200576, 8015670, 7974816, 7980889, 7967447, 7867942, 7828121, 7623113, 7496005, 7492630, 7505285, 7545018, 7672094, 7683798]
4275G683798q3016J58995R7578K37064Q6073M3712m2346R8172N3654J39541L83081
4264H856306L42156N7400O7882J33596J10706L5172j459k13731J07025j74947
4254I320106j62622j23995j74673K15329O5231M390L0437J25956K01655L45658
4244I847472L20743L69681K82509K29577L48794K50418L49728M89316L61149O2775
4234A2912162l97793m74639l74249m12270k98348k77279k54818k47276k56535
4225I918955j55548k68620k79554l37410k14725j06496J83616K15277J09025J46666
4215I211186K99651L42077J69107J19934Q7745k22M2172R3406L07147K10824K11933
4204A1094960q3036j97803l74506l17618m06816k84346q651N7800m09638l35858
$$ y = [7683798, 7600782, 7759777, 7857355, 8094419, 8180492, 8224204, 8181858, 8280030, 8333684, 8473225, 8856306, 9198462, 9255862, 9323744, 9457340, 9568046, 9603218, 9601759, 9388028, 9495053, 9320106, 9157484, 9033489, 8858816, 9074145, 9139376, 9143766, 9174203, 9300159, 9501814, 9847472, 10168215, 10537896, 10820405, 11049982, 11398776, 11649194, 11998922, 12488238, 12849387, 12912162, 12514369, 12039730, 11665481, 11253211, 10954863, 10677584, 10422766, 10175490, 9918955, 9763407, 9494787, 9215233, 8877823, 8663098, 8556602, 8740218, 8955495, 9064520, 9211186, 9510837, 9852914, 10022021, 10141955, 10229700, 10229478, 10271650, 10365056, 10672203, 10883027, 11094960, 11011924, 10814121, 10439615, 10121997, 9715181, 9430835, 9422184, 9479984, 9070346, 8734488]
4194H734488l81996m57561k90278j01656l01239k96030p0097k14437k1433p0774
4184F528987j72514j33882m3624n859N0499n3027r0644k96558L9478J8556O477
4173E847889r4486k82649m405P9315J98199j35820K91448k25749j21453m4605
4163E507684O3344L6388J72119k49568j82252J942m8755Q5006P339J18831O8616
4152E580694J89269j46667J27278j79421P2164p7748K02136o928n565m7505K02202
4141E909909Q2531j11733p5148Q2633Q9394R7964K28416n3505r1395r0468Q4106
4130F152704Q3947J78410J32990J22132J03041J11480K56788J79248J79794L90251
4120G890785R8868n5971N2602j33141k8406m8348J85267J06619J66872J20682
$$ y = [8734488, 8352492, 7894931, 7604653, 7502997, 7201758, 6905728, 6835631, 6621194, 6599761, 6528987, 6356473, 6222591, 6178967, 6173108, 6223607, 6170580, 6079936, 5783378, 5822856, 5841412, 5847889, 5753403, 5470754, 5466349, 5545664, 5743863, 5608043, 5899491, 5673742, 5552289, 5507684, 5571028, 5607416, 5779535, 5529967, 5347715, 5349657, 5300902, 5385908, 5393247, 5512078, 5580694, 5769963, 5623296, 5750574, 5571153, 5643317, 5565569, 5767705, 5760777, 5755212, 5707707, 5909909, 5992440, 5880707, 5805559, 5888192, 5977586, 6075550, 6303966, 6250461, 6159066, 6068598, 6152704, 6236651, 6415061, 6548051, 6670183, 6773224, 6884704, 7141492, 7320740, 7500534, 7890785, 7989653, 7933682, 7986284, 7853143, 7824737, 7776389, 7961656, 8068275, 8235147, 8355829]
4110H355829P2802K54507Q2277J46955K66478J82409q4789j5541K05333J12908
4100I579168j81001j78003N0682j50291l5792r6328r3490k07618j59878k58552
4090H268897p5205r2357J453k3322k1662M5635j69532K7774j75720m5540j74542
4079G565879J87371K3647R8694J8994J31762Q3302l3644j228q3762J86545J05524
4068H283084J7121p9016K65553J67714K22368j27250J27350J87238K08704K3134
4058I296000L2764Q6245j9070J7330J51407L79963K03516J34351O3324K15481
4048A0561311L18121J53712J00312L68649K23518O528L99271L39980L19636L19043
4038A3110081J72747L08572J93730J80562K96798M34239J90950J96634J10440
$$ y = [8355829, 8428631, 8683138, 8765415, 8912370, 9178848, 9361257, 9276468, 9260927, 9466260, 9579168, 9398167, 9220164, 9270846, 9120555, 9084763, 8988435, 8894945, 8687327, 8527449, 8268897, 8193692, 8101335, 8102788, 8079466, 8057804, 8103439, 7933907, 7961681, 7785961, 7740421, 7565879, 7753250, 7776897, 7875591, 7894585, 8026347, 8109649, 8076005, 8074777, 7991015, 8177560, 8283084, 8300205, 8221189, 8486742, 8654456, 8876824, 8749574, 8876924, 9064162, 9272866, 9296000, 9328764, 9415009, 9395939, 9413269, 9564676, 9944639, 10148155, 10282506, 10345830, 10561311, 10879432, 11033144, 11133456, 11502105, 11725623, 11732151, 12131422, 12471402, 12791038, 13110081, 13282828, 13591400, 13785130, 13965692, 14262490, 14696729, 14887679, 15084313, 15194753]
4029A5194753J99014M4007R7457P9295J96690L6273K31060K56119J47033L44520
4019A6826221K61544J47173L6369J07162K4307l4195m07300k28541l59690j56851
4009A6216199l47309j52411l32756k72858n1552j51473j1517k60098K7898k87667
3999A4376456p5609l25485q9186k32390n898J6586J35502j92671J2131l0314M0154
3988A3629276N2835n0773J0935k6581K99042j38472K5217o4824j1555R783K59147
3977A3994030P1783Q5466J00521j0741J25568N2219L91927J13324m8753j73167
3967A4702177K58140O0140O5449R3748Q3114N601j41307J52544J83717M12853
3957A5876176J09541K42399J53085O7413K19235K21402K69618J66058J01047m7939
$$ y = [15194753, 15393767, 15437774, 15535231, 15614526, 15811216, 15847489, 16078549, 16334668, 16481701, 16826221, 17087765, 17234938, 17271307, 17378469, 17402776, 17368581, 16961281, 16732740, 16373050, 16216199, 15868890, 15716479, 15383723, 15110865, 15059313, 14907840, 14896323, 14636225, 14664123, 14376456, 14300847, 13975362, 13886176, 13653786, 13647888, 13664474, 13799976, 13607305, 13619436, 13589122, 13629276, 13682111, 13631338, 13642273, 13615692, 13914734, 13776262, 13801479, 13736655, 13725100, 13734883, 13994030, 14065813, 14151279, 14251800, 14241059, 14366627, 14418846, 14810773, 14924097, 14875344, 14702177, 14960317, 15020457, 15085906, 15179654, 15262768, 15268369, 15127062, 15279606, 15463323, 15876176, 15985717, 16228116, 16381201, 16448614, 16667849, 16889251, 17158869, 17324927, 17425974, 17378035]
3947A7378035J23078L3129K40924L8657K21614K79363K74110L65974J75056K50053
3937A9379993K93016M70098K98097M41086M24367M82621M10880M57432M27173
3928B3084763P95973O52980O87123M81878M93277L20333M19490N09807M26485
3919B7872109M65825K51542M4199k7885J43636J74691L3547j75309J40948J60349
3909B9083652K59411J83845K88844M31820L15902O60753N69417Q52889M48938
3900C3095471P33369O57149J028942R83267J380005J382033J565491J590630J896589
3891D4312946K330414K289149L029680K673832K844708L547732M805378O517894
3883G2351733Q779218J1649078J3596467J3863854J741264j7054785j9899671
$$ y = [17378035, 17501113, 17534242, 17775166, 17813823, 18035437, 18314800, 18588910, 18954884, 19129940, 19379993, 19673009, 20143107, 20441204, 20882290, 21306657, 21789278, 22200158, 22657590, 23084763, 23880736, 24533716, 25220839, 25702717, 26195994, 26516327, 26935817, 27445624, 27872109, 28337934, 28589476, 28633675, 28605790, 28749426, 28924117, 28957664, 28782355, 28923303, 29083652, 29343063, 29526908, 29815752, 30247572, 30563474, 31224227, 31793644, 32646533, 33095471, 33828840, 34485989, 35514931, 36498198, 37878203, 39260236, 40825727, 42416357, 44312946, 46643360, 48932509, 51962189, 54636021, 57480729, 61028461, 65833839, 72351733, 81130951, 92780029, 106376496, 120240350, 121981614, 104926829, 85027158]
3876H5027158j4083560r305647o346767m680445l616090l010915k375086j768829
3868C9839819j361936j254739r13676o61005o93116n68143m38887k38017l27087
3859C3383213j34716j04282O5759j84537k9066N1937P9263J10319J13604K21328
3849C3572822J42673Q8962k34048L1877m6078J96554K77069M49058K83543O41771
3839C5404203O68282Q73889N49341N05836N37487P33680R81496R43349J200050
3830D2397613J133026J118175J525754J932945J895914K065022K235503K410712
3822E6714664L013516L586546L880773L146344J957220J643184J665685J126321
3814G6734253R01280J455338K128929K192677K099919J722574j78343j894853
$$ y = [85027158, 70943598, 61637951, 55291184, 50610739, 46994649, 43983734, 41608648, 39839819, 38477883, 37223144, 36309468, 35648463, 34955347, 34387204, 33948317, 33710300, 33383213, 33248497, 33144215, 33209974, 33025437, 32996371, 33048308, 33127571, 33237890, 33351494, 33572822, 33715495, 33804457, 33570409, 33602286, 33556208, 33752762, 34029831, 34478889, 34762432, 35404203, 36072485, 36946374, 37495715, 38001551, 38539038, 39272718, 40254214, 41197563, 42397613, 43530639, 44648814, 46174568, 48107513, 50003427, 52068449, 54303952, 56714664, 59728180, 63314726, 67195499, 70341843, 72299063, 73942247, 75607932, 76734253, 77635533, 79090871, 81219800, 83412477, 85512396, 87234970, 87056627, 85161774]
3806H5161774k731206k494009j940065p05296K90667Q85485J810754K345677L458285
3797H6082066M386527N184622O362319Q316838J0514658J3573436J7487386K2474149
3789A74382001K8036066L1115519J8836006j8747363l9577855l2977250k1732679
3782A39334445j3877468q646948n125758k424338l20905J58768k746200n504343
3774A00847253m310969j746068Q50135K587875J768001m014849p822494p077724
3766H1081160n065490l164329k232041j825541j377667j163232o74919n52878
3758F5025063l09074m62318j54952k67289M3829j4379J85817p7697r8607k38079
3748F3632314j89610K06411K73793N85501O11955M28764K07856l6281R8732K70757
$$ y = [85161774, 82430568, 79936559, 77996494, 77291198, 77581865, 78467350, 80278104, 82623781, 86082066, 90468593, 95653215, 102015534, 110332372, 120847030, 134420466, 151907852, 174382001, 202418067, 233533586, 252369592, 233622229, 194044374, 161067124, 139334445, 125456977, 116810029, 111684271, 109259933, 108939028, 109097796, 106351596, 100847253, 96536284, 94790216, 95640351, 98228226, 99996227, 95981378, 88158884, 81081160, 76015670, 72851341, 70619300, 68793759, 67416092, 66252860, 65577941, 65025063, 64715989, 64253671, 64098719, 63831430, 63875259, 63860880, 64046697, 63969000, 63870393, 63632314, 63442704, 63649115, 63922908, 64508409, 65120364, 65549128, 65756984, 65720703, 65819435, 66090192]
3738F6090192M90046M56237K36818L70502L86793K60461O42563N91792R48238
3729G0473642P84573J99866J06478L71711P75535J046336J072204J093095J428991
3720G7352431J606607J874415K158695K325667K759378K914969L258097L424361
3712I7674620L827353M032734M216537M778770N345774N881277O329963P157146
3704A39244174P583049Q326813Q316580P687798P141029O374597M869538K771871
3696A92315449M92238k005014m000862n695533o611310p775924q787223q546782
3688A49385039p470416n958792m149833k061125o17402O29774J254122J395300
3680A32406667J474888J421204J110048N13521j83079p80292k159688l996580
$$ y = [66090192, 66580238, 67036475, 67273293, 67643795, 68030588, 68291049, 68933612, 69525404, 70473642, 71258215, 71458081, 71564559, 71936270, 72711805, 73758141, 74830345, 75923440, 77352431, 78959038, 80833453, 82992148, 85317815, 88077193, 90992162, 94250259, 97674620, 101501973, 105534707, 109751244, 114530014, 119875788, 125757065, 132087028, 139244174, 146827223, 155154036, 163470616, 171158414, 178299443, 184674040, 189543578, 192315449, 192807687, 190802673, 186801811, 181106278, 174494968, 166719044, 157931821, 149385039, 141914623, 135955831, 131805998, 129744873, 129127471, 129757245, 131011367, 132406667, 133881555, 135302759, 136412807, 136926328, 136743249, 135962957, 133803269, 129806689]
3672A29806689n348205o161406n965463n861349n648193n603048n628179n257593
3664H4333253m690891m234964l723564l202937l070117k860893k590474k398561
3656E7560852k156446k080536j896465j734386j474665j185691j196413j039829
3648D4796421p81603n25298m82529n01067m81310k86827l26378k89572l99976
3639D0721861o03156m85004n21148l95401m74536p51052o33813m33391m84919
3630C5939441n29821n22509n30256k84913n17166n28292l59443m03979m02223
3621C1860839l97660k50048j43126k70170k42193n5732j27584j2552R6388K51553
3611C0709715J14987P4973M54797M12843O96842P69616J033761J051445J320240
$$ y = [129806689, 124458484, 118297078, 112331615, 106470266, 100822073, 95219025, 89590846, 84333253, 79642362, 75407398, 71683834, 68480897, 65410780, 62549887, 59959413, 57560852, 55404406, 53323870, 51427405, 49693019, 48218354, 47032663, 45836250, 44796421, 44014818, 43489520, 43006991, 42505924, 42024614, 41737787, 41411409, 41121837, 40721861, 40118705, 39633701, 39112553, 38717152, 38242616, 37491564, 36857751, 36424360, 35939441, 35409620, 34887111, 34356855, 34071942, 33554776, 33026484, 32667041, 32263062, 31860839, 31463179, 31213131, 31070005, 30799835, 30557642, 30501910, 30374326, 30361774, 30458162, 30709715, 30824702, 30899675, 31354472, 31767315, 32464157, 33233773, 34267534, 35318979, 36639219]
3602C6639219J665027J983503K198769K932495L507035M046273M794769N166150
3594F2933240M626266J403195l989947p050290o936685n637252m437964l598219
3586C7312344k885832k284645j952731j829948j506618j230466q42558q35094
3578B3944452o93448o65398p40972m38978n26019m44366l56495l64111k49995
3569A9464670l97109j97837j93912k33764l02296l72885l76054j40185j94453
3560A7056175q7985m5844j83553j34245q8498j08327j18023j21261j71983q7147
3550A5909309j86058K5783q7924k8648q415J04567L5292k6095K19772J95177j39597
3539A6013163k36015R0042j11146M5094k61264M5537j47124j07552r1581j60252
$$ y = [36639219, 38304246, 40287749, 42486518, 45419013, 48926048, 52972321, 57767090, 62933240, 67559506, 68962701, 64972754, 57922464, 50985779, 45348527, 40910563, 37312344, 34426512, 32141867, 30189136, 28359188, 26852570, 25622104, 24779546, 23944452, 23251004, 22585606, 21844634, 21405656, 20879637, 20435271, 20078776, 19714665, 19464670, 19067561, 18869724, 18675812, 18442048, 18139752, 17766867, 17390813, 17250628, 17056175, 16968190, 16922346, 16738793, 16604548, 16516050, 16407723, 16289700, 16168439, 15996456, 15909309, 15723251, 15749034, 15661110, 15632462, 15624047, 15728614, 15763906, 15737811, 15957583, 16152760, 16013163, 15777148, 15867190, 15756044, 15801138, 15539874, 15585411, 15438287, 15330735, 15239154, 15078902]
3529A5078902j10583l7662j70950N543N0994p5493p7293j33469J19067J05575
3519A4754631Q3538J92444J44056p8354J49681J28400J38481J22038R0044J18141
3509A5843100K86040K26022m6754j21571n5784N0136j16420j47964o3918L4455
3499A5887342P367k40723J39888K61897L9961m7923o924O5442K37858M5103n2046
3488A6337242Q8734J31864R2557K50392K88850K34707K38489J77169J48070J71952
3478A8160026J32409p3590L66489J40692K62189K39877K32072L14960M00838L99193
3468B0575155M79666L62610L25506O22501N51864P89713M56323R12054P51672
3459B5827064Q55298M63407P17267P79009Q09427R13091Q00066J052405J191098
$$ y = [15078902, 14968319, 14930657, 14759707, 14765250, 14816244, 14740751, 14663458, 14529989, 14649056, 14754631, 14838169, 15030613, 15174669, 15096315, 15245996, 15374396, 15512877, 15634915, 15724959, 15843100, 16129140, 16355162, 16308408, 16186837, 16131053, 16181189, 16064769, 15916805, 15852887, 15887342, 15894709, 15653986, 15793874, 16055771, 16095732, 16047809, 16040885, 16106327, 16344185, 16389288, 16337242, 16425976, 16557840, 16650397, 16900789, 17189639, 17424346, 17662835, 17840004, 17988074, 18160026, 18292435, 18218845, 18585334, 18726026, 18988215, 19228092, 19460164, 19775124, 20175962, 20575155, 21054821, 21417431, 21742937, 22365438, 22917302, 23707015, 24163338, 25075392, 25827064, 26682362, 27145769, 27863036, 28642045, 29451472, 30364563, 31164629, 32217034, 33408132]
3450C3408132J212956R06885J173671J287095J468905J318336J629012J681065
3442D4086057J913484J895595K063898K208065K406734K677099L390681L963579
3434F4605192M302780M818011N489326O584437P446278R094172J1000242J2995144
3426A26335582J5080114J6515295J7211238J7506290J9394006K2293753K3148632
3419B57484910J7270278J44638k1182211l2656883l1900241k6159854k0349314
3412A42651323j5861605j2291524r954990p846971o063990m491556l508357k495775
3404H0136555j709165j047407j1891M91377J169709Q36364o1475j129026j208739
3395G7466302q07044j46960P4733l03819j166798l089603m351482m707895m001007
$$ y = [33408132, 34621088, 35527973, 36701644, 37988739, 39457644, 40775980, 42404992, 44086057, 45999541, 47895136, 49959034, 52167099, 54573833, 57250932, 60641613, 64605192, 68907972, 73725983, 79215309, 85799746, 93246024, 102340196, 113340438, 126335582, 141415696, 157930991, 175142229, 192648519, 212042525, 234336278, 257484910, 274755188, 274899826, 253717615, 221060732, 189160491, 163000637, 142651323, 126789718, 114498194, 104543204, 96696233, 90632243, 86140687, 82632330, 80136555, 78427390, 77379983, 77368092, 77859469, 79029178, 79865542, 79804067, 78675041, 77466302, 76659258, 76512298, 76587031, 76283212, 75116414, 72026811, 67675329, 62967434, 58966427]
3386E8966427l411464k485273j976539j311382j120171q39219n64959m28159m51394
3377D6377867p10467r87705j515586j603710j741525j428575j616091j373999
3369C5400209j285526j160782r53086q76992j115454q14913o74318n11071o68467
3360B7339600p93860n95171p55276n31758m11387m54372l95706m84954l86676
3351B2530440m35656l83661n61696l95875l01348k93840j80370k39589k95735
3342A9442670l79994l32194k55244j25887j80688m19633o74394k48265m03611
3333A6422760j54190r1917j75919l73855o1712o9754k10146j51353k68444o4197
3323A4801273K8419k0978j2815j64906r4934l5819l1925p9978k23506j48847Q3944
$$ y = [58966427, 55554963, 53069690, 51093151, 49781769, 48661598, 47822379, 47257420, 46829261, 46377867, 45667400, 44679695, 43164109, 41560399, 39818874, 38390299, 36774208, 35400209, 34114683, 32953901, 32000815, 31123823, 30008369, 29193456, 28519138, 28008067, 27339600, 26545740, 25950569, 25195293, 24663535, 24252148, 23797776, 23402070, 22917116, 22530440, 22094784, 21711123, 21149427, 20753552, 20452204, 20158364, 19977994, 19738405, 19442670, 19062676, 18730482, 18475238, 18349351, 18168663, 17749030, 17074636, 16826371, 16422760, 16268570, 16176653, 16000734, 15626879, 15565167, 15495413, 15285267, 15133914, 14865470, 14801273, 14829692, 14808714, 14795899, 14630993, 14536059, 14500240, 14468315, 14388337, 14164831, 14015984, 14099928]
3312A4099928k6659N4138r3659p3191Q2608l5915R0126O5649M7788p6455k7413
3301A4106945Q5144N7648P147Q7759p780j13041J29179l8338Q3094J65506q9607
3290A4473656P4866N0810K49006L7616R5976M03139m7340M54964L36192J06679
3280A6235564M52221O88519M97386O45832N48307N70075O43609O48047P00040
3271B1629600M73146N39383M93823P31674O64138Q09407J77741n99683j320137
3262B3599092j435514j293998r86187q14152m90070k69212k92029k08753r6342
3253A7712835j6517j82512j4555J40685J19700n3944k065j19503O311K36141K4101
3242A7850677j8270L9672J42982L95007K47431N43135M09714K99107M81615J24021
$$ y = [14099928, 14073269, 14127407, 14033748, 13960557, 14043165, 14007250, 14097376, 14163025, 14210813, 14134358, 14106945, 14192089, 14249737, 14256884, 14344643, 14336863, 14223822, 14353001, 14314663, 14397757, 14563263, 14473656, 14548522, 14599332, 14848338, 14885954, 14981930, 15385069, 15337729, 15792693, 16128885, 16235564, 16687785, 17376304, 17873690, 18519522, 19067829, 19637904, 20281513, 20929560, 21629600, 22102746, 22642129, 23135952, 23867626, 24531764, 25341171, 25518912, 24919229, 23599092, 22163578, 20869580, 19883393, 19069241, 18579171, 18309959, 18017930, 17809177, 17712835, 17696318, 17513806, 17499251, 17639936, 17759636, 17705692, 17703627, 17584124, 17590435, 17826576, 17850677, 17832407, 17872079, 18015061, 18410068, 18657499, 19200634, 19610348, 19909455, 20391070, 20515091]
3232B0515091K54856k17548j33379j42534j00696j40369n7978j94394k8131j0347
3222A9744571k8766m7492J110J03051r313m6523K0836j22391k35876p4164p8518
3211A9226525K3125O9267J42206L09419M59789M85418O08360P36247Q95790Q17003
3201B3773149O47622K51992m43781n70092q86242o51918n37040o43278m90578
3192B0449834k53013l63160m78641k02243l18619k21163k99869j08297k59386
3183A7945443o2461q3155l7883J27894J54151K18117L00810L01748P69382M62355
3173B0096401O47600P72537N45779L50724k11692o53199q24730p76335p61397
3164A9185688m19869m44223m04876k59242r001m6962k5282k28687K7819j3641
$$ y = [20515091, 20769947, 20552399, 20419020, 20276486, 20175790, 20035421, 19977443, 19783049, 19754918, 19744571, 19715805, 19668313, 19669423, 19772474, 19763161, 19716638, 19737474, 19615083, 19379207, 19305043, 19226525, 19249650, 19318917, 19461123, 19770542, 20230331, 20715749, 21324109, 22060356, 22956146, 23773149, 24420771, 24672763, 24228982, 23658890, 22772648, 22120730, 21583690, 20940412, 20449834, 20196821, 19833661, 19355020, 19152777, 18834158, 18612995, 18313126, 18204829, 17945443, 17882982, 17799827, 17761944, 17889838, 18043989, 18262106, 18562916, 18864664, 19634046, 20096401, 20744001, 21516538, 22062317, 22413041, 22201349, 21548150, 20723420, 19947085, 19185688, 18765819, 18321596, 17916720, 17657478, 17648477, 17601515, 17576233, 17347546, 17375365, 17361724]
3154A7361724j57179j62353j7131r7517k19510l027j09469K15434k92698R9560
3144A6617834Q0897J88037k39013m9626J69655p335J15396J29118J10484J37851
3134A7253298L85188J77152L49334L2806L54855K43519L20782N3089L69530K84738
3124A9824291L07952J72744K91650M92778M49979M56706K59499O10367M12787
3115B3278753N84837M53093O47860L60912M12333J7556L03853K58733L96211L72553
3105B7086694P40106O00228M42771O33086L19698O56591L26854M77261p0297J45536
3095C1358528L7374K81724K31370N90844L98885M62264N44639N82769Q56593Q37517
3085C6182507Q34704N92037Q99039J093285J349805J207736J649108J632167J821559
$$ y = [17361724, 17204545, 17042192, 17025061, 16927544, 16708034, 16705007, 16595538, 16810972, 16518274, 16617834, 16698731, 16886768, 16647755, 16598129, 16767784, 16760449, 16875845, 17004963, 17115447, 17253298, 17638486, 17815638, 18164972, 18197778, 18552633, 18796152, 19116934, 19170023, 19539553, 19824291, 20132243, 20304987, 20596637, 21089415, 21539394, 21996100, 22255599, 22865966, 23278753, 23863590, 24316683, 24964543, 25325455, 25737788, 25755344, 26059197, 26317930, 26714141, 27086694, 27826800, 28427028, 28869799, 29502885, 29822583, 30479174, 30806028, 31283289, 31212992, 31358528, 31395902, 31677626, 31908996, 32499840, 32898725, 33360989, 33905628, 34488397, 35344990, 36182507, 37017211, 37609248, 38508287, 39601572, 40951377, 42159113, 43808221, 45440388, 47261947]
3076D7261947J217914J098029Q06976Q01738R98379J065529Q55677P16114N06821
3067E5329124K37165J83881l08596k00146j25020L64833P31231J131185J628195
3058E8971852K066058K621383L166793L460790M258666M715857M610304L688013
3050H7559716K266138J151040O04930K75804k20751o57300j388856j983301j703138
3041H5904282j083409j300511k774074k978925l160071l325793l809393l699598
3033F3772508l053650k878229k223108j888911j073275q66776j92149K30664O12731
3024E2439805J080810J234796J424119R97134l45087j681544k331563k449414
3016E0369056j739335j333343o92565k27995K43678j40185o83430j075336j380675
$$ y = [47261947, 48479861, 49577890, 50384866, 51186604, 52184983, 53250512, 54106189, 54822303, 55329124, 55566289, 55750170, 55441574, 55241428, 55116408, 55481241, 56212472, 57343657, 58971852, 61037910, 63659293, 66826086, 70286876, 74545542, 79261399, 83871703, 87559716, 89825854, 90976894, 91581824, 91857628, 91636877, 90979577, 89590721, 87607420, 85904282, 84820873, 83520362, 80746288, 77767363, 74607292, 71281499, 67472106, 63772508, 60718858, 57840629, 55617521, 53728610, 52655335, 51788559, 51596410, 51827074, 52439805, 53520615, 54755411, 56179530, 57176664, 56831577, 55150033, 52818470, 50369056, 48629721, 47296378, 46603813, 46375818, 46619496, 46479311, 45795881, 44720545, 43339870]
3007D3339870j706563j781150j632047j621550j803854j699095j373664j260546
2999C0461401j005622q48542n25002n61709l08238k99842j54515k84203n97055
2990B5876673j020639r38859o17630n22162k45803m39526j62711k84552q680m317
2980B1631794J9310J4330j65813l36042m76498o20203o94947n40997m70996Q8721
2970A8448659M3528P1434K93382J96161m03439l28088k89864o68054p66320p22541
2960A5874858l68208l60569l29513l14036l31119m55672l20757l77069k82993
2951A2734922l07071l99979k29757m8581K1067j42543j45011j56471l4729l66950
2941A0924897K20344j76401N5931O4613j19888j66606J03232j2154k04988k06709
$$ y = [43339870, 41633307, 39852157, 38220110, 36598560, 34794706, 33095611, 31721947, 30461401, 29455779, 28607237, 28082235, 27520526, 27212288, 26912446, 26757931, 26473728, 25876673, 24856034, 23917175, 23299545, 22777383, 22531580, 22092054, 21929343, 21644791, 21636111, 21631794, 21651104, 21665434, 21499621, 21163579, 20687081, 20066878, 19371931, 18830934, 18359938, 18448659, 18492187, 18563621, 18857003, 19053164, 18649725, 18321637, 18031773, 17363719, 16597399, 15874858, 15506650, 15146081, 14816568, 14502532, 14171413, 13715741, 13394984, 13017915, 12734922, 12427851, 12027872, 11798115, 11749534, 11770601, 11628058, 11483047, 11326576, 11291847, 10924897, 11145241, 10968840, 11024771, 11089384, 10969496, 10802890, 10906122, 10893968, 10688980, 10482271]
2931A0482271j81396k3263j73714p8453m3133p9792l77077q975k02609L6757j52847
2920I197769K3313J4885n3162Q8653k8610l0317j3217n443k5309J551J45399J02185
2908I417697N5205K3926J7068j7610j02573K16035O9282o4004j85188j02327k01947
2897I125564r2821J1379l1016k10667o0545j76881k60556n7125j98475R18n6371
2886G993404J07656k11790K3051J25631O2374r1888Q5222P8371J13245N7005P8899
2875H421180K32575j3044J02832k01277J23138l56057l7095q1611p3493l24509
2865G792639q3723l16741k14985j84570l19238p4828k77534J14245j53312j52254
2855F129699m51994J6546p7932l3901r6473J09053M3001k08158o9976r1244R1721
$$ y = [10482271, 10300875, 10277612, 10103898, 10025445, 9982312, 9902520, 9525443, 9516468, 9313859, 9350616, 9197769, 9221082, 9235967, 9182805, 9271458, 9242848, 9212531, 9199314, 9193871, 9168562, 9170113, 9315512, 9417697, 9472902, 9496828, 9513896, 9496286, 9393713, 9609748, 9679030, 9615026, 9429838, 9327511, 9125564, 9032743, 9044122, 9013106, 8802439, 8741894, 8565013, 8304457, 8247332, 8048857, 8049775, 7993404, 8101060, 7889270, 7912321, 8037952, 8100326, 8008438, 8093660, 8172031, 8285276, 8342281, 8421180, 8653755, 8640711, 8743543, 8542266, 8665404, 8309347, 8272252, 8190641, 8117148, 7792639, 7708916, 7392175, 7177190, 6992620, 6673382, 6598554, 6321020, 6435265, 6281953, 6129699, 5677705, 5694251, 5616319, 5582418, 5485945, 5594998, 5637999, 5429841, 5359865, 5268621, 5360342]
2844E360342p0682N1969j51549q014k44171m9548r5854J37660j3672j85181j1852
2833D719448j25760O4537j01247M5540q7444n366j65400P8660q3112q5809j78047
2822D076000j54830N6214n5462J56133K4319q3083q0397p052o2532n6743J18748
2811C931315M1544Q306j36576J83575l857j6265Q6663K07424k6374j3515q7288
2800D174952Q0393l8730j99646J1627j25656j56122r8830L3068q3786n3963r8654
2789C444653J25993N8936j78748J50676j19639j6435J24116r0831J2615J76988
2779C688324j47854j70326J32988j18241J7018l1635M6138n6386L3351p7566O3595
2768C379406r3160l3375K0631J28825n843q5736j04585j20550J28048j12030p424
$$ y = [5360342, 5289660, 5341629, 5190080, 5182066, 4937895, 4888347, 4792493, 4930153, 4916481, 4731300, 4719448, 4593688, 4658225, 4556978, 4602518, 4515074, 4509708, 4344308, 4422968, 4339856, 4254047, 4076000, 3921170, 3977384, 3921922, 4078055, 4102374, 4019291, 3938894, 3931842, 3869310, 3812567, 3931315, 3972859, 3981165, 3844589, 4028164, 4024307, 4008042, 4094705, 4302129, 4275755, 4262240, 4174952, 4255345, 4216615, 4016969, 4028596, 3902940, 3746818, 3647988, 3681056, 3597270, 3543307, 3444653, 3570646, 3629582, 3450834, 3601510, 3481871, 3465436, 3589552, 3498721, 3511336, 3688324, 3540470, 3370144, 3503132, 3384891, 3401909, 3370274, 3416412, 3360026, 3393377, 3315811, 3379406, 3286246, 3252871, 3273502, 3402327, 3396484, 3310748, 3206163, 3085613, 3213661, 3101631, 3094207]
2757C094207r7658J70576k6819q797j57758J93804N9150j60079J21264O4884J30444
2746C383218j72588O7516K989K0684j32191m1861k9197P2743M8674J13651j42287
2735C191351J08276P4790j84106K4161J76931K525k42088l0325j58883j9781m2320
2724B900531k1065l3312R3027o8893K2325J61505j60098L0177k4579J1011o0809
2713B849820N3053r6338j48164j6159q3927N3129J3250k9747J28334P1860j194
2702B793917K2506j88996j18460L4154l4612n2600J14809m9753J7373j2102J40474
2691B666710N3607j65750k00578P4847p0047M0817j35817K9851O6635k0136Q9140
2680B429279M3029K70148j10810j7730j76409J31232L2385n6213L3308L4630q1634
$$ y = [3094207, 2996549, 3167125, 3140306, 3131509, 2973751, 3167555, 3226705, 3066626, 3187890, 3252774, 3383218, 3210630, 3278146, 3281135, 3301819, 3169628, 3127767, 3098570, 3171313, 3219987, 3333638, 3191351, 3299627, 3374417, 3190311, 3214472, 3391403, 3393928, 3151840, 3121515, 2962632, 2942851, 2900531, 2879466, 2846154, 2939181, 2870288, 2892613, 3054118, 2894020, 2924197, 2899618, 2910629, 2849820, 2902873, 2806535, 2658371, 2642212, 2558285, 2611414, 2624664, 2594917, 2723251, 2795111, 2793917, 2816423, 2627427, 2508967, 2543121, 2508509, 2455909, 2570718, 2520965, 2538338, 2526236, 2666710, 2720317, 2554567, 2353989, 2428836, 2358789, 2399606, 2263789, 2293640, 2360275, 2340139, 2429279, 2472308, 2742456, 2631646, 2613916, 2437507, 2568739, 2601124, 2544911, 2578219, 2612849, 2531215]
2669B531215M4328L579J62744L5957k13457m1039M3096N1394q9199M8363P4588
2658B651569J03168l9573j1568l4948K4576J67057j92998P9216M1820p8850k1765
2647B687704K35844J40409j94940K8461J23628p7263K628L0166k37027M1871R0574
2636B872055N8112J07151P3462k27743R825r5333M2420M6427j06727J96995P1106
2625C047750K9756K8485q1282J5699L1314J25714j9527N4258n4639L47o6302P1142
2613C182715J9461J29163M8239j09238r4487k87260j1626R0083K9624k48465r4178
2602B654031P3737R9460J0291R670l2981J63524j3908n199k26103J56651K9914
2591B919087j75182k2121M2619J1718o5160J62528q4487J77256j05095n280l51077
$$ y = [2531215, 2575543, 2579122, 2741866, 2777823, 2564366, 2523327, 2566423, 2617817, 2528618, 2576981, 2651569, 2754737, 2715164, 2703596, 2668648, 2693224, 2860281, 2667283, 2746499, 2788319, 2709469, 2687704, 2923548, 3063957, 2869017, 2897478, 3021106, 2943843, 2946471, 2976637, 2739610, 2781481, 2872055, 2930167, 3037318, 3110780, 2883037, 2892862, 2797529, 2839949, 2886376, 2779649, 2976644, 3047750, 3077506, 3105991, 3024709, 3040408, 3071722, 3197436, 3177909, 3232167, 3177528, 3177875, 3111573, 3182715, 3202176, 3331339, 3379578, 3270340, 3175853, 2888593, 2876967, 2967050, 2996674, 2748209, 2654031, 2727768, 2827228, 2837519, 2847189, 2814208, 2977732, 2963824, 2958625, 2732522, 2889173, 2919087, 2743905, 2721784, 2764403, 2776121, 2710961, 2873489, 2789002, 2966258, 2861163, 2855883, 2504806]
2580B504806K0485K9741k53497j55275R277r4074l5648L29607k63873j24424j60065
2569A807060J50782R1353J39021p8462l0895k0802o1194P0317L24N946k24815
2558A848635J02615m7901m8530p7426R1487j67542O9610p4895n311n4880r0637
2547A545225r3903P079M9228j87826Q973m3563J56195l6665R7161j9088p7864
2536A404952j25279J37963j46379j48612J55174J06285r8067l6680M6022p2579
2526A222800L6096j48930L162j67023K87844N4267j94131O076l658Q1032P0939
2515A248474l8191r8803J22127j71576J7601j0228j450j20427J1886J30240J50540
2504A240193k11347q1241J28693L2309n1533m1692K253j2923J10410J4869k9974
$$ y = [2504806, 2525291, 2555032, 2301535, 2146260, 2155537, 2061463, 2025815, 2355422, 2091549, 1967125, 1807060, 1957842, 2049195, 2188216, 2109754, 2078859, 2058057, 1996863, 2067180, 2067504, 2073450, 1848635, 1951250, 1903349, 1854819, 1777393, 1868880, 1701338, 1770948, 1696053, 1690742, 1635862, 1545225, 1451322, 1458401, 1507629, 1319803, 1328776, 1285213, 1441408, 1404743, 1501904, 1482816, 1404952, 1279673, 1417636, 1271257, 1122645, 1277819, 1384104, 1286037, 1249357, 1295379, 1222800, 1258896, 1109966, 1113128, 946105, 1233949, 1288216, 1094085, 1100161, 1096503, 1177535, 1248474, 1210283, 1111480, 1233607, 1062031, 1079632, 1069404, 1067954, 947527, 959413, 1089653, 1240193, 1028846, 947605, 1076298, 1108607, 1057074, 1015382, 1017635, 1004712, 1115122, 1129991, 1100017]
2493A100017k19616R0551N718L9256M088Q9658n3397k13900Q2084K42698N7448
2482A224605k64904j12205q8370K22245j04815r9677M5751J46193J20021r4919
2472I93925j23773O147N2567n0391k31672m2345K15451p5339O7293j01214n7364
2461F53285o2417J46578J6605j60680M500J0662K27454M1903L7223j53281L3512
2450G95344P6901j68818m1042K0202P085M2419Q5939l611j487n2980R4795l3450
2438H21297p9806o8290K3956M8736K293n7746J2393J13240q057Q2688j40796J41711
2426H91619j9776p8454M8752k17048J5137j20194k5603N4200R7983k086Q4821
2415G29351j8254J33262j02978j73452P70J41489m8645l8014p161n8957N7394
$$ y = [1100017, 880401, 970952, 976670, 1015926, 1020014, 1109672, 1056275, 842375, 924459, 1167157, 1224605, 959701, 847496, 759126, 981371, 876556, 776879, 822630, 968823, 1088844, 993925, 870152, 876299, 928866, 878475, 646803, 604458, 819909, 744570, 811863, 710649, 653285, 590868, 737446, 754051, 593371, 597871, 608533, 835987, 877890, 915113, 761832, 795344, 872245, 703427, 662385, 682587, 689672, 732091, 818030, 814419, 812932, 759952, 854747, 821297, 741491, 673201, 697157, 745893, 748186, 690440, 702833, 816073, 808016, 890704, 749908, 891619, 871843, 793389, 842141, 625093, 640230, 520036, 494433, 548633, 646616, 644530, 729351, 711097, 844359, 741381, 567929, 568699, 710188, 661543, 623529, 616368, 557411, 614805]
2404F14805j89648K91581o3858o8742j67774P1601P9503n536N250M1952P366o0697
2392E55803j56406Q8712K46491j90883P202r4832K35570r6336r4585J6807K15463
2381G33006K1885j41293j51241N9769J65095k85767o7662K07367J07916J17781
2371G66856Q1281j85873q4877o1626o98K098r2071J25419J35396j52293N980Q5188
2359F24780r7267n3632l9475p0814O5318j4306J31264K7762P7389k1125M4614
2348F74508M0461j06701j06541k9951K3339n0358M5404N3007K1393K6268J2913
2337F03742K924J27198j80193N7659P6369j21514j46780j5641K22282j84345N9818
2326E01519P1741J19986l6593k29982q2291Q4522k2472J43503l1530J3307O9213
$$ y = [614805, 425157, 716738, 652880, 584138, 416364, 487965, 567468, 561932, 567182, 609134, 616500, 555803, 399397, 488109, 734600, 543717, 550919, 456087, 691657, 595321, 500736, 517543, 733006, 754891, 613598, 462357, 522126, 687221, 401454, 333792, 541159, 649075, 766856, 848137, 662264, 577387, 515761, 515063, 517161, 425090, 550509, 685905, 533612, 539592, 624780, 527513, 473881, 434406, 363592, 428910, 414604, 545868, 573630, 651019, 629894, 674508, 714969, 608268, 501727, 471776, 495115, 444757, 490161, 543168, 564561, 590829, 603742, 606666, 733864, 553671, 611330, 687699, 566185, 419405, 403764, 626046, 441701, 501519, 573260, 693246, 656653, 426671, 344380, 428902, 406430, 549933, 518403, 531710, 600923]
2315F00923k08385Q0838O6675J25127k71516j796J15813Q4211k1543Q3837j4374
2304F39810j4665m4191J8781j08102j24089R5817K2764n6453l7824K10962j34233
2293D68577L85566p2805p3068j20719p5826J59590j95152q8658k4266K05071r1861
2282D76449K19883l9804P5616k9570j60092K7382L83942q5208j42226M7412q1026
2271F92758K02717l6307J03908k2719Q0819j94601k9107J27042j00746m4960j5686
2260G63118N2013K2198J82742P279m0658m6733p859P5467l5731M1595p4077j9657
2248I19697J03229J95806j17981M2299J7146J120j35616L00059J89939n7656K48350
2237A706392J35576J85695J1102j04465j63876r5093o1850p8343r7198J24345
$$ y = [600923, 392538, 473376, 540051, 665178, 393662, 391866, 507679, 591890, 570347, 654184, 639810, 625145, 580954, 599735, 491633, 367544, 463361, 486125, 429672, 391848, 602810, 468577, 854143, 781338, 708270, 587551, 511725, 671315, 476163, 387505, 363239, 568310, 476449, 696332, 656528, 732144, 702574, 542482, 569864, 953806, 868598, 726372, 773784, 692758, 895475, 859168, 963076, 940357, 1021176, 826575, 797468, 924510, 823764, 778804, 763118, 815131, 837329, 1020071, 1027350, 986692, 939959, 932100, 1007567, 971836, 1013431, 939354, 919697, 1022926, 1218732, 1100751, 1143050, 1160196, 1161316, 1025700, 1325759, 1515698, 1458042, 1706392, 1841968, 2027663, 2038765, 1934300, 1770424, 1675331, 1613481, 1535138, 1437940, 1562285]
2227A562285L4171q4964q5046k6682R6533J69290o9744O527j65821L7447l9286
2216A434710O6566K01324k09476j1176K7207K95989K7682J63930Q4502K99870
2206B381128K45158Q8107J7542J60199K47728O1812o9027k48520k08427j91212
2196B484488r760j04145J83193j60331o3609k36955J31150j71423J85673J95032
2186B433313j06493K05564j62335M8151J18711J49756k76648L61966Q9824l6028
2176B825781L7803K92899J92687K21643K34864K22920M34538n8699L15555L05993
2166E025984J63818j51443j75212m23992j44967k26586j34271o8619k3464j60478
2156C680770l10630M5532j22632N8389o4388q4354q6075J98866n5909J26161J63621
$$ y = [1562285, 1596456, 1511492, 1426446, 1399764, 1496297, 1665587, 1595843, 1602370, 1436549, 1473996, 1434710, 1501276, 1702600, 1493124, 1481948, 1509155, 1805144, 1832826, 1996756, 2081258, 2381128, 2626286, 2714393, 2731935, 2892134, 3139862, 3201674, 3132647, 2884127, 2675700, 2484488, 2474728, 2370583, 2553776, 2393445, 2329836, 2092881, 2224031, 2052608, 2238281, 2433313, 2326820, 2532384, 2370049, 2418200, 2536911, 2686667, 2410019, 2771985, 2861809, 2825781, 2863584, 3156483, 3349170, 3570813, 3805677, 4028597, 4463135, 4404436, 4719991, 5025984, 5189802, 5038359, 4863147, 4439155, 4294188, 4067602, 3933331, 3864712, 3841248, 3680770, 3370140, 3415672, 3293040, 3351429, 3287041, 3202687, 3116612, 3315478, 3259569, 3385730, 3549351]
2145C549351L55827k909j34317l13612m60320l20875j90113j26888k83348r5855
2135A976941p2108k3219m8625j77006j59029J18805l3183N5014m1867J41804J7748
2124A755275j30698p924L4568J18400j69467L6173J94263K18908K26934M4020
2114B320452L22174M16094M66893M73206N76724p704p77916q11567m05901k86799
2104B285656k05684k81927k20493j26757j82208j28659l8559J51994l3728j41991
2094A077644J91744J06033j97092p5443l4673j45382J83540J14029j24548p1147
2084A024705K25582j1828L0924Q8602J77479J59554J84829J25681K05203P390
2074B218121j68057k83294j58328k09803j90235j09224j22423j41178j05425J4821
$$ y = [3549351, 3905178, 3902269, 3767952, 3454340, 2994020, 2673145, 2483032, 2356144, 2072796, 1976941, 1904833, 1881614, 1832989, 1655983, 1496954, 1615759, 1582576, 1637590, 1595723, 1737527, 1755275, 1624577, 1616653, 1651221, 1769621, 1600154, 1636327, 1830590, 2049498, 2276432, 2320452, 2642626, 3058720, 3525613, 3998819, 4575543, 4567839, 3789923, 2978356, 2572455, 2285656, 2079972, 1798045, 1577552, 1450795, 1268587, 1139928, 1101369, 1253363, 1219635, 1077644, 1269388, 1375421, 1178329, 1102886, 1068213, 922831, 1106371, 1220400, 1095852, 1024705, 1250287, 1238459, 1269383, 1357985, 1535464, 1695018, 1879847, 2005528, 2210731, 2218121, 2050064, 1766770, 1608442, 1398639, 1208404, 1099180, 976757, 835579, 730154, 744975]
2064G44975q4144P7041r0319J32303j05204K0862j24834Q5314l9268l5083l0685
2053E50958r0423J23591N5827J8517k2289K9608k60015j36076J96163J59174J21311
2042G46346j76335r6475j9622o2373M044k9185M5157M4202k06917L6114J17131
2031D02087M5755N6616M582M7130n5740j98064K2895N1079N6473j81733L1735
2020B82815J23487L2532j91057j25819L5322J22763j3170Q4956K41310l225j69999
2009D19915k68150K0143J12883J71032N7296L1348j01391j6217o6847l4387m3750
1998B81875j52746N5504J6916N5399r2715n2964Q2126j42431O4317o7082Q9488
1987A37687n4923p2410Q1040Q0985K4361k4728j09361j091p820P598N2917K5236
$$ y = [744975, 660831, 737872, 647553, 779856, 674652, 695514, 570680, 655994, 616726, 581643, 550958, 460535, 584126, 639953, 658470, 636181, 665789, 405774, 269698, 465861, 625035, 746346, 570011, 473536, 453914, 391541, 395585, 366400, 411557, 455759, 248842, 284956, 402087, 447842, 504458, 509040, 556170, 500430, 302366, 325261, 376340, 432813, 251080, 282815, 406302, 438834, 247777, 121958, 157280, 280043, 266873, 351829, 593139, 589914, 419915, 151765, 171908, 284791, 455823, 513119, 544467, 443076, 426859, 360012, 325625, 281875, 129129, 184633, 201549, 256948, 164233, 111269, 193395, 50964, 115281, 48199, 137687, 82764, 10354, 91394, 172379, 196740, 172012, 62651, 61560, 53740, 61338, 114255, 139491]
1975A39491N4013n7300R5156K343J16338r9911n9659j16021Q540Q054j4520N5677
1963A32201J7864J73399j00809K6361P6716j35267j6367j00297j3241J77421q3518
1952A54463j27462J46549J80380j52615K4514R5265M559j47661J51338M2954o0959
1941C11325J5656Q3925j07345m6228K2816j56448M6594L7402J39587p9467k7328
1930B40489l1600J36036k04509Q1631R9913j0500j26316j77302J98673n6904L3107
1919A82718R099Q0856n7546j7085j54854J37786q8430j1612O7845J33565K333
1908B84675k4058J53631K4064L4012j21445M187o6473Q9945k61740J0133r5186
1897C1745q0557K1561J34552J66338r2477l797K6542N8117j069o7238N2751J1104
$$ y = [139491, 193504, 136204, 231360, 233703, 350041, 250130, 190471, 74450, 82990, 91044, 76524, 132201, 150065, 323464, 222655, 249016, 325732, 190465, 174098, 73801, 60560, 237981, 154463, 27001, 173550, 353930, 201315, 225829, 321094, 325653, 177992, 329330, 372284, 311325, 326981, 410906, 303561, 257333, 280149, 123701, 170295, 207697, 347284, 267817, 240489, 208889, 344925, 140416, 222047, 321960, 311460, 185144, 7842, 206515, 149611, 182718, 191817, 272673, 215127, 198042, 43188, 180974, 92544, 80932, 148777, 282342, 284675, 260617, 414248, 438312, 472324, 350879, 355066, 288593, 378538, 116798, 126931, 31745, -48812, -27251, 107301, 273639, 181162, 177365, 203907, 262024, 260955, 193717, 246468, 257572]
1885B57572j2959J0138J3075O1027O7117j1637m8299m3504j22953j00275o2227
1874G075J19790O2181J31783m0471r033r8559K2822o2384R6067J1216N9696j92972
1862A07211O5264P0299j36785K2231J3940k0516o3982J03416j19901j35416j8748
1851a12987K1521Q8486R5391P1145K7595O5253r1945k5933O2602J5976J06948
1840C24052o594q0582j06140J92994J69150j5642j43252n8018O5106M3284j71834
1829B12524M7897n7685R6333J85191Q4634l5852o4378k35602L0325k5120P834
1818B46101J15132k025N2504p2458k25771J02822R3838O9512m2652j5589N4873
1807C76287P7591J44757O2920O2038n7645j54272o4449K7596M1086k4109j00157
$$ y = [257572, 244613, 254751, 267826, 328853, 395970, 384333, 336034, 292530, 169577, 69302, 7075, 126865, 189046, 320829, 280358, 271325, 172766, 195588, 133204, 229271, 240487, 300183, 107211, 172475, 242774, 105989, 128220, 142160, 121644, 57662, 161078, 41177, -94239, -112987, -91466, -2980, 92411, 163556, 191151, 256404, 164459, 138526, 201128, 217104, 324052, 317458, 236876, 130736, 323730, 492880, 477238, 333986, 275968, 341074, 384358, 212524, 260421, 202736, 299069, 484260, 568894, 533042, 468664, 233062, 263387, 238267, 246101, 361233, 359208, 411712, 339254, 113483, 216305, 310143, 379655, 337003, 321414, 376287, 453878, 598635, 661555, 723593, 665948, 511676, 447227, 474823, 515909, 491800, 391643]
1796C91643r737j37528J12826K4469J79929j35991k32950M8122Q4471J43054q1302
1785C87006m8206P716R9793M0259J8280j09000n3298P2333m7881k3018o2248j10292
1773A71444r0902L7908K26831J46377k4987j95616k981O9821J60878J40695r7278
1762E42190k94592j724J35758M0441Q6190p7746J852j19043k1754r2891P4336
1751B73017O5637l1515k1183K6315m3477o2807j04539k8374L6666M6391J00168
1740B56299K8724m6212p3948o4611K8892R9810L3797k35005q4682J10573j09582
1729e5945j44468L3506J86597K70766K95K84l9062j34954M6805O166j31303m8372
1717i685p9436j59943Q4548J74456O1141J09485r923r8085L7761L9926o4401j00761
$$ y = [391643, 381906, 244378, 357204, 381673, 561602, 425611, 192661, 240783, 325254, 468308, 387006, 338800, 346516, 446309, 486568, 504848, 395848, 342550, 414883, 367002, 343984, 281736, 171444, 80542, 118450, 345281, 491658, 466671, 271055, 268074, 337895, 498773, 639468, 542190, 247598, 245874, 381632, 422073, 508263, 430517, 432369, 313326, 291572, 198681, 273017, 338654, 307139, 285956, 312271, 268794, 205987, 101448, 73074, 109740, 156131, 256299, 285023, 238811, 164863, 100252, 129144, 228954, 262751, 27746, -56936, 53637, -55945, -200413, -166907, 19690, 290456, 290751, 291035, 251973, 117019, 163824, 169990, 38687, -9685, -89121, -249064, -164516, 9940, 71081, 180566, 170643, 72558, 110319, 150245, 85844, -14917]
1705a4917Q871j23657M3679P0897j46056n2018L203m3077r317P7984J6715k6826
1693a94519R1390R8338m0016m6952l8198j88726K05016J00170L6443j6403o6798
1682f0255r790J45768J47801o2764j78533j45211Q0674j7168r6626k1008N5196
1671a61916Q0979J75448n7763K0114j84286l9467M9443L0254M0666N9070J64157
1660A76699k12446j41728J75015Q2482P5772o0624p0518q725j84117k09684J83828
1649a94046R4704J18724J47409Q9429O0185j75509p6053j1177P7633L847m8092
1638H7054p5889M6099M3125q2138j590M4010k6642q0368P7817L5600L2779k1758
1626G8099O3816l81k58588k104K1771K21677P0587J5896k04904N771J5777j22495
$$ y = [-14917, -6046, -129703, -86024, -15127, -161183, -213201, -209998, -253075, -262392, -184408, -167693, -194519, -103129, -4791, -44807, -91759, -129957, -318683, -113667, -13497, 22946, 6543, -60255, -70045, 75723, 223524, 160760, -17773, -162984, -82310, -99478, -196104, -217112, -161916, -80937, 94511, 36748, 56862, -127424, -166891, -117448, -87194, -46528, 12542, 176699, -35747, -177475, -2460, 80022, 155794, 95170, 24652, 15927, -168190, -377874, -194046, -99342, 19382, 166791, 256220, 316405, 140896, 64843, 53666, 131299, 135146, 87054, 11165, 57264, 100389, 18251, 16661, 60671, 34029, -46339, 31478, 67078, 99857, 78099, 141915, 141534, -117054, -119158, -97387, 124290, 194877, 210773, 5869, 11640, 27417, -95078]
1614i5078K4903O6610k404O176R1560j27493k3061Q5368m2120j48273p9404L6872
1602b06344K22737l2256j4086L6540l4581o4535j11747R1398O0721N4911r7274
1591i4516r1809P8195K30225j67167j7761M0653p277j6883j9093q9699M5647K11295
1579A01810j53699M0123k523O4920o5676r6758j6101J02737P8451q2775R9180
1568F9689j15710O1141j89064J33498L7794l7654q8841k7058J3479j07700M2950
1557b07476m9445O7970m4223J43653p1578L6368o1993Q6399j11933P663p0444
1546b75039R315M0382P0718J75840n1264J12411j8370m974j26529J45572J1147
1535H9209o0007j02196l0907M1937J0045l0569p770J68971q0077k68332k9783
$$ y = [-95078, -70175, -3565, -5969, 207, 91767, -35726, -58787, 26581, -15539, -163812, -243216, -206344, 16393, -15863, -29949, 6591, -27990, -92525, -204272, -112874, -52153, 2758, -94516, -186325, -108130, 122095, -45072, -62833, -22180, -29457, -46340, -65433, -155132, -109485, 101810, -51889, -11766, -14289, 50631, -15045, -111803, -127904, -25167, 53284, -29491, 69689, -46021, 15120, -173944, -40446, -2652, -40306, -129147, -156205, -142726, -250426, -207476, -256921, -188951, -233174, -89521, -161099, -124731, -186724, -100325, -212258, -204595, -275039, -265724, -225342, -154624, 21216, -30048, 82363, 63993, 59019, -67510, 78062, 89209, 29202, -72994, -103901, -61964, -51919, -82488, -90258, 78713, -1364, -269696, -299479]
1524b99479K80284J33934J53899k36487P3720q499k8845k17952K1997O562L8703
1513h2163J24047o2199J10198m4833O8684j1489j22889N836L3853j09751R6893
1502F187O4721j16971j30521J13708k4109L6274O1635K0265j00238M9372p5871
1491i5548l5023j12745K1532J73400l2144L7967j24741J94846O7005n2439j85190
1480a43080N5659q7015k2832K0357J47923K34621r3882j93350J18178J08701k02251
1469e6971J10985p1972m5192j10765P7060J01778P9527q5598R0950k3022j62316
1458i5536P7520j57720J21800O4380K869R8519n2328q586L3418j77770N663L26663
1446B38892r9894k11196j78524M8934O9348p8012J43318N8659r5657J65042J34626
$$ y = [-299479, -19195, 114739, 268638, 32151, 105871, 97372, 68527, -149425, -127428, -120866, -82163, 41884, -20315, 89883, 45050, 113734, 102245, -20644, -14808, 19045, -90706, 6187, 70908, -46063, -176584, -62876, -86985, -50711, 10924, 31189, -69049, -19677, -95548, -130571, -243316, -221784, -48384, -80528, -42561, -167302, 27544, 94549, 42110, -143080, -87421, -174436, -197268, -176911, -28988, 205633, 111751, -81599, 36579, 145280, -56971, 54014, -17958, -63150, -173915, -96855, 4923, 84450, -1148, 89802, 66780, -95536, -18016, -175736, -53936, 10444, 13313, 111832, 59504, 50918, 84336, -93434, -87771, 238892, 138998, -72198, -250722, -201788, -132440, -210452, -67134, -8475, -104132, 60910, 195536]
1435A95536j1626M0951j78809j05430p6361J38888r2777Q4665q2294k4049l0948
1424a42254j595O7643k20360J19248k281J83672n5130r3795j1831K01726k07645
1413a62602n461N7230j5760J89910j64376J9545R1897m1441k36891L0796K2770
1402b14383J51705J05985j66024p8775o1484n1033Q5765K19307L5804m0054p0138
1391h3325K1334n8823m7753j20152J03378P9430N8735j0340L8364R0523k2588
1380D8783j0063M9076j8164n4789j35342P2569O8070N1355j17612k32335J28905
1369a49547K08529J1051l8728M7678j55339N5896k21801J38991J63952n5234l5391
1358b9943R5397q4545k11726O3712J61547l5388R4309J08525j38481q1774J7081
$$ y = [195536, 183910, 224861, 46052, -59378, -135739, 3149, -89628, -4963, -87257, -111306, -142254, -143849, -76206, -296566, -177318, -179599, 4073, -51057, -144852, -156683, 45043, -162602, -168063, -110833, -126593, 63317, -101059, -81514, 10383, -31058, -267949, -237153, -214383, -62678, 43307, -122717, -201492, -262976, -314009, -228244, -8937, 26867, -13187, -83325, -61991, -120814, -168567, -288719, -185341, -105911, -47176, -57516, -19152, 71371, 48783, 38720, 87796, 69632, 14843, -120499, -47930, 20140, 71495, -46117, -278452, -149547, 58982, 70033, 31305, 78983, -76356, -20460, -242261, -103270, 60682, 5448, -29943, 65454, -19091, -230817, -167105, -5558, -40946, 53363, 161888, 23407, -58367, -41286]
1347d1286j20821P4658J00979k0938j97122J28490Q885J53075R388j65219J34862
1336F4951O269l459j32063Q2932n9222J0301R4995l5952j10989J2485J16197P3644
1324A20089n995P1902m3196m6859j50598j03339P2914J33279L6522k03363K16181
1313I7537N0991J23761m3107j68031j66001q5942J06654J34378L9025j27278L3339
1302d674N4145J40183m3196l7539j76437O0581j8701k258J08601J34968j65196
1291E0477j32215J27617J1627j6512j58281p4554o4213l612J89782J58990M8189
1280A37295l4302k7733m0449P214j27252o8872M8910J99526O5849J34668j45031
1269A49823j51844p5503R7845m4901J3675K0136j92144P1497O0877J17601m8396
$$ y = [-41286, -162107, -87449, 13530, -7408, -204530, -76040, -67155, 85920, 95308, -69911, 64951, 71220, 67761, -64302, 18630, -40592, -30291, 64704, 28752, -82237, -69752, 46445, 120089, 114094, 185996, 142800, 95941, -54657, -157996, -85082, 48197, 84719, -118644, 97537, 148528, 272289, 229182, 61151, -104850, -190792, -84138, 50240, 89265, -38013, -4674, 49471, 189654, 146458, 108919, -67518, -6937, -25638, -27896, 80705, 215673, 50477, -81738, 45879, 57506, 40994, -117287, -191841, -256054, -259666, -69884, 89106, 137295, 102993, 75260, 34811, 42025, -85227, -154099, -105189, 94337, 160186, 294854, 149823, -2021, -77524, 20321, -24580, -10905, 9231, -182913, -111416, -50539, 67062, 18666]
1258A8666J52300L3244J24605J5133j05410m9780j11750p1060N8224K1382M3439
1247A28993J29244k94240Q7207J8160K67349J11861N1752j0640j11355J06776
1237D85107j55135L5141L6061n456j29079P5016j74452m2243r0337R8818l6486
1226I6955Q5445p8273J00012M0354m6259P9223k19287n0876O785J52693K0080
1215A86852J51555j39291J3234M8608J01320l2144K9300j05587m6504o5164j3626
1204A28553K07089j08395n82l9672R1627o9216L6537q3059J23288J562L3447j8512
1192C02667j6710R4121P1414k407n3156j10507J64277r0053j39566L0657j58819
1181I1918L2966J54830k18311R0260J25802K746p7967j5713J06282K0915j7603
$$ y = [18666, 170966, 204210, 328815, 343948, 238538, 188758, 77008, 5948, 64172, 85554, 128993, 258237, -36003, 51204, 69364, 336713, 448574, 500326, 489686, 378331, 485107, 329972, 365113, 401174, 395718, 266639, 341655, 167203, 124960, 34623, 133441, 96955, 182400, 104127, 204139, 244493, 198234, 277457, 58170, 7294, 14079, 166772, 186852, 338407, 199116, 212350, 260958, 362278, 330134, 359434, 253847, 207343, 142179, 128553, 335642, 227247, 226665, 186993, 278620, 209404, 245941, 162882, 286170, 287732, 321179, 302667, 285957, 380078, 451492, 449085, 395929, 285422, 449699, 359646, 220080, 250737, 91918, 124884, 279714, 61403, 151663, 277465, 280211, 202244, 186531, 292813, 313728, 296125]
1170B96125M7281J5172k06553j6549J07491N7437j40110k7163P2183P6597p6145
1159B05766J64963M3445O6231M5849r2056o2792J2139m0179j51954J86582J18050
1148D96044k1372m1467K6120j73346p0430n3525J49464J64350k25390m9511O8874
1137B69811R0709j24991L21709q588R930j39704K04973P2710Q5374k16091k19208
1126C46634P9885k676j54203j13103L7356K23781Q0976r0745l897l8786j00867
1115B64355M863K22803J18761N6354k10956j1857J08164j10789j1083k6901J14382
1104E18096k2937o0594k0074N6398j071J23283P7274j60981j01881R6549K18087
1093G22149K9915j6713p6038J64338j5191J52531k22705J12100J13023j48492
$$ y = [296125, 343406, 358578, 152025, 135476, 242967, 300404, 160294, 133131, 205314, 281911, 205766, 370729, 414174, 480405, 526254, 434198, 371406, 383545, 343366, 191412, 377994, 496044, 474672, 433205, 459325, 285979, 215549, 162024, 311488, 475838, 250448, 200937, 269811, 360520, 235529, 557238, 548650, 558580, 418876, 623849, 696559, 781933, 565842, 346634, 426519, 423843, 269640, 156537, 193893, 417674, 498650, 407905, 404008, 365222, 264355, 269218, 492021, 610782, 667136, 456180, 444323, 552487, 441698, 430615, 403714, 518096, 495159, 434565, 414491, 470889, 469818, 593101, 670375, 509394, 407513, 504062, 722149, 752064, 735351, 659313, 823651, 808460, 960991, 738286, 850386, 963409, 814917]
1083H14917m7953p0692P8641M0432O9658N4827J29182j30836J3975l1157K73544
1072A194538J61745l7349j40966j34380O2438m5098J41867N7555q8809j13483
1062A058058K1576Q675J59722j242N2731l4908J6132K02844Q2629m3339N8793
1051A581671P6334Q4589j21320R3173Q1299Q8674K2521j499O854n8797o412k9166
1039A817921k55K2738J64396r6811J76584K65835K83063N2868J12530k45758l2139
1028B520972J16954k41098J1642j81870J35774r0032l3713n2975r453L0465J75407
1017B382073l161K03203j40534m8358P9817K13729L2262N5673K20068J89279K74452
1006C458503o4849J47119K4331P7132r0666J13810K25299J21979J98305J23622
$$ y = [814917, 766964, 696272, 774913, 815345, 885003, 939830, 1069012, 938176, 952151, 920994, 1194538, 1356283, 1318934, 1177968, 1043588, 1106026, 1060928, 1202795, 1260350, 1171541, 1058058, 1079634, 1088309, 1248031, 1246789, 1299520, 1264612, 1280744, 1483588, 1566217, 1522878, 1581671, 1658005, 1742594, 1621274, 1714447, 1795746, 1884420, 1906941, 1905442, 1912296, 1853499, 1847087, 1817921, 1817666, 1840404, 2004800, 1907989, 2084573, 2350408, 2633471, 2686339, 2798869, 2553111, 2520972, 2637926, 2396828, 2408470, 2226600, 2362374, 2272342, 2238629, 2185654, 2176201, 2206666, 2382073, 2378912, 2582115, 2441581, 2393223, 2473040, 2686769, 2719031, 2774704, 2994772, 3184051, 3458503, 3393654, 3540773, 3565104, 3642236, 3551570, 3665380, 3890679, 4012658, 4210963, 4334585]
996D334585K80333J92493K51869K89616J71465J96766K36565K61095L17597L6050
986F568434K83436J15010M09023L05668L74989L91579O65673M71109O14096N77266
976A0776283P69002P55387R26610J272835J382999J466936N74190N34762R71190
967A9430194J262099J821748K610171L169897L717024M795843O065339P492407
959E0364722R957779J3489163J7946941K4410146J7198639j6685462l0758213
952H5923715k2085178j3365796q565730o472976n051247m182855l329684k462604
944B0407645k020142j614502j263322p29249j23278n21550j093784j593210j074582
935A0374026j055198o53847o01511l45987o54500l81289k66967j70669k00188
$$ y = [4334585, 4614918, 4807411, 5059280, 5348896, 5520361, 5717127, 5953692, 6214787, 6532384, 6568434, 6851870, 6966880, 7375903, 7681571, 8056560, 8448139, 9113812, 9584921, 10199017, 10776283, 11545285, 12300672, 13227282, 14500117, 15883116, 17350052, 17924242, 18459004, 19430194, 20692293, 22514041, 25124212, 28294109, 32011133, 36806976, 42872315, 50364722, 60322501, 73811664, 91758605, 116168751, 133367390, 116681928, 85923715, 63838537, 50472741, 41907011, 35434035, 30382788, 26199933, 22870249, 20407645, 18387503, 16773001, 15509679, 14780430, 14657152, 14135602, 13041818, 11448608, 10374026, 9318828, 8664981, 8063470, 7717483, 7062983, 6681694, 6414727, 6244058, 6043870]
926F043870l03167k85212l15084j60629k75184o9168l09710j05442k64961j86129
916C769184r2110j99309j27591n1855K392k66679M5342N5179K2636l37585J85673
905C005277j46423k1246k67647n2057r747m3075j13717p8918o301J24927p4307
894B316766j83298K1423k4329l33k24617n6246K135j6150N483m3351j92416j38058
882A467009K31228o2167j22172r2082L4762j43552O0747M6845P3431j85884P0731
871A378896p4997o2867M582j81427M039P9403J10401j62759k6548r1407J30811
860A108127J6568Q0006j78934r7467j44572J6920J50334n1715n7739j22087J42568
849H62009r9560m1460j21455M6187p7313O4400L0567q8579L3915j68265Q605j4021
$$ y = [6043870, 5740703, 5455491, 5140407, 4979778, 4704594, 4635426, 4325716, 4220274, 3955313, 3769184, 3677074, 3477765, 3350174, 3298319, 3300711, 3034032, 3079374, 3134553, 3157189, 2819604, 3005277, 2858854, 2837608, 2569961, 2517904, 2508157, 2465082, 2351365, 2272447, 2266146, 2391073, 2316766, 2133468, 2154891, 2130562, 2130229, 1905612, 1849366, 1851501, 1835351, 1840834, 1797483, 1605067, 1467009, 1698237, 1636070, 1513898, 1421816, 1456578, 1313026, 1373773, 1420618, 1494049, 1308165, 1378896, 1303899, 1241032, 1245614, 1064187, 1068226, 1147629, 1258030, 1095271, 1068723, 977316, 1108127, 1124695, 1204701, 1025767, 928300, 783728, 800648, 950982, 899267, 841528, 719441, 862009, 762449, 720989, 599534, 645721, 568408, 632808, 663375, 574796, 608711, 440446, 449051, 435030]
837D35030K7342r3436L3542n9546Q8575j11429K7092M5030M4252j4625J6666J20853
825E59346q2204j85660j2043Q8481j05711J03845k11110o431l6135k2978n1345
814C8055J38033k4154J24530j00241l3160K19779k54000J50130M4359R9306n7264
803C45373L8327p4506k4136p6761p1784n0593K05715n8738q2653J6444k05350
792c8662K9052J40051P4210j09453N1066L7491P2439Q1796j23893M8523j41203
781A21417j31659K5142Q2009K674j01133Q0560R4939M6871j17450L5082M0481
770A78933R2303k5415J2261L6865j44419n8978l8649P2862j84190J48273p2180
759A7666n2308m5946M8449O212n053l0375o7545J69177K9162R9504K2507J16943
$$ y = [435030, 462372, 368936, 402478, 342932, 431507, 320078, 347170, 392200, 436452, 421827, 438493, 559346, 477142, 291482, 279439, 367920, 262209, 366054, 154944, 148513, 112378, 89400, 38055, 176088, 151934, 276464, 176223, 143063, 362842, 108842, 258972, 303331, 402637, 345373, 383700, 309194, 285058, 208297, 136513, 85920, 291635, 232897, 150244, 166688, -38662, -9610, 130441, 204651, 95198, 146264, 183755, 256194, 337990, 214097, 262620, 121417, -10242, 14900, 96909, 99583, -1550, 79010, 173949, 220820, 103370, 138452, 178933, 271236, 245821, 258082, 294947, 150528, 91550, 52901, 125763, -58427, 89846, 17666, -34642, -80588, -32139, -25927, -30980, -61355, -128900, 40277, 69439, 168943, 191450, 308393]
747C08393j07148O1584j31079j43247m5143Q5065P38m7326R262j38591P7798P6180
735F486J60778r5847o7019k09800J64209J65352O0055M3965q9627o5701j48676
724g5825L9618J9188l1687r8000O6207J71941M6123j39298K9011J77767j93339
713A1706j50144K627n0710M9805K7273R8705j93457J90012R1486o536l0962j50573
701a10768o1286J3941l0918K646o1119M6580L87964j07503k958j84634j42911
690b50966J54480J92845k7506K0773j13772n0956j8107l2843Q0241j97831O3048
679a80594k3310K24422j76496J81714R5997R7055J12541M6674j7839J43394O2967
668E66525k28941Q717J07110k1898j75655n5518j29973j19857m3759Q9236p6096
$$ y = [308393, 201245, 262829, 131750, -11497, -56640, 28425, 29163, -18163, -8901, -147492, -69694, 6486, 167264, 71417, 4398, -205402, -41193, 124159, 184214, 228179, 138552, 72851, -75825, -36207, -17019, -48706, -146706, -80499, 91442, 137565, -1733, 27278, 205045, 11706, -138438, -135811, -186521, -136716, -109443, -10738, -204195, -14183, 77303, 70767, 39805, -110768, -172054, -158113, -189031, -186385, -247504, -200924, 187040, 79537, 76579, -108055, -250966, -96486, 96359, 68853, 89626, -24146, -75102, -93209, -126052, -45811, -243642, -180594, -203904, 20518, -155978, 25736, 121733, 218788, 331329, 378003, 360164, 503558, 566525, 337584, 346301, 453411, 431513, 255858, 200340, 70367, -49490, -93249, -4013, -80109]
657h0109J55936N1813q2489j13965p3351m2717J37613P2448J60896K2750k63077
646e4252j55269J41724l2262l1073J26153j76333k5279o6400R0795q3342P7588
635a87950l4450K65031j5213q1914Q4902p5631j27685J1684R9582k0191Q8317
624F482l31687J44222r5626K10581j7773o6311L3650J16476p166J2601l433q2539
612h0523J11089o3815J64377k11703j81718j07887K50610J15813m1151k60190
602c05098P1005k2916N105R9914m1379J90736p5811n8118K7782J60684m218J03525
590A51211p8414j52021o5229O3776K2517k2051K8581n272k0852r4264l6694o3454
578b72166J24698J00042p3371m6406j23620J05448M2597P3816r2629o3902j24958
$$ y = [-80109, 75827, 127640, 45151, -68814, -142165, -184882, -47269, 25179, 186075, 208825, -54252, -209521, -67797, -100059, -131132, -4979, -181312, -206591, -272991, -182196, -265538, -187950, -222400, 42631, 27418, -54496, 30406, -45225, -172910, -161226, -61644, -81835, 6482, -325205, -180983, -276609, -66028, -83801, -150112, -116462, 14, -7152, 5449, 2016, -80523, 30566, -33249, 131128, -80575, -262293, -370180, -119570, -3757, -44908, -305098, -234093, -257009, -251904, -151990, -193369, -2633, -78444, -136562, -108780, 51904, 47686, 151211, 72797, -79224, -144453, -80677, -58160, -80211, -51630, -56902, -77754, -172018, -208712, -272166, -147468, -47426, -120797, -167203, -290823, -185375, -142778, -68962, -161591, -225493, -350451]
567c50451P5914J89923n8490K04489n0916p1940K678l7901N917p2662j0811j61756
555c36006J3678L994R9763n3693P0407M6308P0819M2112K8362o2136m245L1509
543d9128l1750k3026l3096O6493j81850J87823o7937n2210q3575J05317j02781
532b65720o4204J44953r2980Q676Q3399n1878j15950o8294J4036O7025J32251
521b08686j3462n9815J04825o2111n0518P2584o7548J09763l949j64824R8385
510b45356O5986p8026N7835k3354R8808r0029R6315J30874p1950q3748m6645q5216
498b74506J87184J46533m3181r3155o5229L8114O12P5624j61584q1644j41422
487d12654K12230j2812J8588P2349O2039k13302Q0300J91496j02954j26682j6192
$$ y = [-350451, -274537, -84614, -143104, 61385, 10469, -61471, -58793, -96694, -90777, -163439, -174250, -336006, -322328, -318334, -218571, -272264, -201857, -155549, -84730, -42618, -14256, -76392, -80637, -49128, -80878, -103904, -137000, -70507, -252357, -64534, -132471, -184681, -268256, -162939, -265720, -329924, -184971, -277951, -269275, -185876, -237754, -353704, -421998, -407962, -340937, -208686, -222148, -281963, -177138, -239249, -289767, -217183, -284731, -174968, -178917, -343741, -245356, -179370, -257396, -199561, -222915, -124107, -214136, -117821, 13053, -58897, -142645, -189290, -274506, -87322, 59211, 16030, -77125, -142354, -104240, -103628, -28004, -189588, -271232, -412654, -200424, -213236, -194648, -122299, -60260, -273562, -193262, -1766, -104720, -231402, -247594]
476b47594K04853q3832m7406p7593L327J0511K18131L312M6036j06987j07835
465a85077J10185p043M3251j18995M8356j30028J65114k30687Q7231J04446J09549
454c698l0925J77314n2727j81166p1730j36299K71512n0252j0109k41922J33350
443a96652j9455J64380N1685O5615j36530j67380J58763K1068K1917m6712q4195
432a67496m7395J4064o9325N7099N480J03396J02676j1866m0223p3757J25824
421a523j58403j7497m8089M9038K331j51943J8849J41663P9707r2763N0728K476
409a25426J0014M4658m0028j55412m2556j5819K8974J61426q5825K3225N9903
398a36866k982j87526J0125N0641J602k8588j34939j9527r620M3071O7773O0502
$$ y = [-247594, -42741, -126573, -173979, -251572, -248245, -237734, -19603, -16291, 29745, -77242, -185077, -74892, -81935, -38684, -157679, -109323, -239351, -74237, -304924, -217693, -113247, -3698, -34623, 142691, 89964, -91202, -162932, -299231, -27719, -77971, -88080, -330002, -196652, -216107, -51727, -42, 65573, -70957, -238337, -79574, -58506, -36589, -83301, -167496, -214891, -200827, -270152, -213053, -207573, -104177, -1501, -13367, -53590, -127347, -1523, -159926, -177423, -225512, -176474, -174143, -326086, -307237, -165574, -85867, -178630, -127902, -125426, -115412, -70754, -110782, -266194, -308750, -324569, -295595, -134169, -219994, -196769, -136866, -139848, -327374, -317249, -266608, -265006, -293594, -428533, -448060, -457680, -414609, -346836, -286334]
386b86334O0608L5198j42098K9549J27411M5147p1886p0269P7639j60791l6182
375c92008J37927l0907k7991m8342R3927L8357L249m8076P6165l8018n5064k128
$$ y = [-286334, -225726, -190528, -332626, -303077, -175666, -130519, -202405, -272674, -195035, -355826, -392008, -254081, -284988, -312979, -361321, -267394, -229037, -225788, -273864, -197699, -235717, -290781, -292909]
$$ [...]
##END NTUPLES=NMR SPECTRUM
##END=
