##TITLE=1H_CG-1138-1
 CDCl3, 8 sc, 
 18.12.2020
##JCAMPDX= 6.0         $$ Bruker NMR JCAMP-DX V2.0
##DATA TYPE= NMR SPECTRUM
##DATA CLASS= NTUPLES
##ORIGIN= UXNMR, Bruker Analytische Messtechnik GmbH
##OWNER= root
$$ XWIN-NMR		Version 3.5
$$ Fri Dec 18 10:33:30 2020 Russian Standard Time (UT+4h)  she@DPX200
##.OBSERVE FREQUENCY= 200.1315066352
##.OBSERVE NUCLEUS= ^1H
##.ACQUISITION MODE= SIMULTANEOUS
##.ACQUISITION SCHEME= undefined
##.AVERAGES= 8
##.DIGITISER RES= 18
##SPECTROMETER/DATA SYSTEM= spect
##.PULSE SEQUENCE= zg30
##.SOLVENT NAME= CDCl3
##.SHIFT REFERENCE= (INTERNAL, CDCl3, 0, 15.9813)
##AUDIT TRAIL= $$ (NUMBER, WHEN, WHO, WHERE, WHAT)
$$ ##TITLE= Audit trail, XWIN-NMR		Version 3.5
$$ ##JCAMPDX= 5.01
$$ ##ORIGIN= Bruker BioSpin GmbH
$$ ##OWNER= she
$$ F:/spectra/data/she/nmr/H-F/1/pdata/1/auditp.txt
$$ ##AUDIT TRAIL=  $$ (NUMBER, WHEN, WHO, WHERE, WHAT)
(   1,<2020-12-18 10:32:07.01 +0400>,<she>,<DPX200>,
      <created by zg, POWCHK disabled, PULCHK disabled
       configuration hash MD5:
       00 E9 B6 7A A2 85 ED C7 34 08 36 98 17 FE 4E 26
       data hash MD5: 16K
       5A 50 46 6C 20 D0 FE 5E 65 11 CD 81 B3 8C B8 83>)
(   2,<2020-12-18 10:32:09.29 +0400>,<she>,<DPX200>,
      <Start of raw data processing
       efp BC_mod = 2 LB = 0.24 FT_mod = 6 PKNL = 1 PHC0 = -10917.17 PHC1 = 10.60095 SI = 16K 
       data hash MD5: 16K
       58 8C 5F B6 A8 43 97 B1 A7 1F 86 2B 82 FC ED C5>)
(   3,<2020-12-18 10:32:28.04 +0400>,<she>,<DPX200>,
      <pk PHC0 = 153.5815 PHC1 = 2 
       data hash MD5: 16K
       F1 29 20 CA 15 8E 29 CE 0E ED CA 92 79 44 52 E2>)
(   4,<2020-12-18 10:32:31.06 +0400>,<she>,<DPX200>,
      <abs ABSG = 5 
       data hash MD5: 16K
       51 1E E5 28 BF D5 F6 62 D8 3C 28 A4 10 0C C7 27>)
(   5,<2020-12-18 10:33:02.12 +0400>,<she>,<DPX200>,
      <abs ABSG = 5 
       data hash MD5: 16K
       E1 DF BE 2E 2E 14 82 82 76 26 08 C6 D1 CE 01 72>)
$$ ##END=
$$ 
$$ hash MD5
$$ 49 33 43 80 82 11 11 28 B7 6D 1C 1A 67 55 A1 05
##$RELAX= 
##$RELAX= 
##$RELAX= 
##$RELAX= 
##$RELAX= 
##$RELAX= 
$$ Bruker specific parameters
$$ --------------------------
##$DU= <F:/spectra>
##$EXPNO= 1
##$NAME= <H-F>
##$PROCNO= 1
##$TYPE= <nmr>
##$USER= <she>
##$AMP= (0..31)
100 100 100 100 100 100 100 100 100 100 100 100 100 100 100 100 100 100 
100 100 100 100 100 100 100 100 100 100 100 100 100 100 
##$AQSEQ= 0
##$AQ_mod= 1
##$AUNM= <au_zg>
##$AUTOPOS= <>
##$BF1= 200.13
##$BF2= 200.13
##$BF3= 200.13
##$BF4= 200.13
##$BF5= 200.13
##$BF6= 200.13
##$BF7= 200.13
##$BF8= 200.13
##$BYTORDA= 1
##$CFDGTYP= 0
##$CFRGTYP= 5
##$CHEMSTR= <none>
##$CNST= (0..31)
1 1 145 1 1 1 1 1 1 1 1 1 1 1 1 1 1 1 1 1 1 1 1 1 1 1 1 1 1 1 1 1 
##$CPDPRG= <>
##$CPDPRG1= <>
##$CPDPRG2= <>
##$CPDPRG3= <>
##$CPDPRG4= <mlev>
##$CPDPRG5= <mlev>
##$CPDPRG6= <mlev>
##$CPDPRG7= <mlev>
##$CPDPRG8= <mlev>
##$CPDPRGB= <>
##$CPDPRGT= <>
##$D= (0..31)
0 1.2 0 0 0 0 0 0 0 0.06 0 0.03 0 0 0 0 0.0002 0 0 0 0 0 0 0 0 0 0 0 0 
0 0 0 
##$DATE= 1608273126
##$DBL= (0..7)
$$ [...]
##$SUBNAM3= <"">
##$SUBNAM4= <"">
##$SUBNAM5= <"">
##$SUBNAM6= <"">
##$SUBNAM7= <"">
##$SUBNAM8= <"">
##$SUBNAM9= <"">
##$SW= 16.9725356469052
##$SWIBOX= (0..15)
0 0 2 0 0 0 0 0 0 0 0 0 0 0 0 0 
##$SW_h= 3396.73913043478
##$TD= 16384
##$TD0= 1
##$TE= 0
##$TE2= 300
##$TE3= 300
##$TEG= 300
##$TL= (0..7)
0 120 120 120 120 120 120 120 
##$TP= (0..7)
150 150 150 150 150 150 150 150 
##$TP07= 0
##$TPNAME0= <>
##$TPNAME1= <>
##$TPNAME2= <>
##$TPNAME3= <>
##$TPNAME4= <>
##$TPNAME5= <>
##$TPNAME6= <>
##$TPNAME7= <>
##$TPOAL= (0..7)
0.5 0.5 0.5 0.5 0.5 0.5 0.5 0.5 
##$TPOFFS= (0..7)
0 0 0 0 0 0 0 0 
##$TUNHIN= 0
##$TUNHOUT= 0
##$TUNXOUT= 0
##$USERA1= <user>
##$USERA2= <user>
##$USERA3= <user>
##$USERA4= <user>
##$USERA5= <user>
##$V9= 5
##$VALIST= <valist>
##$VCLIST= <CCCCCCCCCCCCCCC>
##$VD= 0
##$VDLIST= <DDDDDDDDDDDDDDD>
##$VPLIST= <PPPPPPPPPPPPPPP>
##$VTLIST= <TTTTTTTTTTTTTTT>
##$WBST= 1024
##$WBSW= 4
##$XGAIN= (0..3)
0 0 0 0 
##$XL= 0
##$YL= 0
##$YMAX_a= 362823
##$YMIN_a= -168670
##$ZGOPTNS= <>
##$ZL1= 120
##$ZL2= 120
##$ZL3= 120
##$ZL4= 120
##$ABSF1= 15.98128
##$ABSF2= -0.9913816
##$ABSG= 5
##$ABSL= 3
##$ALPHA= 0
##$AQORDER= 0
##$ASSFAC= 0
##$ASSFACI= 0
##$ASSFACX= 0
##$ASSWID= 0
##$AUNMP= <proc_1d>
##$AZFE= 0.1
##$AZFW= 0.1
##$BCFW= 0
##$BC_mod= 2
##$BYTORDP= 0
##$COROFFS= 0
##$CY= -3
##$DATMOD= 1
##$DC= 0
##$DFILT= <>
##$DTYPP= 0
##$F1P= 0
##$F2P= 0
##$FCOR= 1
##$FTSIZE= 16384
##$FT_mod= 6
##$GAMMA= 0
##$GB= 0
##$INTBC= 1
##$INTSCL= 2.992141e-10
##$ISEN= 128
##$LB= 0.24
##$LEV0= 0
##$LPBIN= 0
##$MAXI= 10000
##$MC2= 0
##$MEAN= 0
##$ME_mod= 0
##$MI= 1.114404
##$NCOEF= 0
##$NC_proc= -8
##$NLEV= 6
##$NOISF1= 3.799351
##$NOISF2= 2.8
##$NSP= 0
##$NTH_PI= 0
##$NZP= 0
##$OFFSET= 15.98128
##$PC= 1
##$PHC0= -10763.59
##$PHC1= 12.60095
##$PH_mod= 1
##$PKNL= yes
##$PPARMOD= 0
##$PSCAL= 0
##$PSIGN= 0
##$REVERSE= no
##$SF= 200.130006672307
##$SI= 16384
##$SIGF1= 3
##$SIGF2= 2
##$SINO= 5.538805
##$SIOLD= 16384
##$SREGLST= <1H.CDCl3>
##$SSB= 0
##$STSI= 16384
##$STSR= 0
##$SW_p= 3396.73913043478
##$SYMM= 0
##$S_DEV= 0
##$TDeff= 16384
##$TDoff= 0
##$TI= <>
##$TILT= no
##$TM1= 0
##$TM2= 0
##$TOPLEV= 0
##$USERP1= <user>
##$USERP2= <user>
##$USERP3= <user>
##$USERP4= <user>
##$USERP5= <user>
##$WDW= 1
##$XDIM= 16384
##$YMAX_p= 385489864
##$YMIN_p= -1269053
$$ End of Bruker specific parameters
$$ ---------------------------------
##NTUPLES= NMR SPECTRUM
##VAR_NAME=  FREQUENCY,     SPECTRUM/REAL,   SPECTRUM/IMAG
##SYMBOL=    X,             R,               I
##VAR_TYPE=  INDEPENDENT,   DEPENDENT,       DEPENDENT
##VAR_FORM=  AFFN,          ASDF,            ASDF
##VAR_DIM=   16384,         16384,           16384
##UNITS=     HZ,            ARBITRARY UNITS, ARBITRARY UNITS
##FACTOR=    0.207333158178281, 1,           1
##FIRST=     3198.33373844315, 0,            0
##LAST=      -198.40539199163, 0,            0
##MIN=       -198.40539199163, -1269053,     0
##MAX=       3198.33373844315, 385489864,    0
$$ Real data points
##PAGE= N=1
##DATA TABLE= (X++(R..R)), XYDATA
$$ [...]
6403A0595035L56228J33011L57503J89899k62337k3866m96751r25495j01639n5192
$$ 10595035 10951263 11084274 11441777 11631676 11369339 11345473 10848722 9923227 9821588 9766396
6393I766396o4667j8026k67062Q3788p3910j71785l2662j36817N7367j74740k97586
$$ 9766396 9701729 9683703 9416641 9500429 9426519 9254734 9222072 9085255 9142622 8967882 8670296
6382H670296L13302l13359l30058l05256k09359K02530m08356k23249K95128M20029
$$ 8670296 8983598 8670239 8340181 8034925 7825566 8028096 7619740 7396491 7691619 8111648
6372H111648k49887K64595M31156p21654o00001M79639N61488J62804J67509j6906
$$ 8111648 7861761 8126356 8557512 7835858 7235857 7715496 8276984 8439788 8607297 8590391
6362H590391k69037j28430M02175Q8877n02264l71854j96959K71053k11167k01386
$$ 8590391 8321354 8192924 8595099 8683976 8181712 7809858 7612899 7883952 7672785 7471399
6352G471399L2615n88990K48087J45077K73651J9798k14548K15534J38653J70261
$$ 7471399 7504014 6915024 7163111 7308188 7581839 7601637 7387089 7602623 7741276 7911537
6342G911537K84852K60491j71192l14279R3003M27417m28973k62602N73275r4596
$$ 7911537 8196389 8456880 8285688 7971409 8064412 8491829 8062856 7800254 8373529 8278933
6332H278933j41668k69748j98664J0489p52464m76133M41612N9089L58758M61992
$$ 8278933 8137265 7867517 7668853 7679342 6926878 6450745 6892357 6951446 7310204 7772196
6322G772196o3487p74269k54318J09351N99075Q1161o45021p5898j35778k00093
$$ 7772196 7708709 6934440 6680122 6789473 7388548 7469709 6824688 6748790 6613012 6412919
6312F412919L70908J12710N3252M1422k33070q7813J7343J29651m46411j58729
$$ 6412919 6783827 6896537 6949789 6991211 6758141 6670328 6687671 6817322 6370911 6212182
6302F212182O20351K18099Q6932k38136k71300O9145l5907k1538L29095k84772
$$ 6212182 6832533 7050632 7137564 6899428 6628128 6697273 6661366 6639828 6968923 6684151
6292F684151q4016j35134r8155Q9480J27440J91370m94582j12388K78628j59309
$$ 6684151 6600135 6465001 6366846 6456326 6583766 6775136 6280554 6168166 6446794 6287485
6282F287485L69617K90779K6130m30702K64473M3741L1353K12461m44389j08487
$$ 6287485 6657102 6947881 6974011 6543309 6807782 6851523 6882876 7095337 6650948 6542461
6272F542461L88785K04199J07247k78614n76925o4116K52813M34771q4125k61292
$$ 6542461 6931246 7135445 7242692 6964078 6387153 6323037 6575850 7010621 6926496 6665204
6262F665204M83077K75873m73103j5422P05485k00709j057319J39961N77990J58135
$$ 6665204 7148281 7424154 6951051 6935629 7641114 7440405 6383086 6523047 7101037 7259172
6252G259172J84159M04957m1465l76320n04489J48292L03750j75130J15750P80366
$$ 7259172 7443331 7848288 7806823 7430503 6926014 7074306 7378056 7202926 7318676 8099042
6242H099042l60112m06629P5017L50922O3597k16866j16805N86536M15051k21705
$$ 8099042 7738930 7332301 7407318 7758240 7821837 7604971 7488166 8074702 8489753 8268048
6232H268048j99070j14623J85505J62956K17050o33712J35997J3139l83140Q29888
$$ 8268048 8068978 7954355 8139860 8302816 8519866 7886154 8022151 8035290 7652150 8482038
6222H482038M00791k52279l82718R1963l62R2784k63661J38280K6302R4321L87698
$$ 8482038 8882829 8630550 8247832 8339795 8339433 8432217 8168556 8306836 8333138 8427459 8815157
6211H815157K66177l20952o15222K42638P53659J03394J29266M66721k91315j70423
$$ 8815157 9081334 8760382 8145160 8387798 9141457 9244851 9374117 9840838 9549523 9379100
6201I379100K08118L77741K64058l69114j83138M56896L58324k70925K42616k04162
$$ 9379100 9587218 9964959 10229017 9859903 9676765 10133661 10491985 10221060 10463676 10259514
6191A0259514o06805P69826N74587l00982r504K46073J66729K15825n9067M93339
$$ 10259514 9652709 10422535 10997122 10696140 10686636 10932709 11099438 11315263 11256196 11749535
6181A1749535M98216l56135J51345J67028l68629j2976O19038M97091P2014j56902
$$ 11749535 12247751 11891616 12042961 12209989 11841360 11828384 12447422 12944513 13016527 12859625
6171A2859625k85552J76151k67502j45855J27823j20394l08694k05974R32906
$$ 12859625 12574073 12750224 12482722 12336867 12464690 12344296 12035602 11829628 12762534
6162A2762534M42836j74915J62652J0366O0710j84930k77807P5828K55140m64357
$$ 12762534 13205370 13030455 13193107 13203473 13264183 13079253 12801446 12877274 13132414 12668057
6152A2668057J71048J16820R2468p4681j98559q3544L53978J84299l25152J51985
$$ 12668057 12839105 12955925 13048393 12973712 12775153 12691609 13045587 13229886 12904734 13056719
6142A3056719M5462l55374K99816R5559p3227J48442k00616j73798j45578j35942
$$ 13056719 13102181 12746807 13046623 13142182 13068955 13217397 13016781 12842983 12697405 12561463
6132A2561463l76426K9795j72808j38686p3342j85237R4194P1544j26430j35480
$$ 12561463 12185037 12214832 12042024 11903338 11829996 11644759 11738953 11810497 11684067 11548587
6122A1548587J94148M43215l01372n23767q3270j6608p8029L19459K26416L79141
$$ 11548587 11742735 12185950 11884578 11360811 11277541 11260933 11182904 11502363 11728779 12107920
6112A2107920o57439j46589L51090K40954K4095J50895L61281K29211L83988J8437
$$ 12107920 11450481 11303892 11654982 11895936 11920031 12070926 12432207 12661418 13045406 13063843
6102A3063843l06848J03481k08659l39266Q74792J46079j96202L57946N74995
$$ 13063843 12756995 12860476 12651817 12312551 13187343 13333422 13137220 13495166 14070161
6093A4070161j60044k29897j91344N48581k466j24888L82776Q80299j74320m34885
$$ 14070161 13910117 13680220 13488876 14037457 14034991 13910103 14292879 15173178 14998858 14563973
6083A4563973Q95177O60964k87435m94095O26859J050169O23223J80766O80533
$$ 14563973 15459150 16120114 15832679 15338584 15965443 17015612 17638835 17819601 18500134
6074A8500134P91605K51085J001050J253269K09872N41298J906494J386838J235191
$$ 18500134 19291739 19542824 20543874 21797143 22007015 22548313 24454807 25841645 27076836
6065B7076836J483678O20694J70575M46352M30051M75712N66551Q60081J252569
$$ 27076836 28560514 29181208 29351783 29798135 30228186 30703898 31270449 32130530 33383099
6056C3383099R95917J508678K701141J794350J266028L071420M066948L467176
$$ 33383099 34379016 35887694 38588835 40383185 41649213 44720633 48787581 52254757
6048E2254757K155744J848611Q48957j104581k241015k571703k738318l551213
$$ 52254757 54410501 56259112 57108069 56003488 53762473 51190770 48452452 44901239
6040D4901239l731889k672350j577566k029576k069240j524115j531124p38854
$$ 44901239 41169350 38497000 36919434 34889858 32820618 31296503 29765379 29026525
6032B9026525j152205q45422k81386p41921j025493k18497P9269o58047q08625
$$ 29026525 27874320 27028898 26747512 26005591 24980098 24761601 24840870 24182823 23374198
6023B3374198J12144l09239q16842j33135k23293K86039n38750n34249J73267
$$ 23374198 23486342 23177103 22360261 22227126 22003833 22289872 21751122 21216873 21390140
6014B1390140j21201j43109m97375R91K75521m9329q7497r4924Q0367J47848l33909
$$ 21390140 21268939 21125830 20628455 20629446 20904967 20855638 20768141 20673217 20753584 20901432 20567523
6003B0567523k57105Q6731K41036J776q9214N8870J36356k0050K79405N22204
$$ 20567523 20310418 20397149 20638185 20639961 20550747 20609617 20745973 20725923 21005328 21527532
5993B1527532n51257p93653j40447L36590J51080L40150L36902k73595Q3578O20099
$$ 21527532 20976275 20182622 20042175 20378765 20529845 20869995 21206897 20933302 21016880 21636979
5983B1636979O84153j5816J19684j23142r9825L62737j408K3921Q86293L05519
$$ 21636979 22321132 22305316 22425000 22301858 22202033 22564770 22563362 22587283 23473576 23779095
5973B3779095L46985J62236j83299N51762k09750K8207K91371L97262P4244j9490
$$ 23779095 24126080 24288316 24105017 24656779 24447029 24475236 24766607 25163869 25238113 25218623
5963B5218623L74698Q86650J62458L91422N50381N08728L89772L73328J024031
$$ 25218623 25593321 26479971 26642429 27033851 27584232 28092960 28482732 28856060 29880091
5954B9880091R92225M56515M36218R43513Q15912P18698N68282R22581N60570
$$ 29880091 30872316 31328831 31765049 32708562 33524474 34243172 34811454 35734035 36294605
5945C6294605P18229O60941O21453K44827J84392k88439k65446j53978M39590
$$ 36294605 37012834 37673775 38295228 38540055 38724447 38436008 38170562 38016584 38456174
5936C8456174M82297J88060L47822L79521q1661L29011L83105L63024O91034L79178
$$ 38456174 38938471 39126531 39474353 39853874 39772213 40101224 40484329 40847353 41538387 41917565
5926D1917565Q30313R88401K46107k7059m85390r00001o36536l98022k91365q61752
$$ 41917565 42747878 43736279 43982386 43955327 43469937 42569936 41933400 41535378 41244013 40382261
5916D0382261o52572m712k10986j048651j265491j174502m69588J14994o11498
$$ 40382261 39729689 39724977 39513991 38465340 37199849 36025347 35555759 35670753 35059255
5907C5059255p84644l94564o42851m53484j41320O16091m06640q90296o50061
$$ 35059255 34274611 33880047 33237196 32783712 32642392 33258483 32851843 31961547 31311486
5898C1311486j7714j16157l7075K74271l35196j83319J05610N90984N20521k36755
$$ 31311486 31293772 31177615 31140540 31414811 31079615 30896296 31001906 31592890 32113411 31876656
5888C1876656N3197O78310N46506q5516J78308O38228L38524L73708J274515N27918
$$ 31876656 31929853 32608163 33154669 33069153 33247461 33885689 34224213 34597921 35872436 36400354
5878C6400354P5791P46969R26693J050199J009639M39439M69163N79180K18207
$$ 36400354 36476145 37223114 38149807 39200006 40209645 40649084 41118247 41697427 41915634
5869D1915634J253881O86022L58127m72885r09984o88980j207146j263681j144209
$$ 41915634 43169515 43855537 44213664 43740779 42830795 42141815 40934669 39670988 38526779
5860C8526779j362224n95043p54058j602126j240928j235959n61859q20193j066231
$$ 38526779 37164555 36569512 35815454 34213328 32972400 31736441 31174582 30354389 29288158
5851B9288158l75296n18458r47974j86579n32971j097408m73547k83375l50174
$$ 29288158 28912862 28394404 27446430 27259851 26726880 25629472 25155925 24872550 24522376
5842B4522376l09807l89470j22270p23507M46972M84209j4894k39665o64022m41364
$$ 24522376 24212569 23823099 23700829 22977322 23424294 23908503 23893609 23653944 22989922 22548558
5832B2548558k03755k47766j2989k60441o49485J38100k68137q01738l00975l07743
$$ 22548558 22344803 22097037 22084048 21823607 21174122 21312222 21044085 20242347 19941372 19633629
5822A9633629o75025m83304j81279o3638k67657q27663k88871J48141J29795k96953
$$ 19633629 18958604 18475300 18294021 18230383 17962726 17135063 16846192 16994333 17124128 16827175
5812A6827175o62340k40616K4634J82630k0141j26423k2967m86586j64731M39505
$$ 16827175 16164835 15924219 15948853 16131483 16111342 15984919 15961952 15475366 15310635 15750140
5802A5750140l64310J19036m37375k04640k1707j16538j00796j97426R1107j81933
$$ 15750140 15385830 15504866 15067491 14862851 14841144 14724606 14623810 14426384 14517491 14335558
5792A4335558j11678R7863l5761k73156K02766J52367j38951L64769L28037o96021
$$ 14335558 14223880 14321743 14285982 14012826 14215592 14367959 14229008 14593777 14921814 14225793
5782A4225793l42603K62400l51622K53468k35646K91801m1687m77599L7645k1698
$$ 14225793 13883190 14145590 13793968 14047436 13811790 14103591 14061904 13584305 13621950 13600252
5772A3600252m26119k99998j45311j40091k78729q3261j4562l23980j04190o7625
$$ 13600252 13174133 12874135 12728824 12588733 12310004 12226743 12212181 11888201 11784011 11716386
5762A1716386j47613L04200k41632k3457P6210k56500l10852o427K57710l56193
$$ 11716386 11568773 11872973 11631341 11607884 11684094 11427594 11116742 11110315 11368025 11011832
5752A1011832K4114l24113K5243R4227l38318R0401o63009p39055Q4489N91232
$$ 11011832 11035946 10711833 10737076 10831303 10492985 10583386 9920377 9181322 9265811 9857043
5742I857043J94153k147m28384k97532l23711J95875K81344j50054n57808n48978
$$ 9857043 10051196 10049049 9620665 9323133 8999422 9195297 9476641 9326587 8768779 8219801
5732H219801J082188P33340l99164m74943J08125O56M89036l89149l64839n35398
$$ 8219801 9301989 10035329 9636165 9161222 9269347 9270003 9759039 9369890 9005051 8469653
5722H469653l35057K07635K81704K10965l50447r4545O66327J23575j47872l38842
$$ 8469653 8134596 8342231 8623935 8834900 8484453 8389908 9056235 9179810 9031938 8693096
5712H693096m73245J0446K45239K18745L3442j85964J1948K13560Q8427j47331
$$ 8693096 8219851 8230297 8475536 8694281 8727723 8541759 8553707 8767267 8855694 8708363
5702H708363k50912l53201k27969N40065L22443l95516J47323L8956j16206L34785
$$ 8708363 8457451 8104250 7876281 8416346 8738789 8343273 8490596 8529552 8413346 8748131
5692H748131j47213k43301j62199O8550j66769L19952M07505m39182k87961N7226
$$ 8748131 8600918 8357617 8195418 8263968 8097199 8417151 8824656 8385474 8097513 8154739
5682H154739j47810J84111Q9221k58584L66734N258k82980N73834n51216o47235
$$ 8154739 8006929 8191040 8280261 8021677 8388411 8393669 8110689 8684523 8133307 7486072
5672G486072N74321L08487N67134o59377k64011L96975J27021j2925P09584R8689
$$ 7486072 8060393 8368880 8936014 8276637 8012626 8409601 8536622 8523697 9233281 9331970
5662I331970m79106k75821M42840J59797m22174N61542j18960o34956j43772K38911
$$ 9331970 8852864 8577043 9019883 9179680 8757506 9319048 9200088 8565132 8421360 8660271
5652H660271K10972k66273k7842N84672j60737q05703L95818J08027m24374P8114
$$ 8660271 8871243 8604970 8577128 9161800 9001063 8195360 8591178 8699205 8274831 8352945
5642H352945K07585M05065l45474q7140O82447K54580k89424k91985k82183K71285
$$ 8352945 8560530 8965595 8620121 8532981 9215428 9470008 9180584 8888599 8606416 8877701
5632H877701p9637r5439K41371l9097q6336K08018K56473K72359k18788l02972
$$ 8877701 8798064 8702625 8943996 8904899 8818563 9026581 9283054 9555413 9336625 9033653
5622I033653j01105J00060l2057Q730k72797j25349K83538K72377o1669J8572
$$ 9033653 8932548 9032608 9000551 9009281 8736484 8611135 8894673 9167050 9105381 9123953
5612I123953l76629J6938O18823J12244K45979J3508J2953j40659m27113L95233
$$ 9123953 8747324 8764262 9383085 9495329 9741308 9754816 9767769 9627110 9199997 9595230
5602I595230L5273l4871J05889K34833M63036r0686J33281j8442k56758M44399
$$ 9595230 9630503 9595632 9701521 9936354 10399390 10308704 10441985 10423543 10166785 10611184
5592A0611184P14132l45898l95733m8237O9064O35754j6578K69982O4741n89696
$$ 10611184 11325316 10979418 10583685 10535448 10604512 11240266 11223688 11493670 11558411 10968715
5582A0968715M82477j65474M71104J54474l89850L36595j11592j40120J61291
$$ 10968715 11451192 11285718 11756822 11911296 11521446 11858041 11746449 11606329 11767620
5573A1767620K44478J97707j73154K30585N96674j67571J30851J52676j52253
$$ 11767620 12012098 12209805 12036651 12267236 12863910 12696339 12827190 12979866 12827613
5564A2827613L53595j38400j7454K31810M8042J83822L53370L53978r9180n04289
$$ 12827613 13181208 13042808 13025354 13257164 13305206 13489028 13842398 14196376 14097196 13592907
5554A3592907L02662M73911n21924k36548L58864N89251k77109J57283l216r655
$$ 13592907 13895569 14369480 13847556 13611008 13969872 14559123 14282014 14439297 14436081 14426426
5544A4426426l80904l857K74699k1388j20944J89947M1857p327M6578J23451L46842
$$ 14426426 14045522 14041665 14316364 14294976 14174032 14363979 14405836 14398509 14445087 14568538 14915380
5533A4915380Q935J01213L17666j86646o8938L5617M22172M17201J40345k61977
$$ 14915380 14924315 15025528 15343194 15156548 15087610 15123227 15545399 15962600 16102945 15840968
5523A5840968o05856L76526J3647L45773M39128J81548j3987M33591K36079N8460
$$ 15840968 15235112 15611638 15625285 15971058 16410186 16591734 16577747 17011338 17247417 17305877
5513A7305877K61256m3354J62439J63632J17884O16027Q5863m28582M13478P69595
$$ 17305877 17567133 17523779 17686218 17849850 17967734 18583761 18669624 18241042 18654520 19424115
5503A9424115K07765Q9461L0584J74269R1772o1596M38135J079199p1600J64564
$$ 19424115 19631880 19721341 19751925 19926194 20017966 19956370 20394505 21473704 21402104 21566668
5493B1566668R79953J89579M64242P85278J02466K33013J23531N25787N62060
$$ 21566668 22546621 22736200 23200442 23985720 24088186 24321199 24444730 24970517 25532577
5484B5532577j22132Q0615O21128M20030P63055Q07430N58380m7728L38215N24174
$$ 25532577 25410445 25491060 26112188 26532218 27295273 28102703 28661083 28613355 28951570 29475744
5474B9475744K54722P97251Q61017N46214L46544J321709Q28661K97131J089511
$$ 29475744 29730466 30527717 31388734 31934948 32281492 33603201 34431862 34728993 35818504
5465C5818504J306047N44899M78992Q69770R97047k53325m10628J127825P07771
$$ 35818504 37124551 37669450 38148442 39018212 40015259 39761934 39351306 40479131 41186902
5456D1186902N01437P03247P39664K67056j16850N83492M94881J76698J026579
$$ 41186902 41688339 42391586 43131250 43398306 43281456 43864948 44359829 44536527 45563106
5447D5563106Q18917Q65936P88532N97132P58377j31453r86075q71074m77122
$$ 45563106 46382023 47247959 48036491 48633623 49392000 49260547 48274472 47403398 46926276
5438D6926276r42477j536680j579831r30605j826628j883660j205137q54249p72011
$$ 46926276 45983799 44447119 42867288 41936683 40110055 38226395 37021258 36167009 35394998
5429C5394998j110394o74053n83726l8246Q9389l40727r02991P4993K2887k30087
$$ 35394998 34284604 33610551 33026825 32988579 33077968 32737241 31834250 31909243 31932130 31702043
5419C1702043n0570L1523n1337O5142p8144m99180k5214m63118p4179K66992n66117
$$ 31702043 31651473 31682996 31631659 31696801 31618657 31119477 31094263 30631145 30556966 30823958 30257841
5408C0257841o02743k66338n46428k86643q82196k89105m33953o76765n05376
$$ 30257841 29655098 29388760 28842332 28555689 27673493 27384388 26950435 26273670 25768294
5399B5768294j15797J16255m48534q93605j77360m24926p06529j77946m5683R0167
$$ 25768294 25652497 25768752 25320218 24426613 24249253 23824327 23117798 22939852 22894169 22984336
5389B2984336k33353m39782R9817J46303k51947k80389J0264j21490N6358K9952
$$ 22984336 22750983 22311201 22411018 22557321 22305374 22024985 22035249 21913759 21970117 22000069
5379B2000069R7032l35859l11384N0408J17618M09947l71624m66291K29231J48173
$$ 22000069 22097101 21761242 21449858 21500266 21617884 22027831 21656207 21189916 21419147 21567320
5369B1567320p08785l33198K62099l08247n4521o92501O24080J29899q13382K93036
$$ 21567320 20858535 20525337 20787436 20479189 20424668 19732167 20356247 20486146 19672764 19965800
5359A9965800J53395l6763J78742l50328q7888J71544L10380L24679n950K96925
$$ 19965800 20119195 20082432 20261174 19910846 19822958 19994502 20304882 20629561 20623611 20920536
5349B0920536n24575J83923M78455n95660K28209N99190o20122R5742m3082l46612
$$ 20920536 20395961 20579884 21058339 20462679 20690888 21290078 20669956 20765698 20722616 20376004
5339B0376004P4170l41973m10364R3364k421L591J20118J81391n6776j64271K30980
$$ 20376004 20450174 20108201 19697837 19791201 19788780 19792371 19912489 20093880 20037104 19872833 20103813
5328B0103813J35307K77558j35042k88150L42717J42793p3394m37698M34238M27433
$$ 20103813 20239120 20516678 20381636 20093486 20436203 20578996 20505602 20067904 20502142 20929575
5318B0929575J13879m14624J53430J74231l97255k14282K28693K1827j46433K91577
$$ 20929575 21043454 20628830 20782260 20956491 20559236 20344954 20573647 20595474 20449041 20740618
5308B0740618J64506j06636n89828P568M72615K77490M58235k45901p9217P2966
$$ 20740618 20905124 20798488 20208660 20216228 20688843 20966333 21424568 21178667 21099450 21172416
5298B1172416J39844Q7425j18171L43980q7047m48178M06669J46083r4709r9479
$$ 21172416 21312260 21399685 21281514 21625494 21538447 21090269 21496938 21643021 21548312 21448833
5288B1448833r3539K23681n9074j36706j4227l02677q7582J34537N39394j13084
$$ 21448833 21355294 21578975 21519901 21383195 21368968 21066291 20978709 21113246 21652640 21539556
5278B1539556j35900j00418P9165L73487p2906J22487k11719k2363L45796L75006
$$ 21539556 21403656 21303238 21382403 21755890 21682984 21805471 21593752 21571389 21917185 22292191
5268B2292191n93328m14539l684K69846J89503j36735M36393j02434p97707K34009
$$ 22292191 21698863 21284324 21280640 21550486 21739989 21603254 22039647 21937213 21139506 21373515
5258B1373515K46059k16568p236n0655p437K48515M74839N54038m39506k81243
$$ 21373515 21619574 21403006 21395770 21345115 21337678 21586193 22061032 22615070 22175564 21894321
5248B1894321l31025j08458K02444l04663L4336K46173k12543K00411J58748j41535
$$ 21894321 21563296 21454838 21657282 21352619 21386955 21633128 21420585 21620996 21779744 21638209
5238B1638209j94798r9134K95352j80429r9638J62770k40889j92320l21041N5725
$$ 21638209 21443411 21344277 21639629 21459200 21359562 21522332 21281443 21089123 20768082 20823807
5228B0823807N3433K90526M42620j92747j60745M46113L34009K913j19249r8354
$$ 20823807 20877240 21167766 21610386 21417639 21256894 21703007 22037016 22039929 21920680 21822326
5218B1822326Q5764r0550J96290M9580j63060L3814j07652L25790l3945K38179
$$ 21822326 21908090 21817540 22013830 22063410 21900350 21934164 21826512 22152302 22118357 22356536
5208B2356536o7796n74761P7222l0528M2286J78914k56291L01689l539P8273Q93011
$$ 22356536 22288740 21713979 21791201 21760673 21802959 21981873 21725582 22027271 22023732 22102005 22995016
5197B2995016J19422l7084q4393O19998K01435j97870l43574j79496j8358j20708
$$ 22995016 23114438 23077354 22992961 23612959 23814394 23616524 23272950 23093454 23075096 22954388
5187B2954388K15884J7241k82999J23697l046R4575K07138J06508l03515k23126
$$ 22954388 23170272 23187513 22904514 23028211 23025165 23119740 23326878 23433386 23129871 22906745
5177B2906745n40048k4791L91442K76855L16788k63790j54691P03833J27085o86137
$$ 22906745 22366697 22341906 22733348 23010203 23326991 23063201 22908510 23612343 23739428 23053291
5167B3053291j37080K11796j67124J00653M08708K09414o67960k79498K50211
$$ 23053291 22916211 23128007 22960883 23061536 23470244 23679658 23011698 22732200 22982411
5158B2982411L43026l57208m3229K65756l12941K08311P30823K49600k51053k85040
$$ 22982411 23325437 22968229 22925000 23190756 22877815 23086126 23816949 24066549 23815496 23530456
5148B3530456P0334J74373N9891L82143j00623k9204n56023O83611P25504n66555
$$ 23530456 23600790 23775163 23835054 24217197 24116574 24087370 23531347 24214958 24940462 24373907
5138B4373907m04790J50523N1097M29473N55135O34805j79419N2567J28382L76418
$$ 24373907 23969117 24119640 24170737 24600210 25155345 25790150 25610731 25663298 25791680 26168098
5128B6168098J38276J55009j77426J79637j19958J52611M84038Q7688R7967k36855
$$ 26168098 26306374 26461383 26283957 26463594 26343636 26496247 26980285 27067973 27165940 26929085
5118B6929085M35320P81156j79705O5809J48227K79349j20443Q7106N61065O7425
$$ 26929085 27364405 28145561 27965856 28031665 28179892 28459241 28338798 28425904 28986969 29054394
5108B9054394k4446L60728J85714L96822Q30355K4815K71900j72017l55519J16480
$$ 29054394 29029948 29390676 29576390 29973212 30803567 30828382 31100282 30928265 30572746 30689226
5098C0689226M82948O56897p6264l60668M33167N50872M40788l32709j16272j20872
$$ 30689226 31172174 31829071 31752807 31392139 31825306 32376178 32816966 32484257 32367985 32247113
5088C2247113k55327P33274Q82795P2187l53637K34815O37036M20581Q42700M50914
$$ 32247113 31991786 32725060 33607855 33680042 33326405 33561220 34198256 34618837 35461537 35912451
5078C5912451M2214K87680J084185J191537O10735p3547N38390P40532J67564
$$ 35912451 35954665 36242345 37326530 38518067 39128802 39055255 39593645 40334177 40501741
5069D0501741R67658R68592m30164m94964O56650Q23731m58496l97324k50513
$$ 40501741 41469399 42437991 42007827 41512863 42169513 42993244 42534748 42137424 41886911
5060D1886911K2786q86029L72776Q94624k70930k02866L23087O44895L05358m7374
$$ 41886911 41909697 41023668 41396444 42291068 42020138 41817272 42140359 42785254 43090612 43043238
5050D3043238J173430K41482N30505O16377O20941Q05607O27406O74297J345883
$$ 43043238 44216668 44458150 44988655 45605032 46225973 47031580 47658986 48333283 49679166
5041D9679166J158685P39865P85385R07254R76372O16983O36052M26107K11321
$$ 49679166 50837851 51577716 52363101 53270355 54246727 54863710 55499762 55925869 56137190
5032E6137190K58217L20281p9541m61608o96955J22241J28118k3340k2783l12885
$$ 56137190 56395407 56715688 56636147 56174539 55477584 55599825 55727943 55704603 55681820 55368935
5022E5368935o10223O90158J51747N62988O74742P62408O59249J083392J600872
$$ 55368935 54758712 55448870 55600617 56163605 56838347 57600755 58260004 59343396 60944268
5013F0944268J823756J775779K028004K705251K525724L136216L354619L311922
$$ 60944268 62768024 64543803 66571807 69277058 71802782 74938998 78293617 81605539
5005H1605539M075700L403517K482218N44812n61123j161716j795460j761814
$$ 81605539 85681239 89084756 91566974 92111786 91550663 90388947 88593487 86831673
4997H6831673k430418k602882j926232j456096o18490j048386j367975q72778
$$ 86831673 84401255 81798373 79872141 78416045 77797555 76749169 75381194 74508416
4989G4508416k20488N68372M17575J412233J631512J378026K348507K988824L417694
$$ 74508416 74287928 74856300 75273875 76686108 78317620 79695646 82044153 85032977 88450671
4980H8450671L725333M104877M919303N705796N883485O966088P256344O988871
$$ 88450671 92176004 96280881 101200184 106905980 112789465 119755553 127011897 134000768
4972A34000768N652703L501804J239134k046397m112274m834347l822196k419028
$$ 134000768 139653471 143155275 144394409 142348012 138235738 133401391 129579195 127160167
4964A27160167j686738j245832k166411l203342m473257m564529l898132l330114
$$ 127160167 125473429 124227597 122061186 118857844 114384587 109820058 105921926 102591812
4956A02591812k922969k149582j357942q91350m02635n4499Q21967J856238J491844
$$ 102591812 99668843 97519261 96161319 95269969 94867334 94812835 95634802 97491040 98982884
4947I8982884J853963K362881L076781K800376K544970M205391M900180N078219
$$ 98982884 100836847 103199728 106276509 109076885 111621855 115827246 120727426 125805645
4939A25805645N756778O568702M965131K441215P1255k427178m805059o990425
$$ 125805645 131562423 138131125 143096256 145537471 145608726 143181548 138376489 131386064
4931A31386064p865134q167746q518296o823334n862503m940706m048428l391426
$$ 131386064 123520930 115353184 106834888 100011554 94149051 89208345 85159917 81768491
4923H1768491k324339k292731j921476j028677o97753n03080L83600Q49805o2360
$$ 81768491 79444152 77151421 75229945 74201268 73503515 73000435 73384035 74233840 74171480
4914G4171480O74280J172443J129063J579022K133118L037071K080111J250866
$$ 74171480 74845760 76018203 77147266 78726288 80859406 83896477 85976588 87227454
4906H7227454L24257j616676l684186m645224l862999l745319l438083k582970
$$ 87227454 87551711 85935035 82250849 77605625 73742626 69997307 66559224 63976254
4898F3976254j838299k022328j681346j611765r33880l89354r82267q27812q18103
$$ 63976254 62137955 60115627 58434281 56822516 55888636 55499282 54517015 53689203 52871100
4889E2871100o20364l02185j37508k0933j45831l27729m64679k6308P9659j90082
$$ 52871100 52250736 51948551 51811043 51790110 51644279 51316550 50851871 50825563 50905222 50715140
4879E0715140j53152L06429k72314L21785j26120k35257K18413j89800o64782
$$ 50715140 50561988 50868417 50596103 50917888 50791768 50556511 50774924 50585124 49920342
4870D9920342n48963j45489n90525j40576j80890l34669m86439l19966J01462
$$ 49920342 49371379 49225890 48635365 48494789 48313899 47979230 47492791 47172825 47274287
4861D7274287j51520j15977J05010p0174L25418N26764j1841K23708j6363l8077
$$ 47274287 47122767 47006790 47111800 47041626 47367044 47893808 47881967 48105675 48089312 48051235
4851D8051235j81147K73407Q75418n0917p3128J244925P90708N30718O69008P02743
$$ 48051235 47870088 48143495 49018913 48967996 48894868 50139793 50930501 51461219 52130227 52832970
4841E2832970j91872j20685L01075j85844J77644J71q5580K41930j06886r45313
$$ 52832970 52641098 52520413 52821488 52635644 52813288 52813459 52727879 52969809 52862923 51917610
4831E1917610n64435l48854m66895l39357p9889k62002j21325j32070K82622l52470
$$ 51917610 51353175 51004321 50537426 50198069 50118180 49856178 49734853 49602783 49885405 49532935
4821D9532935K2819k8268J97739L38934k31517J37059O04397n1448O9787m37747
$$ 49532935 49555754 49527486 49725225 50064159 49832642 49969701 50574098 50522650 50592437 50154690
4811E0154690m55112n50391n26042q98826r78369m40336j004160j152529p45186
$$ 50154690 49699578 49149187 48623145 47724319 46745950 46305614 45301454 44148925 43403739
4802D3403739p22346q26075q55126j098706j026919p37871q67849m77592m54129
$$ 43403739 42681393 41855318 41000192 39901486 38874567 38136696 37268847 36791255 36337126
4793C6337126r52201o16138j063173n93181L80386l94687j039109k20337m59476
$$ 36337126 35384925 34768787 33705614 33112433 33492819 33098132 32059023 31838686 31379210
4784C1379210p00013k23264m49187p19563k91646o48400l92235M49444J46511
$$ 31379210 30679197 30455933 30006746 29287183 28995537 28347137 27954902 28404346 28550857
4775B8550857o55935k46142m67039m71247N7085K9307k06833m28434m92876k864
$$ 28550857 27894922 27648780 27181741 26710494 26767579 26796886 26590053 26161619 25668743 25665879
4765B5665879p5160j063783m70028P9231m66952j0187R1429k24086j13349k9150
$$ 25665879 25590719 24526936 24056908 24136139 23669187 23659000 23750429 23526343 23412994 23383844
4755B3383844k66817M5658j46780o71119l75721K37349n63540o5551Q61901M38239
$$ 23383844 23117027 23162685 23015905 22344786 21969065 22206414 21642874 21577323 22439224 22877463
4745B2877463k64789j24248O61384p6229l0107J88109l35465l41608j38010J95956
$$ 22877463 22612674 22488426 23149810 23073581 23043474 23231583 22896118 22554510 22416500 22612456
4735B2612456L10174l36301m1436l23435l12622J98263K98283r09866o99484o70740
$$ 22612456 22922630 22586329 22544893 22221458 21908836 22107099 22405382 21495516 20796032 20125292
4725B0125292r2403M55805K27022k67038M986l00722p07525K92717O9548m01224
$$ 20125292 20032889 20488694 20715716 20448678 20453664 20152942 19445417 19738134 19807682 19406458
4715A9406458J5281P93183j68772n34002L4994P2030p273j96l04300L46467j77965
$$ 19406458 19421739 20214922 20046150 19512148 19547142 19619172 19611899 19611703 19307403 19653870 19475905
4704A9475905j62490N32111R1283k76156k21031K88773M0873l7303J70236L082
$$ 19475905 19313415 19845526 19936809 19660653 19439622 19728395 19769268 19731965 19902201 19905283
4694A9905283j54419L08274m02681j33387J58292n51720J45943K70081K57208
$$ 19905283 19750864 20059138 19656457 19523070 19681362 19129642 19275585 19545666 19802874
4685A9802874K65699m76135m88147P48739M82761J83989M08981M20493K93234
$$ 19802874 20068573 19592438 19104291 19853030 20335791 20519780 20928761 21349254 21642488
4676B1642488R1207L29940N86428n23179l51926O5088O23337l5982n13508M15567
$$ 21642488 21733695 22063635 22650063 22126884 21774958 21840046 22463383 22427401 21913893 22329460
4666B2329460k66200r2552J64163n4436k71756m04509K1550J78321Q1472J74045
$$ 22329460 22063260 21970708 22134871 22080435 21808679 21404170 21425720 21604041 21685513 21859558
4656B1859558l254K02204J99894j42117k1884l22750J55566O64217K26496M92690
$$ 21859558 21856304 22058508 22258402 22116285 22094401 21771651 21927217 22591434 22817930 23310620
4646B3310620K00116l3107n11602o9018N13601J03783K33150l14270j47453K14097
$$ 23310620 23510736 23477629 22966027 22897009 23410610 23514393 23747543 23433273 23285820 23499917
4636B3499917J62617p0684R3152r5104j95125M48420M85321J38584J74385L12666
$$ 23499917 23662534 23591850 23685002 23589898 23394773 23843193 24328514 24467098 24641483 24954149
4626B4954149K80412K92238J95879K44377j66950K14319M04314K43823P34579
$$ 24954149 25234561 25526799 25722678 25967055 25800105 26014424 26418738 26662561 27397140
4617B7397140l67660m38416K99247M42172k177j76883m6927p5173L91315P33359
$$ 27397140 27029480 26591064 26890311 27332483 27330306 27153423 27106496 27031323 27422638 28155997
4607B8155997L20038o53010j57541J15047P8975M34878J56784j91084N70339K08774
$$ 28155997 28476035 27823025 27665484 27780531 27859506 28294384 28451168 28260084 28830423 29039197
4597B9039197k53185m0794k11506N71849L85557j5048K81090R6232j00965n3385
$$ 29039197 28786012 28745218 28533712 29105561 29491118 29476070 29757160 29853392 29752427 29699042
4587B9699042N1358K40494l74189L35113M13776K78745J24667k09334L58349K18559
$$ 29699042 29750400 29990894 29616705 29951818 30365594 30644339 30769006 30559672 30918021 31136580
4577C1136580k56861K0399P53126Q9317k00888O12475M65914j69369r9393k20773
$$ 31136580 30879719 30900118 31653244 31742561 31541673 32154148 32620062 32450693 32351300 32130527
4567C2130527j43600P4430J56410N6296J06169j50732M74303P26083O30291N28515
$$ 32130527 31986927 32061357 32217767 32274063 32380232 32229500 32703803 33429886 34060177 34588692
4557C4588692M94034O5157N98328Q13502J2055j12586O32956K73809K73892O52926
$$ 34588692 35082726 35147883 35746211 36559713 36571768 36459182 37092138 37365947 37639839 38292765
4547C8292765Q91089N7023r31409m42756n37869n8115l31916m56529n09284p23760
$$ 38292765 39183854 39240877 38309468 37866712 37328843 37270728 36938812 36482283 35972999 35249239
4537C5249239J7250J21728p41000k81603M09240k81539L33707N73102M91809L09702
$$ 35249239 35266489 35388217 34647217 34365614 34774854 34493315 34827022 35400124 35891933 36201635
4527C6201635k47648O58897N72273K91078N64499O24678L57062M52367J160839
$$ 36201635 35953987 36612884 37185157 37476235 38040734 38665412 39022474 39474841 40635680
4518D0635680J344819P78588J254911J831280J504897J250481K90490l64306j364453
$$ 40635680 41980499 42759087 44013998 45845278 47350175 48600656 48891146 48526840 47162387
4509D7162387j547291q63106k11980J09821N1352K4510R05860J30867J86731J170387
$$ 47162387 45615096 44751990 44540010 44649831 44701183 44725693 45631553 45762420 45949151 47119538
4499D7119538N72222J63394K24462L10276O67995Q13582R61942Q70006P69275
$$ 47119538 47691760 47855154 48079616 48389892 49057887 49871469 50833411 51703417 52472692
4490E2472692J094966R08076J426944J013366R05463J271184J481988K047929
$$ 52472692 53567658 54475734 55902678 56916044 57821507 59092691 60574679 62622608
4482F2622608K109948K528206L273882K464476J534953N60728P61224P22988J074436
$$ 62622608 64732556 67260762 70534644 72999120 74534073 75094801 75856025 76579013 77653449
4473G7653449J743618J796682K397317L343718K910016K307346K737149M106883
$$ 77653449 79397067 81193749 83591066 86934784 89844800 92152146 94889295 98996178
4465I8996178M018595L969988L818059M047891L886746M089955M948545M880329
$$ 98996178 103014773 106984761 110802820 114850711 118737457 122827412 127775957 132656286
4457A32656286M005064M533091M514645M576405N448955M563447N016417N201340
$$ 132656286 136661350 141194441 145709086 150285491 155734446 160297893 165314310 170515650
4449A70515650M341278M150969L787116K110468n70715l038439m197038n492814
$$ 170515650 174856928 179007897 182795013 184905481 184334766 181296327 177099289 171606475
4441A71606475o020079n880465n912635o637954o997820o690802n947711o432901
$$ 171606475 165586396 159705931 153793296 147155342 140157522 133466720 127519009 121086108
4433A21086108o188536n656619n215972n210080m676779l706234l819041m227688
$$ 121086108 114897572 109240953 104024981 98814901 94138122 90431888 86612847 82385159
4425H2385159l074449k213899k353543k211760k252129k131968k562243k478787
$$ 82385159 79310710 77096811 74743268 72531508 70279379 68147411 65585168 63106381
4417F3106381j106881j352133j782534j499138j402282j284770j138777l05688
$$ 63106381 61999500 60647367 58864833 57365695 55963413 54678643 53539866 53234178
4409E3234178p46199j609285j084031l81596q91070p02029p35067k45993j041116
$$ 53234178 52487979 50878694 49794663 49413067 48521997 47819968 47084901 46838908 45797792
4400D5797792m24886j39167n79217n58415q50082k46443n98969m99085O6047J92477
$$ 45797792 45372906 45233739 44654522 44096107 43246025 42999582 42400613 41901528 41967575 42160052
4390D2160052p53265n36337j11355o45446l07994M7459p24132n23448J50498L6041
$$ 42160052 41406787 40870450 40759095 40113649 39805655 39853114 39128982 38605534 38756032 38792073
4380C8792073M02054o07431m16084J60473m55952J73054l43565q1740k58628m54745
$$ 38792073 39194127 38586696 38170612 38331085 37875133 38048187 37704622 37622882 37364254 36909509
4370C6909509N21193j43551n13738k55801n40480m6998n09397n79001l06535k91635
$$ 36909509 37430702 37287151 36773413 36517612 35977132 35930134 35420737 34841736 34535201 34243566
4360C4243566j87318k11812k11000k69984o29107n20062k93735o14203l11282
$$ 34243566 34056248 33844436 33633436 33363452 32734345 32214283 31920548 31306345 30995063
4351C0995063l67033o3580j13830n34196J61700L22909m95561K4872J43272J4997
$$ 30995063 30628030 30564450 30450620 29916424 30078124 30401033 29905472 29930344 30073616 30088613
4341C0088613q4494j28424J05879m29882k34154P5503R8114j91916K46122K37241
$$ 30088613 30004119 29875695 29981574 29551692 29317538 29393041 29491155 29299239 29545361 29782602
4331B9782602m15276j41370o2354l0234o622j40699J61270O9738l47284K22235
$$ 29782602 29367326 29225956 29163602 29133368 29126746 28986047 29147317 29217055 28869771 29092006
4321B9092006M71658j49949p81263J36360M20139r20222m1209K18868p8906o07626
$$ 29092006 29563664 29413715 28632452 28768812 29188951 28268729 28227520 28446388 28367482 27759856
4311B7759856k56483j07465m76695K6447j07170k91304l77710l84973N59123M82620
$$ 27759856 27503373 27395908 26919213 26945660 26838490 26547186 26169476 25784503 26343626 26826246
4301B6826246k29810l57713l13226k91214J55397j74759j12110K9274n5366l82799
$$ 26826246 26596436 26238723 25925497 25634283 25789680 25614921 25502811 25532085 25476719 25093920
4291B5093920j03178p0940q08108J02974K60179q7100l32170l34538j93210K09158
$$ 25093920 24990742 24919802 24111694 24214668 24474847 24387747 24055577 23721039 23527829 23736987
4281B3736987l97969r5146j19198J24253m95246J55679r172Q9741j06935j05587
$$ 23736987 23339018 23243872 23124674 23248927 22753681 22909360 22900188 22989929 22882994 22777407
4271B2777407j6610L33311K61460k1431K95100m32097o8778N33500p2742J08069
$$ 22777407 22760797 23094108 23355568 23334137 23629237 23197140 23128362 23661862 23589120 23697189
4261B3697189L64656R6160n70321k95339M63815j18787l33087M5198O44993N74335
$$ 23697189 24061845 24158005 23587684 23292345 23756160 23637373 23304286 23349484 23994477 24568812
4251B4568812L01381O82642N92251j21105M7552j38833j52903o82495j02362m00089
$$ 24568812 24870193 25552835 26145086 26023981 26071533 25932700 25779797 25097302 24994940 24594851
4241B4594851m14064j34833J20778j74542n75554q6040m5280o87159j21665L62117
$$ 24594851 24180787 24045954 24166732 23992190 23416636 23330596 23285316 22598157 22476492 22838609
4231B2838609J66080L480m25216k85609M59198l53413k2625Q4714k35630j23090
$$ 22838609 23004689 23008169 22582953 22297344 22756542 22403129 22380504 22465218 22229588 22106498
4221B2106498J56080K28294k50598k99388r3240m03768L25739L20749N8382K2822
$$ 22106498 22262578 22490872 22240274 21940886 21847646 21443878 21769617 22090366 22148748 22171570
4211B2171570o4348N95219R901l21886P5763J5485l86572k8956k83884L76009
$$ 22171570 22107222 22702441 22712342 22390456 22466219 22481704 22095132 22066176 21782292 22158301
4201B2158301j32511k99607J1110K49955k30445k11755r3088l46698k78455Q4708
$$ 22158301 22025790 21726183 21737293 21987248 21756803 21545048 21451960 21105262 20826807 20911515
4191B0911515J79550l20695n32851j70770l1407k83557J46397l1678o01457l28922
$$ 20911515 21091065 20770370 20237519 20066749 20035342 19751785 19898182 19866504 19265047 18936125
4181A8936125J28172N78042j56022j22206j57787l63302J04986N9102J9453K49066
$$ 18936125 19064297 19642339 19486317 19364111 19206324 18843022 18948008 19007110 19026563 19275629
4171A9275629m60016m86444L39239l47210N3840K30478k9541Q7330R443m3246
$$ 19275629 18815613 18329169 18668408 18321198 18375038 18605516 18575975 18663305 18672748 18629502
4161A8629502K79258o41593J4036M36404k78839m59177L40475M88465q13720m42918
$$ 18629502 18908760 18267167 18281203 18717607 18438768 17979591 18320066 18808531 17994811 17551893
4151A7551893O19297P8067q9191K55931r1172p7714k57936M14570N46723n18553
$$ 17551893 18171190 18249257 18160066 18415997 18324825 18247111 17989175 18403745 18950468 18431915
4141A8431915k75875O54763j5848l33171K45482p2109n00345n8037O03904N84380
$$ 18431915 18156040 18810803 18794955 18461784 18707266 18635157 18134812 18076775 18680679 19265059
4131A9265059r8998R341O41013j83196K22092L57423m57533l76920m55366P31735
$$ 19265059 19166061 19175402 19816415 19633219 19855311 20212734 19755201 19378281 18922915 19654650
4121A9654650m3757l99171L56879l48465l18204K58370J27155r6935k43814j44551
$$ 19654650 19610893 19211722 19568601 19220136 18901932 19160302 19287457 19190522 18946708 18802157
4111A8802157N57090o9074M7166J57291m14539L12832R6579j28882m2192l27333
$$ 18802157 19359247 19290173 19337339 19494630 19080091 19392923 19489502 19360620 19318428 18991095
4101A8991095K73558N67921p1527k46701J23819q4277j99074K97018J71590R7257
$$ 18991095 19264653 19832574 19761047 19514346 19638165 19553888 19354814 19651832 19823422 19920679
4091A9920679m33721K7615P65957m8860n14941k16608J14181N8443J49145J33146
$$ 19920679 19486958 19514573 20280530 20231670 19716729 19500121 19614302 19672745 19821890 19955036
4081A9955036O3085j73909N5293r1220J67537L6086l17915M79929j32886L69894
$$ 19955036 20018121 19844212 19899505 19808285 19975822 20011908 19693993 20173922 20041036 20410930
4071B0410930P47786k10406L02182M62580P6909M18002k10772J95281O76335j04513
$$ 20410930 21158716 20948310 21250492 21713072 21789981 22207983 21997211 22192492 22868827 22764314
4061B2764314Q4135L12580j84680k71902k0545K18635J39531j84628L98978M53974
$$ 22764314 22848449 23161029 22976349 22704447 22683902 22902537 23042068 22857440 23256418 23710392
4051B3710392L8312L76546o0407n00905n81515j47966J008076N57422m59751k91791
$$ 23710392 23748704 24125250 24064843 23563938 22982423 22834457 23842533 24399955 23940204 23648413
4041B3648413N66792J59836K8354J19488o5165r4172r4252J55733P00732J23409
$$ 23648413 24215205 24375041 24403395 24522883 24457718 24363546 24269294 24425027 25125759 25249168
4031B5249168K17857J73903j33868J36000J68089K60938k73056m09296N87658
$$ 25249168 25467025 25640928 25507060 25643060 25811149 26072087 25799031 25389735 25977393
4022B5977393R4231J63527q5156n13993K90418L17775L81225k00298J62470P24244
$$ 25977393 26071624 26235151 26149995 25636002 25926420 26244195 26625420 26425122 26587592 27311836
4012B7311836J20848j75900L56821O08826K78483j81955K19786P34280j15579
$$ 27311836 27432684 27256784 27613605 28222431 28500914 28318959 28538745 29273025 29157446
4003B9157446p685K30601j23847k60881k19519q2661K40126J37045L37802K77771
$$ 29157446 29149761 29380362 29256515 28995634 28776115 28693454 28933580 29070625 29408427 29686198
3993B9686198l89400N8536J4795K80340L87471M82352m46638K5086M11142L62133
$$ 29686198 29296798 29355334 29370129 29650469 30037940 30520292 30073654 30098740 30509882 30872015
3983C0872015N73441J06582L06436L71491L11739O5209M59564N54417J56756j4685
$$ 30872015 31445456 31552038 31858474 32229965 32541704 32606913 33066477 33620894 33777650 33762965
3973C3762965O85399k38935k37976P67907l49256L76104O5749J11265Q39681K7915
$$ 33762965 34448364 34209429 33971453 34739360 34390104 34766208 34831957 34943222 35782903 35810818
3963C5810818k67257N51545q97N43371M26818N3666K71690K94814P84563N47787
$$ 35810818 35543561 36095106 36094209 36637580 37064398 37118064 37389754 37684568 38469131 39016918
3953C9016918J20205L32569K45993L48450O75569N20976M57157N3193L50788P17208
$$ 39016918 39137123 39469692 39715685 40064135 40739704 41260680 41717837 41771030 42121818 42839026
3943D2839026L30626J29390Q44341L08009K30126L39056P40163M81133L58367
$$ 42839026 43169652 43299042 44143383 44451392 44681518 45020574 45760737 46241870 46600237
3934D6600237R87291Q91204L07193O29937K11676M12638K62929M88299N07016
$$ 46600237 47587528 48478732 48785925 49415862 49627538 50040176 50303105 50791404 51298420
3925E1298420M43207K33910K7540L43605K69839n4953l77221k98805M3418o18360
$$ 51298420 51741627 51975537 52003077 52346682 52616521 52561568 52184347 51885542 51928960 51310600
3915E1310600n19474O91786K53162j93919Q5256m59J59246l37449j48336N41334
$$ 51310600 50791126 51482912 51736074 51542155 51627411 51626952 51786198 51448749 51300413 51841747
3905E1841747K42403J6192J73328M34661j52029k32700L16357Q29557j6279K27067
$$ 51841747 52084150 52100342 52273670 52708331 52556302 52323602 52639959 53469516 53453237 53680304
3895E3680304P8089J76307r9944J57375M75450L62268O531L29376J118002P28234
$$ 53680304 53758393 53934700 53834756 53992131 54467581 54829849 54836380 55165756 56283758 57011992
3885E7011992K54401O2408L3395O6702j76190M19410J68742l70712m63189J4005
$$ 57011992 57266393 57328801 57362196 57428898 57252708 57672118 57840860 57470148 57006959 57020964
3875E7020964P23681O05160K78594L27393j5605J65783J103909O46676K48306
$$ 57020964 57744645 58349805 58628399 58955792 58940187 59105970 60209879 60856555 61104861
3866F1104861L50548M73755P84974Q86172P12349R79811N88850O55743J385564
$$ 61104861 61455409 61929164 62714138 63600310 64312659 65292470 65881320 66537063 67922627
3857F7922627J698055J240459O04338R50414R60963N90888N17952L94513M75740
$$ 67922627 69620682 70861141 71465479 72415893 73376856 73967744 74485696 74880209 75355949
3848G5355949M24001M40624J066732O74427M96343J319666N77187P86745J108942
$$ 75355949 75779950 76220574 77287306 77961733 78458076 79777742 80354929 81141674 82250616
3839H2250616J524629J476487J328454K048573K195054K457125L202745K765141
$$ 82250616 83775245 85251732 86580186 88628759 90823813 93280938 96483683 99248824
3831I9248824L640820L388778L868991M593103M576507N684415O573856P859424
$$ 99248824 102889644 106278422 110147413 114740516 119317023 125001438 131575294 139434718
3823A39434718R551920J2908868J6021066J8723031J4439311J65252j1400128
$$ 139434718 148986638 161895506 177916572 196639603 211078914 211244166 199844038
3816A99844038j1361159q087402n033424l643058k832961j066492m20429r30474
$$ 199844038 188482879 180395477 175362053 171718995 168886034 167819542 167399113 166468639
3808A66468639j417988j082418O7689J089897L036111N135930N245244O266593
$$ 166468639 165050651 163968233 164035922 165125819 168161930 173297860 178543104 184809697
3800A84809697P507123R630919J4629882K1318753K8805977L8864812M4992588
$$ 184809697 192316820 201947739 216577621 237896374 266702351 305567163 350559751
3793C50559751L4930113o957545m3651714m6404312l5300413k4115199j7606349
$$ 350559751 385489864 378532319 334880605 288476293 253175880 229060681 211454332
3786B11454332j4367469j3227966j1920504j0532593q179447n836412m341374
$$ 211454332 197086863 183858897 171938393 161405800 153226353 147389941 143048567
3779A43048567l935987l019147k274005k050561j685559j457278j277963r43141
$$ 143048567 139112580 136093433 133819428 131768867 130083308 128626030 127348067 126404926
3771A26404926r77553p19279p13246k82372n83678p51350J64653Q10934M12403
$$ 126404926 125427373 124708094 123994848 123712476 123128798 122377448 122542101 123353035 123765438
3762A23765438N40823k79789R567M82635M33138J232741K454540K122492K128271
$$ 123765438 124306261 124026472 124036039 124518674 124951812 126184553 128639093 130761585 132889856
3753A32889856K801080K372677K708228L734464L405725M156573N117974M953107
$$ 132889856 135690936 138063613 140771841 144506305 147912030 152068603 157186577 162139684
3745A62139684N565413M335995J545600j547638j976925j382301l62663O58238
$$ 162139684 167705097 172041092 173586692 172039054 170062129 168679828 168317165 168975403
3737A68975403J160473O37549J055236J782041K850993L824501M273009M735598
$$ 168975403 170135876 170773425 171828661 173610702 176461695 180286196 184559205 189294803
3729A89294803N082060N990706P603611Q060235Q022787R325493J0785726J2135405
$$ 189294803 194376863 200367569 207971180 216031415 224054202 233379695 244165421 256300826
3721B56300826J2833962J4400382J5203480J5474094J5463313J4594215J2455022
$$ 256300826 269134788 283535170 298738650 314212744 329676057 344270272 356725294
3714C56725294Q064232K697045l819114r353919j3210116j4695496j5267765j5383388
$$ 356725294 364789526 367486571 363667457 354313538 341103422 326407926 311140161 295756773
3706B95756773j5412765j4602542j2911629j1614296j0287031q836845p441906
$$ 295756773 280344008 265741466 252829837 241215541 230928510 222091665 214649759
3699B14649759o389163n142996l565129l665239l634507l041094k926421k791397
$$ 214649759 208260596 203117600 199552471 195887232 192252725 189211631 186285210 183493813
3691A83493813l340144k628681k358861k443500k804520k785773k018085k255708
$$ 183493813 180153669 177524988 175166127 172722627 169918107 167132334 165114249 162858541
3683A62858541k629572j802974j738697k114051j702952j192629p86128j230268
$$ 162858541 160228969 158425995 156687298 154573247 152870295 151677666 150891538 149661270
3675A49661270j464480j016381r33432q13788p38137r51641j622827j814722j226446
$$ 149661270 148196790 147180409 146246977 145433189 144695052 143743411 142120584 140305862 139079416
3666A39079416o90047q75298j033043l98036j73283p85278n6645r678o24395q94830
$$ 139079416 138389369 137514071 136481028 136082992 135909709 135124431 135067786 135058108 134433713 133538883
3656A33538883l40532l68135l85165j30326o56277l52986j18859o68390l98802
$$ 133538883 133198351 132830216 132445051 132314725 131658448 131305462 131186603 130518213 130119411
3647A30119411n22060j114475q78935j011603m68178k06380m77582k7167k48483
$$ 130119411 129597351 128482876 127603941 126592338 126124160 125917780 125440198 125413031 125164548
3638A25164548R4697N52606l42507M268L76096M1952m87072o18091p14305j494519
$$ 125164548 125259245 125811851 125469344 125473612 125849708 125891660 125404588 124786497 124072192 122577673
3628A22577673j486938j395732j194201j374833j056695m51615j194450l18787
$$ 122577673 121090735 119695003 118500802 117125969 116069274 115617659 114423209 114104422
3620A14104422j39889j32029N42819K52043L54102J425784N31033N39754L57173
$$ 114104422 113964533 113832504 114375323 114627366 114981468 116407252 116938285 117478039 117835212
3611A17835212k59723J64705O00N74830R89968R77248K168648K388258J964815
$$ 117835212 117575489 117740194 117740794 118315624 119305592 120282840 122451488 124839746 126804561
3602A26804561J489569j809408l872292l340500k745293j487283j526479j254421
$$ 126804561 128294130 126484722 122612430 119271930 116526637 115039354 113512875 112258454
3594A12258454j005471r74277o98495j224786m22347l41401l83322j31443N3779
$$ 112258454 111252983 110278706 109580211 108355425 107933078 107591677 107208355 107076912 107130691
3585A07130691M55324M30629K19384M90683J155201J797268J512066L142854L513647
$$ 107130691 107586015 108016644 108236028 108726711 109881912 111679180 113191246 116334100 119847747
3576A19847747L474145M036907M666637N687244O668431P399888R459086J0518533
$$ 119847747 123321892 127358799 132025436 137712680 144381111 151780999 161240085 171758618
3568A71758618J0009081O820958M27936o175102j1997935j2531052j2055378j1550362
$$ 171758618 181767699 188588657 189016593 182841491 170843556 158312504 146257126 134706764
3560A34706764r451214q334272p240654n923423n280446m266082l978728l796553
$$ 134706764 125255550 116921278 109680624 103757201 98476755 94210673 90231945 86435392
3552H6435392k732617l263600l276178j823024j679252j706880j735932j747971
$$ 86435392 83702775 80439175 77162997 75339973 73660721 71953841 70217909 68469938
3544F8469938j356076j471510j270418p29829r54105j463453r68164J61627m00806
$$ 68469938 67113862 65642352 64371934 63642105 62688000 61224547 60256383 60418010 60017204
3535F0017204p52115r07561m50962o24754m21131j82084m00531r01729o94741
$$ 60017204 59265089 58357528 57906566 57281812 56860681 56678597 56278066 55376337 54681596
3526E4681596n4731K84193l14882m78466n39828q03073n91820l79497j50067o10577
$$ 54681596 54626865 54911058 54596176 54117710 53577882 52774809 52182989 51803492 51653425 51042848
3516E1042848j022953k86740K67629M0751J18852k69579L92674j11875O9210L16716
$$ 51042848 50019895 49733155 50000784 50041535 50160387 49890808 50283482 50171607 50240817 50557533
3506E0557533n36320K34625L43946M57093P49529j83508J57503Q19268M48555
$$ 50557533 50021213 50255838 50599784 51056877 51806406 51622898 51780401 52599669 53048224
3497E3048224O42420L14065j74652r7267l89611K98822q7475n64537l35700j40255
$$ 53048224 53690644 54004709 53830057 53732790 53343179 53642001 53554526 52989989 52654289 52514034
3487E2514034J51049O06144K35002L6654K80546R5945L67808J19225m22655m6802
$$ 52514034 52665083 53271227 53506229 53542883 53823429 53919374 54287182 54406407 53983752 53936950
3477E3936950R30020N32756N46576K93305K65752N74303O95545J289764J284556
$$ 53936950 54866970 55399726 55946302 56239607 56505359 57079662 57775207 59064971 60349527
3468F0349527J401401J671407J691160Q97392N80080N12332J069100J501235J371177
$$ 60349527 61750928 63422335 65113495 66010887 66590967 67103299 68172399 69673634 71044811
3459G1044811J872718K649086K292991J836643K989879K804336J967778K615590
$$ 71044811 72917529 75566615 77859606 79696249 82686128 85490464 87458242 90073832
3451I0073832K783012K568861J784008J162672J143189R79331J067631J905809
$$ 90073832 92856844 95425705 97209713 98372385 99515574 100494905 101562536 103468345
3443A03468345K913757L601803L530288M264613N655008N773738O837278Q911917
$$ 103468345 106382102 109983905 113514193 117778806 123433814 129207552 136044830 144956747
3435A44956747R471464J0255671J2172380J4249492J6680361J9083168K1031643
$$ 144956747 154428211 164683882 176856262 191105754 207786115 226869283 247900926
3428B47900926K1510919J8666458J1392603J33107j0591005j6127343j7285320
$$ 247900926 269411845 288078303 299470906 299604013 289013008 272885665 255600345
3421B55600345j5598142j2257281j0001417r032591q699320p278340o026489m837071
$$ 255600345 240002203 227744922 217743505 208710914 200011594 192733254 186706765 181869694
3413A81869694l651302k492369j958999j865139j214153j047286j166061j748749
$$ 181869694 178218392 175726023 173767024 171901885 170687732 169640446 168474385 166725636
3405A66725636j173599j313227j015689n20291r8419M36937L20744L37358R91026
$$ 166725636 165552037 164238810 163223121 162702830 162604411 163041348 163362092 163699450 164690476
3396A64690476J645554R75075N96980J710508J535669J849813K786406K943727
$$ 164690476 166336030 167311105 167908085 169618593 171154262 173004075 175790481 178734208
3388A78734208L336847L356131L917423K769840Q02478r67075k982141m794730
$$ 178734208 182071055 185427186 189344609 192114449 192916927 191949852 188967711 184172981
3380A84172981n022583n977092o352554o332612o606515n676617n799376n290720
$$ 184172981 179150398 173173306 166820752 160488140 153881625 148205008 142405632 137114912
3372A37114912l527189m105820l859071l680437l087390k451004k838356k405321
$$ 137114912 133587723 129481903 125622832 121942395 118855005 116404001 113565645 111160324
3364A11160324j174437j508007j716441r53752j361545j281756k157325k163171
$$ 111160324 109985887 108477880 106761439 105807687 104446142 103164386 101007061 98843890
3356I8843890l082084l118068k985994k592336k334008k144542k211405k190001
$$ 98843890 95761806 92643738 89657744 87065408 84731400 82586858 80375453 78185452
3348G8185452k376582j022538j331450j627605q81766j156774r76812p47644m02990
$$ 78185452 75808870 74786332 73454882 71827277 70945511 69788737 68811925 68064281 67661291
3339F7661291p29151j540942l32123l32520j183200q17826o39154q17775p07531
$$ 67661291 66932140 65391198 65059075 64726555 63543355 62725529 62086375 61268600 60561069
3330F0561069o37176q80672l71903p57843k58846L72844M58750m08357l87499
$$ 60561069 59923893 59043221 58671318 57913475 57654629 58027473 58486223 58077866 57690367
3321E7690367L54500O63862M31207N77163J437131P05289K66881K120133K263951
$$ 57690367 58044867 58708729 59139936 59717099 61154230 61859519 62126400 64246533 66510484
3312F6510484K082437K353760K623394L255485K198627K324182R00313q64330
$$ 66510484 68592921 70946681 73570075 76825560 79024187 81348369 82248682 81384352
3304H1384352j990463j904985j579139j976288j984833k170934k958227k514616
$$ 81384352 79393889 77488904 75909765 73933477 71948644 69777710 66819483 64304867
3296F4304867j979372j632092k318613k767126j486061j204801r06942q15474
$$ 64304867 62325495 60693403 58374790 55607664 54121603 52916802 52009860 51194386
3288E1194386q68629r61617q38479k87483K18370o86187p41793M3010J9417q16526
$$ 51194386 50325757 49364140 48525661 48238178 48456548 47770361 47028568 47071578 47090995 46274469
3278D6274469n44639k50250o54008l30954R3336l08871q93367m38980J27277q6982
$$ 46274469 45729830 45479580 44825572 44494618 44587954 44279083 43385716 42946736 43074013 42987031
3268D2987031o28143k13759M63276n40129n89230j58931L14202p13235j66767
$$ 42987031 42358888 42145129 42608405 42068276 41479046 41320115 41634317 40921082 40754315
3259D0754315M76902J55084j59247m8517N7609k8443j49917M9704M32512o1875
$$ 40754315 41231217 41386301 41227054 41178537 41236146 41207703 41057786 41107490 41540002 41478127
3249D1478127K7926O09285P94820J79864l27336K72761L08553M32327P54893M24662
$$ 41478127 41506053 42115338 42910158 43090022 42762686 43035447 43344000 43776327 44531220 44955882
3239D4955882k50996k63609N15829R6702J42955P16777J01224l63802M12791L51555
$$ 44955882 44704886 44441277 44957106 45053808 45196763 45913540 46014764 45650962 46063753 46415308
3229D6415308L86340J91610n73214j98411o2099j09942N50213k50103o1737K627
$$ 46415308 46801648 46993258 46420044 46221633 46159534 46049592 46599805 46349702 46287965 46290592
3219D6290592j97187K00501K1192p5413M1541j77973n4597Q42224K4045J29928
$$ 46290592 46093405 46293906 46315098 46239685 46281226 46103253 46048656 46890880 46914925 47044853
3209D7044853J76187m4212j90640J38649K14345k44941j20743n9123m5441l47049
$$ 47044853 47221040 47176828 46986188 47124837 47339182 47094241 46973498 46914375 46868934 46521885
3199D6521885q15888J87829l9307L7522k45615j4050L21338j27861K99023K12332
$$ 46521885 45705997 45893826 45854519 45892041 45646426 45632376 45953714 45825853 46124876 46337208
3189D6337208j511j8225n91481K0875O68834k33560m00790J16805N00993k10829
$$ 46337208 46335697 46317472 45725991 45746866 46415700 46182140 45781350 45898155 46399148 46188319
3179D6188319K35115N03826m1837l75940N13572J265302N55198l73935k62798
$$ 46188319 46423434 46927260 46885423 46509483 47023055 48288357 48843555 48469620 48206822
3170D8206822Q51270P36378N43269J039706K7932L70532P14294J191108K87263
$$ 48206822 49058092 49794470 50337739 51377445 51405377 51775909 52490203 53681311 53968574
3161E3968574n88730j072973p60014J45036K78837P2674m74010o49588K50596
$$ 53968574 53379844 52306871 51546857 51691893 51970730 52043404 51569394 50919806 51170402
3152E1170402K31159j58038j53186M23935k7983l24848M46675K70551k27025K13882
$$ 51170402 51401561 51243523 51090337 51514272 51486289 51161441 51608116 51878667 51651642 51865524
3142E1865524j85149M33199M80738M7350J97185m5920J27305O27362R0986j26517
$$ 51865524 51680375 52113574 52594312 52641662 52838847 52792927 52920232 53547594 53638580 53512063
3132E3512063O58860P3019M58506L35470P62779N75061P65688Q29539P35092O28947
$$ 53512063 54170923 54243942 54702448 55037918 55800697 56375758 57141446 57970985 58706077 59335024
3122E9335024N65352J086457R67144J382726J367611J158179P90768J122594J687548
$$ 59335024 59900376 60986833 61953977 63336703 64704314 65862493 66653261 67775855 69463403
3113F9463403J662051J450158J919777K531020K187093J868566K123346J769675
$$ 69463403 71125454 72575612 74495389 77026409 79213502 81082068 83205414 84975089
3105H4975089O22625Q44095J583473Q79397N3936k21078M28466M49355n66839
$$ 84975089 85597714 86441809 88025282 88904679 88958615 88737537 89166003 89615358 89048519
3096H9048519M37078j78415n80229L13287M21068J129723N92189J76596J059879
$$ 89048519 89485597 89307182 88726953 89040240 89461308 90591031 91183220 91359816 92419695
3087I2419695J863731J989563K602574K784370K543176K702725K675714K950002
$$ 92419695 94283426 96272989 98875563 101659933 104203109 106905834 109581548 112531550
3079A12531550L513991K222661J857406K626188K153696J600802O65477n08395
$$ 112531550 116045541 118268202 120125608 122751796 124905492 126506294 127171771 126663376
3071A26663376q82610j572271k117199j185801j786616j656651j139100j009279
$$ 126663376 125780766 124208495 122091296 120905495 119118879 117462228 116323128 115313849
3063A15313849j29679p7452L02044K54055M28268J114709J048975J083114J063133
$$ 115313849 115184170 115106718 115408762 115662817 116091085 117205794 118254769 119337883 120401016
3054A20401016K161365K292419K146565K452132L145180K811309K286726K299871
$$ 120401016 122562381 124854800 127001365 129453497 132598677 135409986 137696712 139996583
3046A39996583J822039J186213J80154q23155j739369k652939l693663l872705
$$ 139996583 141818622 143004835 143184989 142361834 140622465 137969526 134275863 130403158
3038A30403158l487251l467885l102571k614722k340643k077076j918121j464391
$$ 130403158 126915907 123448022 120345451 117730729 115390086 113313010 111394889 109930498
3030A09930498j000883j218329r91659m59712M12146J74310l3189N19720J199808
$$ 109930498 108929615 107711286 106719627 106259915 106672061 106846371 106813182 107332902 108532710
3021A08532710R55355J289824J098664P39554J65250j94415j081787j729417j923622
$$ 108532710 109488065 110777889 111876553 112616107 112781357 112586942 111505155 109775738 107852116
3012A07852116k033285k159404k135839k629980k842038k687922k778157k495561
$$ 107852116 105818831 103659427 101523588 98893608 96051570 93363648 90585491 88089930
3004H8089930k124786j251618k036230j305501p07129r90885l66325j05219O50287
$$ 88089930 85965144 84713526 82677296 81371795 80664666 79673781 79307456 79202237 79852524
2995G9852524M36027M41611J347972J499753J835846K087537K460052K216130
$$ 79852524 80288551 80730162 82078134 83577887 85413733 87501270 89961322 92177452
2987I2177452K413495L517600M069757N285167N769860O435520O725403N209075
$$ 92177452 94590947 98108547 102178304 107463471 113233331 119668851 126394254 131603329
2979A31603329K374673k052567o140340q316310q322406p488478o504539n871959
$$ 131603329 133978002 131925435 125785095 117468785 109146379 101657901 95153362 89281403
2971H9281403m135202m176446l015424k437511k315376j736595j291212j045903
$$ 89281403 85146201 80969755 77954331 75516820 73201444 71464849 70173637 69127734
2963F9127734j119247m36686K76471J30220l38595n13410m58712j187816j726432
$$ 69127734 68008487 67571801 67848272 67978492 67639897 67126487 66667775 65479959 63753527
2954F3753527j679909j403289j842800j474167p38798q47239j299144r62622r81248
$$ 63753527 62073618 60670329 58827529 57353362 56614564 55767325 54468181 53505559 52524311
2945E2524311j192760m96701L9530J65427r6853n29365j136423n08989j044899
$$ 52524311 51331551 50834850 50874380 51039807 50942954 50413589 49277166 48768177 47723278
2936D7723278j097700o08042m50798j025365o57567j50437r9883j004088o66891
$$ 47723278 46625578 46017536 45566738 44541373 43883806 43733369 43633486 42629398 41962507
2927D1962507L99467j27796o20773j63429J60541n24980j93209J31902j54576
$$ 41962507 42361974 42234178 41613405 41449976 41610517 41085537 40892328 41024230 40869654
2918D0869654n95386l85469M41836n03162l97772Q39709K95072o28121n34772
$$ 40869654 40274268 39888799 40330635 39827473 39429701 40269410 40564482 39936361 39401589
2909C9401589M06798J96022k55936J79426R31618q8354q130M44698j17982o42211
$$ 39401589 39808387 40004409 39748473 39927899 40859517 40771163 40763033 41207731 41089749 40447538
2899D0447538K05602L46181L7749L8307M76692J48473k80872K13256N54551m62084
$$ 40447538 40653140 40999321 41037070 41075377 41552069 41700542 41419670 41632926 42187477 41725393
2889D1725393j2624K50280J20855P1628J02645Q18433J102319P53834Q33741Q19375
$$ 41725393 41712769 41963049 42083904 42155532 42258177 43076610 44178929 44932763 45766504 46585879
2879D6585879J001664J558539L09173p58781j604741j634428j720309j532988
$$ 46585879 47587543 49146082 49455255 48696474 47091733 45457305 43736996 42204008
2871D2204008j579224j240424j315606j495768n55436l04855o52397j038103p10806
$$ 42204008 40624784 39384360 38068754 36572986 36017550 35712695 35060298 34022195 33311389
2862C3311389l46076n12460k96881l23613j97010q50331n85356Q1891q410n86077
$$ 33311389 32965313 32452853 32155972 31832359 31635349 30785018 30199662 30281553 30273143 29687066
2852B9687066k6880l45324r37040m98419K52314M32610k30067q30797R5584J99398
$$ 29687066 29660186 29314862 28377822 27879403 28131717 28564327 28334260 27503463 27599047 27798445
2842B7798445l50377l39839n14527m00066m30128m45765L33260j02921q06583
$$ 27798445 27448068 27108229 26593702 26193636 25763508 25317743 25651003 25548082 24741499
2833B4741499k49644k39776l01004L0568K06042m54103n74305J83164k80997l14209
$$ 24741499 24491855 24252079 23951075 23981643 24187685 23733582 23159277 23342441 23061444 22747235
2823B2747235n75882k30133j7387n216n22824r2847M41256l95462j75802l60325
$$ 22747235 22171353 21941220 21923833 21918617 21395793 21302946 21744202 21348740 21172938 20812613
2813B0812613m50812l02974n80305m86906J56896r450j9079L29710L88359Q5599
$$ 20812613 20361801 20058827 19478522 18991616 19148512 19139062 19119983 19449693 19838052 19923651
2803A9923651K13466j8891n27504l48936K07381k38095j67662J8918l89621K39376
$$ 19923651 20137117 20118226 19590722 19241786 19449167 19211072 19043410 19062328 18672707 18912083
2793A8912083J03996j20966j70476p49685j66809K27951n01737l4297l27526o37185
$$ 18912083 19016079 18895113 18724637 17974952 17808143 18036094 17534357 17500060 17172534 16535349
2783A6535349M4766M88101m1188l5088l83214J17222K20005K78166K92812m92211
$$ 16535349 16580115 17068216 17027028 16991940 16608726 16725948 16945953 17224119 17516931 17024720
2773A7024720k98208j75387p8470L653j49753l46424l88304r835M47321M11088
$$ 17024720 16726512 16551125 16472655 16476308 16326555 15980131 15591827 15581992 16029313 16440401
2763A6440401l57630l33409J70204M4062K11438o44524n17624j53028m98599l5593
$$ 16440401 16082771 15749362 15919566 15963628 16175066 15530542 15012918 14859890 14361291 14325698
2753A4325698Q66575l02412j20188J06186L02709m47681n7141L46665n25230R2629
$$ 14325698 15192273 14889861 14769673 14875859 15178568 14730887 14673746 15020411 14495181 14587810
2743A4587810M13009j57788k55362k12889j22137O95908J23252m93041n50264
$$ 14587810 15000819 14843031 14587669 14374780 14252643 14948551 15071803 14578762 14028498
2734A4028498J48351J38317j20973k9837m85020J66975Q7314K40246J85075l11518
$$ 14028498 14176849 14315166 14194193 14164356 13679336 13846311 13933625 14173871 14358946 14047428
2724A4047428n05424o7562O57533K5670j83051n78883l87739K98956J29623k42829
$$ 14047428 13542004 13474442 14131975 14157645 13974594 13395711 13007972 13306928 13436551 13193722
2714A3193722L3193J3041Q3372O87297K48048L55869o66724p46153m615L35798
$$ 13193722 13226915 13239956 13323328 14010625 14258673 14614542 13947818 13201665 13197050 13532848
2704A3532848j85620k60041l4131k27242J78200M67284M54081k32502j070972
$$ 13532848 13347228 13087187 13053056 12825814 13004014 13471298 13925379 13692877 12621905
2695A2621905R7821M60854J35552j23580j85720j18008j19361N4132N80601p7555
$$ 12621905 12719726 13180580 13316132 13192552 13006832 12888824 12769463 12823595 13404196 13326641
2685A3326641k80496L35461o6218j22973J86690J46745k22740J68582L94559J14604
$$ 13326641 13046145 13381606 13315388 13192415 13379105 13525850 13303110 13471692 13866251 13980855
2675A3980855j81554n15942k04644M89113O19589k97043l56695L82121k73083
$$ 13980855 13799301 13283359 13078715 13567828 14187417 13890374 13533679 13915800 13642717
2666A3642717K21238j46948l39382K32654K94856K50661k06323l47145J25755
$$ 13642717 13863955 13717007 13377625 13610279 13905135 14155796 13949473 13602328 13728083
2657A3728083j11193R7292Q0100J01621l0036k95355k62837N41349K16520p2450
$$ 13728083 13616890 13714182 13794282 13895903 13865867 13570512 13307675 13849024 14065544 13993094
2647A3993094k9450J80081N95572P7635m67319k85396J15889P3407M32234k12715
$$ 13993094 13963644 14143725 14739297 14816932 14349613 14064217 14180106 14253513 14685747 14473032
2637A4473032k50850J1834k59230N36666k55768n06720j84889m9162N54059M37813
$$ 14473032 14222182 14234016 13974786 14511452 14255684 13748964 13564075 13514913 14068972 14506785
2627A4506785k15599o00642k99672K65432J0310J6485j46251N34968Q7188j95672
$$ 14506785 14291186 13690544 13390872 13656304 13666614 13683099 13536848 14071816 14159004 13963332
2617A3963332M94208k15454l62183n94954K60697M58372J20830J2739m64904j07417
$$ 13963332 14457540 14242086 13879903 13284949 13545646 14004018 14124848 14137587 13672683 13565266
2607A3565266k88581K98887K16767O6452k62586M5495J20015K40770l93436j32221
$$ 13565266 13276685 13575572 13792339 13858791 13596205 13641700 13761715 14002485 13609049 13476828
2597A3476828l33145m6771L84486p99421J14242M76108l48993k41290N02891k822
$$ 13476828 13143683 13096912 13481398 12681977 12796219 13272327 12923334 12682044 13184935 13182113
2587A3182113l51938m97025L67378J18141j67785K11761J1538l30610l47474n6897
$$ 13182113 12830175 12333150 12700528 12818669 12650884 12862645 12874183 12543573 12196099 12139202
2577A2139202M92516k41468j68665M02506p2534j25295n20370l25895K40356J7641
$$ 12139202 12631718 12390250 12221585 12624091 12551557 12426262 11905892 11579997 11820353 11837994
2567A1837994n31293j6627N50374j09362K43886J65973o93397n367K81048n21166
$$ 11837994 11306701 11290074 11840448 11731086 11974972 12140945 11447548 11442181 11723229 11202063
2557A1202063k25096O19805K57096k95943j70070L27889J86568l31243j66107
$$ 11202063 10976967 11596772 11853868 11557925 11387855 11715744 11902312 11571069 11404962
2548A1404962R5945J63678k17307O29007l78737p03085M1493K02603M06482k6372
$$ 11404962 11500907 11664585 11447278 12076285 11697548 10994463 11035956 11238559 11645041 11618669
2538A1618669k01129j24217k03045J6475L47036n765r7291O4668j63868K03378
$$ 11618669 11417540 11293323 11090278 11106753 11453789 11448024 11350733 11415401 11251533 11454911
2528A1454911K9455N9690r2398l441L62351k4890k90639j13942K67529K19326
$$ 11454911 11484366 11544056 11451658 11448217 11810568 11785678 11495039 11381097 11648626 11867952
2518A1867952p95J72810M29466m12485n60548N89949N14924m49006k73948L69768
$$ 11867952 11867157 12039967 12469433 12056948 11496400 12086349 12601273 12152267 11878319 12248087
2508A2248087J82524j19789J19297M77771o5048l98042J53177J18600k36587J58538
$$ 12248087 12430611 12310822 12430119 12907890 12842842 12444800 12597977 12716577 12479990 12638528
2498A2638528N57763L66070o7679K97349J23471R5008J81796j37863L37203n4555
$$ 12638528 13196291 13562361 13494682 13792031 13915502 14010510 14192306 14054443 14391646 14337091
2488A4337091j08436R0780J68746k551k13321R1216M04575q7253j06641J37481
$$ 14337091 14228655 14319435 14488181 14485630 14272309 14363525 14768100 14680847 14574206 14711687
2478A4711687l22673m50003J27663J42140m85580L80593J68412P0658J08180J33960
$$ 14711687 14389014 13939011 14066674 14208814 13723234 14103827 14272239 14342897 14451077 14585037
2468A4585037K34978J72653k53775j77200J00360j24269o8888k73481L49063q3207
$$ 14585037 14820015 14992668 14738893 14561693 14662053 14537784 14468896 14195415 14544478 14461271
2458A4461271M4077l6694N41094J57612l10635O900N7203l42029l98070k97956
$$ 14461271 14505348 14468654 15009748 15167360 14856725 14863625 14920828 14578799 14180729 13882773
2448A3882773K5322J54049l36147l51945J93487k19590n01410P32516j82847o37341
$$ 13882773 13908095 14062144 13725997 13374052 13567539 13347949 12846539 13579055 13396208 12758867
2438A2758867l20699K25991j43581k55147k83379j89016k96368M2353N29827k55649
$$ 12758867 12438168 12664159 12520578 12265431 11982052 11793036 11496668 11539021 12068848 11813199
2428A1813199J23696K69103K4802l51887k78937M03604l83981m46461J84311L84428
$$ 11813199 11936895 12205998 12230800 11878913 11599976 12003580 11619599 11173138 11357449 11741877
2418A1741877L4269k14178l23444n33162n5001q3517k7981l72150k59488k92467
$$ 11741877 11776146 11561968 11238524 10705362 10650361 10566844 10538863 10166713 9907225 9614758
2408I614758j2896l51159r9628K9035l85950k94424K33668l02538J61068l17214
$$ 9614758 9601862 9250703 9151075 9180110 8794160 8499736 8733404 8430866 8591934 8274720
2398H274720j37794M8958N07663L1837o03376J62977n67736o5335M19405j88905
$$ 8274720 8136926 8185884 8693547 8725384 8122008 8284985 7717249 7651914 8071319 7882414
2388G882414K83692p4116j08682k94657j17482O5042m87515p0486J61453J27030
$$ 7882414 8166106 8091990 7983308 7688651 7571169 7636211 7148696 7078210 7239663 7366693
2378G366693j44541n5326q7693J82469m57878j45331K24276k69729k17908L32603
$$ 7366693 7222152 7166826 7079133 7261602 6803724 6658393 6882669 6612940 6395032 6727635
2368F727635N7303O9805o9049k10787j29027L520l06971Q3633L24889o3791k13299
$$ 6727635 6784938 6854743 6785694 6574907 6445880 6449400 6142429 6226062 6550951 6487160 6273861
2357F273861K32674j09805q4382m37000J24758L55721J07024K3704m47528J43581
$$ 6273861 6506535 6396730 6312348 5875348 6000106 6355827 6462851 6486555 6039027 6182608
2347F182608R41588n01398m10085j91075k07254o900M80948J22484p31368n0813
$$ 6182608 7124196 6622798 6212713 6021638 5814384 5807484 6288432 6410916 5679548 5628735
2337E628735J29523j41297J52421M38966m9509j45302l17627L62494P1762j8867
$$ 5628735 5758258 5616961 5769382 6208348 6158839 6013537 5695910 6058404 6130166 6111299
2327F111299j55388m18536N6894P05421K04466j47897m23318k85148L91219O24925
$$ 6111299 5955911 5537375 5594269 6299690 6504156 6356259 5932941 5647793 6039012 6663937
2317F663937k52887j45190N23364m03732l91263M34252N50374J36785m18911o14
$$ 6663937 6411050 6265860 6789224 6385492 5994229 6428481 6978855 7115640 6696729 6696115
2307F696115N1999k21158l81054O90800M2201m66145j0310L69865J35207j1200
$$ 6696115 6748114 6526956 6145902 6836702 6878903 6412758 6402448 6772313 6907520 6896320
2297F896320J28102r4709N36321O1606L0133K63867J03466k87328M5430K21638
$$ 6896320 7024422 6929713 7466034 7527640 7557773 7821640 7925106 7637778 7683208 7904846
2287G904846L49412J13081n60453j00558N84919L18122j4790J92890J67490m5584
$$ 7904846 8254258 8367339 7806886 7706328 8291247 8609369 8594579 8787469 8954959 8909375
2277H909375K56167K31588M24286M9238j38507O33069K44627k63588N2118L33341
$$ 8909375 9165542 9397130 9821416 9870654 9732147 10365216 10609843 10346255 10398373 10731714
2267A0731714N24107Q4819J28692K21643K41572k75661J79234N22848O29629J88213
$$ 10731714 11255821 11340640 11469332 11690975 11932547 11656886 11836120 12358968 12988597 13176810
2257A3176810K13610P01587j16081L41434M29916O29908K24434j62344O91554
$$ 13176810 13390420 14092007 13975926 14317360 14747276 15377184 15601618 15439274 16130828
2248A6130828k5357j77252P98563M45275o0022K88287O04173R03768m8058O75803
$$ 16130828 16105471 15928219 16726782 17172057 17112035 17400322 18004495 18908263 18860205 19536008
2238A9536008P72726m59960N11585O32498K94395M44501Q90427L31359O20739
$$ 19536008 20308734 19848774 20360359 20992857 21287252 21731753 22622180 22953539 23574278
2229B3574278N56038Q02382R52356J76078J43320J153763Q61956K61712Q79450
$$ 23574278 24130316 24932698 25885054 26061132 26204452 27358215 28220171 28481883 29361333
2220B9361333J101246M67577L29400N44127J138338O41357m2212M29302P76724
$$ 29361333 30462579 30930156 31259556 31803683 32942021 33583378 33541166 33970468 34747192
2211C4747192Q42817K65770J434445R25955J62559J358567R36446O47790J185181
$$ 34747192 35590009 35855779 37290224 38216179 38378738 39737305 40673751 41321541 42506722
2202D2506722N42219P74700J796673J426991J351251J017702J025673J376160
$$ 42506722 43048941 43823641 45620314 47047305 48398556 49416258 50441931 51818091
2194E1818091J698910J523878J439487J640539J601462K898333K999494J867328
$$ 51818091 53517001 55040879 56480366 58120905 59722367 62620700 65620194 67487522
2186F7487522K292707L250950L653115L829923L772328M750620M973617M583018
$$ 67487522 69780229 73031179 76684294 80514217 84286545 89037165 94010782 98593800
2178I8593800O146815O964274O635347P010384P721003Q557486Q850275R147418
$$ 98593800 104740615 111704889 118340236 125350620 133071623 141629109 150479384 159626802
2170A59626802Q573565P664433O669455N941517M667424K433439J538308R90557
$$ 159626802 168200367 175864800 182534255 188475772 193143196 195576635 197114943 198105500
2162A98105500k30480q7889n31139j194316j520186j035155p38421p45773o90658
$$ 198105500 197875020 197787131 197255992 196061676 194541490 193506335 192767914 192022141 191331483
2153A91331483j459687k888149n456140q003138r496796j1010236j1849516j0995534
$$ 191331483 189871796 186983647 181527507 173524369 164027573 153017337 141167821 130172287
2145A30172287r886318r395300q614551p792641p321501o110429n648250m836272
$$ 130172287 120285969 110890669 102276118 94483477 87161976 81051547 75403297 70567025
2137G0567025m357679l661441k957133k571983k631041k355989k022757k456415
$$ 70567025 66209346 62547905 59590772 57018789 54387748 52031759 50009002 47552587
2129D7552587j687409p89610j330987j376782j372418m36896k07912O6935J075396
$$ 47552587 45865178 45075568 43744581 42367799 40995381 40558485 40350573 40417508 41492904
2120D1492904J529280Q52262J947659L48815l308010m232191l592023k675116
$$ 41492904 43022184 43874446 45822105 46170920 42862910 38630719 35038696 32363580
2112C2363580k201208j497012j415423j273450j605114j110785m79901n83744
$$ 32363580 30162372 28665360 27249937 25976487 24371373 23260588 22780687 22196943
2104B2196943q68261r13487o43111k87130j55307K05084m61457o31597k08363
$$ 22196943 21328682 20415195 19772084 19484954 19329647 19534731 19073274 18441677 18233314
2095A8233314m43266k51418j8723j59569l31457k2904O14182K46778P13207J130021
$$ 18233314 17790048 17538630 17519907 17360338 17028881 17005977 17620159 17866937 18580144 19710165
2085A9710165Q20092J202914J77023j821873j440772j470118j376327j159651
$$ 19710165 20530257 21733171 21910194 20088321 18647549 17177431 15801104 14641453
2077A4641453q65379q10145p08718o93618m75759k04902J58018J49320n21165
$$ 14641453 13776074 12965929 12257211 11563593 11087834 10882932 11040950 11190270 10669105
2068A0669105l98280K49263m84639m97315J80684j42828m82337q77053M84309
$$ 10669105 10270825 10520088 10035449 9538134 9718818 9575990 9093653 8216600 8700909
2059H700909r0861o82608L79418K10798n10176j11119M38950k00922m31147l10714
$$ 8700909 8610048 7927440 8306858 8517656 8007480 7896361 8335311 8134389 7703242 7392528
2049G392528l46160M39605k52150n84614J14640O2278j65078K11599L8186k00368
$$ 7392528 7046368 7485973 7233823 6649209 6763849 6826127 6661049 6872648 6910834 6710466
2039F710466m0062l46875N143K5806K40874N3529k68820L27628L69502k03424
$$ 6710466 6670404 6323529 6328672 6354478 6595352 6648881 6380061 6707689 7077191 6873767
2029F873767n91324k05632j81598k63772l51877L36427L16556n34552p2354N4249
$$ 6873767 6282443 6076811 5895213 5631441 5279564 5615991 5932547 5397995 5325641 5379890
2019E379890m32058j72232J75382k04180k57477J49648M55193j20918k37700J45425
$$ 5379890 4947832 4775600 4950982 4746802 4489325 4638973 5094166 4973248 4735548 4880973
2009D880973K58723m29244o26200N76120R6641n85776L39977K69973p33938K1447
$$ 4880973 5139696 4710452 4084252 4660372 4757013 4171237 4511214 4781187 4047249 4068696
1999D068696M12159K31775l47456q84594M78931J14085p26291K80300M55309r4893
$$ 4068696 4480855 4712630 4365174 3480580 3959511 4073596 3347305 3627605 4082914 3988021
1989C988021m69892J33423K24401l48759j25804K21J17915n27356k84362M38125
$$ 3988021 3518129 3651552 3875953 3527194 3401390 3401611 3519526 2992170 2707808 3145933
1979C145933L19438j11012N23527l8457n97854K28754J72374r2710l00836K71209
$$ 3145933 3465371 3354359 3877886 3839429 3241575 3470329 3642703 3549993 3249157 3520366
1969C520366l06020j71186N79259O8716m07301l08412J0387K85295k87421n81386
$$ 3520366 3214346 3043160 3622419 3691135 3283834 2975422 2985809 3271104 2983683 2402297
1959B402297N66448K54999j00473M5116J24332m17635k23803N69210l19538J58968
$$ 2402297 2968745 3223744 3123271 3168387 3292719 2875084 2651281 3220491 2900953 3059921
1949C059921q2133K30484R0651j50023j33879k45498p0148p6428M72493M0678
$$ 3059921 2977788 3208272 3298923 3148900 3015021 2769523 2699375 2622947 3095440 3136118
1939C136118j81007k05554K96321Q0831L34625j40019n19322J69480J60124k0027
$$ 3136118 2955111 2749557 3045878 3126709 3461334 3321315 2801993 2971473 3131597 3111570
1929C111570J96858j54468k94584j10175p0293N00194Q7668k05306m37582O9820
$$ 3111570 3308428 3153960 2859376 2749201 2678908 3179102 3266770 3061464 2623882 2693702
1919B693702M22190J56477L476k98899p5464N99537M96305L12525l95296n17153
$$ 2693702 3115892 3272369 3275845 2976946 2901482 3501019 3997324 4309849 3914553 3397400
1909C397400J00153J32944L73753j81182p54650m24268O0690L44753L5333K45038
$$ 3397400 3497553 3630497 4004250 3823068 3068418 2644150 2704840 3049593 3084926 3329964
1899C329964K36431o34901j75626N68626N62031n03957j67476j55218L59291N61290
$$ 3329964 3566395 2931494 2755868 3324494 3886525 3382568 3215092 3059874 3419165 3980455
1889C980455j95183J8525J19874l72212J55199N00283J11399m0122l98157J09451
$$ 3980455 3785272 3803797 3923671 3551459 3706658 4206941 4318340 4278218 3880061 3989512
1879C989512N55824J01222k31862L3607M32506p3042l85960k63644j10591K21126
$$ 3989512 4545336 4646558 4414696 4448303 4880809 4807767 4421807 4158163 4047572 4268698
1869D268698N2045L7576M56562P3314J75225L15616m29895k64387l8216l0742
$$ 4268698 4320743 4358319 4814881 4888195 5063420 5379036 4949141 4684754 4646538 4615796
1859D615796M91718M58437J77453K21100k1398K44424L43553P03732l15146n81618
$$ 4615796 5107514 5565951 5743404 5964504 5943106 6187530 6531083 7234815 6919669 6338051
1849F338051K63099P87100L54122N16104R6109K77110M15209O74631P73344L18238
$$ 6338051 6601150 7388250 7742372 8258476 8354585 8631695 9046904 9721535 10494879 10813117
1839A0813117K28468N09577R8914O35654O33268L22254M34036k72134N5360M17718
$$ 10813117 11041585 11551162 11650076 12285730 12918998 13241252 13675288 13403154 13458514 13876232
1829A3876232J45863m74415k65547m28423L02526M89772K11964M8644j08227k57896
$$ 13876232 14022095 13547680 13282133 12853710 13156236 13646008 13857972 13906616 13798389 13540493
1819A3540493M29648N11145J49556K14727L07335L61774N58691P24819O56889
$$ 13540493 13970141 14481286 14630842 14845569 15152904 15514678 16073369 16798188 17455077
1810A7455077O86664P80902R82732J669278J411417J609790J377213j44584j143849
$$ 17455077 18141741 18922643 19905375 21574653 22986070 24595860 25973073 25828489 24684640
1801B4684640j338577j431793j382401j442621j440612j157999p35141n54266
$$ 24684640 23346063 21914270 20531869 19089248 17648636 16490637 15755496 15201230
1793A5201230p41998n62907l37952q870k48621l2447l33002p30412j76498K67476
$$ 15201230 14459232 13896325 13558373 13549503 13300882 13268435 12935433 12205021 12028523 12295999
1783A2295999m36690J72945J55464M9560K44564k11569O52146P0678k71222K03893
$$ 12295999 11859309 12032254 12187718 12237278 12481842 12270273 12922419 12993097 12721875 12925768
1773A2925768O99300J95356n36269r9712o78131j050077l17266J4405k82472o84168
$$ 12925768 13625068 13820424 13284155 13184443 12506312 11456235 11138969 11153374 10870902 10186734
1763A0186734n53028j007818l65417J40610m30356N7406r3184o24130l31531l47558
$$ 10186734 9633706 8625888 8260471 8401081 7970725 8028131 7934947 7310817 6979286 6631728
1753F631728N013m22787o20016K60831k7743r16460j138K43423m2646n43218o76065
$$ 6631728 6636741 6213954 5593938 5854769 5827026 4910566 4909428 5152851 5110205 4566987 3890922
1742C890922K76737m86572K76719j36540m26028j10062k64761P87083J57171n28794
$$ 3890922 4167659 3681087 3957806 3821266 3395238 3285176 3020415 3807498 3964669 3435875
1732C435875k75451l59495k61085J1741N23214j75233q65215r7004N74210M57579
$$ 3435875 3160424 2800929 2539844 2551585 3074799 2899566 2034351 1937347 2511557 2969136
1722B969136l22659o89390K9884K41191l27072J50760O5618k68361n31451N63585
$$ 2969136 2646477 1957087 1986971 2228162 1901090 2051850 2117468 1849107 1317656 1881241
1712A881241O527j8549p9914j99622J56097n79404j59418K82644M4002m78504
$$ 1881241 1887768 1869219 1789305 1589683 1745780 1166376 1006958 1289602 1333604 855100
1702H55100L92882M75855j39651n23842L88672J69556m63522J46093R6961l78195
$$ 855100 1247982 1723837 1584186 1060344 1449016 1618572 1155050 1301143 1398104 1019909
1692A019909o0974k8290O23806J11209l15596k47762l67739L48641j76005j2981
$$ 1019909 958935 930645 1554451 1665660 1350064 1102302 734563 1083204 907199 894218
1682H94218n6329j07908K41633L41491J47936n10362j71210R9136m41997k87012
$$ 894218 837889 729981 971614 1313105 1461041 950679 779469 878605 436608 149596
1672A49596J94110l879j00942L67454K02048J2864n27467j26438N49476k75532
$$ 149596 343706 339827 238885 606339 808387 821251 293784 167346 716822 441290
1662D41290J08998R4141j07269k90424q8519N60959N52156o4491l34698n86593
$$ 441290 550288 644429 537160 246736 158217 719176 1271332 1206841 872143 285550
1652B85550K84419P62J65371R8233q9204j02333m63249N74713L35072j35807Q1970
$$ 285550 569969 570731 736102 834335 745131 642798 179549 754262 1089334 953527 1035497
1641A035497j53386k39929L8792j39081J83784J27181k57972l24766O18342J47808
$$ 1035497 882111 642182 680974 541893 725677 852858 594886 270120 888462 1036270
1631A036270n59118m24627L47966j55438j94664K47468M51604k38860n06170O04753
$$ 1036270 477152 52525 400491 245053 50389 297857 749461 510601 4431 609184
1621F09184L4201m92389q779k77199J79897L7965j20856L94415k74625r9109O6152
$$ 609184 643385 150996 142217 -134982 44915 82880 -37976 356439 81814 -17295 48857
1610D8857k60834K5063K23882j60261j45695l7869K71008o7543K89092L69891
$$ 48857 -211977 -186914 36968 -123293 -268988 -306857 -35849 -103392 185700 555591
1600E55591L13126j64225k73293q1616p8496k70556O1316M82454o8493k94286
$$ 555591 868717 704492 431199 349583 271087 531 61847 544301 475808 181522
1590A81522K70108J66405m32230l68452L32910J44945k63201l51981j83079Q5091
$$ 181522 451630 618035 185805 -182647 150263 295208 32007 -319974 -503053 -417962
1580d17962K59945K46544J10817J27320L815k59848l03496n6526k75844J79435
$$ -417962 -158017 88527 199344 326664 330479 70631 -232865 -289391 -565235 -385800
1570c85800m51145K91587M93692K55202m4179p024l29793l67109K88970J96213
$$ -385800 -836945 -545358 -51666 203536 159357 152333 -177460 -544569 -255599 -59386
1560e9386J02902J37302R2527Q0276L92524J27620p99213n45776J71007J82930
$$ -59386 43516 180818 273345 353621 746145 873765 74552 -471224 -300217 -117287
1550a17287L46645M38576k65313p34075K49401J00909L21708k63215k45843m3008
$$ -117287 229358 667934 402621 -331454 -82053 18856 340564 77349 -168494 -211502
1540b11502l21059R1541M96237p8591r7981r2404N46040N10470l39084m53196
$$ -211502 -532561 -441020 55217 -23374 -121355 -213759 332281 842751 503667 50471
1530E0471j88825J56987j96771L42595M2996j03302J73969N72791k0003j56485
$$ 50471 -138354 18633 -178138 164457 207453 104151 278120 850911 830908 674423
1520F74423q0647j17390p85317k587k89295J74548J24386M4592L08686K42283
$$ 674423 593776 476386 -308931 -311518 -600813 -426265 -301879 -257287 51399 293682
1510B93682j29060o13581L2128J30566Q8422J24023j29083M67935j16865J07008
$$ 293682 164622 -448959 -416831 -286265 -197843 -73820 -202903 265032 148167 255175
1500B55175O90903k47771j41612m03263l6027J54990j67145k30919j87105J1883
$$ 255175 946078 698307 556695 153432 117405 272395 105250 -125669 -312774 -300891
1490c00891N40806m266j55614l57488k60499p5389P21097M52994p61969l95405
$$ -300891 239915 235649 80035 -277453 -537952 -613341 107756 560750 -201219 -596624
1480e96624M40969M0500N65726o529k5025l2173j65829K63507J2608m89726n98908
$$ -596624 -155655 -115155 450571 444042 419017 386844 221015 484522 497130 7404 -591504
1469e91504K97759q5943j49776M84561J71099m88572m72413J66707M45387j87953
$$ -591504 -293745 -379688 -529464 -44903 126196 -362376 -834789 -668082 -222695 -410648
1459d10648J02040L46595l25862j04279L05135Q22338k92465k58973K18380k59481
$$ -410648 -308608 37987 -287875 -392154 -87019 735319 442854 183881 402261 142780
1449A42780o96963K62652N9758j20789M61052n7261K98550n63265M3500M44641
$$ 142780 -554183 -291531 -231773 -352562 108490 51229 349779 -213486 -169986 274655
1439B74655n72343J6258l4665j7591K40411J28238L7960P1554M2033K03857m67571
$$ 274655 -297688 -281430 -316095 -333686 -93275 34963 72923 144477 186510 390367 -77204
1428g7204j04529L77069n51376l32411o570M70173K74230K62522Q6098o01538
$$ -77204 -181733 195336 -356040 -688451 -695021 -224848 49382 311904 398002 -203536
1418b03536m52463q802M21088j33448m62477j60038L07686L17629M8480O38900
$$ -203536 -655999 -664801 -243713 -377161 -839638 -999676 -691990 -374361 -325881 313019
1408C13019m6579p69655m25313J64664K19321k92483L08309K78721J69802J0255
$$ 313019 266440 -503215 -928528 -763864 -544543 -837026 -528717 -249996 -80194 -69939
1398f9939O04823K94432r02473l26545J85560J56310r0229j31439K89750Q1026
$$ -69939 534884 829316 -73157 -399702 -214142 -57832 -148061 -279500 10250 91276
1388I1276r3420J06389j72380l667J27011k76432n8681P2513J0331L20262j67681
$$ 91276 -2144 104245 -68135 -71802 55209 -221223 -279904 -207391 -197060 123202 -44479
1377d4479L202R9542K04689j43095o0187l26893q0442M13219k59533k24508J64951
$$ -44479 -41277 58265 262954 119859 59672 -267221 -347663 65556 -193977 -418485 -253534
1366b53534j21994K27950M6190l90126l04157M21799j1745J13065l83935q634
$$ -253534 -375528 -147578 -101388 -491514 -795671 -373872 -385617 -272552 -656487 -665121
1356f65121K05120L99834N04346K31809l85597n80318L12880O05719o66423m56102
$$ -665121 -460001 -60167 444179 675988 290391 -289927 22953 628672 -37751 -493853
1346d93853R8320P4357K84061Q1651o2045O2001P9272l23781M07546m59320k22563
$$ -493853 -395533 -321176 -37115 44536 -17509 44492 123764 -200017 207529 -251791 -474354
1335d74354L9454K01543J88580L81876J4387p16747K1981L47715R4115k94325
$$ -474354 -434900 -233357 -44777 337099 351486 -365261 -343280 4435 98550 -195775
1325a95775O0739r9986r3069K50876K69830J89653m77788m26319J41214n1912
$$ -195775 -135036 -235022 -328091 -77215 192615 382268 -95520 -521839 -380625 -432537
1315d32537J95844K74532l47816Q9115j33944N07451J68010m06944K81760K34233
$$ -432537 -236693 37839 -309977 -220862 -354806 152645 320655 -86289 195471 429704
1305D29704J9120k62043k20356K04463j82123J22782R9860j96727j03932J01453
$$ 429704 448824 186781 -33575 170888 -11235 111547 211407 14680 -89252 12201
1295A2201M749j35865J74975n7818o27813o3371K54956M50434K28584j35056O3183
$$ 12201 16950 -118915 56060 -1758 -629571 -692942 -437986 12448 241032 105976 169159
1284A69159j6761l69223J04004L76969Q4215p7801k56861J74868j06605J04808
$$ 169159 152398 -216825 -112821 264148 348363 270562 13701 188569 81964 186772
1274A86772Q3200q6518Q4693o3750j50809j26106m53961j32132M07580k56888
$$ 186772 269972 183454 268147 204397 53588 -72518 -526479 -658611 -251031 -507919
1264e07919k21506M02500K51596p9562j41470l6013M14086l65864k43324K52164
$$ -507919 -729425 -326925 -75329 -154891 -296361 -332374 81712 -284152 -527476 -275312
1254b75312O38804O2796j44204j02960J70836L63324o5151j21493J59987K93673
$$ -275312 363492 426288 282084 179124 349960 713284 648133 526640 686627 980300
1244I80300j30158L12363N85906r6731J70986k92671r07789l5800k06630m19756
$$ 980300 850142 1162505 1748411 1651680 1822666 1529995 622206 586406 379776 -39980
1234c9980J76526L32596q4480n906j44810J45093k76933j70227P543L53648j23589
$$ -39980 136546 469142 384662 378756 233946 379039 102106 -68121 -60578 293070 169481
1223A69481j82281M45674K06547j13090n20503M6333N6816O86R0238k13725j06873
$$ 169481 -12800 432874 639421 526331 5828 52161 108977 109663 199901 -13824 -120697
1212a20697J22022K02681J66613j10922n3192k00793m1811N57230j54454l67671
$$ -120697 1325 204006 370619 259697 206505 5712 -36099 521131 366677 -994
1202i94k25148K75941j61157J61971K22614j91212m10235J5344K91583N26872
$$ -994 -226142 49799 -111358 50613 273227 82015 -328220 -312876 -21293 505579
1192E05579m30140n06213M14799M37396J48569L34032K07125o36048o70902K95122
$$ 505579 75439 -430774 -15975 421421 569990 904022 1111147 475099 -195803 99319
1182I9319Q14828k59329l16798k70065j6058J75269j48398k4669K81816j37601
$$ 99319 914147 654818 338020 67955 51897 227166 78768 54099 335915 198314
1172A98314n10079k43997O87759L6452j6413j92487m4666J53992M36518K58841
$$ 198314 -311765 -555762 131997 168449 152036 -40451 -85117 68875 505393 764234
1162G64234k50491m14052O6121J2197P05020J2753j57189Q8632m32610J44645
$$ 764234 513743 99691 165812 178009 883029 895782 738593 827225 394615 539260
1152E39260J60512J40976l05703l92360j7142K62625J8978P9415k16905m73623
$$ 539260 699772 840748 535045 142685 125543 388168 407146 486561 269656 -203967
1142b03967k30676M69671O45156K07044j9759l25355k7262Q6441K39986j63863
$$ -203967 -434643 35028 680184 887228 867469 542114 514852 601293 841279 677416
1132F77416o56498K65259J04192P4764N36098j17038n79413l25006L29157K46962
$$ 677416 20918 286177 390369 465133 1001231 884193 304780 -20226 308931 555893
1122E55893L40656O51007j14886m94578j72115l1038m8474l13731K75842K98459
$$ 555893 896549 1547556 1432670 938092 765977 734939 686465 372734 648576 947035
1112I47035l40196O97511L90467l92853m14981Q4329K03259k23931m05525L54436
$$ 947035 606839 1304350 1694817 1301964 886983 971312 1174571 950640 545115 899551
1102H99551K73253m42344Q2152Q40713l56746p91042j65179L45022m7127J74407
$$ 899551 1172804 730460 812612 1653325 1296579 505537 340358 685380 638253 812660
1092H12660J04235K70874l22142o89557P48393O68872k34149j07321k94467J7959
$$ 812660 916895 1187769 865627 176070 924463 1593335 1359186 1251865 957398 975357
1082I75357k79561J35499L72464r5126k45077K12311P76095P2551j05555l03256
$$ 975357 695796 831295 1203759 1108633 863556 1075867 1851962 1924513 1818958 1515702
1072A515702L86048L17851k72191j01212o7725J93514j03386J20863Q35100M84938
$$ 1515702 1901750 2219601 1947410 1846198 1778473 1971987 1868601 1989464 2824564 3309502
1062C309502l67187p17327p2538j17993L51078L66575n3665l6726Q6168K95993
$$ 3309502 2942315 2224988 2152450 2034457 2385535 2752110 2698445 2661719 2747887 3043880
1052C043880k20445M56226N21200K05891m19860r9645k51545l53444O20916R5730
$$ 3043880 2823435 3279661 3800861 4006752 3586892 3487247 3235702 2882258 3503174 3598904
1042C598904l02956M24784K59337j73532m50581j90634N15489N02215N38741M92585
$$ 3598904 3295948 3720732 3980069 3806537 3355956 3165322 3680811 4183026 4721767 5214352
$$ [...]
##END NTUPLES=NMR SPECTRUM
##END=
