##TITLE=1H_CG-1137
 CDCl3, 8 sc, 
 25.11.2020
##JCAMPDX= 6.0         $$ Bruker NMR JCAMP-DX V2.0
##DATA TYPE= NMR SPECTRUM
##DATA CLASS= NTUPLES
##ORIGIN= UXNMR, Bruker Analytische Messtechnik GmbH
##OWNER= root
$$ XWIN-NMR		Version 3.5
$$ Wed Nov 25 12:23:11 2020 Russian Standard Time (UT+4h)  she@DPX200
##.OBSERVE FREQUENCY= 200.1315066352
##.OBSERVE NUCLEUS= ^1H
##.ACQUISITION MODE= SIMULTANEOUS
##.ACQUISITION SCHEME= undefined
##.AVERAGES= 8
##.DIGITISER RES= 18
##SPECTROMETER/DATA SYSTEM= spect
##.PULSE SEQUENCE= zg30
##.SOLVENT NAME= CDCl3
##.SHIFT REFERENCE= (INTERNAL, CDCl3, 0, 15.9761)
##AUDIT TRAIL= $$ (NUMBER, WHEN, WHO, WHERE, WHAT)
$$ ##TITLE= Audit trail, XWIN-NMR		Version 3.5
$$ ##JCAMPDX= 5.01
$$ ##ORIGIN= Bruker BioSpin GmbH
$$ ##OWNER= she
$$ F:/spectra/data/she/nmr/H-F/1/pdata/1/auditp.txt
$$ ##AUDIT TRAIL=  $$ (NUMBER, WHEN, WHO, WHERE, WHAT)
(   1,<2020-11-25 12:21:42.96 +0400>,<she>,<DPX200>,
      <created by zg, POWCHK disabled, PULCHK disabled
       configuration hash MD5:
       00 E9 B6 7A A2 85 ED C7 34 08 36 98 17 FE 4E 26
       data hash MD5: 16K
       AA C3 86 98 ED 58 CB 68 9B FC D9 1F A5 F4 51 FA>)
(   2,<2020-11-25 12:22:00.56 +0400>,<she>,<DPX200>,
      <Start of raw data processing
       efp BC_mod = 2 LB = 0.24 FT_mod = 6 PKNL = 1 PHC0 = -11139.75 PHC1 = 26.40089 SI = 16K 
       data hash MD5: 16K
       3C A8 C7 32 3A 16 72 DD 4F 58 E5 21 E6 07 31 D8>)
(   3,<2020-11-25 12:22:15.10 +0400>,<she>,<DPX200>,
      <pk PHC0 = -75.06868 PHC1 = -4.600003 
       data hash MD5: 16K
       4A 45 BD 05 55 19 9B 77 71 68 74 50 34 7C 73 94>)
(   4,<2020-11-25 12:22:19.28 +0400>,<she>,<DPX200>,
      <abs ABSG = 5 
       data hash MD5: 16K
       B4 82 7F 5B 21 42 49 EF 0F 96 43 80 30 A3 F6 9C>)
$$ ##END=
$$ 
$$ hash MD5
$$ CE 5D 83 BD D1 40 74 03 8C 7F 24 2A 19 69 9F BF
##$RELAX= 
##$RELAX= 
##$RELAX= 
##$RELAX= 
##$RELAX= 
##$RELAX= 
$$ Bruker specific parameters
$$ --------------------------
##$DU= <F:/spectra>
##$EXPNO= 1
##$NAME= <H-F>
##$PROCNO= 1
##$TYPE= <nmr>
##$USER= <she>
##$AMP= (0..31)
100 100 100 100 100 100 100 100 100 100 100 100 100 100 100 100 100 100 
100 100 100 100 100 100 100 100 100 100 100 100 100 100 
##$AQSEQ= 0
##$AQ_mod= 1
##$AUNM= <au_zg>
##$AUTOPOS= <>
##$BF1= 200.13
##$BF2= 200.13
##$BF3= 200.13
##$BF4= 200.13
##$BF5= 200.13
##$BF6= 200.13
##$BF7= 200.13
##$BF8= 200.13
##$BYTORDA= 1
##$CFDGTYP= 0
##$CFRGTYP= 5
##$CHEMSTR= <none>
##$CNST= (0..31)
1 1 145 1 1 1 1 1 1 1 1 1 1 1 1 1 1 1 1 1 1 1 1 1 1 1 1 1 1 1 1 1 
##$CPDPRG= <>
##$CPDPRG1= <>
##$CPDPRG2= <>
##$CPDPRG3= <>
##$CPDPRG4= <mlev>
##$CPDPRG5= <mlev>
##$CPDPRG6= <mlev>
##$CPDPRG7= <mlev>
##$CPDPRG8= <mlev>
##$CPDPRGB= <>
##$CPDPRGT= <>
##$D= (0..31)
0 1.2 0 0 0 0 0 0 0 0.06 0 0.03 0 0 0 0 0.0002 0 0 0 0 0 0 0 0 0 0 0 0 
0 0 0 
##$DATE= 1606292502
##$DBL= (0..7)
120 120 120 120 120 120 120 120 
##$DBP= (0..7)
150 150 150 150 150 150 150 150 
##$DBP07= 0
##$DBPNAM0= <>
##$DBPNAM1= <>
##$DBPNAM2= <>
##$DBPNAM3= <>
##$DBPNAM4= <>
$$ [...]
##$SUBNAM3= <"">
##$SUBNAM4= <"">
##$SUBNAM5= <"">
##$SUBNAM6= <"">
##$SUBNAM7= <"">
##$SUBNAM8= <"">
##$SUBNAM9= <"">
##$SW= 16.9725356469052
##$SWIBOX= (0..15)
0 0 2 0 0 0 0 0 0 0 0 0 0 0 0 0 
##$SW_h= 3396.73913043478
##$TD= 16384
##$TD0= 1
##$TE= 0
##$TE2= 300
##$TE3= 300
##$TEG= 300
##$TL= (0..7)
0 120 120 120 120 120 120 120 
##$TP= (0..7)
150 150 150 150 150 150 150 150 
##$TP07= 0
##$TPNAME0= <>
##$TPNAME1= <>
##$TPNAME2= <>
##$TPNAME3= <>
##$TPNAME4= <>
##$TPNAME5= <>
##$TPNAME6= <>
##$TPNAME7= <>
##$TPOAL= (0..7)
0.5 0.5 0.5 0.5 0.5 0.5 0.5 0.5 
##$TPOFFS= (0..7)
0 0 0 0 0 0 0 0 
##$TUNHIN= 0
##$TUNHOUT= 0
##$TUNXOUT= 0
##$USERA1= <user>
##$USERA2= <user>
##$USERA3= <user>
##$USERA4= <user>
##$USERA5= <user>
##$V9= 5
##$VALIST= <valist>
##$VCLIST= <CCCCCCCCCCCCCCC>
##$VD= 0
##$VDLIST= <DDDDDDDDDDDDDDD>
##$VPLIST= <PPPPPPPPPPPPPPP>
##$VTLIST= <TTTTTTTTTTTTTTT>
##$WBST= 1024
##$WBSW= 4
##$XGAIN= (0..3)
0 0 0 0 
##$XL= 0
##$YL= 0
##$YMAX_a= 39369
##$YMIN_a= -37119
##$ZGOPTNS= <>
##$ZL1= 120
##$ZL2= 120
##$ZL3= 120
##$ZL4= 120
##$ABSF1= 15.9761
##$ABSF2= -0.996562
##$ABSG= 5
##$ABSL= 3
##$ALPHA= 0
##$AQORDER= 0
##$ASSFAC= 0
##$ASSFACI= 0
##$ASSFACX= 0
##$ASSWID= 0
##$AUNMP= <proc_1d>
##$AZFE= 0.1
##$AZFW= 0.1
##$BCFW= 0
##$BC_mod= 2
##$BYTORDP= 0
##$COROFFS= 0
##$CY= -3
##$DATMOD= 1
##$DC= 0
##$DFILT= <>
##$DTYPP= 0
##$F1P= 0
##$F2P= 0
##$FCOR= 1
##$FTSIZE= 16384
##$FT_mod= 6
##$GAMMA= 0
##$GB= 0
##$INTBC= 1
##$INTSCL= 2.992141e-10
##$ISEN= 128
##$LB= 0.24
##$LEV0= 0
##$LPBIN= 0
##$MAXI= 10000
##$MC2= 0
##$MEAN= 0
##$ME_mod= 0
##$MI= 1.114404
##$NCOEF= 0
##$NC_proc= -10
##$NLEV= 6
##$NOISF1= 3.799351
##$NOISF2= 2.8
##$NSP= 0
##$NTH_PI= 0
##$NZP= 0
##$OFFSET= 15.9761
##$PC= 1
##$PHC0= -11214.82
##$PHC1= 21.80089
##$PH_mod= 1
##$PKNL= yes
##$PPARMOD= 0
##$PSCAL= 0
##$PSIGN= 0
##$REVERSE= no
##$SF= 200.130007708106
##$SI= 16384
##$SIGF1= 3
##$SIGF2= 2
##$SINO= 5.538805
##$SIOLD= 16384
##$SREGLST= <1H.CDCl3>
##$SSB= 0
##$STSI= 16384
##$STSR= 0
##$SW_p= 3396.73913043478
##$SYMM= 0
##$S_DEV= 0
##$TDeff= 16384
##$TDoff= 0
##$TI= <>
##$TILT= no
##$TM1= 0
##$TM2= 0
##$TOPLEV= 0
##$USERP1= <user>
##$USERP2= <user>
##$USERP3= <user>
##$USERP4= <user>
##$USERP5= <user>
##$WDW= 1
##$XDIM= 16384
##$YMAX_p= 475580452
##$YMIN_p= -5887234
$$ End of Bruker specific parameters
$$ ---------------------------------
##NTUPLES= NMR SPECTRUM
##VAR_NAME=  FREQUENCY,     SPECTRUM/REAL,   SPECTRUM/IMAG
##SYMBOL=    X,             R,               I
##VAR_TYPE=  INDEPENDENT,   DEPENDENT,       DEPENDENT
##VAR_FORM=  AFFN,          ASDF,            ASDF
##VAR_DIM=   16384,         16384,           16384
##UNITS=     HZ,            ARBITRARY UNITS, ARBITRARY UNITS
##FACTOR=    0.207333158178281, 1,           1
##FIRST=     3197.29700973262, 0,            0
##LAST=      -199.442120702165, 0,           0
##MIN=       -199.442120702165, -5887234,    0
##MAX=       3197.29700973262, 475580452,    0
$$ Real data points
##PAGE= N=1
##DATA TABLE= (X++(R..R)), XYDATA
$$ [...]
3670A5095204Q693j98573K35605P45839Q8323Q63116O83550M58854M31185M87935
$$ 15095204 15103897 14905324 15140929 15886768 15975091 16838207 17521757 17980611 18411796 18899731
3660A8899731Q33213P00006m6631J327170P86740J028494J189695K568110K971627
$$ 18899731 19732944 20432950 20386319 21713489 22500229 23528723 24718418 27286528 30258155
3651C0258155J586349O12931J168485J49708q02266k429956j995143j765623j978356
$$ 30258155 31844504 32457435 33625920 33775628 32973362 30543406 28548263 26782640 24804284
3642B4804284k278379j896291j140703j348394j390936n65812k02307J66418L4461
$$ 24804284 22525905 20629614 19488911 18140517 16749581 16183769 15981462 16147880 16182341
3633A6182341k1494j87534N9376j050034j039242j55399j42952r62111m40561
$$ 16182341 16160847 15973313 16032689 14982655 13943413 13788014 13645062 12682951 12242390
3624A2242390Q81300O3726m58970M82405K23773M48080J98208R1073k45705k68804
$$ 12242390 13123690 13187416 12728446 13210851 13434624 13882704 14080912 14171985 13926280 13657476
3614A3657476N43522n44275R6965l4646r00967r33001k23164k89468m93087k85922
$$ 13657476 14200998 13656723 13753688 13719042 12818075 11885074 11661910 11372442 10879355 10593433
3604A0593433Q89501L38644k32342l71298P49716q217o34491p21753l66617r50832
$$ 10593433 11482934 11821578 11589236 11217938 11967654 11959437 11324946 10603193 10236576 9285744
3594I285744o27076J5206M6453M16241M48331J48847J40381M15684J33725r24921
$$ 9285744 8658668 8673874 8720327 9136568 9584899 9733746 9874127 10289811 10423536 9498615
3584I498615L66570K4000k20078l17882K55750q89842l90370l96798O92951K28512
$$ 9498615 9865185 9889185 9669107 9351225 9606975 8717133 8326763 7929965 8622916 8851428
3574H851428q3447J45151P96696P07820J59059o85203N65345K1786q35670l21802
$$ 8851428 8767981 8913132 9709828 10417648 10576707 9891504 10456849 10478635 9642965 9321163
3564I321163l05732p13172m52206K69801J313519n000r7717J75248M09997L83107
$$ 9321163 9015431 8302259 7850053 8119854 9433373 9428373 9330656 9505904 9915901 10299008
3554A0299008p81900n51457o00971L0032j05719N50876j87336P01736n99680J06581
$$ 10299008 9517108 8965651 8364680 8394712 8288993 8839869 8652533 9354269 8754589 8861170
3544H861170K76418j30414O2008N36887K05372P32195j82481k68486n22599L92220
$$ 8861170 9137588 9007174 9069182 9606069 9811441 10543636 10361155 10092669 9570070 9962290
3534I962290n1691j43697J26933L12961R4846M90090K20014l3806o2845l7449
$$ 9962290 9910599 9766902 9893835 10206796 10301642 10791732 11011746 10977940 10915095 10877646
3524A0877646K45823n5384o81378p27845p84146P1617m85222j57398P656M32434
$$ 10877646 11123469 11068085 10386707 9658862 8874716 8946333 8461111 8303713 8311369 8743803
3514H743803j38828m0920M43108N9029p13958k04307P12831l6779k37641k30586
$$ 8743803 8604975 8564055 9007163 9066192 8352234 8147927 8860758 8823979 8586338 8355752
3504H355752Q9398m32250l32275o04125j13892L83909J10980J44953M28465Q18637
$$ 8355752 8445150 8012900 7680625 7076500 6962608 7346517 7457497 7602450 8030915 8849552
3494H849552Q16561j153744o73017L83268M43930q11952K08591J88745M05956
$$ 8849552 9666113 8512369 7839352 8222620 8666550 7854598 8063189 8251934 8657890
3485H657890n0220L2902M30015M23655j38238m22411K34650n69786o44002l26738
$$ 8657890 8607670 8640572 9070587 9494242 9356004 8933593 9168243 8598457 7954455 7627717
3475G627717O17038p4480k72300k02304Q5033Q03355N5600n05319o01971L65571
$$ 7627717 8244755 8170275 7897975 7695671 7780704 8584059 8639659 8134340 7532369 7897940
3465G897940P67184O88368N71456Q12595k09951m52370K01840J63895k80355l55121
$$ 7897940 8665124 9353492 9924948 10737543 10527592 10075222 10277062 10440957 10160602 9805481
3455I805481j82220O53764Q49192J84812O03245N59694J65338M25063J160606
$$ 9805481 9623261 10277025 11126217 11311029 11914274 12473968 12639306 13064369 14224975
3446A4224975P27803N78040K68571R93528j4526m84086j615185j267351m73634
$$ 14224975 14952778 15530818 15799389 16792917 16778391 16294305 14679120 13411769 12938135
3437A2938135q21247k87377L33905j07926K55143N20965L85456M70443k95904
$$ 12938135 12116888 11829511 12163416 12055490 12310633 12831598 13217054 13687497 13391593
3428A3391593J67252M62941L57832J69696m81138j82509J106762J530190Q20010
$$ 13391593 13558845 14021786 14379618 14549314 14068176 13885667 14992429 16522619 17342629
3419A7342629N27319J51787M43208Q6086K89957N26502K62689J29671P00944J231540
$$ 17342629 17869948 18021735 18464943 18551029 18840986 19367488 19630177 19759848 20460792 21692332
3409B1692332J352934Q65556j032399j731980j564110j185472j379458q73754
$$ 21692332 23045266 23910822 22878423 21146443 19582333 18396861 17017403 16143649
3401A6143649j110380p34453M2117n61371k58405l39978j246810l97549k72744
$$ 16143649 15033269 14298816 14340933 13779562 13521157 13181179 11934369 11536820 11264076
3392A1264076o93533l81341J12308l39312L43693l5600N41014n02920n60197l83262
$$ 11264076 10570543 10189202 10301510 9962198 10305891 10270291 10811305 10308385 9748188 9364926
3382I364926p7359L80863o58056k10874k89450N54925o2964k86225K40693n6596
$$ 9364926 9287567 9668430 9010374 8799500 8510050 9064975 9002011 8715786 8956479 8899883
3372H899883r7474L30316L74266l18099K1591M08661K69820k15246k06503n29741
$$ 8899883 8802409 9132725 9506991 9188892 9210483 9619144 9888964 9673718 9467215 8937474
3362H937474l62739N92181J75892L06246l09970j57176P93108L11586R06767L00683
$$ 8937474 8574735 9166916 9342808 9649054 9339084 9181908 9975016 10286602 11193369 11494052
3352A1494052k73249j231381n07774J81528O8706M9852O33254O06503l99380m95860
$$ 11494052 11220803 9989422 9481648 9663176 9731882 9781734 10414988 11021491 10622111 10126251
3342A0126251l69666l75553J26707J09777K818J85339J48388p1006L49494m09517
$$ 10126251 9756585 9381032 9507739 9617516 9620334 9805673 9954061 9883055 10232549 9823032
3332I823032m75920n54128K45543L13090N34129R2568M51324k39933j86776m17858
$$ 9823032 9347112 8792984 9038527 9351617 9885746 9978314 10429638 10189705 10002929 9585071
3322I585071k89786k921r86355o04130r9054K90042k8881n76163o9150O11202
$$ 9585071 9295285 9292364 8306009 7701879 7602825 7892867 7863986 7287823 7218673 7829875
3312G829875K08579L01290J92478j88438o08855p6666j31343Q26575j94468k50312
$$ 7829875 8038454 8339744 8532222 8343784 7734929 7658263 7526920 8353495 8159027 7908715
3302G908715l29126O87030K36486l998m61717Q03995O35013J09653O01691J55457
$$ 7908715 7579589 8266619 8503105 8499107 8037390 8841385 9476398 9586051 10187742 10343199
3292A0343199m28945k99935r75832J69797n6880n42304m65077K56623K79278N427
$$ 10343199 9914254 9614319 8638487 8808284 8751404 8209100 7744023 8000646 8279924 8285351
3282H285351m82140J058398L65574J57624k88898K43261j82809n32305m15307
$$ 8285351 7803211 8861609 9227183 9384807 9095909 9339170 9156361 8624056 8208749
3273H208749K73393R1144l12582j52338Q14965J451813L30243Q3615O75642L59841
$$ 8208749 8482142 8573286 8260704 8108366 8923331 10375144 10705387 10789002 11464644 11824485
3263A1824485J15364l01957k69091j83644q99876k15998M00677P30736L6085m66078
$$ 11824485 11939849 11637892 11368801 11185157 10285281 10069283 10469960 11200696 11236781 10770703
3253A0770703r75669N98917K70616l02015k10640P43326m06008l58220n90965
$$ 10770703 9795034 10393951 10664567 10362552 10151912 10895238 10489230 10131010 9540045
3244I540045M52712r58134L07112J34198M90893j66081M60760P23102N64828j01279
$$ 9540045 9992757 9034623 9341735 9475933 9966826 9800745 10261505 10984607 11549435 11448156
3234A1448156m4220K20049O73694o84502j71580k28024j42850l1256m01240N34946
$$ 11448156 11403936 11623985 12297679 11613177 11441597 11213573 11070723 11039467 10638227 11173173
3224A1173173Q9845K5466L43896M6555l04273M11796K92591j20228K73814O1401
$$ 11173173 11263018 11288484 11632380 11678935 11374662 11786458 12079049 11958821 12232635 12294036
3214A2294036p07646p38232l9168R10277n34395M4601Q90264O64090K50761L87643
$$ 12294036 11586390 10848158 10808990 11719267 11184872 11229473 12119737 12783827 13034588 13422231
3204A3422231j16463k85244m34518K55410J1833k10369n17206N87929P7789O99114
$$ 13422231 13305768 13020524 12586006 12841416 12853249 12642880 12125674 12713603 12791392 13490506
3194A3490506n81062P7573O54486N11998n53599J93274K51941J46219m91479p47427
$$ 13490506 12909444 12987017 13641503 14153501 13599902 13793176 14045117 14191336 13699857 12952430
3184A2952430n16786k02454m38147J91410M47267M83041J02220K44763J178679
$$ 12952430 12435644 12233190 11795043 11986453 12433720 12916761 13018981 13263744 14442423
3175A4442423N21223K34530O43553L7278L46543q69962n83069R14425k26608K53993
$$ 14442423 14963646 15198176 15841729 15879007 16225550 15355588 14772519 15686944 15460336 15714329
3165A5714329Q3348L83451l5990m90482p01243O70434p182q58713k06798P60128
$$ 15714329 15797677 16181128 16145138 15654656 14953413 15623847 15616665 14757952 14551154 15311282
3155A5311282l51032q87157k71142R06586K78206l44678r8668Q16188j88790P29117
$$ 15311282 14960250 14073093 13801951 14708537 14986743 14642065 14543397 15359585 15170795 15899912
3145A5899912K72981O23676p29531m69797o87063L76711L73076k40728r7101J030734
$$ 15899912 16172893 16796569 16067038 15597241 14910178 15286889 15659965 15419237 15322136 16352870
3135A6352870M26775j19352N48564P41427J20966p5799k52451j08017j06621l60812
$$ 16352870 16779645 16660293 17208857 17950284 18071250 17995451 17743000 17634983 17528362 17167550
3125A7167550J12759R84217m00792M6121n54781M09125N77540n54159O8455M3589
$$ 17167550 17280309 18264526 17863734 17909855 17355074 17764199 18341739 17787580 17856035 17899624
3115A7899624O00897o23336k66996P44065O90168p95368k94693K49068J393314
$$ 17899624 18500521 17877185 17610189 18354254 19044422 18249054 17954361 18203429 19596743
3106A9596743K09988K96543N79660P58812l14324L63344o21065K40190p02422
$$ 19596743 19806731 20103274 20682934 21441746 21127422 21490766 20869701 21109891 20407469
3097B0407469J0679k5204l10945O673M50072Q12659R29715k85762K47678J43791
$$ 20407469 20418148 20392944 20081999 20088672 20538744 21351403 22281118 21995356 22243034 22386825
3087B2386825N88767k09453K15890M10149L47263m92099r36762M47243P21656
$$ 22386825 22975592 22766139 22982029 23392178 23739441 23247342 22310580 22757823 23479479
3078B3479479m56962k44474P7517R39852N29970J7988K97659O67311P73912m98963
$$ 23479479 23022517 22778043 22855560 23795412 24325382 24343370 24641029 25308340 26082252 25583289
3068B5583289l95360L39168P6243o66562J3813O75108P70837M62489Q32987L30360
$$ 25583289 25187929 25527097 25603340 24936778 24950591 25625699 26396536 26859025 27692012 28022372
3058B8022372J07737o9539P30216N8770K89534j47721N06244l7302L76808Q9440
$$ 28022372 28130109 28060570 28790786 28849556 29139090 28991369 29497613 29460311 29837119 29926559
3048B9926559P22038M69988l41286l65106K37656n7626M88755l33622K35719L45992
$$ 29926559 30648597 31118585 30777299 30412193 30649849 30592223 31080978 30747356 30983075 31329067
3038C1329067m96155m7006K44391o83107k11895p29766O35559R54353P27025k76593
$$ 31329067 30832912 30785906 31030297 30347190 30135295 29405529 30041088 30995441 31722466 31445873
3028C1445873j29448J353024k76138m62964l24333P2540l90050o32852l19236
$$ 31445873 31316425 32669449 32393311 31930347 31606014 31678554 31288504 30655652 30336416
3019C0336416O1548n14486l66195p97585P39636K18729l56079K12254J046830
$$ 30336416 30397964 29883478 29517283 28719698 29459334 29678063 29321984 29534238 30581068
3010C0581068o91210l69820M99585J401600M90929j89449O82568J116508J43341
$$ 30581068 29889858 29520038 30019623 31421223 31912152 31722703 32405271 33521779 33665120
3001C3665120j064659j958617j684548j186606j205962j008059m96561n94255
$$ 33665120 32600461 30641844 28957296 27770690 26564728 25556669 25060108 24465853
2993B4465853j431577j096743k83393p71053r11591M53946P120l76816o16001
$$ 24465853 23034276 21937533 21654140 20883087 19971496 20425442 20432562 20055746 19439745
2984A9439745n59081j56773L26722j024481r45779o75109O11677K7147l16260
$$ 19439745 18880664 18723891 19050613 18026132 17080353 16405244 17016921 17044068 16727808
2975A6727808k50776J85906K2740n51632M63678m41142n12328M33306P2852n81254
$$ 16727808 16477032 16662938 16685678 16134046 16597724 16156582 15644254 16077560 16150412 15569158
2965A5569158p75751R7580M31955M16056n67069o19932p40263O79353J4537n85712
$$ 15569158 14793407 14890987 15322942 15738998 15171929 14551997 13811734 14491087 14505624 13919912
2955A3919912J40855N85116r7429l23068k14692k25078L1147m66147K41760l05403
$$ 13919912 14060767 14645883 14548454 14225386 14010694 13785616 13816763 13350616 13592376 13286973
2945A3286973n89067O81062O66306q456l43208r96066j86852K50516K4886m13339
$$ 13286973 12697906 13378968 14045274 14036818 13693610 12697544 12510692 12761208 12786094 12372755
2935A2372755j97259k04514K22837k06140M24580j00999L5249L5725M37950L39851
$$ 12372755 12175496 11970982 12193819 11987679 12412259 12311260 12346509 12382234 12820184 13160035
2925A3160035j85283J42326J133444J86188p18349n87327J15439m62820L77473
$$ 13160035 12974752 13117078 14250522 14436710 13718361 13131034 13246473 12783653 13161126
2916A3161126p67046k85139K08167J112215R39168k39847m36841K22444J02638
$$ 13161126 12394080 12108941 12317108 13429323 14368491 14128644 13691803 13914247 14016885
2907A4016885M19031m87747j111016O10147J000552J373209l57325O61757K34905
$$ 14016885 14435916 13948169 12837153 13447300 14447852 15821061 15463736 16125493 16360398
2898A6360398O4685j53739M23733q63516O8702o28747l6938J6397N00534k70458
$$ 16360398 16425083 16271344 16695077 15831561 15900263 15271516 15234578 15250975 15751509 15481051
2888A5481051l94961l15067J80651n62402L78590L37444N74624m06742m53798
$$ 15481051 15086090 14771023 14951674 14389272 14767862 15105306 15679930 15273188 14819390
2879A4819390N19364P57r43744j160634o96621j95007l56621q08066l66463L53466
$$ 14819390 15338754 15339511 14395767 13235133 12538512 12343505 11986884 11178818 10812355 11165821
2869A1165821J335656P4844K49692n62702n01495Q52585O57718j67271n32539
$$ 11165821 12501477 12576321 12826013 12263311 11761816 12614401 13272119 13104848 12572309
2860A2572309j5911Q68059O65018J76441n61458j94955l9562N65284j00475j87584
$$ 12572309 12556398 13424457 14089475 14265916 13704458 13509503 13469941 14035225 13934750 13747166
2850A3747166j65814J73610m0624k45479l48991o47245q54013j38059o26976o11470
$$ 13747166 13581352 13754962 13714338 13468859 13119868 12472623 11618610 11480551 10853575 10242105
2840A0242105J15451J130185j98490n9335J53989L6669K8651r4638q79830l72803
$$ 10242105 10357556 11487741 11289251 11229916 11383905 11420574 11449225 11354587 10474757 10101954
2830A0101954M02701N33654K5221m06087n84427M31721O71991O72854j33593k05947
$$ 10101954 10504655 11038309 11063530 10657443 10073016 10504737 11176728 11849582 11715989 11510042
2820A1510042o606O74560l2691K03610k58349L77716J18750M60147j072527n85066
$$ 11510042 11503436 12177996 12145305 12348915 12090566 12468282 12587032 13047179 11974652 11389586
2810A1389586j6794k4302O9901k586N38276K51147n5227N81387M5484l16194K99113
$$ 11389586 11372792 11348490 11418391 11415805 11954081 12205228 12150001 12731388 12776872 12460678 12759791
2799A2759791K81074L88930K20525N34223M3460M11181n67959l23444k94377J78025
$$ 12759791 13040865 13429795 13650320 14184543 14228003 14639184 14071225 13747781 13453404 13631429
2789A3631429J91958j30124n54297R02346K20942J140514N25571L7895k21546
$$ 13631429 13823387 13693263 13138966 14041312 14262254 15402768 15928339 15966234 15744688
2780A5744688J44743l78080L30571l89317J213997N69472J439760Q15248P76045
$$ 15744688 15889431 15511351 15841922 15452605 16666602 17236074 18675834 19491082 20267127
2771B0267127J344064P59217O59491K98385J45643N75757O90497J098402P4464
$$ 20267127 21611191 22370408 23029899 23328284 23473927 24049684 24740181 25838583 25913047
2762B5913047q67130m82979K12197J44234K38743N42201k97725k4615N09676j62688
$$ 25913047 25045917 24562938 24775135 24919369 25158112 25700313 25402588 25377973 25887649 25724961
2752B5724961j248663K36941m61746o38301j083543j070893j178715p83622K26490
$$ 25724961 24476298 24713239 24251493 23613192 22529649 21458756 20280041 19496419 19722909
2743A9722909k32863j143352q44446L36744j60980j020820o03472m45840J53746
$$ 19722909 19490046 18346694 17502248 17838992 17678012 16657192 16053720 15607880 15761626
2734A5761626m54556j94453r6309j41966q77769K43030k6848R8467n02548P2537
$$ 15761626 15307070 15112617 15016308 14874342 13996573 14239603 14212755 14311222 13808674 13881211
2724A3881211N57747j22505k30282K40834L30330j60477l10185q05201n91041
$$ 13881211 14438958 14316453 14086171 14327005 14657335 14496858 14186673 13381472 12790431
2715A2790431M88090j38675p14970k65320O0041Q30986L24707q9482M45732l44985
$$ 12790431 13278521 13139846 12424876 12159556 12219597 13050583 13375290 13285808 13731540 13386555
2705A3386555j23316J20288j174634J77615k4429L99389J32152j93395o41693
$$ 13386555 13263239 13383527 12208893 12386508 12362079 12761468 12893620 12700225 12058532
2696A2058532M74310J010953J18759l45021K40476L40060O21170j34921L7205
$$ 12058532 12532842 13543795 13662554 13317533 13558009 13898069 14519239 14384318 14421523
2687A4421523m15289M4996l78508J80726o34643p30969K18354P01263N30072k95992
$$ 14421523 14006234 14051230 13672722 13853448 13218805 12487836 12706190 13407453 13937525 13641533
2677A3641533j71544N28736O27675j6146n94744n76225m613M38339K66313N12319
$$ 13641533 13469989 13998725 14626400 14610254 14015510 13439285 13434672 13873011 14139324 14651643
2667A4651643j76027N72891P10026R40525R11129k93206j10970k9129R02805l20594
$$ 14651643 14475616 15048507 15758533 16699058 17610187 17316981 17206011 17176882 18079687 17759093
2657A7759093k54152o4004N76536j70517m82921p95831J092737L29592k22070
$$ 17759093 17504941 17440937 18017473 17846956 17364035 16568204 17660941 17990533 17768463
2648A7768463n76400O08929Q32528O90483n09196K65450k66331P4798M13950J31885
$$ 17768463 17192063 17800992 18633520 19324003 18814807 19080257 18813926 18888724 19302674 19434559
2638A9434559o56360p33631O45571J571678l68058p74988R3550O69769P57801
$$ 19434559 18778199 18044568 18690139 20261817 19893759 19118771 19212321 19882090 20639891
2629B0639891l85811j40602K15465j94803N84332m4900o44878J30367J76407o8052
$$ 20639891 20254080 20113478 20328943 20134140 20718472 20673572 20028694 20159061 20335468 20267416
2619B0267416M53368J92077J81563j64210M37245O51231o4259k10074M19772Q16833
$$ 20267416 20720784 20912861 21094424 20930214 21367459 22018690 21954431 21744357 22164129 22980962
2609B2980962P3106J86306R04834M86541k54634Q80239J158055L02815K91973
$$ 22980962 23054068 23240374 24145208 24631749 24377115 25257354 26415409 26718224 27010197
2600B7010197J596162R88930L12330L35440R73340J359879J190487R62383K123546
$$ 27010197 28606359 29595289 29907619 30243059 31216399 32576278 33766765 34729148 36852694
2591C6852694J672522J136450Q509J234502J260659J972439P56715Q62727J177598
$$ 36852694 38525216 39661666 39670175 40904677 42165336 44137775 44894490 45757217 46934815
2582D6934815J110663J699914J684890Q90204R48774M62425K577725R37075l1017
$$ 46934815 48045478 49745392 51430282 52320486 53269260 53731685 56309410 57246485 57215468
2573E7215468n9900P54852R74980K77918j899874j254910p47537m87214q44993
$$ 57215468 57155568 57910420 58885400 59163318 57263444 56008534 55260997 54773783 53928790
2564E3928790k028798j486076j299446r25143j681464j659511r01653j007770
$$ 53928790 51899992 50413916 49114470 48189327 46507863 44848352 43946699 42938929
2556D2938929j401903j261813j835555j691752j959024n69434q74744r93709r02299
$$ 42938929 41537026 40275213 38439658 36747906 34788882 34219448 33344704 32350995 31448696
2547C1448696l11590p65863j93607q76879k20534r48195n61570j56829l04555
$$ 31448696 31137106 30371243 30177636 29300757 29080223 28132028 27570458 27413629 27109074
2538B7109074n6574M69400j06338k81214n08778L48800K01673K59399Q1299m57533
$$ 27109074 27052500 27521900 27415562 27134348 26625570 26974370 27176043 27435442 27516741 27059208
2528B7059208j439575O078R7250n93145j068416J07088N21364J58441j2144m25586
$$ 27059208 25619633 25625711 25722961 25129816 24061400 24168488 24689852 24848293 24836149 24410563
2518B4410563M73898O24613Q32573L62262K76842k93218L32389N98210J52298
$$ 24410563 24884461 25509074 26341647 26703909 26980751 26687533 27019922 27618132 27770430
2509B7770430j14442j59156M17158J693743M05243N20907Q45928J350609N75048
$$ 27770430 27655988 27496832 27913990 29607733 30012976 30533883 31379811 32730420 33305468
2500C3305468N18253J60063L94426j44082J50562j280827l02511l51154k63345
$$ 33305468 33823721 33983784 34378210 34234128 34384690 33103863 32801352 32450198 32186853
2491C2186853l1546n69458M4699O97766L01817L92545j17601j39445N60521Q99972
$$ 32186853 32155307 31585849 31630548 32328314 32630131 33022676 32905075 32765630 33326151 34226123
2481C4226123j32314k33390O96294P58063Q67091J221386Q28876R01971K407528
$$ 34226123 34093809 33860419 34556713 35314776 36181867 37403253 38232129 39134100 41541628
2472D1541628J185988J483037O43782K42059L65428J46971r905j46205j229443
$$ 41541628 42727616 44210653 44854435 45096494 45461922 45608893 45598988 45452783 44223340
2463D4223340n19360R74687J47550k36059m2401O89733M49875m03301j32007l16079
$$ 44223340 43703980 44678667 44826217 44590158 44547757 45237490 45687365 45284064 45152057 44835978
2453D4835978k3014l11368r69812j271778j363836j691907q78690j465082r45629
$$ 44835978 44812964 44501596 43531784 42260006 40896170 39204263 38325573 36860491 35914862
2444C5914862o80765o26738k98483J57668L8294o91624p51547L20262q48619j424158
$$ 35914862 35234097 34607359 34308876 34466544 34504838 33813214 33061667 33381929 32533310 31109152
2434C1109152j135038j54219J7277n51435o45052n97587k08439P67497K21505
$$ 31109152 29974114 29819895 29837172 29285737 28640685 28043098 27834659 28602156 28823661
2425B8823661j16473j79664k30185M85367k56145j02382j29536j42564J38624
$$ 28823661 28707188 28527524 28297339 28782706 28526561 28424179 28294643 28152079 28290703
2416B8290703r3936l54100R2806J068255N61650J77872m91573M1223J185921R6438
$$ 28290703 28196767 27842667 27935473 29003728 29565378 29743250 29251677 29292900 30478821 30575259
2406C0575259J0274l40705l60335k94441J16494N53836p26004J35733R85754P73812
$$ 30575259 30585533 30244828 29884493 29590052 29706546 30260382 29534378 29670111 30655865 31429677
2396C1429677Q15921N41546J130201J478846J436608N52085O36137J067907K051860
$$ 31429677 32245598 32787144 33917345 35396191 36832799 37384884 38021021 39088928 41140788
2387D1140788O85082J336980J235764J054688J322747J139136J819293Q91949
$$ 41140788 41825870 43162850 44398614 45453302 46776049 47915185 49734478 50626427
2379E0626427J036563j62791l8352j90465l86751J24978L2633M05838n70058o66402
$$ 50626427 51662990 51500199 51461847 51271382 50884631 51009609 51042242 51448080 50878022 50211620
2369E0211620r4003L44294m04054o37636K9423L72822p0877n59131o66290q46746
$$ 50211620 50117617 50461911 50057857 49420221 49449644 49822466 49751589 49192458 48526168 47679422
2359D7679422l67981p40525p00804j226426l41118k48183K39035Q93552k78851
$$ 47679422 47311441 46570916 45870112 44643686 44302568 44054385 44293420 45186972 44908121
2350D4908121j86394j99481J19171O02720n13872J01763O53833J376008J379657
$$ 44908121 44721727 44522246 44641417 45244137 44730265 44832028 45485861 46861869 48241526
2341D8241526Q6075O8977J111979J153143J276702N55413N6900K20602N95134
$$ 48241526 48327601 48396578 49508557 50661700 51938402 52493815 52550715 52771317 53366451
2332E3366451J582994L26498K75377J040412J410213J70124j91646M94255N69386
$$ 53366451 54949445 55275943 55551320 56591732 58001945 58172069 57980423 58474678 59044064
2323E9044064K58447M10862P52237J431696O71527o43966m48480P55627J44080
$$ 59044064 59302511 59713373 60465610 61897306 62568833 61924867 61476387 62232014 62376094
2314F2376094Q3560l05827M97626R52302O55183O30558R19610J014597M97729
$$ 62376094 62459654 62153827 62651453 63603755 64258938 64889496 65809106 66823703 67321432
2305F7321432Q07074R92562Q09110l94747M88339J025542Q06077O49738K63249
$$ 67321432 68128506 69121068 69930178 69535431 70023770 71049312 71855389 72505127 72768376
2296G2768376J196164J127592J144302J267476J142307J473199J459863J834912
$$ 72768376 73964540 75092132 76236434 77503910 78646217 80119416 81579279 83414191
2288H3414191K363520K152469J956843J385991J771155K645976K326823K435062
$$ 83414191 85777711 87930180 89887023 91273014 93044169 95690145 98016968 100452030
2280A00452030L681963L518358M229209K847954L619848L396651K795916K132789
$$ 100452030 104133993 107652351 111881560 114729514 118349362 121746013 124541929 126674718
2272A26674718K789975K341789J251492J712747J612331J455291J023713J260378
$$ 126674718 129464693 131806482 133057974 134770721 136383052 137838343 138862056 140122434
2264A40122434J502817J688468O78202l32920Q56039J031166K87812l4172K11240
$$ 140122434 141625251 143313719 143991921 143659001 144515040 145546206 145834018 145799846 146011086
2255A46011086M90581p10563j320940j363085n76871n81557j03372j054510n97890
$$ 146011086 146501667 145791104 144470164 143107079 142530208 141948651 141845279 140790769 140192879
2246A40192879j511533j485794j106578j918180k287666j723907j154578j432415
$$ 140192879 138681346 137195552 136088974 134170794 131883128 130159221 129004643 127572228
2238A27572228j464736j276573k11085J277468L01872l29388L73054J097867Q97146
$$ 127572228 126107492 124830919 124619834 125897302 126199174 125869786 126242840 127340707 128237853
2229A28237853J112842J017112K280767J160422J500933J866389J730283J744370
$$ 128237853 129350695 130367807 132648574 133808996 135309929 137176318 138906601 140650971
2221A40650971J842939K049722K121268J854470J770565J488100J868327R53729
$$ 140650971 142493910 144543632 146664900 148519370 150289935 151778035 153646362 154600091
2213A54600091J176845J070851K278102J686204J693716J407286K252094J980743
$$ 154600091 155776936 156847787 159125889 160812093 162505809 163913095 166165189 168145932
2205A68145932J615657K355049J907220J491597P51175K52228N90588R44569j40211
$$ 168145932 169761589 172116638 174023858 175515455 176266630 176518858 177109446 178054015 177913804
2196A77913804P86738J667554P51846J059739J683303L170021K947187K502613
$$ 177913804 178700542 180368096 181119942 182179681 183862984 187033005 189980192 192482805
2188A92482805M102339M946913O298413N572963P586622P026685P838806P965559
$$ 192482805 196585144 201532057 207830470 213403433 220990055 228016740 235855546 243821105
2180B43821105R430694R573989R603938P694935P653271O467556M003571K17912
$$ 243821105 253251799 262825788 272429726 280124661 287777932 294245488 298249059 298466971
2172B98466971m653820p662164j0556754j2894227j2557747j0981556j0083950
$$ 298466971 293813151 286150987 275594233 262700006 250142259 239160703 229076753
2165B29076753j0045860q465469p399906p285269p534107o340537n831120m706596
$$ 229076753 219030893 210565424 203165518 195880249 188346142 182005605 176174485 171467889
2157A71467889m479306m130822l008636l343952m178723l737756j760073j951468
$$ 171467889 166988583 162857761 159849125 156505173 152326450 148588694 146828621 144877153
2149A44877153k565687k647475j445441j261516j506100j740985r57773p20168
$$ 144877153 142311466 139663991 138218550 136957034 135450934 133709949 132752176 132032008
2141A32032008j530855j237902r86712j289727j686715j826100p03844r17576
$$ 132032008 130501153 129263251 128276539 126986812 125300097 123473997 122770153 121852577
2133A21852577k611072k962545k200955j645141j877523k777565j803815j382339
$$ 121852577 119241505 116278960 114078005 112432864 110555341 107777776 105973961 104591622
2125A04591622k037151k195625k131541j510891j648790j444482q8210o18610
$$ 104591622 102554471 100358846 98227305 96716414 95067624 93623142 93534932 92916322
2117I2916322o09584j245911K47110p90730j375571j049558n27779l38055m12098
$$ 92916322 92306738 91060827 91307937 90517207 89141636 88092078 87564299 87226244 86814146
2108H6814146o05714p0251P38895k36821r17409L04088J143715L77262n86993
$$ 86814146 86208432 86138181 86877076 86640255 85722846 86026934 87170649 87547911 86960918
2099H6960918N58827P00498N73558K38872K37787k56719o14064j68937j965j04968
$$ 86960918 87519745 88220243 88793801 89032673 89270460 89013741 88399677 88230740 88228775 88123807
2089H8123807j105182m85375k06160r4763p65923q35130k74677N35592L9630n36359
$$ 88123807 87018625 86533250 86327090 86232327 85466404 84631274 84356597 84892189 84931819 84395460
2079H4395460j62662N20803q58134j90644K97029l98494j304588j159584p33465
$$ 84395460 84232798 84753601 83895467 83704823 84001852 83603358 82298770 81139186 80405721
2070H0405721j346587k050119k241121k107775l55178j290478j756265p01803
$$ 80405721 79059134 77009015 74767894 72660119 72304941 71014463 69258198 68556395
2062F8556395j85038j047712j139395r01401k95754n84446k1953K20693N87954
$$ 68556395 68371357 67323645 66184250 65282849 64987095 64402649 64380696 64601389 65189343
2053F5189343O25475o35330P6399J353577Q63764J82794J346551J979012R76358
$$ 65189343 65814818 65179488 65255887 66609464 67473228 67656022 69002573 70981585 71957943
2044G1957943J073887J052937K103231J904510J005171J275686J068330J175150
$$ 71957943 73031830 74084767 76187998 78092508 79097679 80373365 81441695 82616845
2036H2616845J50833m55200n54996n53079j752171k106147k336443k135780l624028
$$ 82616845 82767678 82312478 81757482 81204403 79452232 77346085 75009642 72873862 69249834
2027F9249834k932603j973471k704213l800072k178526j279501j546447k380910
$$ 69249834 66317231 64343760 61639547 57839475 55660949 54381448 52835001 50454091
2019E0454091j370734j079170r53372r27286j644261j345980p36203o41535n68275
$$ 50454091 49083357 48004187 47050815 46123529 44479268 43133288 42397085 41755550 41187275
2010D1187275o62818l58777j313203r15081m93885m77976R662n13140o01516N36345
$$ 41187275 40524457 40165680 38852477 37937396 37443511 36965535 36975197 36462057 35860541 36396886
2000C6396886O0362j310904k76732n4795j194939k33573M16346L05537m59787
$$ 36396886 36457248 35146344 34869612 34814817 33619878 33386305 33802651 34108188 33648401
1991C3648401j04123k21594l53445p04410j349862l33145j63077o37303n53672
$$ 33648401 33544278 33322684 32969239 32264829 30914967 30581822 30418745 29781442 29227770
1982B9227770J82591j2l99242n55400M27800R9178J17576n58787P608m7589j133825
$$ 29227770 29410361 29410349 29011107 28455707 28883507 28982685 29100261 28541474 28549082 28501493 27367668
1971B7367668j4272O84540o85986j92630J14031m68534k289p87862n31168P54638
$$ 27367668 27353396 28037936 27351950 27159320 27273351 26804817 26802528 26014666 25483498 26238136
1961B6238136k23260J31442o53293P8585L91699k49288l88417L0920J58288N9055
$$ 26238136 26014876 26146318 25493025 25571610 25963309 25714021 25325604 25356524 25514812 25573867
1951B5573867p63643l2182K0007n56959j120995n82699K33626l12849j548811
$$ 25573867 24810224 24778042 24798049 24241090 23120095 22537396 22771022 22458173 20909362
1942B0909362N53685K67206n47976j58426K08836R21112N50451n99760j79277
$$ 20909362 21463047 21730253 21182277 21023851 21232687 22153799 22704250 22104490 21925213
1933B1925213N67450o83036j189976j88534N30656l93558Q7655J45016N51536
$$ 21925213 22492663 21809627 20619651 20431117 20961773 20568215 20655870 20800886 21352422
1924B1352422k62505o09540j02213J021889J47718o55370l93910J148193P35843
$$ 21352422 21089917 20480377 20378164 21400053 21547771 20892401 20498491 21646684 22382527
1915B2382527m9733l05782Q05131j55695k21650m44285M03154J269363L96138
$$ 22382527 22332794 22027012 22832143 22676448 22454798 22010513 22413667 23683030 24079168
1906B4079168J85279Q49807L04562m25065n60036J677444J80927l19334K1117
$$ 24079168 24264447 25114254 25418816 24993751 24433715 26111159 26292086 25972752 25993869
1897B5993869J032134J468602M97215J295404J449682l00900o53398l33523O79684
$$ 25993869 27026003 28494605 28991820 30287224 31736906 31436006 30782608 30449085 31128769
1888C1128769O86720q77177m52081J156432R20294J53178K51466K19004P29598
$$ 31128769 31815489 30938312 30486231 31642663 32562957 32716135 32967601 33186605 33916203
1879C3916203L68252Q65169O83908J101525r2995R55817J304102O39940k11354
$$ 33916203 34284455 35149624 35833532 36935057 36842062 37797879 39101981 39741921 39530567
1870C9530567r6629N18784J130795J089104J026128K089217J801668L45267P78464
$$ 39530567 39433938 39952722 41083517 42172621 43198749 45287966 47089634 47434901 48213365
1861D8213365J174742J164844K97653J002543J980528J617088R19496J296535
$$ 48213365 49388107 50552951 50850604 51853147 53833675 55450763 56370259 57666794
1853E7666794R79019J417663L20629J888146K136856J280682J299903K004077
$$ 57666794 58645813 60063476 60384105 62272251 64409107 65689789 66989692 68993769
1845F8993769K996769J781949J447908J763945J666899J985068J091585K88792
$$ 68993769 71990538 73772487 75220395 76984340 78651239 80636307 81727892 82016684
1837H2016684O06623J956851J636660K455088K628154L045158K548367K709569
$$ 82016684 82623307 84580158 86216818 88671906 91300060 94345218 96893585 99603154
1829I9603154L936287L993731K559094L339380N364800N745535O124477O666677
$$ 99603154 103539441 107533172 110092266 113431646 118796446 124541981 130666458 137333135
1821A37333135P667389R241467R220865P361883N507089L169977K024394L593128
$$ 137333135 145000524 154241991 163462856 170824739 176331828 179501805 181526199 185119327
1813A85119327O119378N967125L445659o51155j832943k459084q82581J133248
$$ 185119327 191238705 197205830 200651489 200000334 198167391 195708307 194825726 195958974
1805A95958974M912649P200440P975802M117458k865912p447217p687565o859415
$$ 195958974 200871623 208072063 216047865 220165323 217299411 209852194 202164629 195305214
1797A95305214m352503l314036k512483j101496K094309L577213N315838N986615
$$ 195305214 190952711 187638675 185126192 184024696 186119005 189696218 195012056 200998671
1789B00998671P342545P017925M250506J168404J656841J809062K993955M061467
$$ 200998671 208341216 215359141 219609647 220778051 222434892 224243954 227237909 231299376
1781B31299376N189788P101639P426111R781399J1026978J1138625O489510l491572
$$ 231299376 236489164 243590803 251016914 260798313 271825291 282963916 289453426 285961854
1773B85961854j2643502j8599974j8793505j5343575j3209284r527536q831795
$$ 285961854 273318352 254718378 235924873 220581298 207372014 197844478 189012683
1766A89012683q066097o055833m753152m922807n577830o188158n382331o380152
$$ 189012683 180946586 174890753 170137601 165214794 159636964 153448806 148066475 141686323
1758A41686323o340699o583879n916685m451249m460717m337229l882587n249104
$$ 141686323 135345624 128761745 122845060 118393811 113933094 109595865 105713278 100464174
1750A00464174m857518m410206l851262l870226l959663l692515l020333l261634
$$ 100464174 95606656 91196450 87345188 83474962 79515299 75822784 72802451 69540817
1742F9540817k672368l098008j634198j969377k527218j339202o85361j859584
$$ 69540817 66868449 63770441 62136243 60166866 57639648 56300446 55615085 53755501
1734E3755501k409744j398541j899888j338527j896576j158014r78252q30090
$$ 53755501 51345757 49947216 48047328 46708801 44812225 43654211 42675959 41845869
1726D1845869r50057j166577l92954o33189j120250j370119o04160q88393j382679
$$ 41845869 40895812 39729235 39336281 38703092 37582842 36212723 35608563 34720170 33337491
1717C3337491n99480j351617q57159j433017m31001m80977j03879n43898j261062
$$ 33337491 32738011 31386394 30529235 29096218 28665217 28184240 28080361 27536463 26275401
1708B6275401l89593m05502k57435k65809k96719k92513j270564n21444p27821
$$ 26275401 25885808 25480306 25222871 24957062 24660343 24367830 23097266 22575822 21848001
1699B1848001n0141j414190o14899N73092K48893l03565P60793l8322m93239m84627
$$ 21848001 21797860 20383670 19768771 20341863 20590756 20287191 21047984 21009662 20516423 20031796
1689B0031796p69105J21197k74980p05718p68895m50871m5129l38840l08127J63063
$$ 20031796 19262691 19383888 19108908 18403190 17634295 17183424 17138295 16799455 16491328 16654391
1679A6654391m02435r08764L38831m57695l80735j74766J67596K70454p02990
$$ 16654391 16251956 15343192 15682023 15224328 14843593 14668827 14836423 15106877 14403887
1670A4403887j049601j226270j26889n94221J18208k3231J30205J99847J77453
$$ 14403887 13354286 12128016 12001127 11406906 11525114 11501883 11632088 11831935 12009388
1661A2009388L53378j65255m76316q30944q78405k23108N8598N52690j218409
$$ 12009388 12362766 12197511 11721195 10890251 10011846 9788738 9847336 10400026 9181617
1652I181617R5806k37525j6882r9940N49188o85878k61252j62534O11740k69228
$$ 9181617 9277423 9039898 9023016 8923076 9472264 8786386 8525134 8362600 8974340 8705112
1642H705112r22689o30987L97430M51842o58784p18004J47619o21663j28635K50372
$$ 8705112 7782423 7151436 7548866 8000708 7341924 6623920 6771539 6149876 6021241 6271613
1632F271613N67229m84489j11564J04177j00004N91036l97095m77023q05033j98093
$$ 6271613 6838842 6354353 6242789 6346966 6246962 6837998 6440903 5963880 5158847 4960754
1622D960754J45549N5273q12344P83511N41544J20153o67282L77974K384k16216
$$ 4960754 5106303 5161576 4349232 5132743 5674287 5794440 5127158 5505132 5507516 5291300
1612E291300j05864K59678n18296o94876M47874l0988l71150k67502p28769O63436
$$ 5291300 5185436 5445114 4926818 4231942 4679816 4648828 4277678 4010176 3281407 3944843
1602C944843p9170L40485K33412n2822o8102j74930O2761l35862K34187p69773
$$ 3944843 3865673 4206158 4439570 4386748 4318646 4143716 4206477 3870615 4104802 3335029
1592C335029o59441l00337N89807Q54445k06405j84573O45975O42716j61988L09151
$$ 3335029 2675588 2375251 2965058 3819503 3613098 3428525 4074500 4717216 4555228 4864379
1582D864379o01921n20959l54045J44551M42435l29598o11073l57543J38442n45163
$$ 4864379 4262458 3741499 3387454 3532005 3974440 3644842 3033769 2676226 2814668 2269505
1572B269505k82034Q4358N35203J60225J74935K91853l88512n02513k11413M2758
$$ 2269505 1987471 2071829 2607032 2767257 2942192 3234045 2845533 2343020 2131607 2174365
1562B174365J91750p19799k89900M95392K89997o51252K57724N69037O75919k48392
$$ 2174365 2366115 1646316 1356416 1851808 2141805 1490553 1748277 2317314 2993233 2744841
1552B744841k93171l25222K01698J44568o35049J74322n06445L87436j32985m05952
$$ 2744841 2451670 2126448 2328146 2472714 1837665 2011987 1505542 1892978 1759993 1354041
1542A354041L19561K50772K5282M98313M36483q3075k66387n7724O03044l24397
$$ 1354041 1673602 1924374 1949656 2447969 2884452 2801377 2534990 2477266 3080310 2755913
1532B755913j075560k79789k68162P08124j82473j17948J01840M80112o9283J71215
$$ 2755913 1680353 1400564 1132402 1840526 1658053 1540105 1641945 2122057 2052774 2223989
1522B223989J13863J50488m63990J43230j69395j53251J43534K3288R1529K8275
$$ 2223989 2337852 2488340 2024350 2167580 1998185 1844934 1988468 2011756 2103285 2131560
1512B131560l2155J69076m10712N93349J18114r18323K27584O93012J48901k88877
$$ 2131560 2099405 2268481 1857769 2451118 2569232 1650909 1878493 2571505 2720406 2431529
1502B431529J37224J49747m26424n34706O85992l65792m94032l51308N93859Q64797
$$ 2431529 2568753 2718500 2292076 1757370 2443362 2077570 1583538 1232230 1826089 2690886
1492B690886n48142k61393J91651Q2638m86796k10789j99172p1376k02430j14355
$$ 2690886 2142744 1881351 2073002 2155640 1668844 1458055 1258883 1187507 985077 870722
1482H70722N15632J43045L03678J57854m4164J736J843K20582L60778p75105K65127
$$ 870722 1386354 1529399 1833077 1990931 1946767 1948503 1950346 2170928 2531706 1756601 2021728
1471B021728j58427q8085j84254L6095j00908r1732L72400N84204r64756k71233
$$ 2021728 1863301 1775216 1590962 1627057 1526149 1434417 1806817 2391021 1426265 1155032
1461A155032J61597O48502K23619j50686k45313K34431j44014k91341l09918k82790
$$ 1155032 1316629 1965131 2188750 2038064 1792751 2027182 1883168 1591827 1281909 999119
1451I99119j197466L71561L64484L59969k7927m97869M07532J10129m56261k00015
$$ 999119 -198347 173214 537698 897667 869740 371871 779403 889532 433271 233256
1441B33256q5001L35310M76619j19254q4858K14774M53014N0101Q0909k06375
$$ 233256 148255 483565 960184 840930 756072 970846 1423860 1473961 1554870 1348495
1431A348495l98464l85659O04495Q3874k82002k38585J68791K10335n84190m52932
$$ 1348495 950031 564372 1168867 1252741 970739 732154 900945 1111280 527090 74158
1421G4158N52852k13347J50548o2221M783j05934n47362M4666O9781m98517K38045
$$ 74158 627010 413663 564211 501990 506773 400839 -146523 -101857 -32076 -530593 -292548
1410b92548J14084R69858m43634q47695Q86772N24076n26228k91652m16150k90779
$$ -292548 -178464 791394 347760 -499935 386837 910913 384685 93033 -323117 -613896
1400f13896k66348L77131j31053r8264n27088L800k04933K22173N75387J93150
$$ -613896 -880244 -503113 -634166 -732430 -1259518 -1255718 -1460651 -1238478 -663091 -469941
1390d69941k84978L28056K87101L57642m69641l16561L18856j9641m06942K99155
$$ -469941 -754919 -426863 -139762 217880 -251761 -568322 -249466 -269107 -676049 -376894
1380c76894J03111L207N6348J97679N20325m4461K1223J95503k6070q84767l85524
$$ -376894 -273783 -270576 -214228 -16549 503776 459315 480538 676041 649971 -234796 -620320
1369f20320k0933k18243n72311o7735J1676M24124o88941J020559Q59988N32982
$$ -620320 -641253 -859496 -1431807 -1499542 -1487866 -1063742 -1752683 -732124 127864 660846
1359F60846r85489K70859k02011K5155J0899Q0844j93399J13075o9176m80397
$$ 660846 -324643 -53784 -255795 -230640 -219741 -138897 -332296 -219221 -288397 -768794
1349g68794j4602R78945J75423j10701M67035L17912J17830n82696l64677l28643
$$ -768794 -783396 195549 370972 260271 727306 1045218 1163048 580352 215675 -112968
1339a12968l68420m85885k28173M58377k09777j15147n75599j93221O67547P9001
$$ -112968 -481388 -967273 -1195446 -737069 -946846 -1061993 -1637592 -1830813 -1163266 -1084265
1329a084265N28319l4513o20065n6800M7028p14254m02717J22333N28206M71600
$$ -1084265 -555946 -590459 -1210524 -1267324 -1220296 -1934550 -2337267 -2214934 -1686728 -1215128
1319a215128M19772k08099j61038R5120J002580p2582P78248R1721M71052q66939
$$ -1215128 -795356 -1003455 -1164493 -1069373 -66793 -139375 638873 730594 1201646 334707
1309C34707j72977n75149n22810n38736J32944l27143m24327P27703K6900P3314
$$ 334707 161730 -413419 -936229 -1474965 -1342021 -1669164 -2093491 -1365788 -1338888 -1265574
1299a265574k94027m66261P8178L17960O85519j2834j24078k98898N70692m22850
$$ -1265574 -1559601 -2025862 -1947684 -1629724 -944205 -957039 -1081117 -1380015 -809323 -1232173
1289a232173N35021l91519j6877L89426N47916R31874j4153K35706J84355k15057
$$ -1232173 -697152 -1088671 -1105548 -716122 -168206 763668 749515 985221 1169576 954519
1279I54519k05097j80884o06641M16622l03623K2769R9253k91581K7409j61113
$$ 954519 749422 568538 -38103 378519 74896 97665 196918 -94663 -67254 -228367
1269b28367k1316m57104n15151L64676j89405R7212o96886Q52152l18973J99289
$$ -228367 -249683 -706787 -1221938 -857262 -1046667 -949455 -1646341 -794189 -1113162 -913873
1259i13873m45662L53194J13916L28574M12128L38407q0581K20525P80866m82416
$$ -913873 -1359535 -1006341 -892425 -563851 -151723 186684 106103 326628 1107494 625078
1249F25078j3382Q61923l08464M91722j67572l20383q33784j33596p85806K05083
$$ 625078 611696 1473619 1165155 1656877 1489305 1168922 335138 201542 -584264 -379181
1239c79181l9254p79157n06157R0510J38437k92265J45172K39504j16589Q5907
$$ -379181 -418435 -1197592 -1703749 -1613239 -1474802 -1767067 -1621895 -1382391 -1498980 -1413073
1229a413073l01157K0149K50733K45248M84022m96497j83418P45868L95447j09711
$$ -1413073 -1714230 -1694081 -1443348 -1198100 -714078 -1210575 -1393993 -648125 -252678 -362389
1219c62389K01039L29337O04047L44330M1985n67193M73151p79066k05172l01320
$$ -362389 -161350 167987 772034 1116364 1158349 591156 1064307 285241 80069 -221251
1209b21251j69600k85450K88873M4318j62197n38452J56828k42180o5097n82695
$$ -221251 -390851 -676301 -387428 -343110 -505307 -1043759 -886931 -1129111 -1194208 -1776903
1199a776903O78312Q4539J008754o44483j22605m40108L15315j40097j59301J55740
$$ -1776903 -1098591 -1014052 -5298 -649781 -772386 -1212494 -897179 -1037276 -1196577 -1040837
1189a040837q147J3615J18765J354768K07869p60409l83969N0240J60420k36498
$$ -1040837 -1048984 -1035369 -916604 438164 646033 -114376 -498345 -448105 -287685 -524183
1179e24183r22455l98863K8157M38277l84566P0996L98767N2376l79775P76744
$$ -524183 -1446638 -1845501 -1817344 -1379067 -1763633 -1692637 -1293870 -1241494 -1621269 -844525
1169h44525K7858n0411J60389L88976l03437O0768n49790O761o6336j57273n81841
$$ -844525 -816667 -867078 -706689 -317713 -621150 -560382 -1110172 -1103411 -1169747 -1327020 -1908861
1158a908861J48576Q16189R33523l36791K85733N46737L37225q01986o3930m03046
$$ -1908861 -1760285 -944096 -10573 -347364 -61631 485106 822331 20345 -43585 -446631
1148d46631p1394m82807Q4941k26591J81661m5260P32374R9273j93312j88074
$$ -446631 -518025 -1000832 -915891 -1142482 -960821 -1006081 -273707 -174434 -367746 -555820
1138e55820O31597R03207o54890j32564P9861O20127m03465M80800j0955m73564
$$ -555820 75777 978984 324094 191530 271391 891518 488053 968853 957898 484334
1128D84334J27662m5291k99647P61841n4423K34401M58435L64645j073190o49805
$$ 484334 611996 566705 267058 1028899 974476 1208877 1667312 2031957 958767 308962
1118C08962l00408L72945K7345l78647j50548K73135O95324O77337j06449R48080
$$ 308962 8554 381499 408844 30197 -120351 152784 848108 1525445 1418996 2367076
1108B367076k40007m85707L49302J8989r17656j004307K37857J585419m40242
$$ 2367076 2127069 1641362 1990664 2009653 1091997 87690 325547 1910966 1470724
1099A470724p41855n55636N96947j68380o48256P1481M22333O32486R2567l21697
$$ 1470724 728869 173233 770180 601800 -46456 25025 447358 1079844 1172411 850714
1089H50714N16418Q2664o19304J26231l57600J78902n8008n05282L72508K37782
$$ 850714 1367132 1449796 830492 956723 599123 778025 720017 214735 587243 825025
1079H25025j61734M60469K99955j26435q31589L47213k848L69336K91313n5887
$$ 825025 663291 1123760 1423715 1297280 465691 812904 810056 1179392 1470705 1414818
1069A414818J93671P15078k75957n51682k67979K81518J99464K83452l04128k71643
$$ 1414818 1608489 2323567 2047610 1495928 1227949 1509467 1708931 1992383 1688255 1416612
1059A416612j01458J014438L62462K2595p31504o98810R01671K61369p24494p3344
$$ 1416612 1315154 2329592 2692054 2714649 1983145 1284335 2186006 2447375 1722881 1649537
1049A649537L08872N70312J25315J44040J140076q46753q55865M32130O72526
$$ 1649537 1958409 2528721 2654036 2798076 3938152 3091399 2235534 2667664 3340190
1040C340190k27649J68167P96443J408754K60739m85068l15283j77508J86575
$$ 3340190 3112541 3280708 4077151 5485905 5746644 5261576 4946293 4768785 4955360
1031D955360J31451k85648Q00448M39967j42403k71297J217000M64120n26249
$$ 4955360 5086811 4801163 5601611 6041578 5899175 5627878 6844878 7308998 6782749
1022F782749l31653N8247R96003K49166o04524K96890N05840M39601J56956M76900
$$ 6782749 6451096 6509343 7505346 7754512 7149988 7446878 7952718 8392319 8549275 9026175
1012I026175N99106l01046J04787J125894J096651L85537M07773j31583P33116
$$ 9026175 9625281 9324235 9429022 10554916 11651567 12037104 12444877 12313294 13046410
1003A3046410N32714J20655k95931l94829K66092J815337J122621P67457N91244
$$ 13046410 13579124 13699779 13403848 13009019 13275111 15090448 16213069 16980526 17571770
994A7571770J784799J437607R52137Q07967P48806J641597K164418R14409J867635
$$ 17571770 19356569 20794176 21746313 22554280 23303086 24944683 27109101 28023510 29891145
985B9891145J549681K233242K524910L251252L082716M066996L720713N201593
$$ 29891145 31440826 33674068 36198978 39450230 42532946 46599942 50320655 55522248
977E5522248N420794L574769J562521L547814O115190P577980Q722221J1621549
$$ 55522248 60943042 64517811 66080332 69628146 75743336 83321316 92043537 103665086
969A03665086J2794461J6560977J8784890K6229179L3981242M6000280O4534270
$$ 103665086 116459547 133020524 151805414 178034593 212015835 258016115 322550385
962C22550385R2025905O1004162m8551238r1627489p3819210m8153253l3105342
$$ 322550385 414576290 475580452 427029214 335401725 261582515 213429262 180323920
955A80323920k3994769k0826980j8828966j6519080j2285184q552250n023010
$$ 180323920 156329151 135502171 116673205 100154125 87868941 79316691 74293681
948G4293681l888830l582820l056008k843210m578935n011953m862640m626937
$$ 74293681 70404851 66822031 63766023 60922813 56343878 51331925 46469285 41842348
940D1842348l002079k432954k706262j990155k069686j301597j024808p40640
$$ 41842348 38840269 36407315 33701053 31710898 29641212 28339615 27314807 26574167
932B6574167l5074j216136j287234n88152o28558j656351j653342j183121j15516
$$ 26574167 26539093 25322957 24035723 23447571 22819013 21162662 19509320 18326199 18210683
923A8210683j337730o89108l59295m53164o34173j06920J16057o16578p63872
$$ 18210683 16872953 16183845 15824550 15371386 14737213 14630293 14746350 14129772 13365900
914A3365900k20882o57958n15206l93480Q0861j013891m57292j127447O4062q00388
$$ 13365900 13145018 12487060 11971854 11578374 11659235 10645344 10188052 9060605 9124667 8324279
904H324279n2311P8043K26992q0470q8073K62275J34698k78271j35555p88516
$$ 8324279 8271968 8350011 8577003 8496533 8408460 8670735 8805433 8527162 8391607 7603091
894G603091n01395o94894n00156n8476L68702j87016K35000j10613j01172M92285
$$ 7603091 7101696 6406802 5906646 5848170 6216872 6029856 6264856 6154243 6053071 6545356
884F545356K726o32501o52308J05461k46608K51629l19160j35842o14463J09330
$$ 6545356 6548082 5915581 5263273 5368734 5122126 5373755 5054595 4918753 4304290 4413620
874D413620k97219J3896n46030M29648L14508O8849L46475j77578n63950K1028
$$ 4413620 4116401 4130297 3584267 4013915 4328423 4397272 4743747 4566169 4002219 4023247
864D023247m32498K48087m26166m94346l1010m1577K9912M12284M0205K42269
$$ 4023247 3590749 3838836 3412670 2918324 2887314 2845737 2875649 3287933 3328138 3570407
854C570407j41814J46457j37160l26952j23416j46833K1191j17084j035134K58338
$$ 3570407 3428593 3575050 3437890 3110938 2987522 2840689 2861880 2744796 1709662 1968000
844A968000L84508k78895l78526K48443L35205K4684L28907M1380R5283j77592
$$ 1968000 2352508 2073613 1695087 1943530 2278735 2303419 2632326 2673706 2768989 2591397
834B591397m41365m35733l54364q34214J81919J42509j74845j96502O58728L70988
$$ 2591397 2150032 1714299 1359935 525721 707640 850149 675304 478802 1137530 1508518
824A508518L76784n89217N42595j12661n38494l89557L74299L53388J43080j94264
$$ 1508518 1885302 1296085 1838680 1726019 1187525 797968 1172267 1525655 1668735 1474471
814A474471N06922o00251o31849J89105J04681O7032m41995k9254J3387P29863
$$ 1474471 1981393 1381142 749293 938398 1043079 1110111 668116 638862 652249 1382112
804A382112j37574m42647k01075J36875J99265m02915J32476o91822K38920j69894
$$ 1382112 1244538 801891 600816 737691 936956 534041 666517 -25305 213615 43721
794D3721K05081J96961l58349n08234j20652N72350J68622r05782M7399P40515
$$ 43721 248802 445763 87414 -420820 -541472 30878 199500 -706282 -658883 81632
784H1632N71128K27911l13235N25416l23230M5559L41331L2372k85927p4377l41222
$$ 81632 652760 880671 567436 1092852 769622 815181 1156512 1188884 902957 828580 487358
773D87358N36475Q0913k06921m31918K61442K72144j69934n5362K08340p62480
$$ 487358 1023833 1104746 897825 465907 727349 999493 829559 774197 982537 220057
763B20057J14496K3712J47217n91360l82154R7399O07334J90905m11396k68943
$$ 220057 334553 358265 505482 -85878 -468032 -370633 236701 427606 16210 -252733
753b52733J08688O38770j48117m71981l4726L97632o86166o14210O80699k15257
$$ -252733 -144045 494725 346608 -125373 -160099 237533 -448633 -1062843 -382144 -597401
743e97401n26976R51301R22387J20822k87034m7163r0729J38213k49317p84474
$$ -597401 -1124377 -173076 749311 870133 583099 535936 445207 583420 334103 -450371
733d50371N4421R07696M4802m90623J64526J74337N6437j011816m3704O43193
$$ -450371 -395950 511746 556548 65925 230451 404788 461225 -550591 -594295 48898
723D8898k69955k7410J20251j59518m8476m22566k66857k64720P4240O04652Q92659
$$ 48898 -221057 -248467 -128216 -287734 -336210 -758776 -1025633 -1290353 -1216113 -611461 281198
712B81198N58422n17819M0566M037R1914j93451k7170l14581P00564o77985m72708
$$ 281198 839620 321801 362367 366404 458318 264867 237697 -76884 623680 -54305 -527013
701e27013N51971N24857m04833o1059K76036n2838l44110O33751o35797m11642
$$ -527013 24958 549815 144982 83923 359959 307121 -36989 596762 -39035 -450677
691d50677N006L86802M89640l68073P8853K17587j47746k54476k90886J22274
$$ -450677 -445671 -58869 430771 62698 141551 359138 211392 -43084 -333970 -211696
681b11696Q63496L38044n35896K26192P03253M85892j64071k52595R4465p3524
$$ -211696 651800 989844 453948 680140 1383393 1869285 1705214 1452619 1547084 1473560
671A473560R185q88326l95800L99801L9335m3229O47870P0575N5858n39480k03117
$$ 1473560 1482745 594419 198619 598420 637755 594526 1242396 1312971 1368829 829349 626232
660F26232k00702p00405p01653Q55086K29950k26586l90954L90941L77328k24342
$$ 626232 425530 -274875 -976528 -121442 108508 -118078 -509032 -118091 259237 34895
650C4895m50608L81232L24062k18669m96125L19112M6813K10263o14174o40990
$$ 34895 -415713 -34481 289581 70912 -425213 -106101 -59288 150975 -463199 -1104189
640a104189M97508K75447Q6947M88774L28709M46917J59694m70415k28930p53881
$$ -1104189 -606681 -331234 -244287 244487 573196 1020113 1179807 709392 480462 -273419
630b73419J16090L54213n98165j04165Q4119O92148K30690p21053j01943Q25671
$$ -273419 -157329 196884 -401281 -505446 -421327 270821 501511 -219542 -321485 504186
620E04186N80426n24139k95944L4610N3214r19565j43425J10610M06541n46758
$$ 504186 1084612 560473 264529 299139 352353 -567212 -710637 -600027 -193486 -740244
610g40244j97359J82024M11411L13348J36523j89108O16150M9664k20388k08361
$$ -740244 -937603 -755579 -344168 -30820 105703 -83405 532745 582409 362021 153660
600A53660L714p79811m36598K82695j48729k31453R3114M23488O19744m470m82182
$$ 153660 157374 -622437 -1059035 -776340 -925069 -1156522 -1063408 -639920 -20176 -24646 -506828
589e06828M99094j30654p9238m62484l32742r9120n50871k38717J11132O3105
$$ -506828 -7734 -138388 -217626 -680110 -1012852 -1111972 -1662843 -1901560 -1790428 -1727323
579a727323K89303J54218M98075M57901k57843R470K83421J71542J62302o17651
$$ -1727323 -1438020 -1283802 -785727 -327826 -585669 -576199 -292778 -121236 41066 -576585
569e76585o80012J3542j98366K39714J80647J79114R31678J53525O73620K78459
$$ -576585 -1256597 -1243055 -1441421 -1201707 -1021060 -841946 89732 243257 916877 1195336
559A195336l08759m66434m13801p5996j90849l77583N57167l48448o9453k01593
$$ 1195336 886577 420143 6342 -69654 -260503 -638086 -80919 -429367 -498820 -700413
549g00413N49030O44709m55774l10254N49377j25727l7601j52036J10679L36572
$$ -700413 -151383 493326 37552 -272702 276675 150948 113347 -38689 71990 408562
539D08562o94039J67737r5040o54336M13908r3048L1925Q87241j8839l11472j87712
$$ 408562 -285477 -117740 -212780 -867116 -453208 -546256 -514331 372910 354071 42599 -145113
528a45113O71714J85322l63953j094256R5164l47006j86610o9139K12738K26126
$$ -145113 526601 711923 347970 -746286 -651122 -998128 -1184738 -1253877 -1041139 -815013
518h15013R0181J30587J31801j23172M12546K72148o3070n62094p51914M66531
$$ -815013 -724832 -594245 -462444 -585616 -173070 99078 36008 -526086 -1278000 -811469
508h11469J97187k75406l23110j71909P3362O75089O14294K18144J56302k37667
$$ -811469 -614282 -889688 -1212798 -1384707 -1311345 -636256 -21962 196182 352484 114817
498A14817J61193M52909L34831n94557l81664k71605o56400j29560o32360M31380
$$ 114817 276010 728919 1063750 469193 87529 -184076 -840476 -970036 -1602396 -1171016
488a171016P71317K21453J40929J2465K60906L64720K12564o66786k30863K53073
$$ -1171016 -399699 -178246 -37317 -24852 236054 600774 813338 146552 -84311 168762
478A68762p01470m03687N76170N33930k2835m2937n72466L74907M81320O15857
$$ 168762 -532708 -936395 -360225 173705 150870 107933 -464533 -89626 391694 1007551
468A007551j74526p54449k74075l67688k76303o368L44160r05618M37313L70392
$$ 1007551 833025 78576 -195499 -563187 -839490 -845858 -501698 -1407316 -970003 -599611
458e99611O68884K26728j61644J5443k16830L70243K23775p60106L0005L18499
$$ -599611 69273 296001 134357 149800 -67030 303213 526988 -233118 -203113 115386
448A15386o7729n05694n39941R1537N52082K65591J17704m09255m9756q8695l4029
$$ 115386 47657 -458037 -997978 -906441 -354359 -88768 28936 -380319 -430075 -518770 -552799
437e52799j77183k622M67317n27370k77679K39281J63653j11723K23436L6043
$$ -552799 -729982 -732604 -265287 -792657 -1070336 -831055 -667402 -779125 -555689 -519646
427e19646J9630J61349J96451R6537l0046L0179L7816J6359j61390n34831N38058
$$ -519646 -500016 -338667 -142216 -45679 -75725 -45546 -7730 8629 -152761 -687592 -149534
416a49534k55561M00626K83981K13388K88906K64375l29089j00286l04873l08950
$$ -149534 -405095 -4469 279512 492900 781806 1046181 717092 616806 311933 2983
406B983p34232K98475m9280K6414J25465K39491k09688P91345j76407l46076o12579
$$ 2983 -731249 -432774 -482054 -455640 -330175 -90684 -300372 490973 314566 -31510 -644089
395f44089M75713j36766M4885M26814n52211j40260O80417k84096p33954P06594
$$ -644089 -168376 -305142 -260257 166557 -385654 -525914 154503 -129593 -863547 -156953
385a56953k42087R02147L53350k36386J66247q40755m9523J56942k23001m18304
$$ -156953 -399040 503107 856457 620071 786318 -54437 -103960 52982 -170019 -588323
375e88323q49826N3892O3686O76875L16846M07074n39526O33117p44229K48011
$$ -588323 -1438149 -1384257 -1320571 -643696 -326850 80224 -459302 173815 -570414 -322403
365c22403j99469K14877J12087j73068m4526J86887p98696J14281K42021M58103
$$ -322403 -521872 -306995 -194908 -367976 -412502 -225615 -1024311 -910030 -668009 -209906
355b09906M4022O61051l24826n7594K65472J52940m33962k18027m83711o7349
$$ -209906 -165884 495167 170341 112747 378219 531159 97197 -120830 -604541 -671890
345f71890K62869m48975l4948m37573P23164K35244K02785J19571J0336j08222
$$ -671890 -409021 -857996 -892944 -1330517 -607353 -372109 -169324 -49753 -39417 -147639
335a47639O58777M8931k83102r71147Q5388k51808P42887L49304o4103j80319
$$ -147639 511138 560069 276967 -694180 -608792 -860600 -117713 231591 167488 -12831
325a2831L75769m1532N93336N26614j8526k43857l46441r56362L33732j03645
$$ -12831 362938 321406 914742 1441356 1422830 1178973 832532 -123830 209902 106257
315A06257o41800k92989K75077k43412J88426l6728N16181K1078k80572l82381
$$ 106257 -535543 -828532 -553455 -796867 -608441 -645169 -128988 -107910 -388482 -770863
305g70863q6237J95310k53205n45678K58470L675K49079J60587R4750P57327j29958
$$ -770863 -857100 -661790 -914995 -1460673 -1202203 -1198528 -949449 -788862 -694112 63215 -66743
294f6743P1n33156Q59038j69390o18018j19650O72510l42772j00792q2645L81188
$$ -66743 -66672 -599828 259210 89820 -528198 -647848 24662 -318110 -418902 -501547 -120359
283a20359o73260q8343j94707P18994j4542K75624k02136j76174j99956M12548
$$ -120359 -793619 -881962 -1076669 -357675 -372217 -96593 -298729 -474903 -674859 -262311
273b62311o35535l41322m38219J15408n5349O65438O3708J96102J43913P38321
$$ -262311 -897846 -1239168 -1677387 -1561979 -1617328 -951890 -888182 -692080 -548167 190154
263A90154j48355L59578l06507l38180j54600j93270J10792j39462j55764J59452
$$ 190154 41799 401377 94870 -243310 -397910 -591180 -480388 -619850 -775614 -616162
253f16162K59397r936O22872n77666J95143K89356o7746k92662O00921q06574
$$ -616162 -356765 -366701 256171 -321495 -126352 163004 95258 -197404 403517 -403057
243d03057j23544q01312O81268J72852l53230o32053P45667N50652P37128o98523
$$ -403057 -526601 -1327913 -646645 -473793 -827023 -1459076 -713409 -162757 574371 -124152
233a24152P04411p01671K42563j91372l14336m26826J68481m55896M35482j08182
$$ -124152 580259 -121412 121151 -70221 -384557 -811383 -642902 -1098798 -663316 -771498
223g71498r8299O10396o3962P8409K80563m47660O65776p08286r258m4170j39955
$$ -771498 -869797 -259401 -323363 -244954 35609 -412051 253725 -454561 -463819 -507989 -647944
212f47944o3809m96831J18652l13311J62243Q8545J50662J48913R25130k68627
$$ -647944 -711753 -1208584 -1089932 -1403243 -1241000 -1152455 -1001793 -852880 72250 -196377
202a96377J82356n69331K27290o15116j48553J52434K80736p47251k7835K72504
$$ -196377 -14021 -583352 -356062 -971178 -1119731 -967297 -686561 -1433812 -1461647 -1189143
192a189143N14215j05924m2179N87719Q52534o02836J65744j53548L12079o63924
$$ -1189143 -674928 -780852 -823031 -235312 617222 14386 180130 26582 338661 -325263
182c25263l80194k04674O48113n32330l37511K37990K97776j3036j37862K26301
$$ -325263 -705457 -910131 -262018 -794348 -1131859 -893869 -596093 -609129 -746991 -520690
172e20690L6801M2223P0662m85115M38564l39121l03916m5409J89962K59018j38376
$$ -520690 -483889 -441666 -371004 -856119 -417555 -756676 -1060592 -1106001 -916039 -657021 -795397
161g95397k45612L15963P98730M105j09315l13001Q08821n02187n40062L23952
$$ -795397 -1041009 -725046 73684 77789 -31526 -344527 464294 -37893 -577955 -254003
151b54003k04119n66066J65634K07806L11829l01282J12163J33015l40178j33594
$$ -254003 -458122 -1024188 -858554 -650748 -338919 -640201 -528038 -395023 -735201 -868795
141h68795L57087l43109R665k29597J47803j98811l19770n81328M40304O22315
$$ -868795 -511708 -854817 -845152 -1074749 -926946 -1125757 -1445527 -2026855 -1586551 -964236
131i64236l7437l09149J60262m3407M03608k13291N30102J36155m72006J4765
$$ -964236 -1001673 -1310822 -1150560 -1193967 -790359 -1003650 -473548 -337393 -809399 -794634
121g94634N34221j38173o13410j77844N07240J6532O20425L21577o55490j15985
$$ -794634 -260413 -398586 -1011996 -1189840 -682600 -666068 -45643 275934 -379556 -495541
111d95541k74937l58950J33400n943o9504l35078J89822J40008M1499l10668m60944
$$ -495541 -770478 -1129428 -996028 -1001971 -1071475 -1406553 -1216731 -1076723 -1035224 -1345892 -1806836
100a806836L48275P39352r603l83249L75466J69211L47836k23167o807l38131
$$ -1806836 -1458561 -719209 -728812 -1112061 -736595 -567384 -219548 -442715 -449522 -787653
90g87653l42792J56092Q10688k23934l17829M6209O7124J83502L50286n99257
$$ -787653 -1130445 -974353 -163665 -387599 -705428 -659219 -592095 -408593 -58307 -657564
80f57564J29268j37301j40626K09562K15074l85159J03150q1543L6148k22199
$$ -657564 -528296 -665597 -806223 -596661 -381587 -766746 -663596 -745139 -708991 -931190
70i31190m6255j27006l0093j89870k42980K24845P04414j67399r1849J66100J36405
$$ -931190 -977445 -1104451 -1134544 -1324414 -1567394 -1342549 -638135 -805534 -897383 -731283 -594878
59e94878m95526k23572Q0193M54405l9763j65956j36874K6437N78872k73424j28439
$$ -594878 -1090404 -1313976 -1233783 -779378 -819141 -985097 -1121971 -1095534 -516662 -790086 -918525
48i18525p0612o1838J09812L48930N2354n1141o14031K5540N65305M35756k24421
$$ -918525 -989137 -1050975 -941163 -592233 -539879 -591020 -1205051 -1179511 -614206 -178450 -402871
37d02871r35295o5875J93093k06708M39411K58356M11682q9466l25515m2080k85269
$$ -402871 -1338166 -1404041 -1210948 -1417656 -978245 -719889 -308207 -397673 -723188 -765268 -1050537
26a050537m64011j09485J15051K44685k96104L63335M66724J492j41361p6468
$$ -1050537 -1514548 -1624033 -1508982 -1264297 -1560401 -1197066 -730342 -728850 -870211 -946679
16i46679j4571M25380k36545k20561j37093K13774j1356j62550J3446j7344j57332
$$ -946679 -961250 -535870 -772415 -992976 -1130069 -916295 -927651 -1090201 -1076755 -1094099 -1251431
5a251431K27367L7922K53005k58703J04742
$$ -1251431 -1024064 -986142 -733137 -991840 -887098
0h87098
$$ -887098
$$ Imaginary data points
##PAGE= N=2
##DATA TABLE= (X++(I..I)), XYDATA
16383g227814l72006k52483J30668N22313j07227J7495K98823L49565K43967l77086
$$ -7227814 -7599820 -7852303 -7721635 -7199322 -7306549 -7289054 -6990231 -6640666 -6396699 -6773785
16373f773785O42509M06911m0223r6099J26752m15408L35841J04254J48506k67771
$$ -6773785 -6131276 -5724365 -5764588 -5860687 -5733935 -6149343 -5813502 -5709248 -5560742 -5828513
16363e828513J55725L31282K46121l9056j42126j50081R92773L18902j26249j87855
$$ -5828513 -5672788 -5341506 -5095385 -5134441 -5276567 -5426648 -4433875 -4114973 -4241222 -4429077
16353d429077r6024K31065L3697l88196n4464p8900k38482K7481O53490j05711
$$ -4429077 -4525101 -4294036 -4260339 -4648535 -4702999 -4781899 -5020381 -4992900 -4339410 -4445121
16343d445121m72380J98537M31930n4073j64373M17593K47355q8639J81532j34736
$$ -4445121 -4917501 -4718964 -4287034 -4341107 -4505480 -4087887 -3840532 -3929171 -3747639 -3882375
16333c882375O364M32797J0709R85j36412K46611L78997L33353m27790j5440K62518
$$ -3882375 -3876011 -3443214 -3432505 -3431520 -3567932 -3321321 -2942324 -2608971 -3036761 -3052201 -2789683
16322b789683K68700P6825R3456p90744k63723L91463P88830l56832k29564J58164
$$ -2789683 -2520983 -2444158 -2350702 -3141446 -3405169 -3013706 -2224876 -2581708 -2811272 -2653108
16312b653108M49926L0823l10956k33107N99474j8386o17429K05931L9775k11306
$$ -2653108 -2203182 -2172359 -2483315 -2716422 -2116948 -2135334 -2752763 -2546832 -2507057 -2718363
16302b718363K07902L73749P47k95537M55726J55010M58370L1003l93406L73684
$$ -2718363 -2510461 -2136712 -2135965 -2431502 -1975776 -1820766 -1362396 -1331393 -1724799 -1351115
16292a351115J44006j92193N64198k51519n02944K06425q0835m45900K38480N75425
$$ -1351115 -1207109 -1399302 -835104 -1086623 -1589567 -1383142 -1463977 -1909877 -1671397 -1095972
16282a095972j99271L39151N97725k46900J87088Q9174o73591K03342k57414j21216
$$ -1095972 -1295243 -956092 -358367 -605267 -418179 -329005 -1002596 -799254 -1056668 -1177884
16272a177884R4490J18566m57438J35583O63936j3744L11396m3620P2244M43365
$$ -1177884 -1083394 -964828 -1422266 -1286683 -622747 -636491 -325095 -368715 -296471 146894
16262A46894K56895M3367p2835j0959n76621K72004J0524j70561k15007L01234
$$ 146894 403789 447156 374321 363362 -213259 58745 69269 -101292 -316299 -15065
16252a5065L82645L53100K46311n0133j17244N85507l87414l85753L49287q3729
$$ -15065 367580 720680 966991 916858 799614 1385121 997707 611954 961241 877512
16242H77512j10830l08270l30518L16723q683L12766M08841K33238k38320l89338
$$ 877512 766682 458412 127894 444617 435934 748700 1157541 1390779 1152459 763121
16232G63121K26948Q6267m80260R3142K50595o8473n62812K40790N12854j66210
$$ 763121 990069 1076336 596076 689218 939813 871340 308528 549318 1062172 895962
16222H95962m7503N24320L32819M06736J85236O61891j10951q88869K61460j46296
$$ 895962 848459 1372779 1705598 2112334 2297570 2959461 2848510 1959641 2221101 2074805
16212B074805o21979k10590J07074k84100l9660N00440M90214k2525k45170M51793
$$ 2074805 1452826 1242236 1349310 1065210 1025550 1525990 2016204 1993679 1748509 2200302
16202B200302k06j6406J6409l0616J8164j147353q82554L75523L44795J55698
$$ 2200302 2200096 2183690 2200099 2169483 2187647 1040294 157740 533263 878058 1033756
16192A033756R4587N9885N44697K23173O24656M46792p4977j54785K76657N64756
$$ 1033756 1128343 1188228 1732925 1956098 2580754 3027546 2952569 2797784 3074441 3639197
16182C639197j72953j126437k30570m62737L56946k7193k48547P4028L80972l31905
$$ 3639197 3466244 2339807 2109237 1646500 2003446 1976253 1727706 1801734 2182706 1850801
16172A850801K30298N42930N82372m96749j6333o47541m89747J08954l8427K48743
$$ 1850801 2081099 2624029 3206401 2709652 2693319 2045778 1556031 1664985 1626558 1875301
16162A875301N33700n51701n63303J023259J292879j57773j47340R2544j5590
$$ 1875301 2409001 1857300 1293997 2317256 3610135 3452362 3305022 3397566 3381976
16153C381976K67383L65563k86933o00537q29764k33434L50276L78330j8877n6399
$$ 3381976 3649359 4014922 3727989 3127452 2297688 2064254 2414530 2792860 2773983 2717584
16143B717584N50420m3017o15725L18370L14637o36628l4720q48484m7851K10371
$$ 2717584 3268004 3224987 2609262 2927632 3242269 2605641 2570921 1722437 1674586 1884957
16133A884957J20725j14339K29446R1594R9197j87162K82550J75143Q35643l01510
$$ 1884957 2005682 1891343 2120789 2212383 2311580 2124418 2406968 2582111 3417754 3116244
16123C116244M39247M92342P7877o55406M12128o46502p68593k14988K33179K05533
$$ 3116244 3555491 4047833 4125710 3470304 3882432 3235930 2467337 2252349 2485528 2691061
16113B691061K69881m54283K44465O91025K56141j031699l71244L88352k10670
$$ 2691061 2960942 2506659 2751124 3442149 3698290 2666591 2295347 2683699 2473029
16104B473029m45144M09643L46380k26135N8588K40740N99282J14335k43468j11853
$$ 2473029 2027885 2437528 2783908 2557773 2616361 2857101 3456383 3570718 3327250 3215397
16094C215397P77166j56233r542k69064O17754j96228R344n86818l60749J70593
$$ 3215397 3992563 3836330 3826788 3557724 4175478 3979250 3988594 3401776 3041027 3211620
16084C211620L82244m48468K17572l6766j19083l0O02141j2450q0957j242709
$$ 3211620 3593864 3145396 3362968 3326202 3207119 3207089 3809230 3796780 3715823 2473114
16074B473114L45208K64936m52837n50764Q37460m98935j55469O39726R24839
$$ 2473114 2818322 3083258 2630421 2079657 2917117 2418182 2262713 2902439 3827278
16065C827278k36338q30200J33589K09417P76944k98678k60186L47824r61671
$$ 3827278 3590940 2760740 2894329 3103746 3880690 3582012 3321826 3669650 2707979
16056B707979j9159N42477l96030K8443K91449k91242L23538r8482k02919O66355
$$ 2707979 2688820 3231297 2835267 2863710 3155159 2863917 3187455 3088973 2886054 3552409
16046C552409l8206P27615j025492n51875J33620L67452l24192K1088o83561K67374
$$ 3552409 3514203 4241818 3216326 2664451 2798071 3165523 2841331 2862419 2178858 2446232
16036B446232L54666J007220J14610n51306n84175n4275P96050N10402q10880
$$ 2446232 2800898 3808118 3922728 3371422 2787247 2732972 3529022 4039424 3228544
16027C228544j15879J07368N12056M19019m6993m85951K68868n14439L90562J51803
$$ 3228544 3112665 3220033 3732089 4151108 4104115 3618164 3887032 3372593 3763155 3914958
16017C914958M18949k1680m33839j45227j16441k90229J34733l83726K69423M26089
$$ 3914958 4333907 4312227 3878388 3733161 3616720 3326491 3461224 3077498 3346921 3773010
16007C773010M11148j65397J18644n20601j56081L77960P2562k56312l06729l03506
$$ 3773010 4184158 4018761 4137405 3616804 3460723 3838683 3911245 3654933 3348204 3044698
15997C044698N21038M68776o31322l43676K42386Q7620k015k60548j71072J93565
$$ 3044698 3565736 4034512 3403190 3059514 3301900 3389520 3387505 3126957 2955885 3149450
15987C149450k16703P97038Q60906r0837j461713N2234O52306J14731j157679
$$ 3149450 2932747 3729785 4590691 4499854 3038141 3090375 3742681 3857412 2699733
15978B699733l67703J54405P73287o5004J29299p89988k18858M6814R44256n59303
$$ 2699733 2332030 2486435 3259722 3194718 3324017 2534029 2315171 2361985 3306241 2746938
15968B746938K503l55352K93137N26268N08353N1247l53562k82090Q1649l35847
$$ 2746938 2749441 2394089 2687226 3213494 3721847 3773094 3419532 3137442 3219091 2883244
15958B883244l85423l82315Q69558J10568Q1884P15924J34570k81104L41806L11718
$$ 2883244 2497821 2115506 2985064 3095632 3177516 3893440 4028010 3746906 4088712 4400430
15948D400430j88993m46826j65465L83751J64577l50041r6472K34523J8291k41295
$$ 4400430 4211437 3764611 3599146 3982897 4147474 3797433 3700961 3935484 3953775 3712480
15938C712480L8748j03058l09011l19301J53113L73731M83025l31643j19317m56116
$$ 3712480 3751228 3648170 3339159 3019858 3172971 3546702 4029727 3698084 3578767 3122651
15928C122651r43610O39204K73825n93324o7398O38144M17035J065299j36269
$$ 3122651 2179041 2818245 3092070 2498746 2431348 3069492 3486527 4551826 4415557
15919D415557n46568o77765Q08679N980m84897m59626o35712K23862Q39085m01247
$$ 4415557 3868989 3191224 3999903 4005883 3520986 3061360 2425648 2649510 3488595 3087348
15909C087348N33935K65239k45134r85709n7846J52796M01300j53174M66714j21291
$$ 3087348 3621283 3886522 3641388 2655679 2597833 2750629 3151929 2998755 3465469 3344178
15899C344178p467p61020n60807K41478J0524j10762K78290K30120P09727N71345
$$ 3344178 3336711 2575691 2014884 2256362 2266886 2156124 2434414 2664534 3374261 3945606
15889C945606Q2514k0248k10898k30681k39038R36400l82494r91999J69947J55652
$$ 3945606 4028120 4007872 3796974 3566293 3327255 4263655 3881161 2889162 3059109 3214761
15879C214761L13088M68082l86186J19272J74370j31906k88891L86045J10355
$$ 3214761 3527849 3995931 3609745 3729017 3903387 3771481 3482590 3868635 3978990
15870C978990p89167n61273J005317l99091l99857J6502J2227q3815j09874J77652
$$ 3978990 3189823 2628550 3633867 3234776 2834919 2851421 2863648 2779833 2669959 2847611
15860B847611M14839M70658N23100K90290j48720j094297l20701O62962j578p25657
$$ 2847611 3262450 3733108 4256208 4546498 4397778 3303481 2982780 3645742 3644164 2918507
15850B918507k89161o3755N42069J283218M41535j012498o80993J38532N78048
$$ 2918507 2629346 2565591 3107660 4390878 4832413 3819915 3138922 3277454 3855502
15841C855502q35192m36486m657K49934n9760q0090K77429m8181o21410r5580
$$ 3855502 3020310 2583824 2579167 2829101 2769341 2689251 2966680 2918499 2297089 2201509
15831B201509P58578M39208p09208k51435O35663R3054N49897l48580J75970j36215
$$ 2201509 2960087 3399295 2690087 2438652 3074315 3167369 3717266 3368686 3544656 3408441
15821C408441l19175J1944L48449r80374K7753J442699l0683j86166k87462n0325
$$ 3408441 3089266 3101210 3449659 2469285 2497038 3939737 3909054 3722888 3435426 3385101
15811C385101k30247O5056N18561p10713l52055j89587L29378O85471j57336n36857
$$ 3385101 3154854 3219910 3738471 3027758 2675703 2486116 2815494 3500965 3343629 2806772
15801B806772J80412o26351Q70734J268360m2451p07536k16426N33415M60977
$$ 2806772 2987184 2360833 3231567 4499927 4457476 3749940 3533514 4066929 4527906
15792D527906L4114n04749j031305M27167M30756O07537n99278j081840j11353
$$ 4527906 4562020 4057271 3025966 3453133 3883889 4491426 3892148 2810308 2698955
15783B698955J723457q8807q50627m25110K21524Q1671o25188k12712m84799J64818
$$ 2698955 4422412 4333605 3482978 3057868 3279392 3361063 2735875 2523163 2038364 2203182
15773B203182O88810N84985P59575m47296o33303L17802J89535l50880n70095
$$ 2203182 2891992 3476977 4236552 3789256 3155953 3473755 3663290 3312410 2742315
15764B742315m38380N69562J242284J81045m52588l62411L95239l33556m31535
$$ 2742315 2303935 2873497 4115781 4296826 3844238 3481827 3877066 3543510 3111975
15755C111975N51563k44183n36621L41143J03108L52347p41859n53450k81104
$$ 3111975 3663538 3419355 2882734 3223877 3326985 3679332 2937473 2384023 2102919
15746B102919M52872L04481K02070n84686O8215R637J233647P78562J28245j116696
$$ 2102919 2555791 2860272 3062342 2477656 2545871 2555508 3789155 4567717 4695962 3579266
15736C579266k31921M1986R31203j19621k66273r82288O35752K91064M33120p6176
$$ 3579266 3347345 3389331 4320534 4200913 3934640 2952352 3588104 3879168 4312288 4236112
15726D236112q56395L7584O59521L90004p1186p90834o094M25287r4838k24277
$$ 4236112 3379717 3417301 4076822 4466826 4395640 3604806 3598712 4023999 3929161 3704884
15716C704884p37194q45674J66161N95393M88307M770n9541K26009n07205Q29909
$$ 3704884 2967690 2122016 2288177 2883570 3371877 3376647 3317106 3543115 3035910 3865819
15706C865819K41941j014131r2348O30955Q7540L4445l99627k16535J64693N17841
$$ 3865819 4107760 3093629 3001281 3632236 3719776 3754221 3354594 3138059 3302752 3820593
15696C820593N1545j83241j08210n9146q10416Q05703n9943m47643n11300L27954
$$ 3820593 3872138 3688897 3580687 3521541 2711125 3516828 3456885 3009242 2497942 2825896
15686B825896n4294j07930k18787J32345n99715O11213L17425M26857J45317m35707
$$ 2825896 2771602 2663672 2444885 2577230 1977515 2588728 2906153 3333010 3478327 3042620
15676C042620j55584M12846j03554n4685j31264M41188k3252L16357L39322n33741
$$ 3042620 2887036 3299882 3196328 3141643 3010379 3451567 3428315 3744672 4083994 3550253
15666C550253o23147P03962J27818L87287l37523o51804j05020L76055Q15128
$$ 3550253 2927106 3631068 3758886 4146173 3808650 3156846 3051826 3427881 4243009
15657D243009R1018q33704N31043J51504o23244j83658q08631L25181L74437N38880
$$ 4243009 4334027 3500323 4031366 4182870 3559626 3375968 2567337 2892518 3266955 3805835
15647C805835M92723l82165n24868K03615k5554M78167m24475M02655n48601k92641
$$ 3805835 4298558 3916393 3391525 3595140 3569586 4047753 3623278 4025933 3477332 3184691
15637C184691M4076O5111j20751N25555p5589P2364q56941Q59074n20598m05745
$$ 3184691 3228767 3293878 3173127 3698682 3623093 3695457 2838516 3697590 3176992 2771247
15627B771247N0417L36590L41439K53708p51365P08332M00908p86892m19927j93294
$$ 2771247 2821664 3158254 3499693 3753401 3002036 3710368 4111276 3324384 2904457 2711163
15617B711163m9094P10551N96521O04354p54323q62571K13932m89986M19307m76000
$$ 2711163 2662069 3372620 3969141 4573495 3819172 2956601 3170533 2680547 3099854 2623854
15607B623854j49704j07623J12210J52956J007260j8438l98572j5497Q18634l02724
$$ 2623854 2474150 2366527 2478737 2631693 3638953 3620515 3221943 3206446 4025080 3722356
15597C722356J76663l26014m68048K61964O98971j53229o4570l32431j33945m38952
$$ 3722356 3899019 3573005 3104957 3366921 4065892 3912663 3848093 3515662 3381717 2942765
15587B942765J93979K98522M71131l83562M4329O4755N07576k27412q57183O5034
$$ 2942765 3136744 3435266 3906397 3522835 3567164 3631919 4139495 3912083 3054900 3119934
15577C119934m20983l45977Q18510p384Q9610J0872L16652k1523J49751l26537
$$ 3119934 2698951 2352974 3171484 3164100 3253710 3264582 3581234 3559711 3709462 3382925
15567C382925j27847P9826O4812n48980J98885J21854L35619J14761m60190l195
$$ 3382925 3255078 3334904 3399716 2850736 3049621 3171475 3507094 3621855 3161665 3158470
15557C158470J23362J40292L7317L93409N10198k71062l93794N54313l36315k53269
$$ 3158470 3281832 3422124 3459441 3852850 4363048 4091986 3698192 4252505 3916190 3662921
15547C662921j76516q23684n42514P55478n48394N06378J38994L54391r5968J054087
$$ 3662921 3486405 2662721 2120207 2875685 2327291 2833669 2972663 3327054 3231086 4285173
15537D285173J78465j89431n17756j28327J33275k42283k6436Q2604k5056K17125
$$ 4285173 4463638 4274207 3756451 3628124 3761399 3519116 3492680 3575284 3550228 3767353
15527C767353L9901K56819k36432k20202O8618J017639m06410J6780K64308k89526
$$ 3767353 3807254 4064073 3827641 3607439 3676057 4693696 4287286 4304066 4568374 4278848
15517D278848l85351k02722o66432L33038p31764M05652O42881j37731J15752
$$ 4278848 3893497 3690775 3024343 3357381 2625617 3031269 3674150 3536419 3652171
15508C652171L80592L671K72782L07092k83419j959697p2074N19695K32262q9507
$$ 3652171 4032763 4036434 4309216 4616308 4332889 2373192 2301118 2820813 3053075 2963568
15498B963568m93870K28075O23961L90392J95318K19712o17024K20896J23052
$$ 2963568 2469698 2697773 3321734 3712126 3907444 4127156 3510132 3731028 3854080
15489C854080M74617l12647o69182q8714n86919N0349J93858o48680L94956M03006
$$ 3854080 4328697 4016050 3346868 3258154 2671235 2721584 2915442 2266762 2661718 3064724
15479C064724J69060L33333K63010L20655K91945k88844k56943o60391L97707
$$ 3064724 3233784 3567117 3830127 4150782 4442727 4153883 3896940 3236549 3634256
15470C634256j058558n54878K43266N65360L0184L29361J90012Q03129o69902
$$ 3634256 2575698 2020820 2264086 2829446 2859630 3188991 3379003 4182132 3512230
15461C512230L03165J90579m6033l21745K68586n24998n07467r62671J136854
$$ 3512230 3815395 4005974 3959941 3638196 3906782 3381784 2874317 1911646 3048500
15452C048500j77404L70814O2139J2162M00390N17002p9172J14539n11323j37679
$$ 3048500 2871096 3241910 3304049 3316211 3716601 4233603 4154431 4268970 3757647 3619968
15442C619968m86014J45869K22208l47729o92996M1836m12136Q28037P78590m77304
$$ 3619968 3133954 3279823 3502031 3154302 2461306 2503142 2091006 2919043 3697633 3220329
15432C220329P54106O5095O73677p80560j076290K01595M81216k53727q1100k80097
$$ 3220329 3974435 4039530 4713207 3932647 2856357 3057952 3539168 3285441 3204341 2924244
15422B924244N24170n88319M83138N4128jn82830P99771M6125J057192p13072
$$ 2924244 3448414 2860095 3343233 3397361 3397360 2814530 3614301 3660426 4717618 4004546
15412D004546j91989j72680l45921j95027l38186j062229j60569K49978J737447
$$ 4004546 3812557 3639877 3293956 3098929 2760743 1698514 1537945 1787923 3525370
15403C525370J62114L49564k01495m57972P57743Q72193n47439q28189n33984
$$ 3525370 3687484 4037048 3835553 3377581 4135324 5007517 4460078 3631889 3097905
15394C097905N78861k81342j52529J65094K60339q7784O165J36446L57542m49509
$$ 3097905 3676766 3395424 3242895 3407989 3668328 3580544 3586709 3723155 4080697 3631188
15384C631188j0571M11537j63021P3659l62467j65109L62198K31576p58021m7366
$$ 3631188 3620617 4032154 3869133 3942792 3580325 3415216 3777414 4008990 3250969 3203603
15374C203603j59901R25579n2128Q46842K84666o5993j23376k49422j36213O00536
$$ 3203603 3043702 3969281 3917153 4763995 5048661 4982668 4859292 4609870 4473657 5074193
15364E074193j324355o6403l36552P29919l19676j78683l04287L6653j33357J081815
$$ 5074193 3749838 3683435 3346883 4076802 3757126 3578443 3274156 3310809 3177452 4259267
15354D259267m48253q2916m07856l2903O72789Q1119j023156L2603K46272N84957
$$ 4259267 3811014 3728098 3320242 3287339 3960128 4041247 3018091 3050694 3296966 3881923
15344C881923r44653m28631M95346j95937K34785O93926R2792l0454l41993K39446
$$ 3881923 2937270 2508639 3003985 2808048 3042833 3736759 3829551 3799097 3457104 3696550
15334C696550M73335p14625n73979l75144P25778K55467N41996n48792j04261
$$ 3696550 4169885 3455260 2881281 2506137 3231915 3487382 4029378 3480586 3376325
15325C376325N31382R72555o86058o5453q62323p99335N91090J111363n48771
$$ 3376325 3907707 4880262 4194204 4128751 3266428 2467093 3058183 4169546 3620775
15316C620775j55511p46278R67786q9625P5363n50369K186N12387M53470k53026
$$ 3620775 3465264 2718986 3686772 3597147 3672510 3122141 3124327 3636714 4090184 3837158
15306C837158k51231j206070J24566m23266O05016J173712j81538n11366L81152
$$ 3837158 3585927 2379857 2504423 2081157 2686173 3859885 3678347 3166981 3548133
15297C548133k49238P20849j8159R0137n52926n45852M56718K32797m77086p11882
$$ 3548133 3298895 4019744 4001585 4091722 3538796 2992944 3449662 3682459 3205373 2493491
15287B493491Q3252J131123j34017P725K74066p54619M09241O31415m97527p60415
$$ 2493491 2576743 3707866 3573849 3581574 3855640 3101021 3510262 4141677 3644150 2883735
15277B883735r6650K34079R37483n73849K81862j486707l4054P57924M98464r982
$$ 2883735 2787085 3021164 3958647 3384798 3666660 2179953 2145899 2903823 3402287 3392305
15267C392305m72299L77695J685471n49919l23338o66271k46725j75051J43319
$$ 3392305 2920006 3297701 4983172 4433253 4109915 3443644 3196919 3021868 3165187
15258C165187J15470P88577q95353M84185L63002N88969J59085j60225O37713
$$ 3165187 3280657 4069234 3173881 3658066 4021068 4610037 4769122 4608897 5246610
15249E246610L1112p15864m36358o82298J92342n66156R6818J63994m2015Q4826
$$ 5246610 5277722 4561858 4125500 3443202 3635544 3069388 3166206 3330200 3288185 3373011
15239C373011K11463p70130O90670r0233j51968L9217n68451N38123m20947m57452
$$ 3373011 3584474 2814344 3505014 3414781 3262813 3302030 2733579 3271702 2850755 2393303
15229B393303K48551k88895j50943L99221O16149O94670l47528J44230Q97890
$$ 2393303 2641854 2352959 2202016 2601237 3217386 3912056 3564528 3708758 4606648
15220D606648O0647l42392l47917k23245J98594n35759O96154q39251m47566J54933
$$ 4606648 4667295 4324903 3976986 3753741 3952335 3416576 4112730 3273479 2825913 2980846
15210B980846O18399m06594p2434j92197J043569J53004J86245l99842o32652
$$ 2980846 3599245 3192651 3120217 2928020 3971589 4124593 4310838 3910996 3278344
15201C278344k63435n6442j89670j75846k92823L24201n99238M41471K45257O33908
$$ 3278344 3014909 2958467 2768797 2592951 2300128 2624329 2025091 2466562 2711819 3345727
15191C345727M1370P86508j24212N52229l97373M8438j6645n27550O7552m14099
$$ 3345727 3387097 4173605 4049393 4601622 4204249 4252687 4236042 3708492 3776044 3361945
15181C361945P55531k0011p0076O8274J63879O46707m79717m70581J4980K03367
$$ 3361945 4117476 4097465 4027389 4095663 4259542 4906249 4426532 3955951 3970931 4174298
15171D174298j79789m29109n22680k26826K34682j22169j748j012739N29291l44962
$$ 4174298 3994509 3565400 3042720 2815894 3050576 2928407 2926659 1913920 2443211 2098249
15161B098249M83194J129583j27103l23135J98808P0443k56187r14116J25673
$$ 2098249 2581443 3711026 3583923 3260788 3459596 3530039 3273852 2359736 2485409
15152B485409l21986n7533K73147N44091J53390L46673m74490N80733K04349n37287
$$ 2485409 2163423 2105890 2379037 2923128 3076518 3423191 2948701 3529434 3733783 3196496
15142C196496J26256R17022m18709r58502m60443Q41545j32385j249409p48186
$$ 3196496 3322752 4239774 3821065 2862563 2402120 3243665 3111280 1861871 1113685
15133A113685N01150L83170K64097L42251P91518o0266M04102m46670j60421J64594
$$ 1113685 1614835 1998005 2262102 2604353 3395871 3335605 3739707 3293037 3132616 3297210
15123C297210m8123k7621P19767j75056q02297j38540J035816M37354l62146J15007
$$ 3297210 3249087 3221466 3941233 3766177 2963880 2825340 3861156 4298510 3936364 4051371
15113D051371l51273N05352J112023o11146j114683O60003l66509O11921K6671
$$ 4051371 3700098 4205450 5317473 4706327 3591644 4251647 3885138 4497059 4523730
15104D523730l01100j038567R0590M49120K31463j09433q4124l45753Q26180j68500
$$ 4523730 4222630 3184063 3274653 3723773 3955236 3845803 3761679 3415926 4242106 4073606
15094D073606l86055j45401O23797j86874K77213r40851j45806j54227N74454
$$ 4073606 3687551 3542150 4165947 3979073 4256286 3315435 3169629 3015402 3589856
15085C589856k96488L78261o51243j25582M43034j13956n20244L80836M90486
$$ 3589856 3293368 3671629 3020386 2894804 3337838 3223882 2703638 3084474 3574960
15076C574960p4023k82920J26904O8758l49547j38188m05084k13803O61450R31656
$$ 3574960 3500937 3218017 3344921 3413679 3064132 2925944 2520860 2307057 2968507 3900163
15066C900163q8079J3946m0479M02843O5253L90439n57814o91626p99180M35255
$$ 3900163 3812084 3826030 3785551 4188394 4253647 4644086 4086272 3394646 2595466 3030721
15056C030721J39554q7705r51693P56294R55108K94295r74329K20510K74754R08255
$$ 3030721 3170275 3082570 2130877 2887171 3842279 4136574 3162245 3382755 3657509 4565764
15046D565764j97339k65119N22668m84220k65290K22266o30638m19725l8843O91049
$$ 4565764 4368425 4103306 4625974 4141754 3876464 4098730 3468092 3048367 3009524 3700573
15036C700573K53661L30714P4624K74227L69161N32806l54975K88659p79206j71706
$$ 3700573 3954234 4284948 4359572 4633799 5002960 5535766 5180791 5469450 4690244 4518538
15026D518538N7370j06497j016960m7969p5468R207q4081O63737k60265k76664
$$ 4518538 4575908 4469411 3452451 3404482 3329014 3338221 3254140 3917877 3657612 3380948
15016C380948M46363l54033j30476O2827N46071l94824r36870r25175Q02434k41240
$$ 3380948 3827311 3473278 3342802 3405629 3951700 3556876 2620006 1694831 2497265 2256025
15006B256025n95584K90975N10009K49471N24820O13914O00616l95228J64946
$$ 2256025 1660441 1951416 2461425 2710896 3235716 3849630 4450246 4055018 4219964
14997D219964l40937R8165r56773j40802L632K94684l06236m924j47086J122118
$$ 4219964 3879027 3977192 3020419 2879617 2883249 3177933 2871697 2866773 2719687 3841805
14987C841805M12608k90112n56875n2617k2345P13202l50715k24692j87954r7263
$$ 3841805 4254413 3964301 3407426 3354809 3332464 4045666 3694951 3470259 3282305 3185042
14977C185042l28497k08507k81375K46386K94269R29630q338j59363L22307Q20488
$$ 3185042 2856545 2648038 2366663 2613049 2907318 3836948 3828610 3669247 3991554 4812042
14967D812042m8171j01977k74050l11716m25645m24385m15819J28205L42418J80269
$$ 4812042 4763871 4661894 4387844 4076128 3650483 3226098 2810279 2938484 3280902 3461171
14957C461171N44359K51223J34965j4771N53510Q9037r07709R6813K86438n95117
$$ 3461171 4005530 4256753 4391718 4376947 4930457 5019494 4111785 4208598 4495036 3899919
14947C899919N85649r12032n91073k99888M71594k15960n18865M04007R77822
$$ 3899919 4485568 3573536 2982463 2682575 3154169 2938209 2419344 2823351 3801173
14938C801173K62647j89593q4605K8681j99257M11572k42080o15259p23488r2826
$$ 3801173 4063820 3874227 3789622 3818303 3619046 4030618 3788538 3173279 2449791 2356965
14928B356965M38420J092152l86262J26573k09835N07752q4972K59623k35467
$$ 2356965 2795385 3887537 3501275 3627848 3418013 3925765 3840793 4100416 3864949
14919C864949L7295k46640N00335q2874m40365m79062K039j96505k19789q0883
$$ 3864949 3902244 3655604 4155939 4073065 3632700 3153638 3155677 2959172 2739383 2658500
14909B658500L61849K20637P68064l63697J34228J74346k69739J29899m33710
$$ 2658500 3020349 3240986 4009050 3645353 3779581 3953927 3684188 3814087 3380377
14900C380377l81393q0467N21428l64240p10728M31087P96614M59363P849l77162
$$ 3380377 2998984 2918517 3439945 3075705 2364977 2796064 3592678 4052041 4059890 3682728
14890C682728P73550K50004k16744l52172m20190O46966K35582j26924j59153
$$ 3682728 4456278 4706282 4489538 4137366 3717176 4364142 4599724 4472800 4313647
14881D313647o2080P7271m57160P47806j15054l5557k38830L88898L39353N19131
$$ 4313647 4251567 4328838 3871678 4619484 4504430 4468873 4230043 4618941 4958294 5477425
14871E477425q95878k59679o03177k57078j10564J81793J34585N38504j7628N04665
$$ 5477425 4581547 4321868 3718691 3461613 3351049 3532842 3667427 4205931 4188303 4692968
14861D692968l51342N3240k01926L81969j36989n6991J39376J76378j70133j46720
$$ 4692968 4341626 4394866 4192940 4574909 4437920 4380929 4520305 4696683 4526550 4379830
14851D379830m98348j38638L4430k72433l98604K70885O80730p6672p1666k01699
$$ 4379830 3881482 3742844 3777274 3504841 3106237 3377122 4057852 3981180 3909514 3707815
14841C707815K95011J59822l37592q1596l51449l13128l73198N00866K30193p14422
$$ 3707815 4002826 4162648 3825056 3743460 3392011 3078883 2705685 3206551 3436744 2722322
14831B722322P6360k32145Q76466J96429k63061m78559R89932M23182j04864R0105
$$ 2722322 2798682 2566537 3443003 3639432 3376371 2897812 3887744 4310926 4206062 4296167
14821D296167R4094k54382o85446l36633l0769m79026K85960L80507O04396j06679
$$ 4296167 4390261 4135879 3450433 3113800 3083031 2604005 2889965 3270472 3874868 3768189
14811C768189m71070M89036N94190p48277K57179j66342j62811O6789N6774J62819
$$ 3768189 3297119 3786155 4380345 3632068 3889247 3722905 3560094 3626883 3683657 3846476
14801C846476M6891j36752O09535R665P76597k82517M76791m45720m21769m26589
$$ 3846476 3893367 3756615 4366150 4375815 5152412 4869895 5346686 4900966 4479197 4052608
14791D052608n7900J1238j87213m51372o47272l116L18463K45224l53893m4997
$$ 4052608 3994708 4005946 3818733 3367361 2720089 2716973 3035436 3280660 2926767 2881770
14781B881770M65778J034729k0025K5098n18704L26032n69909Q7706K68009k92738
$$ 2881770 3347548 4382277 4362252 4387350 3868646 4194678 3624769 3712475 3980484 3687746
14771C687746o75896k0564O71724N39293r70675N23286N49283N4390o53783k21332
$$ 3687746 3011850 2991286 3663010 4202303 3231628 3754914 4304197 4358587 3704804 3483472
14761C483472l66869J21242l27627q8107j66687m07885l03925O12034l72933K68025
$$ 3483472 3116603 3237845 2910218 2822111 2655424 2247539 1943614 2555648 2182715 2450740
14751B450740L773k94369j65868N02040L46554J64518o61084j69923K02787o704
$$ 2450740 2454513 2160144 1994276 2496316 2842870 3007388 2346304 2176381 2379168 2372464
14741B372464M07490L75406o90234J85357P53767R38306J07552n19169K76829
$$ 2372464 2779954 3155360 2465126 2650483 3404250 4342556 4450108 3930939 4207768
14732D207768N57414j54163J30402M6363r01898l75204k59133J269139j60995
$$ 4207768 4765182 4611019 4741421 4787784 3885886 3510682 3251549 4520688 4359693
14723D359693l88665j16911Q49630k01056O6104m56931l69826j67149l5131k17804
$$ 4359693 3971028 3854117 4703747 4502691 4568795 4111864 3742038 3574889 3539758 3321954
14713C321954J63053n7834M40028N9508L51714J29090l25822r42040R47277P21407
$$ 3321954 3485007 3427173 3867201 3926709 4278423 4407513 4081691 3139651 4086928 4808335
14703D808335J9880j287290R29590o7843k12012p43997m11568m05537N20207M55741
$$ 4808335 4828215 3540925 4470515 4402672 4190660 3446663 3035095 2629558 3149765 3605506
14693C605506Q35816m47386m83476k53940O87549L53781k29230o91256p83337
$$ 3605506 4441322 3993936 3510460 3256520 3944069 4297850 4068620 3377364 2594027
14684B594027l50542J67982O97637P9182O45554k92350M7863j93366M89823j08961
$$ 2594027 2243485 2411467 3109104 3188286 3833840 3541490 3589353 3395987 3885810 3776849
14674C776849j28965q92459J96824O51243K8626l22136k68398k43739K02858K14207
$$ 3776849 3647884 2755425 2952249 3603492 3632118 3309982 3041584 2797845 3000703 3214910
14664C214910N67069p19114J35199K79082O52328n98129j34429j94361J080611
$$ 3214910 3781979 3062865 3198064 3477146 4129474 3531345 3396916 3202555 4283166
14655D283166q32063N24003K25106Q6511j20145N72477K54485J23668k47549l33287
$$ 4283166 3451103 3975106 4200212 4286723 4166578 4739055 4993540 5117208 4869659 4536372
14645D536372m77558P03048p29888l43287j61596K39162k25911L19328l53649
$$ 4536372 4058814 4761862 4031974 3688687 3527091 3766253 3540342 3859670 3506021
14636C506021j47518L71964k13126N00739J91624K0023q10196J04817R5034M05583
$$ 3506021 3358503 3730467 3517341 4018080 4209704 4229727 3419531 3524348 3619382 4024965
14626D024965n76246m2308j41737J85030k76908N36466N90912j18626j8647J21695
$$ 4024965 3448719 3406411 3264674 3449704 3172796 3709262 4300174 4181548 4162901 4284596
14616D284596j29363M81217o48036l12247j89191L91887r95882J13545l83661
$$ 4284596 4155233 4636450 3988414 3676167 3486976 3878863 2882981 2996526 2612865
14607B612865L8558j8126N62613l03205q65426l74805Q81857L69642Q7653m54749
$$ 2612865 2651423 2633297 3195910 2892705 2027279 1652474 2534331 2903973 2991626 2536877
14597B536877K53605k05169J15978k20512J9534m62720P81708K86594P03001J16719
$$ 2536877 2790482 2585313 2701291 2480779 2500313 2037593 2819301 3105895 3808896 3925615
14587C925615m40056k82977L90512P44736j3984M63432r78705R4108L96346K48514
$$ 3925615 3485559 3202582 3593094 4337830 4323846 4787278 3808573 3902681 4299027 4547541
14577D547541K32783k30013r06884M33182M27364J28621k92729n32873o84284
$$ 4547541 4780324 4550311 3643427 4076609 4503973 4632594 4339865 3806992 3122708
14568C122708J041050n2093L24591r57310M5170K38022l21832j80742N63975m14871
$$ 3122708 4163758 4111665 4436256 3478946 3524116 3762138 3440306 3259564 3823539 3408668
14558C408668L14742J30743N87653k95699j22130l19450k1089M49240K36170q16508
$$ 3408668 3723410 3854153 4441806 4146107 4023977 3704527 3683438 4132678 4368848 3552340
14548C552340l57563L73489M00451j42037K48822o27336M19057M80731l28141
$$ 3552340 3194777 3568266 3968717 3826680 4075502 3448166 3867223 4347954 4019813
14539D019813o04189q46487k57617J9896R71056n61787m09772M25785O80012J08964
$$ 4019813 3415624 2569137 2311520 2331416 3302472 2740685 2330913 2756698 3436710 3545674
$$ [...]
##END NTUPLES=NMR SPECTRUM
##END=
