##TITLE=1H_CG-1137-2
 CDCl3, 8 sc, 
 26.11.2020
##JCAMPDX= 6.0         $$ Bruker NMR JCAMP-DX V2.0
##DATA TYPE= NMR SPECTRUM
##DATA CLASS= NTUPLES
##ORIGIN= UXNMR, Bruker Analytische Messtechnik GmbH
##OWNER= root
$$ XWIN-NMR		Version 3.5
$$ Thu Nov 26 11:50:32 2020 Russian Standard Time (UT+4h)  she@DPX200
##.OBSERVE FREQUENCY= 200.1315066352
##.OBSERVE NUCLEUS= ^1H
##.ACQUISITION MODE= SIMULTANEOUS
##.ACQUISITION SCHEME= undefined
##.AVERAGES= 8
##.DIGITISER RES= 18
##SPECTROMETER/DATA SYSTEM= spect
##.PULSE SEQUENCE= zg30
##.SOLVENT NAME= CDCl3
##.SHIFT REFERENCE= (INTERNAL, CDCl3, 0, 16.003)
##AUDIT TRAIL= $$ (NUMBER, WHEN, WHO, WHERE, WHAT)
$$ ##TITLE= Audit trail, XWIN-NMR		Version 3.5
$$ ##JCAMPDX= 5.01
$$ ##ORIGIN= Bruker BioSpin GmbH
$$ ##OWNER= she
$$ F:/spectra/data/she/nmr/H-F/1/pdata/1/auditp.txt
$$ ##AUDIT TRAIL=  $$ (NUMBER, WHEN, WHO, WHERE, WHAT)
(   1,<2020-11-26 11:48:36.17 +0400>,<she>,<DPX200>,
      <created by zg, POWCHK disabled, PULCHK disabled
       configuration hash MD5:
       00 E9 B6 7A A2 85 ED C7 34 08 36 98 17 FE 4E 26
       data hash MD5: 16K
       0C EF 45 D0 E6 52 6C 6B 46 5B 28 4B 7E EC 36 2C>)
(   2,<2020-11-26 11:48:39.21 +0400>,<she>,<DPX200>,
      <Start of raw data processing
       efp BC_mod = 2 LB = 0.24 FT_mod = 6 PKNL = 1 PHC0 = -11049.92 PHC1 = 8.600883 SI = 16K 
       data hash MD5: 16K
       3F B7 43 FF 1A 88 2F DE AC D6 D9 8D 28 1F 0A 68>)
(   3,<2020-11-26 11:48:58.82 +0400>,<she>,<DPX200>,
      <pk PHC0 = -0.7891629 PHC1 = 5.6 
       data hash MD5: 16K
       AE 6B C8 7A E8 2E C2 38 C4 7A 28 4E 52 CE D0 40>)
(   4,<2020-11-26 11:49:02.90 +0400>,<she>,<DPX200>,
      <abs ABSG = 5 
       data hash MD5: 16K
       C4 84 DE 1C 21 D4 C3 3C 51 FA FF B1 9E 8F CE E1>)
$$ ##END=
$$ 
$$ hash MD5
$$ B6 C3 63 91 DD DE D3 EE AE 28 F0 5B C6 B9 33 14
##$RELAX= 
##$RELAX= 
##$RELAX= 
##$RELAX= 
##$RELAX= 
##$RELAX= 
$$ Bruker specific parameters
$$ --------------------------
##$DU= <F:/spectra>
##$EXPNO= 1
##$NAME= <H-F>
##$PROCNO= 1
##$TYPE= <nmr>
##$USER= <she>
##$AMP= (0..31)
100 100 100 100 100 100 100 100 100 100 100 100 100 100 100 100 100 100 
100 100 100 100 100 100 100 100 100 100 100 100 100 100 
##$AQSEQ= 0
##$AQ_mod= 1
##$AUNM= <au_zg>
##$AUTOPOS= <>
##$BF1= 200.13
##$BF2= 200.13
##$BF3= 200.13
##$BF4= 200.13
##$BF5= 200.13
##$BF6= 200.13
##$BF7= 200.13
##$BF8= 200.13
##$BYTORDA= 1
##$CFDGTYP= 0
##$CFRGTYP= 5
##$CHEMSTR= <none>
##$CNST= (0..31)
1 1 145 1 1 1 1 1 1 1 1 1 1 1 1 1 1 1 1 1 1 1 1 1 1 1 1 1 1 1 1 1 
##$CPDPRG= <>
##$CPDPRG1= <>
##$CPDPRG2= <>
##$CPDPRG3= <>
##$CPDPRG4= <mlev>
##$CPDPRG5= <mlev>
##$CPDPRG6= <mlev>
##$CPDPRG7= <mlev>
##$CPDPRG8= <mlev>
##$CPDPRGB= <>
##$CPDPRGT= <>
##$D= (0..31)
0 1.2 0 0 0 0 0 0 0 0.06 0 0.03 0 0 0 0 0.0002 0 0 0 0 0 0 0 0 0 0 0 0 
0 0 0 
##$DATE= 1606376915
##$DBL= (0..7)
120 120 120 120 120 120 120 120 
##$DBP= (0..7)
150 150 150 150 150 150 150 150 
##$DBP07= 0
##$DBPNAM0= <>
##$DBPNAM1= <>
##$DBPNAM2= <>
##$DBPNAM3= <>
##$DBPNAM4= <>
$$ [...]
##$SUBNAM3= <"">
##$SUBNAM4= <"">
##$SUBNAM5= <"">
##$SUBNAM6= <"">
##$SUBNAM7= <"">
##$SUBNAM8= <"">
##$SUBNAM9= <"">
##$SW= 16.9725356469052
##$SWIBOX= (0..15)
0 0 2 0 0 0 0 0 0 0 0 0 0 0 0 0 
##$SW_h= 3396.73913043478
##$TD= 16384
##$TD0= 1
##$TE= 0
##$TE2= 300
##$TE3= 300
##$TEG= 300
##$TL= (0..7)
0 120 120 120 120 120 120 120 
##$TP= (0..7)
150 150 150 150 150 150 150 150 
##$TP07= 0
##$TPNAME0= <>
##$TPNAME1= <>
##$TPNAME2= <>
##$TPNAME3= <>
##$TPNAME4= <>
##$TPNAME5= <>
##$TPNAME6= <>
##$TPNAME7= <>
##$TPOAL= (0..7)
0.5 0.5 0.5 0.5 0.5 0.5 0.5 0.5 
##$TPOFFS= (0..7)
0 0 0 0 0 0 0 0 
##$TUNHIN= 0
##$TUNHOUT= 0
##$TUNXOUT= 0
##$USERA1= <user>
##$USERA2= <user>
##$USERA3= <user>
##$USERA4= <user>
##$USERA5= <user>
##$V9= 5
##$VALIST= <valist>
##$VCLIST= <CCCCCCCCCCCCCCC>
##$VD= 0
##$VDLIST= <DDDDDDDDDDDDDDD>
##$VPLIST= <PPPPPPPPPPPPPPP>
##$VTLIST= <TTTTTTTTTTTTTTT>
##$WBST= 1024
##$WBSW= 4
##$XGAIN= (0..3)
0 0 0 0 
##$XL= 0
##$YL= 0
##$YMAX_a= 810610
##$YMIN_a= -529110
##$ZGOPTNS= <>
##$ZL1= 120
##$ZL2= 120
##$ZL3= 120
##$ZL4= 120
##$ABSF1= 16.03411
##$ABSF2= -0.9385548
##$ABSG= 5
##$ABSL= 3
##$ALPHA= 0
##$AQORDER= 0
##$ASSFAC= 0
##$ASSFACI= 0
##$ASSFACX= 0
##$ASSWID= 0
##$AUNMP= <proc_1d>
##$AZFE= 0.1
##$AZFW= 0.1
##$BCFW= 0
##$BC_mod= 2
##$BYTORDP= 0
##$COROFFS= 0
##$CY= -3
##$DATMOD= 1
##$DC= 0
##$DFILT= <>
##$DTYPP= 0
##$F1P= 0
##$F2P= 0
##$FCOR= 1
##$FTSIZE= 16384
##$FT_mod= 6
##$GAMMA= 0
##$GB= 0
##$INTBC= 1
##$INTSCL= 2.992141e-10
##$ISEN= 128
##$LB= 0.24
##$LEV0= 0
##$LPBIN= 0
##$MAXI= 10000
##$MC2= 0
##$MEAN= 0
##$ME_mod= 0
##$MI= 1.114404
##$NCOEF= 0
##$NC_proc= -5
##$NLEV= 6
##$NOISF1= 3.799351
##$NOISF2= 2.8
##$NSP= 0
##$NTH_PI= 0
##$NZP= 0
##$OFFSET= 16.00303
##$PC= 1
##$PHC0= -11050.71
##$PHC1= 14.20088
##$PH_mod= 1
##$PKNL= yes
##$PPARMOD= 0
##$PSCAL= 0
##$PSIGN= 0
##$REVERSE= no
##$SF= 200.130002317482
##$SI= 16384
##$SIGF1= 3
##$SIGF2= 2
##$SINO= 5.538805
##$SIOLD= 16384
##$SREGLST= <1H.CDCl3>
##$SSB= 0
##$STSI= 16384
##$STSR= 0
##$SW_p= 3396.73913043478
##$SYMM= 0
##$S_DEV= 0
##$TDeff= 16384
##$TDoff= 0
##$TI= <>
##$TILT= no
##$TM1= 0
##$TM2= 0
##$TOPLEV= 0
##$USERP1= <user>
##$USERP2= <user>
##$USERP3= <user>
##$USERP4= <user>
##$USERP5= <user>
##$WDW= 1
##$XDIM= 16384
##$YMAX_p= 487282320
##$YMIN_p= -224866
$$ End of Bruker specific parameters
$$ ---------------------------------
##NTUPLES= NMR SPECTRUM
##VAR_NAME=  FREQUENCY,     SPECTRUM/REAL,   SPECTRUM/IMAG
##SYMBOL=    X,             R,               I
##VAR_TYPE=  INDEPENDENT,   DEPENDENT,       DEPENDENT
##VAR_FORM=  AFFN,          ASDF,            ASDF
##VAR_DIM=   16384,         16384,           16384
##UNITS=     HZ,            ARBITRARY UNITS, ARBITRARY UNITS
##FACTOR=    0.207333158178281, 1,           1
##FIRST=     3202.68658648325, 0,            0
##LAST=      -194.052543951529, 0,           0
##MIN=       -194.052543951529, -224866,     0
##MAX=       3202.68658648325, 487282320,    0
$$ Real data points
##PAGE= N=1
##DATA TABLE= (X++(R..R)), XYDATA
$$ [...]
4684A62589M8443J0338j67R1219j4415q1031l7911M5419l8978J25394l6172j6587
$$ 162589 211032 221370 221203 312422 298007 216976 179065 224484 185506 310900 274728 258141
4672B58141O6312j01112p9687R031P4336j689N9425L60k7403P7168j3619m2660
$$ 258141 324453 223341 143654 152685 227021 225332 284757 285117 257714 334882 321263 278603
4660B78603O6793L8205j46062K8985M4778l2736P7480r3340l3682K4418M1518
$$ 278603 345396 383601 237539 266524 311302 278566 356046 262706 229024 253442 294960
4649B94960N5883K3895k1414l1484o1267L615J400K9692o962P091J7886j6566
$$ 294960 350843 374738 353324 321840 260573 264188 265588 295280 288318 295409 313295 296729
4637B96729Q0839m4004n1732j8588p4621L1142k9625N1850Q4194m5000o0679k5350
$$ 296729 377568 333564 281832 263244 188623 219765 190140 241990 326184 281184 220505 195155
4625A95155k4463O6505L2137K88j9867M6149j16169j3560Q5759P9780K0254j33865
$$ 195155 170692 237197 269334 269622 249755 295904 179735 166175 251934 331714 351968 218103
4613B18103k2850R968Q9743J8766O423q1380m6841N9811O2532N3247n8967j8651
$$ 218103 195253 205221 294964 313730 320153 238773 191932 251743 314275 367522 308555 289904
4601B89904J5794K227k4631K7080Q5530n6017O9655L8641m0707L4103l855q1330
$$ 289904 305698 307925 283294 310374 395904 339887 409542 448183 407476 441579 437724 356394
4589C56394L2384J1877M0708J3229K0011K8431j826L747k613J674k1000n5588
$$ 356394 388778 400655 441363 454592 474603 503034 501208 504955 502342 504016 483016 427428
4577D27428n7284P0534P50R1873Q5657M6199p6772j3388k5196J20583M7274m7137
$$ 427428 370144 440678 441428 533301 618958 665157 588385 574997 549801 670384 717658 670521
4565F70521O7829O0604O828m6505J5405j1724m0454j46149J4113J6206Q252J9868
$$ 670521 738350 798954 805782 759277 774682 762958 722504 576355 590468 606674 614926 634794
4553F34794o2105O3628q3871K5972K2404N4904l696j24666J492M7247K167j0353
$$ 634794 572689 636317 552446 578418 600822 655726 652030 527364 528856 576103 578270 567917
4541E67917N2198N6184N8009r4527P6703P2713J30527J40982m464o5059R2179
$$ 567917 620115 676299 734308 639781 716484 789197 919724 1060706 1056242 991183 1083362
4530A083362K17800O3008K3108j01682j56568l5815k2821j2311O3161R2213j8339
$$ 1083362 1301162 1364170 1387278 1285596 1129028 1093213 1070392 1058081 1121242 1213455 1195116
4519A195116K5P6044N8835J05427J25443K7755O6855J07299J37532L9217K4544
$$ 1195116 1195141 1271185 1330020 1435447 1560890 1588645 1655500 1762799 1900331 1939548 1964092
4508A964092J987k4448L4492J8486N1217l9728M8133l2025p1517O191P5193N8228
$$ 1964092 1966079 1941631 1976123 1994609 2045826 2006098 2054231 2022206 1950689 1956880 2032073 2090301
4496B090301N0808j6375j80942k39499j88063j06402j57261r1602m9986K2910
$$ 2090301 2141109 2124734 1943792 1704293 1516230 1409828 1252567 1160965 1110979 1133889
4486A133889M3012m1158o3166K2368j54231o9464K4708o9768K4673K4098L797
$$ 1133889 1176901 1135743 1072577 1094945 940714 871250 895958 826190 850863 874961 878758
4475H78758k4964L4061m176J8106M2630L501m3208l1225P4001M0095j6732o8663
$$ 878758 853794 887855 883679 901785 944415 947916 904708 873483 947484 987579 970847 902184
4463I02184O5940P6827K1768M6278n1984p4374n8488n819k8751Q9642O843k7808
$$ 902184 968124 1044951 1066719 1112997 1061013 986639 928151 922332 893581 983223 990066 962258
4451I62258o4412k4486N6212j8654j1339M8324M5072n641O0987O8838Q2874k7328
$$ 962258 897846 873360 929572 910918 899579 947903 992975 987334 1048321 1117159 1200033 1172705
4439A172705O4239J16748O9284P5998L8843J15919P9004K8718r948L6092M2057
$$ 1172705 1236944 1353692 1422976 1498974 1537817 1653736 1732740 1761458 1751510 1787602 1829659
4428A829659m1428K1384j01709j7492j36593l9647k7231J0752o2242j14282q1178
$$ 1829659 1788231 1809615 1707906 1690414 1553821 1514174 1486943 1497695 1435453 1321171 1239993
4417A239993o2602L6983m6649q8594l7353j1354j4463j1838j6637m4918j8206
$$ 1239993 1177391 1214374 1167725 1079131 1041778 1030424 1015961 1004123 987486 942568 924362
4406I24362q9806l7843r775m0107K9452j327k3951n9429k5528L4353j2656j15763
$$ 924362 834556 796713 786938 746831 776283 774956 751005 691576 666048 700401 687745 571982
4394E71982J4637k5826J052R902O6367p7722L7025l2967N6770j5475J0259J2791
$$ 571982 586619 560793 561845 571747 638114 560392 597417 564450 621220 605745 616004 628795
4382F28795p6289L9780N5309P7218l860l8749J5652k7267p9467l730l4238p9702
$$ 628795 552506 592286 647595 724813 720953 682204 697856 670589 591122 587392 553154 473452
4370D73452m8417l874J9035K1416O5103Q3357k2741R057l6991l870M5355k6861
$$ 473452 425035 421161 440196 461612 526715 610072 587331 596388 559397 555527 600882 574021
4358E74021k5546j2003k4053J6929o1821r5482J1139O1423p9044L4700O8984J0494
$$ 574021 548475 536472 512419 529348 467527 372045 383184 444607 365563 400263 469247 479741
4346D79741j5249n3639N3484n4778K0444N8689l7075N2801M7956l5745n596K2909
$$ 479741 464492 410853 464337 409559 430003 488692 451617 504418 552374 516629 511033 533942
4334E33942q8437M7526O0537r9491o6387k1806K5876K4742k4068p9745k7490O7707
$$ 533942 445505 493031 553568 454077 387690 365884 391760 416502 392434 312689 285199 352906
4322C52906O0404Q4286l9258n2782k3678m7484L6654P1157l0521k8707K2651q7678
$$ 352906 413310 497596 458338 405556 381878 334394 371048 442205 411684 382977 405628 317950
4310C17950L7282j7808o265L0272K7177O2633P975l3190L5998j6824r3165N723
$$ 317950 355232 337424 331159 361431 388608 451241 459216 426026 462024 445200 352035 357758
4298C57758O3870O6229N8459q0975N8728l0088p6900M6540j5395o3216J05602
$$ 357758 421628 487857 546316 465341 524069 493981 417081 463621 448226 385010 490612
4287D90612N7703m3656K7991N7817N5867J8259J6772K5988P1831M0899O2241L4908
$$ 490612 548315 504659 532650 590467 646334 664593 681365 707353 779184 820083 882324 917232
4275I17232J55366O1278J78155J42134J42895K94577K15203O2837l64194l51489
$$ 917232 1072598 1133876 1312031 1454165 1597060 1891637 2106840 2169677 1805483 1453994
4265A453994k28039j54665j73016o3381j6871n2111m2520m3359J12279j75392
$$ 1453994 1225955 1071290 898274 834893 818022 765911 723391 680032 792311 616919
4255F16919o8962m8283n9708l7571L4634m8818J073R3937k1787P99J4650J9388
$$ 616919 547957 499674 439966 402395 437029 388211 389284 483221 461434 462233 476883 496271
4243D96271O9487k0067k6615O911p831L2154J6595m555n7132k3189P8136k8407
$$ 496271 565758 545691 519076 525987 518156 550310 566905 562350 505218 482029 560165 531758
4231E31758j7794q238L019j1107J1399K124P5618r197q2213N2130l7869k8096
$$ 531758 513964 505726 508745 497638 509037 511161 586779 577582 495369 547499 509630 481534
4219D81534J3111L8361J3647n738r7227j8814r49l6637K9739J9891J057L83L4673
$$ 481534 494645 533006 546653 540915 443688 424874 423925 387288 417027 436918 437975 438358 473031
4206D73031j4521J64874Q3374l2628k370l2252L3281m6300m8326m0466Q2373L8983
$$ 473031 458510 623384 706758 674130 671760 639508 672789 626489 578163 537697 620070 659053
4194F59053k1204j05154l4481L0281q005M9825O7746j1857k322j5292J3146Q0766
$$ 659053 637849 532695 498214 528495 520490 570315 638061 626204 623882 608590 621736 702502
4182G02502m3527n5963P2313o1558l0284O4590M2573Q952j12802J7580r2513j26356
$$ 702502 658975 603012 675325 613767 583483 648073 690646 699598 586796 604376 511863 385507
4170C85507N3158L1841K0177N1557l5774R388l4331j1001N9293J6117o1672M272
$$ 385507 438665 470506 490683 542240 506466 515854 481523 470522 529815 545932 484260 488532
4158D88532J823J6516O5093m0679n518l6863n6972q3572M8233j8763J5836m9052
$$ 488532 490355 506871 571964 531285 525767 488904 431932 348360 396593 377830 393666 344614
4146C44614J07698J4559M3713K9574j7554p82l8413O1234l1922l3385j7332j650
$$ 344614 452312 466871 510584 540158 522604 521822 483409 544643 512721 479336 462004 460354
4134D60354k2019k6654J6583Q307O1382j1526J4355N819M4969L7097o5150r9062
$$ 460354 438335 411681 428264 436571 497953 486427 500782 506601 551570 588667 523517 424455
4122D24455Q2879L2757o0246q334o969L2206m1551O4716N2622L6457M2706K0904
$$ 424455 507334 540091 479845 471511 464542 496748 455197 519913 572535 608992 651698 672602
4110F72602o5226N0630j7080m0794P353l2602j1101L376J08793R7945j17736p950
$$ 672602 607376 658006 640926 600132 607485 574883 563782 567158 675951 773896 656160 648210
4098F48210N6236K0421K7544n7494J04956N1509l6632r247n4124k5367k555l2171
$$ 648210 704446 724867 752411 694917 799873 851382 814750 805503 751379 726012 723457 691286
4086F91286J14553J32242k6396j3767O263R9593O1650L4565j4479q3726p7370
$$ 691286 805839 938081 911685 897918 904181 1003774 1065424 1099989 1085510 1001784 924414
4075I24414J1430K6169O3720N2601r2262l6177L2625q9271L2467q5141j2417J0950
$$ 924414 935844 962013 1025733 1078334 986072 949895 982520 893249 925716 840575 828158 839108
4063H39108p0662j221P2464M0167j24496l0975K3691Q251j0920J2009J5451j1983
$$ 839108 768446 767225 839689 879856 755360 724385 748076 756327 745407 757416 772867 760884
4051G60884m3133p3073N3866N1830m3330q7678K0630q4047K2999j3083l8940N2037
$$ 760884 717751 644678 698544 750374 707044 619366 639996 555949 578948 565865 526925 578962
4039E78962q0958l5581J4042Q238L866o774m9422O7782m2677j1010m5630o9590
$$ 578962 498004 462423 476465 484703 488569 481795 432373 500155 457478 446468 400838 331248
4027C31248P7355j9597N5884L5752L4470l7609K7201J0780l0546q4068l1386J09805
$$ 331248 408603 389006 444890 480642 515112 477503 504704 515484 484938 400870 369484 479289
4015D79289K5538R8920p5650J8429j7727o7673R603O7285J2025j1898N7660J17496
$$ 479289 504827 603747 528097 546526 528799 461126 470729 538014 550039 538141 595801 713297
4003G13297M9638r6446o4010k9648L3520p259k7289L0081Q5321p6471o0665Q786
$$ 713297 762935 666489 602479 572831 606351 599092 571803 601884 687205 610734 550069 558855
3991E58855P5299N0310j40278R3626O9901J15134K1762n602N0702N5970o1900
$$ 558855 634154 684464 544186 637812 707713 822847 844609 839007 889709 945679 883779
3980H83779J02069K15882J17862J6765P3180J10567L9296k5742o1092p8359j46301
$$ 883779 985848 1201730 1319592 1336357 1409537 1520104 1559400 1533658 1472566 1394207 1247906
3969A247906j41354q6253M2982j18o7531n0424r3572l4467R3775K2740m9789l8773
$$ 1247906 1106552 1020299 1063281 1063163 995632 945208 851636 817169 910944 933684 883895 845122
3957H45122M3198l5079o3102M0176p640o2929r231N981j5718K2568L9456K9110
$$ 845122 888320 853241 790139 830315 822675 759746 750515 756496 740778 763346 802802 831912
3945H31912P3082p4328K3872j3831j8818N0868N495J02000L3274n1467q8296k2158
$$ 831912 904994 830666 854538 840707 821889 872757 878252 980252 1013526 962059 873763 851605
3933H51605L8161k3745r827q450q619j20904O8176M1260K9749l0626N662Q1185
$$ 851605 889766 866021 856194 847744 839125 718221 786397 827657 857406 826780 832442 913627
3921I13627j9227k1715M1544N3391N1468j1374m6534R5260k2178q0106K8344j5444
$$ 913627 894400 872685 914229 967620 1019088 1007714 961180 1056440 1034262 954156 982500 967056
3909I67056N5139J8986J0550N3038k0790m7718o97M2055p622M9401p7667M9907
$$ 967056 1022195 1041181 1051731 1104769 1083979 1036261 1035564 1077619 1069997 1119398 1041731 1091638
3897A091638K1433j0008J8140M8821J13391j8708m821l0068m3204m0979j6182
$$ 1091638 1113071 1103063 1121203 1170024 1283415 1264707 1259886 1229818 1186614 1145635 1129453
3886A129453M5754j4389L1978k4662l6577R1589J6484k8971L9786J11599J18430
$$ 1129453 1175207 1160818 1192796 1168134 1131557 1223146 1239630 1210659 1250445 1362044 1480474
3875A480474m2092n2473l7770R475o6041l2254j2585O2907K30R1654J30607q613
$$ 1480474 1438382 1385909 1348139 1357614 1291573 1259319 1246734 1309641 1309871 1401525 1532132 1523519
3863A523519j3828P967m057j4309k2050K8054P0579K2200M3747n6689N1976j271
$$ 1523519 1509691 1517658 1513601 1499292 1477242 1505296 1575875 1598075 1641822 1585133 1637109 1635838
3851A635838N7341k2182k531J11463K7567N1704O9385L4752n550L1859P268J13086
$$ 1635838 1693179 1670997 1668466 1779929 1807496 1859200 1928585 1963337 1957787 1989646 1996914 2110000
3839B110000J07259N3302m5859M9164R1067n825M6681O7286J13985j6101l10J31737
$$ 2110000 2217259 2270561 2224702 2273866 2364933 2359108 2405789 2473075 2587060 2570959 2570649 2702386
3827B702386R7155N8488J12031J52163K34884J31697J24028J97510N4734Q7466
$$ 2702386 2799541 2858029 2970060 3122223 3357107 3488804 3612832 3810342 3865076 3952542
3817C952542J72551J40974J30007J32756K10205J54358K27360K41239K57344L66618
$$ 3952542 4125093 4266067 4396074 4528830 4739035 4893393 5120753 5361992 5619336 5985954
3807E985954M50536N71515P39990P00555R50404J156832J420195J682092K111071
$$ 5985954 6436490 7008005 7747995 8448550 9398954 10555786 11975981 13658073 15769144
3798A5769144K765234K739685J248351m76123j642984l232271l143433k233388
$$ 15769144 18534378 21274063 22522414 22046291 20403307 17171036 14027603 11794215
3790A1794215j545440j132961q97289o55448n11738l98487l67954k77158k39035
$$ 11794215 10248775 9115814 8218525 7563077 7051339 6652852 6284898 6007740 5768705
3781E768705j70998j36395j32090j30616q0754j53673l2648j7187q8361m8652
$$ 5768705 5597707 5461312 5329222 5198606 5117852 4964179 4931531 4914344 4825983 4777331
3771D777331m8903L7022J49109P9135K2923J08182L5672J09321Q7189m7795j5780
$$ 4777331 4728428 4765450 4914559 4993694 5016617 5124799 5160471 5269792 5356981 5309186 5293406
3760E293406l973O8617P5506J69287N5273J5318N7221J6683K8678P4501K10150
$$ 5293406 5289433 5358050 5433556 5602843 5658116 5673434 5730655 5747338 5776016 5850517 6060667
3749F060667Q4997J64873J18491J41799J92855J82339K05698K20437J63193M6739
$$ 6060667 6145664 6310537 6429028 6570827 6763682 6946021 7151719 7372156 7535349 7582088
3739G582088J56562K04988K31343K17564L66471M77377M19895M80585N90442R15254
$$ 7582088 7738650 7943638 8174981 8392545 8759016 9236393 9656288 10136873 10727315 11642569
3729A1642569J030372J121940J386758J622525K000754K543780K756858J602407
$$ 11642569 12672941 13794881 15181639 16804164 18804918 21348698 24105556 25707963
3721B5707963j05798k35637q95965k677069k810902j977691j305350j052028p19038
$$ 25707963 25602165 25366528 24470563 21793494 18982592 17004901 15699551 14647523 13928485
3712A3928485n90388m70544l49379k01530j37212j56273p2968P3732p4559O0740
$$ 13928485 13338097 12867553 12518174 12316644 12179432 12023159 11950191 12023923 11949364 12010104
3702A2010104J32072R0853K99778J04995J30931K56656K26128K44949L12734K68739
$$ 12010104 12142176 12233029 12532807 12637802 12768733 13025389 13251517 13496466 13809200 14077939
3692A4077939L03565L62730L87328M06012M42464M72684M89593N46268N90934
$$ 14077939 14381504 14744234 15131562 15537574 15980038 16452722 16942315 17488583 18079517
3683A8079517O30838N93379N82494Q40292Q48945J032377J017442J146741J353895
$$ 18079517 18710355 19303734 19886228 20726520 21575465 22607842 23625284 24772025 26125920
3674B6125920J371049J522410J530459J487828J632848J687695J874855K102767
$$ 26125920 27496969 29019379 30549838 32037666 33670514 35358209 37233064 39335831
3666C9335831K314301K668358L156622L523877M085540M967178O212126P593376
$$ 39335831 41650132 44318490 47475112 50998989 55084529 60051707 66263833 73857209
3658G3857209R234010J1087242J3074494J5380737J8040937K0781145K3977163
$$ 73857209 83091219 94178461 107252955 122633692 140674629 161455774 185432937
3651A85432937K7192197K5842226R485908j9853301l5135530l2477065k5805026
$$ 185432937 212625134 238467360 247953268 228099967 192964437 160487372 134682346
3644A34682346j9952125j5569167j2542408j0417342q567359p194879n869129
$$ 134682346 114730221 99161054 86618646 76201304 67633945 60439066 54569937
3637E4569937n177783m453349l784660l360095k985612k619843k286237k076619
$$ 54569937 49392154 44938805 41154145 37794050 34808438 32188595 29902358 27825739
3629B7825739j933935j547428j346832j204610j114725p95733p60204o40190o51018
$$ 27825739 25891804 24344376 22997544 21792934 20678209 19882476 19122272 18482082 17831064
3620A7831064p85207n93051o37405p85290o99637o11493n24438n07257m22026
$$ 17831064 17045857 16452806 15815401 15030111 14330474 13718981 13194543 12687286 12265260
3611A2265260m98203m85788l68273m16333l49570l19717l55564k39699k05985
$$ 12265260 11767057 11281269 10912996 10496663 10147093 9827376 9471812 9232113 9026128
3602I026128k76472l01876k83629k14785j95956j19543j41281j72724j48539k00160
$$ 9026128 8749656 8447780 8164151 7949366 7753410 7633867 7492586 7319862 7171323 6971163
3592F971163k20573j86956n7104j80119j91232q5146j03163K5986q4381j08657
$$ 6971163 6750590 6563634 6506530 6326411 6135179 6050033 5946870 5972856 5888475 5779818
3582E779818j02582p3643o0143q1255p0120j5333o5127j33108p4259j55261j08170
$$ 5779818 5677236 5603593 5543450 5462195 5392075 5376742 5311615 5178507 5104248 4948987 4840817
3571D840817j23537o8023M2275j07600k23443j18245j28013j15816j32398j45769
$$ 4840817 4717280 4649257 4691532 4583932 4360489 4242244 4114231 3998415 3866017 3720248
3561C720248k8110m4089o7061j02383o606m6131j09387o4917N5167j27221j06067
$$ 3720248 3692138 3648049 3580988 3478605 3471999 3425868 3316481 3251564 3306731 3179510 3073443
3550C073443J1545K1219m1436l0217l498P4030m2661n401N7554q1170M014n5792
$$ 3073443 3084988 3106207 3064771 3034554 3031056 3105086 3062425 3057024 3114578 3033408 3037422 2981630
3538B981630q9131K7603p7686j17005J2495p7429j1061n2844p8817k7249N630
$$ 2981630 2892499 2920102 2842416 2725411 2737906 2660477 2649416 2596572 2517755 2490506 2496136
3527B496136J1939N2278K2900J4389l0232o2934j8319j12462j67197o7519J1880
$$ 2496136 2508075 2560353 2583253 2597642 2567410 2504476 2486157 2373695 2206498 2138979 2150859
3516B150859L1202n4074n2250Q6554N0241m2890k7966J2075m3499R1213K8194
$$ 2150859 2182061 2127987 2075737 2162291 2212532 2169642 2141676 2153751 2110252 2201465 2229659
3505B229659L0242M2199Q826j570J8959o672k2657n9220O8416j2909J6085M8747
$$ 2229659 2259901 2302100 2310926 2309356 2328315 2321643 2298986 2239766 2308182 2295273 2311358 2360105
3493B360105l1423K849P9782J81757L5238J19007J56722J0619J23997J4980R5879
$$ 2360105 2328682 2331531 2411313 2593070 2628308 2747315 2904037 2914656 3038653 3053633 3149512
3482C149512O7403N9016J44849J04447R2150K76657M31140j79132m90785m92547
$$ 3149512 3216915 3275931 3420780 3525227 3617377 3894034 4325174 4146042 3655257 3162710
3472C162710k55022j82683j27900j07346o7575n6981m4276j28934n311J70424
$$ 3162710 2907688 2725005 2597105 2489759 2422184 2365203 2320927 2191993 2186682 2357106
3462B357106m1636q1618q6136o0924l0840j20381l4104J8319l2132l4261J8658
$$ 2357106 2315470 2233852 2147716 2086792 2055952 1935571 1901467 1919786 1887654 1853393 1872051
3451A872051k8939l3152m1777L8438Q354J3116M558k9907r262k7115o4088O834
$$ 1872051 1843112 1809960 1768183 1806621 1814975 1828091 1832649 1802742 1793480 1766365 1702277 1709111
3439A709111m6221o2591J12132P4941K1973K1955q2391l8791J04327K2773K0947
$$ 1709111 1662890 1600299 1712431 1787372 1809345 1831300 1748909 1710118 1814445 1837218 1858165
3428A858165o6690j7328k0624K216P8478r940M3882k9132p3846N3737J58225n7501
$$ 1858165 1791475 1774147 1753523 1755739 1834217 1824277 1868159 1839027 1765181 1818918 1977143 1919642
3416A919642N8718J07154J25658Q3114K37451K20730J84796J71057J72509K43024
$$ 1919642 1978360 2085514 2211172 2294286 2531737 2752467 2937263 3108320 3280829 3523853
3406C523853K31198J93934R5722O2735j81822l55966l20228k35327j92357j93401
$$ 3523853 3755051 3948985 4044707 4107442 3925620 3569654 3249426 3014099 2821742 2628341
3396B628341j37621j26078q5161P219q8116j921r2824n2246J9240M6313K5579
$$ 2628341 2490720 2364642 2279481 2286700 2198584 2196663 2103839 2051593 2070833 2117146 2142725
3385B142725n4600o3516n8329N4346j15325j27019l2885o3827o1430p6120q000
$$ 2142725 2088125 2024609 1966280 2020626 1905301 1778282 1745397 1681570 1620140 1544020 1536020
3374A536020j1054m7590r576l2676m7140m6538l4472K8499j7829m4062j41671
$$ 1536020 1524966 1477376 1467800 1435124 1387984 1341446 1306974 1335473 1317644 1273582 1131911
3363A131911r6736m8841J76796l8091r1262N9525J4370J9511j2122k5434P2468
$$ 1131911 1035175 986334 1163130 1125039 1033777 1093302 1107672 1127183 1115061 1089627 1162095
3352A162095K0799J1084k0327K222K06O6439K9247m2807j44384N6783N6492p1934
$$ 1162095 1182894 1193978 1173651 1175873 1176079 1242518 1271765 1228958 1084574 1141357 1197849 1125915
3340A125915J1373J243M564J3056K3363k896M6991O0940m419M0456r693J38347
$$ 1125915 1137288 1138531 1143095 1156151 1179514 1176618 1223609 1284549 1280130 1320586 1310893 1449240
3328A449240J25994J5860M4711R0714M7078J03720K0517l1610j19730j82841j57282
$$ 1449240 1575234 1591094 1635805 1726519 1773597 1877317 1897834 1866224 1746494 1563653 1406371
3317A406371j43953P572r6590p6009K782q5153q8446M069l4765l3793J3858l2305
$$ 1406371 1262418 1269990 1173400 1097391 1100173 1015020 926574 930643 895878 862085 875943 843638
3305H43638k6189J08541p3485J7275N6953n0917p8367O0634M4512J25385n9172
$$ 843638 817449 925990 852505 869780 926733 875816 797449 858083 902595 1027980 968808
3294I68808q5604m1599N444J04211O4159j32288n2439Q0452K6216m1763o6917
$$ 968808 883204 841605 847049 951260 1015419 883131 830692 911144 937360 895597 828680
3283H28680L6789q2760K5416P0166J1078p2592r2735J7329n286J14481p6155K5209
$$ 828680 865469 782709 808125 878291 889369 816777 724042 741371 736085 850566 774411 799620
3271G99620N304m5990m6396M9961Q2725m0755j2351N1711J1519k3485L0406K2344
$$ 799620 804924 758934 712538 762499 845224 804469 792118 843829 855348 831863 862269 884613
3259H84613P649k0837N9265j2800j9563J2508M7284J7162P7622o887q1354m6646
$$ 884613 892262 871425 930690 917890 898327 910835 958119 975281 1052903 1046016 964662 918016
3247I18016P3974N7357m9228j1754J803j6791O9297M5407k1229M3330l138l2688
$$ 918016 991990 1049347 1000119 988365 990168 973377 1042674 1088081 1066852 1110182 1107044 1074356
3235A074356P429l4162N816J06714k2220k2011k3440K548M5132L1783L9808J977
$$ 1074356 1081785 1047623 1053439 1160153 1137933 1115922 1092482 1095030 1140162 1171945 1211753 1213730
3223A213730L2958K5440J3880J19018J24918o8166j00335N3777O2359J36488J0818
$$ 1213730 1246688 1272128 1286008 1405026 1529944 1461778 1361443 1415220 1477579 1614067 1624885
3212A624885M305K6467k8029o984r7733Q585l7065j8962m046Q9483L2070L3614
$$ 1624885 1629190 1655657 1627628 1620644 1522911 1531496 1494431 1475469 1471423 1560906 1592976 1626590
3200A626590Q6898k8064n720j318j8305R6650Q5398P3491Q4174Q5986L8282J12611
$$ 1626590 1713488 1685424 1679704 1678386 1660081 1756731 1842129 1915620 1999794 2085780 2124062 2236673
3188B236673N9203Q5971J10200k8165k7482L331n0811m846n8095r3327q6453p3598
$$ 2236673 2295876 2381847 2492047 2463882 2436400 2439731 2388920 2384074 2325979 2232652 2146199 2072601
3176B072601K6016l7178J1212N0352J3752k8030J9029L5054K6320j1261O8745
$$ 2072601 2098617 2061439 2072651 2123003 2136755 2108725 2127754 2162808 2189128 2177867 2246612
3165B246612m4340j2423N8460Q1371J01791J5579k0194K8234L7023K3180N6663
$$ 2246612 2202272 2189849 2248309 2329680 2431471 2447050 2426856 2455090 2492113 2515293 2571956
3154B571956M3435L9751K5215O8926M9003k2162M2246J01314n132L1869J26910
$$ 2571956 2615391 2655142 2680357 2749283 2798286 2776124 2818370 2919684 2914552 2946421 3073331
3143C073331J40656K08272J24831J12962K34529J13370K63190K69987L92478M46682
$$ 3073331 3213987 3422259 3547090 3660052 3894581 4007951 4271141 4541128 4933606 5380288
3133E380288M46217L28522J64269n8001k26239k61268o2602N2574j07506K2738
$$ 5380288 5826505 6155027 6319296 6261295 6035056 5773788 5711186 5763760 5656254 5678992
3123E678992m4648j88963j07457j9370j56563p5889j2663M8L2429j1806M4117
$$ 5678992 5634344 5445381 5337924 5318554 5161991 5086102 5073439 5073487 5105916 5094110 5138227
3112E138227N0089M0969J42951Q3434J60247J23929J37691J07391J59284K61701
$$ 5138227 5188316 5229285 5372236 5455670 5615917 5739846 5877537 5984928 6144212 6405913
3102F405913K04010J10127L14095K77557K92200L15451K85126L69804K69953L66982
$$ 6405913 6609923 6720050 7034145 7311702 7603902 7919353 8204479 8574283 8844236 9211218
3092I211218L07660L38961L50496L31243L63122M49476N05690O56752O34470O76859
$$ 9211218 9518878 9857839 10208335 10539578 10902700 11352176 11857866 12514618 13149088 13825947
3082A3825947P11045P62262P52359O48594P18333P21305O62154O13860O58564
$$ 13825947 14536992 15299254 16051613 16700207 17418540 18139845 18801999 19415859 20074423
3073B0074423P55873P97903J024336J019161J012538J193898J115496R57760R42350
$$ 20074423 20830296 21628199 22652535 23671696 24684234 25878132 26993628 27951388 28893738
3064B8893738R27586P32898N54124M45242L26964K46082K15774L76378L95585
$$ 28893738 29821324 30554222 31108346 31553588 31880552 32126634 32342408 32718786 33114371
3055C3114371O60039P18332Q54294R45919J004579R46426Q51235O52091M49127
$$ 33114371 33774410 34492742 35347036 36292955 37297534 38243960 39095195 39747286 40196413
3046D0196413J89279j24409n9467r8614o7495K02614N54195Q62619J498258K283789
$$ 40196413 40385692 40261283 40201816 40103202 40035707 40238321 40792516 41655135 43153393 45437182
3036D5437182K147728k135824l702597k489031k093415j800400j690966j558075
$$ 45437182 47584910 45449086 41746489 39257458 37164043 35363643 33672677 32114602
3028C2114602j554397j421833j378544j133101q98230q42965r79730r46179j002424
$$ 32114602 30560205 29138372 27759828 26626727 25728497 24885532 23905802 22959623 21957199
3019B1957199q86963q79620r18991q67681q59322r52994r37490q29736p28016
$$ 21957199 21070236 20190616 19271625 18403944 17544622 16591628 15654138 14824402 14096386
3010A4096386p26554o84894n74323n37221m68932m66383l70901l01804l01412
$$ 14096386 13369832 12684938 12110615 11573394 11104462 10638079 10267178 9965374 9663962
3001I663962l01160k64547k70594k84535k48020k00253j92816k39311k14505k51122
$$ 9663962 9362802 9098255 8827661 8543126 8295106 8094853 7902037 7662726 7448221 7197099
2991G197099j94754k33373k61574k79380j74267l18238k16203j49689j46795k38102
$$ 7197099 7002345 6768972 6507398 6228018 6053751 5735513 5519310 5369621 5222826 4984724
2981D984724k46124j66670j49784j38547l9359j40066j29151m9044j51450j63048
$$ 4984724 4738600 4571930 4422146 4283599 4244240 4104174 3975023 3925979 3774529 3611481
2971C611481j49k1775r6262J172j11417j17962k6608o7059j9756r8948q7806l8806
$$ 3611481 3611332 3589557 3493295 3494467 3383050 3265088 3238480 3171421 3151665 3052717 2964911 2926105
2959B926105n0923j6602j11485j33383p201r6709p0873o2182k9027R12K6757l291
$$ 2926105 2875182 2858580 2747095 2613712 2606511 2509802 2438929 2376747 2347720 2348632 2375389 2372098
2947B372098p2992l9956j11872o136O4653M7496k9197J2544K6190N6630n192k6765
$$ 2372098 2299106 2259150 2147278 2141142 2205795 2253291 2224094 2236638 2262828 2319458 2314266 2287501
2935B287501q273q871l0670J01528k277j7570J863M747K1999M8500m2216j5694
$$ 2287501 2279228 2270357 2239687 2341215 2338938 2321368 2323231 2327978 2349977 2398477 2356261 2340567
2923B340567l9321n7286k2774l3618L574m7025K1035l9673k7239q5968M9317j09854
$$ 2340567 2301246 2243960 2221186 2187568 2191142 2144117 2165152 2125479 2098240 2012272 2061589 1951735
2911A951735q3738n4748m5780L8503j6808O297j2425n1513m2452J8348j1252J25601
$$ 1951735 1867997 1813249 1767469 1805972 1789164 1795461 1783036 1731523 1689071 1707419 1696167 1821768
2899A821768o6296n4621L4442l9278j5180M0127j3397k5802m2023P6021L509j3383
$$ 1821768 1755472 1700851 1735293 1696015 1680835 1720962 1707565 1681763 1639740 1715761 1719270 1705887
2887A705887q002o9359J4762J01785K4144m6790J6809j6753k28k3829n0764K2027
$$ 1705887 1697885 1628526 1643288 1745073 1769217 1722427 1739236 1722483 1722255 1698426 1647662 1669689
2875A669689J7380J9700l0110L2682k3667m4089l773Q6448j4584q2721K1077R2477
$$ 1669689 1687069 1706769 1676659 1709341 1685674 1641585 1637812 1724260 1709676 1626955 1648032 1740509
2863A740509O3601p3453j7616J282K7991q0575O9040M6571p475O288J0450Q7080
$$ 1740509 1804110 1730657 1713041 1714323 1742314 1661739 1730779 1777350 1769875 1776163 1786613 1873693
2851A873693J08551J08029j148J11334J60320P0807J80091L11358J91813J26948
$$ 1873693 1982244 2090273 2089125 2200459 2360779 2431586 2611677 2923035 3114848 3241796
2841C241796j48098l85254k35649k28070q7004n5277j9949l3992o5152k1498J9400
$$ 3241796 3093698 2708444 2472795 2244725 2157721 2102444 2082495 2048503 1983351 1961853 1981253
2830A981253m5085O810j0905q8459R55j12754l8515R4407o7829K3732n4645J0614
$$ 1981253 1936168 1942978 1932073 1843614 1844569 1731815 1693300 1787707 1719878 1743610 1688965 1699579
2818A699579K9619r1264p3585L9405P4397l4l9768L6346O593j2992n1936m0214
$$ 1699579 1729198 1637934 1564349 1603754 1678151 1678117 1638349 1674695 1681288 1668296 1616360 1576146
2806A576146O4084M346q1128l6189k7749p5410J06181J9723L985l1902K851L5024
$$ 1576146 1640230 1644576 1563448 1527259 1499510 1424100 1530281 1550004 1553989 1522087 1524938 1559962
2794A559962M8936P350J0518K9794J03J52805R3449j5900p301J8718L2226m9959
$$ 1559962 1608898 1616248 1626766 1656560 1656663 1809468 1902917 1887017 1879716 1898434 1930660 1880701
2782A880701K0396O6563l3122k756L6560K2985j8899l585L2215O2289l5158n6526
$$ 1880701 1901097 1967660 1934538 1931782 1968342 1991327 1972428 1968843 2001058 2063347 2028189 1971663
2770A971663o469K7151M3585R0857N1961J5767o1733O6932O5575n1761N0714r0075
$$ 1971663 1965194 1992345 2035930 2126787 2178748 2194515 2132782 2199714 2265289 2213528 2264242 2174167
2758B174167L3071J1134J8899Q7334M9490k6807N5698P2596P5593J18160O51Q9118
$$ 2174167 2207238 2218372 2237271 2324605 2374095 2347288 2402986 2475582 2551175 2669335 2669986 2759104
2746B759104O1475M211P3499P0135J307Q9651J38249m633O576R5330J11190M281
$$ 2759104 2820579 2824790 2898289 2968424 2969731 3059382 3197631 3192998 3199574 3294904 3406094 3410375
2734C410375N9962P0955O7138J03098N4140J6132M9842p548o1788J4926K3085
$$ 3410375 3470337 3541292 3608430 3711528 3765668 3781800 3831642 3824094 3762306 3777232 3800317
2723C800317O5068q0762j1547P6161n8266j9805P3132P1803J17879J7823Q005
$$ 3800317 3865385 3784623 3773076 3849237 3790971 3771166 3844298 3916101 4033980 4051803 4059808
2712D059808O5740n317J50409P0304M3948P4504J02834O3875J42527m3887O0771
$$ 4059808 4125548 4120231 4270640 4340944 4384892 4459396 4562230 4626105 4768632 4724745 4785516
2701D785516Q1347O247J17146n641J06466J27795R8899Q0859M9780J42191K22695
$$ 4785516 4866863 4873110 4990256 4984615 5091081 5218876 5317775 5398634 5448414 5590605 5813300
2690E813300O3617J21449Q4567J14619J90217J56609J71950J14950N1324R6505
$$ 5813300 5876917 5998366 6082933 6197552 6387769 6544378 6716328 6831278 6882602 6979107
2680F979107J50352K06211J74402J01773K15336K44929J55028J12357K12884K87312
$$ 6979107 7129459 7335670 7510072 7611845 7827181 8072110 8227138 8339495 8552379 8839691
2670H839691K33032J55169K08319K41637K78598K81057K81395K59738K59729L34759
$$ 8839691 9072723 9227892 9436211 9677848 9956446 10237503 10518898 10778636 11038365 11373124
2660A1373124L32496M38499M15854M11491M00673N82931N41563N33895O26852
$$ 11373124 11705620 12144119 12559973 12971464 13372137 13955068 14496631 15030526 15657378
2651A5657378O30096O07528P68821Q14884Q50600R52445Q92220J060097J178136
$$ 15657378 16287474 16895002 17663823 18478707 19329307 20281752 21173972 22234069 23412205
2642B3412205J214258J358596J531531J652542J764861J849737K135000K463870
$$ 23412205 24626463 25985059 27516590 29169132 30933993 32783730 34918730 37382600
2634C7382600K702604K926487L223078L604648L711505L965561M175351M234174
$$ 37382600 40085204 43011691 46234769 49839417 53550922 57516483 61691834 65926008
2626F5926008M114854L938036L626617L094448K676594J947182J383556Q17528
$$ 65926008 70040862 73978898 77605515 80699963 83376557 85323739 86707295 87524823
2618H7524823L19050j85950k99258m07480m06455l99917l70531j42085j96377
$$ 87524823 87843873 87657923 87358665 86951185 86544730 86144813 85774282 85632197 85435820
2609H5435820m27595o98094j065215j566088k004934k512713l048849l459004
$$ 85435820 85008225 84310131 83244916 81678828 79673894 77161181 74112332 70653328
2601G0653328l752270m083840m167427l903942l839677l754609l486910l207946
$$ 70653328 66901058 62817218 58649791 54745849 50906172 47151563 43664653 40456707
2593D0456707k862255k586114k365600k029736j876728j795434j534377j462676
$$ 40456707 37594452 35008338 32642738 30613002 28736274 26940840 25406463 23943787
2585B3943787j220336j114627r96844q77939q85109q77345o62612o62805n19968
$$ 23943787 22723451 21608824 20611980 19734041 18848932 17971587 17308975 16646170 16126202
2576A6126202n02648n59858m23272m30998l11044l38663l54268k27378k72455
$$ 16126202 15623554 15063696 14640424 14209426 13898382 13559719 13205451 12978073 12705618
2567A2705618k28976k68748k15452j60837j46705j99851j12034j36861r1841j27980
$$ 12705618 12476642 12207894 11992442 11831605 11684900 11485049 11373015 11236154 11144313 11016333
2557A1016333j28572P83j30869j56822l999l0239o883m5278j19442P445o3643
$$ 11016333 10887761 10888544 10757675 10600853 10596854 10566615 10559732 10514454 10395012 10402457 10338814
2546A0338814q8385j06758p7756q3751n5169j53311k3196m7776J5131q6950r9590
$$ 10338814 10250429 10143671 10065915 9982164 9926995 9773684 9750488 9702712 9717843 9630893 9531303
2535I531303j11690l1041j3800j8396j51478p1111K8966L0796K102n6887L2577
$$ 9531303 9419613 9388572 9374772 9356376 9204898 9133787 9162753 9193549 9195651 9138764 9171341
2524I171341j3057o1400k1456J08054Q4864J07822l1635K3539J18139R1393J09399
$$ 9171341 9158284 9096884 9075428 9183482 9268346 9376168 9344533 9368072 9486211 9577604 9687003
2513I687003K48478Q5620O1933P9608J66190L05738J07170J89863K50671J20598
$$ 9687003 9935481 10021101 10083034 10162642 10328832 10634570 10741740 10931603 11182274 11302872
2503A1302872K33732L00372K44418L84880L27519L31487M70415M36409M79907
$$ 11302872 11536604 11836976 12081394 12466274 12793793 13125280 13595695 14032104 14512011
2494A4512011N17863M80662N86054O60086Q01224R09611J023888J081383J008352
$$ 14512011 15029874 15510536 16096590 16756676 17557900 18467511 19491399 20572782 21581134
2485B1581134J143663J246095J314873J303274J228226R82350R18329O04122L49065
$$ 21581134 22724797 23970892 25285765 26589039 27817265 28799615 29717944 30322066 30671131
2476C0671131K96814q4567l54889p14564q61423q31826p77590p88398n41923n07685
$$ 30671131 30967945 30883378 30528489 29813925 28952502 28120676 27343086 26554688 26012765 25505080
2466B5505080m25508l86976k02974j9508o1183O4612J96193K76605L45771L47630
$$ 25505080 25079572 24692596 24489622 24470114 24408931 24473543 24669736 24946341 25292112 25639742
2456B5639742M33199O08747M96173N89071P95585Q42595R30203Q84124R88539
$$ 25639742 26072941 26681688 27177861 27766932 28562517 29405112 30335315 31219439 32207978
2447C2207978J139882J251674J257014J496096J661728J742919J892288K101457
$$ 32207978 33347860 34599534 35856548 37352644 39014372 40757291 42649579 44751036
2439D4751036K452011K580569K821754L141858L584102M006244M440423M853443
$$ 44751036 47203047 49783616 52605370 55747228 59331330 63337574 67777997 72631440
2431G2631440N378164N860119O325842O550790O706836O714408O447369N985907
$$ 72631440 78009604 83869723 90195565 96746355 103453191 110167599 116614968 122600875
2423A22600875N202003M106321L010223J726796O59582k50949j071923j630625
$$ 122600875 127802878 131909199 134919422 136646218 137305800 137054851 135982928 134352303
2415A34352303j961193k081962k051524j889961j496944j112686q19901l93281
$$ 134352303 132391110 130309148 128257624 126367663 124870719 123758033 122938132 122544851
2407A22544851p7039J37147K45132J75181J50738m6374m83387j051791j669013
$$ 122544851 122467812 122604959 122850091 123025272 123176010 123129636 122646249 121594458 119925445
2398A19925445k253014k697106l273743l828288m268140m695977m910649n058698
$$ 119925445 117672431 114975325 111701582 107873294 103605154 98909177 93998528 88939830
2390H8939830n118819m964000m985350m738727m423988m142597l803201l620240
$$ 88939830 83821011 78857011 73871661 69132934 64708946 60566349 56763148 53142908
2382E3142908l206820k787249k587031k345757k097154j899845j633996j532345
$$ 53142908 49936088 47148839 44561808 42216051 40118897 38219052 36585056 35052711
2374C5052711j324235j169821j106042r41277q69771p60350o56515n57103m75807
$$ 35052711 33728476 32558655 31452613 30511336 29641565 28881215 28224700 27667597 27191790
2365B7191790m24440m30366l46576k81216k22528r2449p4442K2185J17050J84581
$$ 27191790 26767350 26336984 25990408 25709192 25486664 25394215 25319773 25341958 25459008 25643589
2355B5643589K28366K84676L17272M77494L99756M90726N56946N02736N69247
$$ 25643589 25871955 26156631 26473903 26951397 27351153 27841879 28398825 28901561 29470808
2346B9470808M26538K83573K49421K32997O1038m7119k36029m85446n77778n88821
$$ 29470808 29897346 30180919 30430340 30663337 30724375 30677256 30441227 29955781 29378003 28789182
2336B8789182p82934q92667q05889q65847q66376p67905q20129p50293n90559
$$ 28789182 28006248 27113581 26307692 25441845 24575469 23807564 22987435 22237142 21646583
2327B1646583n90789m93042m90171l43438k44117k88268j23246p3533q3676m8497
$$ 21646583 21055794 20562752 20072581 19729143 19485026 19196758 19073512 18999979 18916303 18867806
2317A8867806R7248K48564K36647J57686L22028K96905L62215N05297N44417O18159
$$ 18867806 18965054 19213618 19450265 19607951 19929979 20226884 20589099 21094396 21638813 22256972
2307B2256972O08880O69913O81708P47344N20220N95189M56644L46733L73276
$$ 22256972 22865852 23535765 24217473 24964817 25485037 26080226 26536870 26883603 27256879
2298B7256879K05754J19679J28427J35454J5849J9153J62336K03262K42083K06705
$$ 27256879 27462633 27582312 27710739 27846193 27862042 27881195 28043531 28246793 28488876 28695581
2288B8695581K08474J54488J41455m0031n1096k24646k61328k65757l57279j63524
$$ 28695581 28904055 29058543 29199998 29159967 29108871 28884225 28622897 28357140 27999861 27836337
2278B7836337j90199k00705p9926l1659R2483J37307J96331L33992M14983L91701
$$ 27836337 27646138 27445433 27365507 27333848 27426331 27563638 27759969 28093961 28508944 28900645
2268B8900645M97738N81462N95081P45931P30905Q94729J030701J067231J314887
$$ 28900645 29398383 29979845 30574926 31320857 32051762 32946491 33977192 35044423 36359310
2259C6359310J419400J530772J652135J767499K009195K293075K492492K752970
$$ 36359310 37778710 39309482 40961617 42729116 44738311 47031386 49523878 52276848
2251E2276848L117584L400047L625463L887041M159606M426214M505422M286509
$$ 52276848 55394432 58794479 62419942 66306983 70466589 74892803 79398225 83684734
2243H3684734M179263L941200L598416L233429K826339K336435K108178J767456
$$ 83684734 87863997 91805197 95403613 98637042 101463381 103799816 105907994 107675450
2235A07675450J586660J629626J772894J888453J980770K242255K418915K442298
$$ 107675450 109262110 110891736 112664630 114553083 116533853 118776108 121195023 123637321
2227A23637321K321516K159508J888102J270049Q74379N61419M467n93794j027946
$$ 123637321 125958837 128118345 130006447 131276496 132150875 132712294 132716761 132122967 131095021
2218A31095021j463018j721389k023601k129354k110872k086387k159998k127236
$$ 131095021 129632003 127910614 125887013 123757659 121646787 119560400 117400402 115273166
2210A15273166j935050j891612j897208j785225j788355j958737k146975k334829
$$ 115273166 113338116 111446504 109549296 107764071 105975716 104016979 101870004 99535175
2202I9535175k521253k752218l140418l307907l561174l582258l661996l754303
$$ 99535175 97013922 94261704 91121286 87813379 84252205 80669947 77007951 73253648
2194G3253648l773155l622974l369963l242426l004277k704193k535408k282428
$$ 73253648 69480493 65857519 62487556 59245130 56240853 53536660 51001252 48718824
2186D8718824k019142j823730j496886j375347j261298j117119r40052q77901
$$ 48718824 46699682 44875952 43379066 42003719 40742421 39625302 38685250 37807349
2178C7807349p52736n90173n14549m99562m67470l84472k63711j46709J9673J25651
$$ 37807349 37054613 36464440 35949891 35450329 34982859 34598387 34334676 34187967 34207640 34333291
2168C4333291J80752J79375M27185N14162O01544P04872Q37729Q25585Q19551
$$ 34333291 34514043 34693418 35120603 35634765 36236309 36941181 37778910 38604495 39424046
2159C9424046P21178P89699P77431R09950Q13959P55598Q05979O91358N30754
$$ 39424046 40145224 40934923 41712354 42622304 43436263 44191861 44997840 45689198 46219952
2150D6219952J9714n06433q33639r22382j162972j170106j093806j069002r89050
$$ 46219952 46239666 45733233 44899594 43977212 42814240 41644134 40550328 39481326 38492276
2141C8492276j151370r92859j002392j003173q63107r90147r75651q89607p90864
$$ 38492276 37340906 36348047 35345655 34342482 33479375 32489228 31513577 30623970 29833106
2132B9833106o96365n57857n46039l73579k42292l24362o03989m96142k94892
$$ 29833106 29136741 28578884 28032845 27659266 27416974 27092612 26488623 25992481 25697589
2123B5697589j27595N435L1K00394L01763K73561M47285P52412P89315l36655
$$ 25697589 25569994 25575429 25575460 25775854 26077617 26351178 26798463 27550875 28340190 28003535
2113B8003535j474911j289123q88988o39828m73140j81654k46209j92750q1377
$$ 28003535 26528624 25239501 24350513 23710685 23237545 23055891 22809682 22616932 22535555
2104B2535555j77176l0862Q4497n297J58373K07978J86626L57693M16257M91222
$$ 22535555 22358379 22327517 22412014 22406717 22565090 22773068 22959694 23317387 23733644 24224866
2094B4224866N39704N24158M86145N40846P26655R61982J074090J321885J672343
$$ 24224866 24764570 25288728 25774873 26315719 27042374 28004356 29078446 30400331 32072674
2085C2072674J261470r3618m34967J44820M78178Q19675R49703J088095J191539
$$ 32072674 33334144 33240526 32805559 32950379 33428557 34248232 35197935 36286030 37477569
2076C7477569J273426J400588J538114J696706J830026K085312K472375K773030
$$ 37477569 38750995 40151583 41689697 43386403 45216429 47301741 49774116 52547146
2068E2547146L141094L532165M005972M508328N022059N382386N726508O081229
$$ 52547146 55688240 59220405 63226377 67734705 72756764 78139150 83865658 89946887
2060H9946887O129777O029167N569515N132151M323011L329869K171363Q83118
$$ 89946887 96076664 102105831 107675346 112807497 117130508 120460377 122631740 123514858
2052A23514858o21654k158293l411229m668388n611161o212502o646817o822889
$$ 123514858 122893204 120734911 117323682 112655294 107044133 100831631 94184814 87361925
2044H7361925o554238o170325n804476n475979m947017m306422l947646l476503
$$ 87361925 80807687 74637362 68832886 63356907 58409890 54103468 50155822 46679319
2036D6679319l138747k874197k612610k293735k024266j858118j678993j543694
$$ 46679319 43540572 40666375 38053765 35760030 33735764 31877646 30198653 28654959
2028B8654959j328371j308936j074630r09438q77920r22239q30416p28841p16979
$$ 28654959 27326588 26017652 24943022 24033584 23155664 22233425 21403009 20674168 19957189
2019A9957189o31237o27858n42355m52407m53263n66358m54662l71713l65396
$$ 19957189 19325952 18698094 18155739 17703332 17250069 16683711 16229049 15857336 15491940
2010A5491940l50721l48163l32593k70503k77317k55105k44856k34073j94685
$$ 15491940 15141219 14793056 14460463 14189960 13912643 13657538 13412682 13178609 12983924
2001A2983924k86248j88756k15278k27999j51793j99894j85511k41679o1184j00422
$$ 12983924 12697676 12508920 12293642 12065643 11913850 11713956 11528445 11286766 11225582 11125160
1991A1125160k08936k23988r9006j40558k48468k64378j74165j02076j68347j69320
$$ 11125160 10916224 10692236 10593230 10452672 10204204 9939826 9765661 9663585 9495238 9325918
1981I325918j94687j54104j75682j54216j30096j66205j21016j04306j31930j57128
$$ 9325918 9131231 8977127 8801445 8647229 8517133 8350928 8229912 8125606 7993676 7836548
1971G836548k05877p9009p2200o4001o6319j18755n5415j2143r467m7504j09191
$$ 7836548 7630671 7551662 7479462 7415461 7349142 7230387 7174972 7162829 7153362 7105858 6996667
1960F996667m6173m7391P293q8882R827j02354n9667P790m7488p4335m6272k065
$$ 6996667 6950494 6903103 6910396 6821514 6831341 6728987 6669320 6677110 6629622 6555287 6509015 6506950
1948F506950K6984o993p7181J0810m9087R897N1230l4671J04034M0466K1081j06838
$$ 6506950 6533934 6526941 6449760 6460570 6411483 6421380 6472610 6437939 6541973 6582439 6603520 6496682
1936F496682j51017M7462l1110K490L3460L3664n9543m2600j3086R0277j453J6926
$$ 6496682 6345665 6393127 6362017 6364507 6397967 6431631 6372088 6329488 6316402 6406679 6405226 6422152
1924F422152K3034k3161j13912J0315R5524N2278k6707J131R977L5120N3196K7519
$$ 6422152 6445186 6422025 6308113 6318428 6413952 6466230 6439523 6440654 6450631 6485751 6538947 6566466
1912F566466N982O4049J31608O2920N8598L2961M4386K7262J5463R7530M1402
$$ 6566466 6572448 6636497 6768105 6831025 6889623 6922584 6966970 6994232 7009695 7107225 7148627
1901G148627Q4928O3633J4657P9743P0872O4809J41340M8825Q881j2706p0928
$$ 7148627 7233555 7297188 7311845 7391588 7462460 7527269 7668609 7717434 7726315 7713609 7642681
1890G642681Q0026J33775P0810J7716M4860l5554R2764P3862N5250k033k4440
$$ 7642681 7722707 7856482 7927292 7945008 7989868 7954314 8047078 8120940 8176190 8174157 8149717
1879H149717Q0825J01582R4097J7926M6388J47101M9111O7316K28576J90814J51722
$$ 8149717 8230542 8332124 8426221 8444147 8490535 8637636 8686747 8754063 8982639 9173453 9325175
1868I325175J73341J91294K86619K46552J78602K74720K57408K61650K50788K74175
$$ 9325175 9498516 9689810 9976429 10222981 10401583 10676303 10933711 11195361 11446149 11720324
1858A1720324L05683L62317M61421M31396L83752L67475M33164M30039M52597
$$ 11720324 12026007 12388324 12849745 13281141 13664893 14032368 14465532 14895571 15348168
1849A5348168L51075L99651M61778M71426N01376M56746N11687M91239N71115
$$ 15348168 15699243 16098894 16560672 17032098 17533474 17990220 18501907 18993146 19564261
1840A9564261M89635M79290M81960N70488O31774O16427N92541M87636O24211
$$ 19564261 20053896 20533186 21015146 21585634 22217408 22833835 23426376 23914012 24538223
1831B4538223P83764O97562O59785P89354P98654Q58976R11081J064859R94620
$$ 24538223 25321987 26019549 26679334 27468688 28267342 29126318 30037399 31102258 32096878
1822C2096878R10683J086294J276357J228558J326484J377830J526380J525786
$$ 32096878 33007561 34093855 35370212 36598770 37925254 39303084 40829464 42355250
1814D2355250J709549J828854J866866K032029K207414K223144K439313K628917
$$ 42355250 44064799 45893653 47760519 49792548 51999962 54223106 56662419 59291336
1806E9291336K731971K967619L205223L497590L726935M021750M307656M554738
$$ 59291336 62023307 64990926 68196149 71693739 75420674 79442424 83750080 88304818
1798H8304818M975177N413507N828679O444428P251091Q140985R178827J0335118
$$ 88304818 93279995 98693502 104522181 110966609 118217700 126358685 135537512 145872630
1790A45872630J1849644J3635227J5749327J8124417K0692104K3699383K6887107
$$ 145872630 157722274 171357501 187106828 205231245 225923349 249622732 276509839
1783B76509839L0434433L3684933L6414056L7502850L5465685K6886250J0384274
$$ 276509839 306944272 340629205 377043261 414546111 450011796 476898046 487282320
1776D87282320j1543302l0869134m1024978m2559461l9305561l4424526k9578708
$$ 487282320 475739018 444869884 403844906 361285445 321979884 287555358 257976650
1769B57976650k5246561k1687433j8712109j6304328j4455149j2733029j1309108
$$ 257976650 232730089 211042656 192330547 176026219 161571070 148838041 137528933
1762A37528933j0077689q944284q004755p177616o283226n617421m912674m202961
$$ 137528933 127451244 118506960 110502205 103324589 97041363 91423942 86511268 82308307
1754H2308307l824331l337224k874999k612183k655656k936475k969746k883651
$$ 82308307 78483976 75146752 72271753 69659570 67003914 64067439 61097693 58214042
1746E8214042k749935k502244k259971k152814j938814j822484j630843j412371
$$ 58214042 55464107 52961863 50701892 48549078 46610264 44787780 43156937 41744566
1738D1744566j416078j405105j431988j255289j246120j317415j155761r56244
$$ 41744566 40328488 38923383 37491395 36236106 34989986 33672571 32516810 31560566
1730C1560566r88428r18361r44871r76280q68540r28099q25828p77357q05268
$$ 31560566 30572138 29653777 28708906 27732626 26864086 25935987 25110159 24332802 23527534
1721B3527534p21127o87177p40073m61497n91365n91947m08926m06918l59468
$$ 23527534 22806407 22119230 21379157 20917660 20326295 19734348 19325422 18918504 18559036
1712A8559036l42683l78433k88473l85487k92875k68547l80311l24070l48880
$$ 18559036 18216353 17837920 17549447 17163960 16871085 16602538 16222227 15898157 15549277
1703A5549277l75068l66125l57785l62225m91975l62611k35098l43012k50268
$$ 15549277 15174209 14808084 14450299 14088074 13596099 13233488 12998390 12655378 12405110
1694A2405110k80803l42602k88723k44811l43037l20869m50065j52199k28804
$$ 12405110 12124307 11781705 11492982 11248171 10905134 10584265 10134200 9982001 9753197
1685I753197k48444j73319k29934k51006j68041k04191j90635k01199k22131m9125
$$ 9753197 9504753 9331434 9101500 8850494 8682453 8478262 8287627 8086428 7864297 7815172
1675G815172j13898j62041j41818j64546o4650k5368k05843p5284j24636j03165
$$ 7815172 7701274 7539233 7397415 7232869 7168219 7142851 6937008 6861724 6737088 6633923
1665F633923j18344k30131j83745j19996j68623j9055j56661m8949k848q9757
$$ 6633923 6515579 6285448 6101703 5981707 5813084 5794029 5637368 5588419 5585571 5495814
1655E495814k3655p5304j01413j03574j53010j14972j5864j43142j84756j60449
$$ 5495814 5472159 5396855 5295442 5191868 5038858 4923886 4908022 4764880 4580124 4419675
1645D419675j04861k3336j02943r5491l8749j65182Q715p9348n1083k0743r603
$$ 4419675 4314814 4291478 4188535 4093044 4054295 3889113 3897828 3818480 3767397 3746654 3737051
1634C737051k4218m1237K4841M801j6870O67K0576j09504M3138j12787j61701
$$ 3737051 3712833 3671596 3696437 3701238 3684368 3685035 3705611 3596107 3639245 3526458 3364757
1623C364757L0713l1743j00420m3544n5565J33724N3419l3411P0519k011k6323
$$ 3364757 3395470 3363727 3263307 3219763 3164198 3297922 3351341 3317930 3388449 3386438 3360115
1612C360115N630q1253k6494n1024r4811L9166m6313r3515m6831j92215o8887
$$ 3360115 3365745 3284492 3257998 3206974 3112163 3151329 3105016 3011501 2964670 2772455 2703568
1601B703568p1525M576P6564q7568m9813j3060k145O8616j27258n9100o333j22446
$$ 2703568 2632043 2636619 2713183 2625615 2575802 2562742 2560597 2629213 2501955 2442855 2436522 2314076
1589B314076k9626o0612q2408K3024l9288O6585K518j19739j8345J4318J7672
$$ 2314076 2284450 2223838 2141430 2164454 2125166 2191751 2194269 2074530 2056185 2070503 2088175
1578B088175M3839M1672n8692j2466K1412M1688P922K1725p9497J1984q6290l1486
$$ 2088175 2132014 2173686 2114994 2102528 2123940 2165628 2173550 2195275 2115778 2127762 2041472 2009986
1566B009986o9910K5249j5773n8877m2910j6741Q924K5670j704j28572j5158J9315
$$ 2009986 1940076 1965325 1949552 1890675 1847765 1831024 1839948 1865618 1863914 1735342 1720184 1739499
1554A739499Q0749p6513o9085J5003m8701l1468n9437p3128m2981J6505j5623
$$ 1739499 1820248 1743735 1674650 1689653 1640952 1609484 1550047 1476919 1433938 1450443 1434820
1543A434820K8058m3934n7463o8540N3570M0527Q776K6945K4840o754l7413J9961
$$ 1434820 1462878 1418944 1361481 1292941 1346511 1387038 1395814 1422759 1447599 1440845 1403432 1423393
1531A423393K6673J3777p621K7868J6366P8675N2606j37225j73P4679K607n1793
$$ 1423393 1450066 1463843 1456222 1484090 1500456 1579131 1631737 1494512 1494339 1569018 1571625 1519832
1519A519832o3073L593j0669R3836L910j15636m8767R8980l5058j9309J3521n3079
$$ 1519832 1456759 1460352 1449683 1543519 1547429 1431793 1383026 1482006 1446948 1427639 1441160 1388081
1507A388081p430n8607k7707N0128l1266m5746j3256L1703N8560j43k5053k1147
$$ 1388081 1380651 1322044 1294337 1344465 1313199 1267453 1254197 1285900 1344460 1344317 1319264 1298117
1495A298117N1889L3117Q0302P3410j4244K2521J10528N4058j3539J37101J13082
$$ 1298117 1350006 1383123 1463425 1536835 1522591 1545112 1655640 1709698 1696159 1833260 1946342
1484A946342R5771J46825P1626J82242K05235P9482J98873K48536O9884L0597
$$ 1946342 2042113 2188938 2260564 2442806 2648041 2727523 2926396 3174932 3244816 3275413
1474C275413n2962r6284r8820j47004j76140k14185j03559j30263k11992j73885
$$ 3275413 3222451 3126167 3027347 2880343 2704203 2490018 2386459 2256196 2044204 1870319
1464A870319r0133r9239o7043j03518j50657m3385j2797K3107n6422j27183m4677
$$ 1870319 1780186 1680947 1613904 1510386 1359729 1316344 1303547 1326654 1270232 1143049 1098372
1453A098372j7422J126j4710j10319m1303k3096l3752K1588j19753k3351l4951
$$ 1098372 1080950 1082076 1067366 957047 915744 892648 858896 880484 760731 737380 702429
1442G02429k3982P9117j4197n8203R8291J0510J3330M3274m0241o905J6621J669
$$ 702429 678447 757564 743367 685164 783455 793965 807295 850569 810328 803423 820044 821713
1430H21713N5706k8761k458k9758j20772N0258L1763L0472K5667m3413N5944j7840
$$ 821713 877419 848658 846200 816442 695670 745928 777691 808163 833830 790417 846361 828521
1418H28521o8639M3006j03740n1023p859k4401l556o9606p7560P1740k3796n966
$$ 828521 759882 802888 699148 648125 640266 615865 612309 542703 465143 536883 513087 507121
1406E07121J1216p0892J9052K7324k2216L1797m211n0646Q051J8518M7027n2790
$$ 507121 518337 447445 466497 493821 471605 503402 499191 448545 456596 475114 522141 469351
1394D69351m403j1649j5001P2793l459r5442K6179O5190R698K3476m2145L4763
$$ 469351 464948 453299 438298 511091 507632 412190 438369 503559 513257 536733 494588 529351
1382E29351M7172n0987N4120O9296r240m3908o212j932J103k5291j7866n1028
$$ 529351 576523 525536 579656 648952 639712 595804 589592 587660 588763 563472 545606 494578
1370D94578l9401N7824l8182K6548J2089m6846n6691m3777m9270M5350l4019P4165
$$ 494578 455177 513001 474819 501367 513456 466610 409919 366142 316872 362222 328203 402368
1358D02368K1990j04897j294J9335L161N6559q6850l6319j4k7461k7267J3235
$$ 402368 424358 319461 318167 337502 340663 397222 310372 274053 274039 246578 219311 232546
1346B32546J36747R422k0554P4540j529m58r556j20632J11936K7157N7947m6193
$$ 232546 369293 378715 358161 432701 431172 430714 421158 300526 412462 439619 497566 451373
1334D51373k4627j8613K9511l7837m1042K2465m2388L2609R6792k6197p3622o0477
$$ 451373 426746 408133 437644 399807 358765 381230 338842 371451 468243 442046 368424 307947
1322C07947J2047J9603o1956m2489l2521k1292k8172K8797L4088k3464k3498M7926
$$ 307947 319994 339597 277641 235152 202631 181339 153167 181964 216052 192588 169090 217016
1310B17016l7226l6306N4961m7388P985j3469K2216R7511k6856j229k9404l0544
$$ 217016 179790 143484 198445 151057 159042 145573 167789 265300 238444 237215 207811 177267
1298A77267M8672m129k5949R6594l9083j1160J4567k2516o127J04662J3042j6201
$$ 177267 225939 221810 195861 292455 253372 242212 256779 234263 228136 332798 345840 329639
1286C29639q1462J7739N8992l2925N3827k439m5318K2485M8756k2643n1723r3053
$$ 329639 248177 265916 324908 291983 345810 343371 298053 320538 369294 346651 294928 201875
1274B01875J553L5920k3671k4626j9616j8084j7294j24531O77Q4762j9303L9708
$$ 201875 203428 239348 215677 191051 171435 153351 136057 11526 12203 96965 77662 117370
1262A17370M4134K3515p0179l9181P4449j3667k5591J0924M2734L3629J3120k5301
$$ 117370 161504 185019 114840 75659 150108 136441 110850 121774 164508 198137 211257 185956
1250A85956L6152L6814J601o0514K16N7039l8246k1706N9944O6716N04r7469J5788
$$ 185956 222108 258922 260523 200009 200225 257264 219018 197312 257256 323972 324476 227007 242795
1237B42795J13331o9321J2631K0262l4045O965N983l7157J614m001j3798K4461
$$ 242795 356126 286805 299436 319698 285653 292618 298601 261444 263058 259057 245259 269720
1225B69720n698J1558J6073n24P7313M392L4035j10264k194J2702j7966q3860
$$ 269720 264022 275580 291653 291129 368442 372834 406869 296605 294411 307113 289147 205287
1213B05287n7428K900K1464O4928j2222k9662l1451L0671M5285L4316l0918R712
$$ 205287 147859 150759 172223 237151 224929 195267 163816 194487 239772 274088 243170 252882
1201B52882k7150L8993R07P739m2893k4998N1534o6133K5118n877j3420L2881
$$ 252882 225732 264725 265632 273371 230478 205480 257014 190881 215999 210122 196702 229583
1189B29583m7274P331L5337l5230l3878R4383r481n8990j8271q9723O870R1151
$$ 229583 182309 189640 224977 189747 155869 250252 240771 181781 163510 73787 80657 171808
1177A71808q273M94j73626J1000O1829k7566O0877q9480m04L3562K4385O7096
$$ 171808 163535 164029 -9597 1403 63232 35666 96543 7063 6659 40221 64606 131702
1165A31702j2234m7443M1649j0455m5033N1362R060N1705L6132r6m3689j05024
$$ 131702 119468 72025 113674 103219 58186 109548 118608 170313 206445 206349 162660 57636
1153E7636R7682J31950K1666n8900l5269j2055L5466Q513j341O2396p3829J1891
$$ 57636 155318 287268 308934 250034 214765 202710 238176 246689 245348 307744 233915 245806
1141B45806L7630k327j29759J3685K8970l4046p2602N104k7542Q4912M393l1670
$$ 245806 283436 281109 151350 165035 194005 159959 87357 92461 64919 149831 154224 122554
1129A22554J4675m9219j4971R5228r256o8009j7697r5090J6748P2409K0597R375
$$ 122554 137229 88010 73039 168267 159011 91002 73305 -21785 -5037 67372 87969 97344
1117I7344K3852J3617l7045k370P2969r5721J825J03437J06798K3510K2845l7413
$$ 97344 121196 134813 97768 95398 168367 72646 74471 177908 284706 308216 331061 293648
1105B93648O2262j3257o022P0411j5304M555j3005j22188J6001N2580k5286l6838
$$ 293648 355910 342653 336631 407042 391738 396293 383288 261100 277101 329681 304395 267557
1093B67557k1972K9430m2970j3121k7682K5503N6178L403j01006Q6780N1016o3547
$$ 267557 245585 275015 232045 218924 191242 216745 272923 276326 175320 262100 313116 249569
1081B49569L9801K3975j1845N6361K3550L6490K5576k573R4755Q9974r3489m3719
$$ 249569 289370 313345 301500 357861 381411 417901 443477 440904 535659 625633 532144 488425
1069D88425k4204P769Q15r1508O9166m0181J2466N4332o0240Q9437L7689n5830
$$ 488425 464221 471990 472805 381297 450463 410282 422748 477080 416840 506277 543966 488136
1057D88136M2881l5940o498j7868p145P0719l249r6641R2070M7574m4782o1529
$$ 488136 531017 495077 488579 470711 463566 534285 531036 434395 526465 574039 529257 467728
1045D67728j837j6691j20365J4857P0549J2870J6727o3986l9012L417J5401n9643
$$ 467728 465891 449200 328835 343692 414241 427111 443838 379852 340840 344257 359658 300015
1033C00015N3779L9645j217j2584j9280M4213Q8112J8817j1481n4015p413K4737
$$ 300015 353794 393439 392222 379638 360358 404571 492683 511500 500019 446004 438591 463328
1021D63328l7845M9722j5975j7770J24419k2043K0666J34997M6612J15215K3392
$$ 463328 425483 475205 459230 441460 565879 543836 564502 699499 746111 861326 884718
1010H84718o5348O9534j9409L0546l4749J2091M3090L1816M388Q8502l1399R0241
$$ 884718 819370 888904 869495 900041 865292 877383 920473 952289 956677 1045179 1013780 1104021
998A104021M7924r587O5616O618M961n9541m7794J50801O8792M3784O6341q7751
$$ 1104021 1151945 1142358 1207974 1214592 1219553 1160012 1112218 1263019 1331811 1375595 1441936 1354185
986A354185O6825J00397K9104R9051J6374K3542J63704N2722N1491Q7528j8045
$$ 1354185 1421010 1521407 1550511 1649562 1665936 1689478 1853182 1905904 1957395 2044923 2026878
975B026878J50717J23932J24329J21950Q9682J79079R1451J47202J80552J89151
$$ 2026878 2177595 2301527 2425856 2547806 2637488 2816567 2908018 3055220 3235772 3424923
965C424923J37690K40013K00371K41669K52633L89200M03951K67523K26649M02193
$$ 3424923 3562613 3802626 4002997 4244666 4497299 4886499 5290450 5557973 5784622 6186815
955F186815L96625N02302N72212O57448M93681K67525L77484O69569P52610J249362
$$ 6186815 6583440 7085742 7657954 8315402 8809083 9076608 9454092 10123661 10876271 12125633
945A2125633J619360K012265K508905L003268L692278M309171M688327O646078
$$ 12125633 13744993 15757258 18266163 21269431 24961709 29270880 33959207 40605285
937D0605285R343754R715702m817451j4039032r263946o040893m077471l045008
$$ 40605285 49949039 59664741 54847290 40808258 31544312 25503419 21425948 18380940
929A8380940k265852k111875j539715j361417r65527p83853o83752m72715m29830
$$ 18380940 16115088 14003213 12463498 11102081 10136554 9352701 8668949 8196234 7766404
920G766404l57733n85376q05758m35490m96668l52342m06500k41956k35859j45764
$$ 7766404 7408671 6823295 6017537 5582047 5085379 4733037 4326537 4084581 3848722 3702958
910C702958j73408o6314j10724j38115j80358j17558j23877m6134j98230j78347
$$ 3702958 3529550 3463236 3352512 3214397 3034039 2916481 2792604 2746470 2548240 2369893
900B369893j24461j34877q8809m6903o5744o8190j22600M529j7486p8359p9395
$$ 2369893 2245432 2110555 2021746 1974843 1909099 1840909 1718309 1722838 1705352 1626993 1547598
889A547598k7377k9283n4659q4528K4175K3000o4233q8164k1824m458j194p183
$$ 1547598 1520221 1490938 1436279 1351751 1375926 1398926 1334693 1246529 1224705 1220247 1219053 1211870
877A211870k2171j14835m0597n018l6178M8315L6205p4711j7833k2239J2740l7165
$$ 1211870 1189699 1074864 1034267 1029249 993071 1041386 1077591 1002880 985047 962808 975548 938383
865I38383J4275o1849k7245O87n7627m4332n153M2774n2771K9439p0511q2482
$$ 938383 952658 890809 863564 864251 806624 762292 757139 799913 747142 776581 706070 623588
853F23588J0587M637l0449m1474l2677l6399k3201j9377J718M5936Q844N1073
$$ 623588 634175 638812 608363 566889 534212 497813 474612 455235 456953 502889 511733 562806
841E62806l5622q8697k6859n552m3634o1559J10483J6247k4182r983p3380K5322
$$ 562806 527184 438487 411628 406076 362442 300883 411366 427613 403431 393448 320068 345390
829C45390J51758p6715n2543M1980k0350l2119j3444P3134J9718o3428J1756o3894
$$ 345390 497148 420433 367890 409870 389520 357401 343957 417091 436809 373381 385137 321243
817C21243M023K7751j34333O4335K7682n7122M3079M4303l5335L5102j10944L7286
$$ 321243 325266 353017 218684 283019 310701 253579 296658 340961 305626 340728 229784 267070
805B67070p3006o7875m2492O0018M9103l694k6878P499r8319M2498J2649n1696
$$ 267070 194064 126189 83697 143715 192818 189124 162246 169745 71426 113924 126573 74877
793G4877J11261J8947m4565O5212j9176j4842L9652j3266M8650J2780n5499n1786
$$ 74877 186138 205085 160520 225732 206556 191714 231366 218100 266750 279530 224031 172245
781A72245K2935L113P98o2266L9348Q57l8997J01125K2946k691K9690l9924M081
$$ 172245 195180 198293 199091 136825 176173 177030 138033 239158 262104 259413 289103 249179 253260
768B53260n1479j40006L6944N8848N3238L0284j16253p3325j3283J1150J783l2520
$$ 253260 201781 61775 98719 157567 210805 241089 124836 51511 38228 49378 51161 18641
756A8641Q6595o3850q0918N7861L8040P036O5056r8483p9402M5626R908P8584
$$ 18641 105236 41386 -39532 18329 56369 63405 128461 29978 -49424 -3798 6110 84694
744H4694M6556j08527Q1958r486p1080R7610o1547K2744P6682J1422l2473K5032
$$ 84694 131250 22723 104681 95195 24115 121725 60178 82922 159604 171026 138553 163585
732A63585L6587o8016j48729L1541J10847L4782n3509k1477J18736j3511q1630
$$ 163585 200172 132156 -16573 14968 125815 160597 107088 85611 204347 190836 109206
721A09206M2771J3052q3768r6531o6754L455O2165j0545O6101Q231k7217j1110
$$ 109206 151977 165029 81261 -15270 -82024 -78569 -16404 -26949 39152 47383 20166 9056
709I056k8495K3017O0930k4472k9548L7039r8365K6597L1734R904O4073k3215
$$ 9056 -19439 3578 64508 40036 10488 47527 -50838 -24241 7493 17397 81470 58255
697E8255j8852k823L3623O6012R3421k4711q9877J797K2906m5662J8455k963m6009
$$ 58255 39403 36580 70203 136215 229636 204925 115048 116845 139751 94089 112544 109581 63572
684F3572J12898R3967q1521j13759K9072k5502m2494J6639R2810j0253k2231J2480
$$ 63572 176470 270437 188916 75157 104229 78727 36233 52872 145682 135429 113198 125678
672A25678n9278n3177J1215J9733K397l5755p154J3141P232k042M8248n9064l972
$$ 125678 66400 13223 24438 44171 46568 10813 3659 16800 24032 21990 70238 11174 7202
659G202O204l543R2913o2784k0950L2162L9668q927J80575M8736o0427K5756L2668
$$ 7202 13406 9863 102776 39992 19042 51204 90872 81945 262520 311256 250829 276585 309253
646C09253k04761R1767o4939r373J3789Q008m9610L9572J6375p9493P9702J4012
$$ 309253 104492 196259 131320 121947 135736 143744 94134 133706 150081 70588 150290 164302
634A64302m6506p6796k3837J8727O908L7971n0941p6101O1468K1771l4172K4049
$$ 164302 117796 41000 17163 35890 42798 80769 29828 -46273 15195 36966 2794 26843
622B6843k9615p5838K2295M4425L2718j4742j02623l1234L3186l7381N8088K3611
$$ 26843 -2772 -78610 -56315 -11890 20828 6086 -96537 -127771 -94585 -131966 -73878 -50267
610e0267l223M5948m5239n2449O5407M801L0704m9672l1633J7748j4262O6092
$$ -50267 -53490 -7542 -52781 -105230 -39823 -35022 -4318 -53990 -85623 -67875 -82137 -16045
598a6045M6477l5178k5342j03030K7697Q7817N5216K0324m117m9480l467K3714
$$ -16045 30432 -4746 -30088 -133118 -105421 -17604 37612 57936 53819 4339 872 24586
586B4586K8351Q1j12826k0109M6757k1961R597q465N2821m417l7890l0733K4914
$$ 24586 52937 53018 -59808 -79917 -33160 -55121 -45524 -53989 -1168 -5585 -43475 -74208 -49294
573d9294k6773j0569n7216k4921P0175M2832k3909l936n2830M0280m0785J371
$$ -49294 -76067 -86636 -143852 -168773 -98598 -55766 -79675 -83611 -136441 -96161 -136946 -135575
561a35575M7376J187q803q2232R289P4003J0073l5528K6878k1035J5772R7517
$$ -135575 -88199 -87012 -95815 -178047 -168758 -94755 -84682 -120210 -93332 -114367 -98595 -1078
549a078Q215k6043j825J9766M7985L6882n9240L1616p4783K5985P3799m7860l677
$$ -1078 7137 -18906 -20731 -965 47020 83902 24662 56278 -18505 7480 81279 33419 29742
536B9742k0152J4198m8544l9391M3727p4765j6828M2876M243N736l1106j13025
$$ 29742 9590 23788 -24756 -64147 -20420 -95185 -112013 -69137 -64894 -59158 -90264 -203289
524b03289P4896R2097p0061j8970J4022O2775l6406n9568j9481K826N9210M5k7479
$$ -203289 -128393 -36296 -106357 -125327 -111305 -48530 -84936 -144504 -163985 -161159 -101949 -101904 -129383
511a29383K9669Q7605M3856j5085p0015m1924K22K8955N9711m1948J910m7287
$$ -129383 -99714 -12109 31747 16662 -53353 -95277 -95055 -66100 -6389 -48337 -46427 -93714
499i3714J77289o9181l0927j9844j8613p6L9625k6253K9931m3674k859J8082J7720
$$ -93714 83575 14394 -16533 -36377 -54990 -55066 -15441 -41694 -11763 -55437 -58296 -40214 -22494
486b2494J2755J6713m2723p2326j9781N4685O5155m0558r5649K9644P6071k9377
$$ -22494 -9739 6974 -35749 -108075 -127856 -73171 -8016 -48574 -144223 -114579 -38508 -67885
474f7885L0793q716m8235o6324M3899L6289p129k2468M2385k4437n0327N2217
$$ -67885 -37092 -45808 -94043 -160367 -116468 -80179 -87308 -109776 -67391 -91828 -142155 -89938
462h9938N108J7804O3858L9904o6264l8964K0667l2328J512J820J31265Q047o5222
$$ -89938 -84830 -67026 -3168 36736 -29528 -68492 -47825 -80153 -78641 -76821 54444 62491 -2731
449b731k3043J3880j9611O97n8450K6265P161P6315r35r4585o003K5874K7688
$$ -2731 -25774 -11894 -31505 -30808 -89258 -62993 -55832 20483 19548 -75037 -81040 -55166 -27478
436b7478m0915J2318K357L3603L492o7951Q2007q227m9665J578j0357j4273j9793
$$ -27478 -68393 -56075 -53718 -20115 -16623 -84574 -2567 -10794 -60459 -58881 -69238 -83511 -103304
423a03304l3934N5517M3092l3457o7606k6900K5855k858O515N665q139P1877k2050
$$ -103304 -137238 -81721 -38629 -72086 -139692 -166592 -140737 -143595 -137080 -131415 -139554 -67677 -89727
410h9727r7981J00929j6728N3198j1905K769l4387l2586O5533k0079M2375J25
$$ -89727 -187708 -86779 -103507 -50309 -62214 -59445 -93832 -126418 -60885 -80964 -38589 -38464
398c8464n8595K6896J04495l5086r3185q2773m6609l703J30857M7128j947k2491
$$ -38464 -97059 -70163 34332 -754 -93939 -176712 -223321 -227024 -96167 -49039 -50986 -73477
386g3477r7892k429J02114N1149n1680l3968P541L0482o1423N418M819J2712Q9181
$$ -73477 -171369 -173798 -71684 -20535 -72215 -106183 -98642 -68160 -129583 -124165 -119346 -106634 -17453
373a7453r258p5882j2491k9890N9131j0463M1248j4609o2903N1081J14773p5528
$$ -17453 -26711 -102593 -115084 -144974 -85843 -96306 -55058 -69667 -132570 -81489 33284 -42244
361d2244r349L2672q9300j8834N3124l705J691m2J3307l0971L3800L7971J3726
$$ -42244 -51593 -18921 -108221 -127055 -73931 -77636 -75945 -75987 -62680 -93651 -59851 -21880 -8154
348h154O9128k4263m4314m5981n2375N23l317n6038N0641K6257k9451K6264K953
$$ -8154 60974 36711 -7603 -53584 -105959 -105436 -108753 -164791 -114150 -87893 -117344 -91080 -88127
335h8127n5127k3324j8189L7964Q231M7447J6137l5356J00736M195p5127k6123
$$ -88127 -143254 -166578 -184767 -146803 -138572 -91125 -74988 -110344 -9608 -5413 -80540 -106663
323a06663j19382M7192Q2202K0485k9627M2264L6057q9661o3147l51k0136O4954
$$ -106663 -226045 -178853 -96651 -76166 -105793 -63529 -27472 -117133 -180280 -180631 -200767 -135813
311a35813L0481j6470L6734J8742l0052M0379o8093j2569P587L2625m2987Q9511
$$ -135813 -105332 -121802 -85068 -66326 -96378 -55999 -124092 -136661 -129074 -96449 -139436 -49925
299d9925l4219o3629L552k2009k1124P9961J01252o4374p6860j1414l8518L8928
$$ -49925 -84144 -147773 -144221 -166230 -187354 -107393 -6141 -70515 -147375 -158789 -197307 -158379
287a58379J14156m6425j2712n7713L9132M3950l7228l8977M6992L9391J3731O2369
$$ -158379 -44223 -90648 -103360 -161073 -121941 -77991 -115219 -154196 -107204 -67813 -54082 8287
275H287j01167l6772M9404n9161K0887k1987P1033J7429j110k703l0357n6357
$$ 8287 -92880 -129652 -80248 -139409 -118522 -140509 -69476 -52047 -53157 -55860 -86217 -142574
263a42574l0842m4855M1021P1897o0916p991R36k819J46762l5698j16007L8449
$$ -142574 -173416 -218271 -177250 -105353 -166269 -174260 -173324 -176143 -29381 -65079 -181086 -142637
251a42637M1273K3532k334o3130J2590n5867L4490m961j1279O2068q6707J6165
$$ -142637 -101364 -77832 -80166 -143296 -130706 -186573 -152083 -157044 -168323 -106255 -192962 -176797
239a76797O6410K556K07m2258m3261M2614L4740J3118m0365K7182Q6860l1273
$$ -176797 -110387 -107831 -107624 -149882 -193143 -150529 -115789 -102671 -143036 -115854 -28994 -60267
227f0267l4168l1650k3084R4095L3353q0730j12307K060O4414M0872o2945j6875
$$ -60267 -94435 -126085 -149169 -55074 -21721 -102451 -214758 -212698 -148284 -107412 -170357 -187232
215a87232N9367J4457j6848o700J0412J3599L8151j713O5616j2019k8051l1553
$$ -187232 -127865 -113408 -130256 -136956 -126544 -112945 -74794 -76507 -10891 -22910 -50961 -82514
203h2514n9284k3084j1492J1492N1644R850M0339j1241k7788o8503P685J5369
$$ -82514 -141798 -164882 -176374 -164882 -113238 -103388 -63049 -74290 -102078 -170581 -162896 -147527
191a47527l091k0729L1134O0024k8355r356J1640p553k7526o8692M2369P4617
$$ -147527 -150618 -171347 -140213 -80189 -108544 -117900 -106260 -113813 -141339 -210031 -167662 -93045
179i3045m4671Q1711k6727l6258r921m8202k7539l5517J8426N4583m624M3732
$$ -93045 -137716 -56005 -82732 -118990 -128911 -177113 -204652 -240169 -221743 -167160 -171784 -128052
167a28052L3085l1892p7017M0572j6581j4360J8800K584L831j2411K7191m7107
$$ -128052 -94967 -126859 -203876 -163304 -179885 -194245 -175445 -172861 -169030 -181441 -154250 -201357
155b01357M3242N7551o0437j5244n097k8229O0373P4040m7905j9047L7767l1721
$$ -201357 -158115 -100564 -161001 -176245 -181342 -209571 -149198 -75158 -123063 -142110 -104343 -136064
143a36064j3666J1374k3661O2013J0998r1965L8092J2351j02992J07993J9577
$$ -136064 -149730 -138356 -162017 -100004 -89006 -180971 -142879 -130528 -233520 -125527 -105950
132a05950l4720j3431k4595J5474j5266L8596J2250k594M046k3913L5207N0703
$$ -105950 -140670 -154101 -178696 -163222 -178488 -139892 -127642 -130236 -126190 -150103 -114896 -64193
120f4193j14386m8048O2254l2165j3515J123J8271j6541L4804N8706L6084l5211
$$ -64193 -178579 -226627 -164373 -196538 -210053 -208930 -190659 -207200 -172396 -113690 -77606 -112817
108a12817p7117m0945j6481R2340J6063o190K27m957k3880l9280J1071N8330j3046
$$ -112817 -189934 -230879 -247360 -155020 -138957 -145147 -144920 -149877 -173757 -213037 -201966 -143636 -156682
95a56682m9441J1741K1626n732j876K3237j4591M168j5146p291o578O1179L643
$$ -156682 -206123 -194382 -172756 -178488 -180364 -157127 -171718 -167550 -182696 -189987 -196565 -135386 -131743
82a31743q0320N8624M779j4155l1125o396N0555j2564J8858j4619o8760n104M2311
$$ -131743 -212063 -153439 -148660 -162815 -193940 -200336 -149781 -162345 -143487 -158106 -226866 -231970 -189659
69a89659L4833j8663N9775l8926m0148j948K7918j5114M860J8066o0026J2724
$$ -189659 -154826 -173489 -113714 -152640 -192788 -194736 -166818 -181932 -177072 -159006 -219032 -206308
57b06308K8546M7166N4389k0225m1679K1795l4162m6959o822N6581n4524l771
$$ -206308 -177762 -130596 -76207 -96432 -138111 -116316 -150478 -197437 -204259 -147678 -202202 -205973
45b05973N3769j7094j0498n11L3423m1186L4139R077r434j0942j9842P586L136
$$ -205973 -152204 -169298 -179796 -180307 -146884 -188070 -153931 -144854 -154288 -165230 -185072 -177486 -174350
32a74350j3220l0946J51L0064Q963n9879j3829J3494R3290N1942p8927o1357N179
$$ -174350 -187570 -218516 -218365 -188301 -179338 -239217 -253046 -239552 -146262 -94320 -173247 -234604 -229425
19b29425K8215l696k0656k2800N3199L818K1005L1443j4845j4617P333j49m0432
$$ -229425 -201210 -204906 -225562 -248362 -195163 -191345 -170340 -138897 -153742 -168359 -161026 -161175 -201607
6b01607j0010O913K5396k6663J5032J543
$$ -201607 -211617 -204704 -179308 -205971 -190939 -189396
0a89396
$$ -189396
$$ Imaginary data points
##PAGE= N=2
##DATA TABLE= (X++(I..I)), XYDATA
16383c361361k4636P5518P2589J4398P5381L2685q252N0353O517J8203M5174L1980
$$ -3361361 -3385997 -3310479 -3237890 -3223492 -3148111 -3115426 -3123678 -3073325 -3066808 -3048605 -3003431 -2971451
16371b971451J2027O2856K8964J5590M1293O3541O3059M8763j44j7773M9207N8137
$$ -2971451 -2959424 -2896568 -2867604 -2852014 -2810721 -2747180 -2684121 -2635358 -2635502 -2653275 -2604068 -2545931
16359b545931K0479K3490P4586l1651J3504M7774P5194p191M6868L1097N4718
$$ -2545931 -2525452 -2501962 -2427376 -2459027 -2445523 -2397749 -2322555 -2329746 -2282878 -2251781 -2197063
16348b197063N0865Q28M5290O942N1959J448M5243P1393P906N521K364M1296J6731
$$ -2197063 -2146198 -2145370 -2100080 -2093138 -2041179 -2039731 -1994488 -1923095 -1915189 -1909668 -1907304 -1866008 -1849277
16335a849277K7174N7985k9376j3091Q0239L0473O7409N5163K4377R4082q826
$$ -1849277 -1822103 -1764118 -1793494 -1806585 -1726346 -1695873 -1628464 -1573301 -1548924 -1454842 -1463668
16324a463668K9224M5744K4160M5090l5260l341N0955R2258J5597P969N2581L1057
$$ -1463668 -1434444 -1388700 -1364540 -1319450 -1354710 -1358051 -1307096 -1214838 -1199241 -1191272 -1138691 -1107634
16312a107634j7811k2192L7834N8365O5239j1350K2582M3482L5565N8721M5056
$$ -1107634 -1125445 -1147637 -1109803 -1051438 -986199 -997549 -974967 -931485 -895920 -837199 -792143
16301g92143l7724K6213R337L5060N2779M8531M4148n6374K1054P7004r825L5004
$$ -792143 -829867 -803654 -794317 -759257 -706478 -657947 -613799 -670173 -649119 -572115 -581940 -546936
16289e46936O5288j0537j5136Q1202j492M0759l8823J3056M3411R9199J01073
$$ -546936 -481648 -492185 -507321 -426119 -427611 -386852 -425675 -412619 -369208 -270009 -168936
16278a68936K0854l040n6121L3114m2230O8362J20888r019l5437P484R1710J3937
$$ -168936 -148082 -151122 -207243 -174129 -216359 -147997 -27109 -36128 -71565 -64081 27629 41566
16266D1566J1603j4801r728N2840j3652J0613R3352J9928o0123L9566P252L0501
$$ 41566 53169 38368 28640 81480 67828 78441 171793 191721 131598 171164 178416 208917
16254B08917J3181J9589J00208p849L3597L8064j0882Q450N213O53J4877j8014
$$ 208917 222098 241687 341895 334046 367643 405707 394825 403275 408488 409141 424018 406004
16242D06004m2225R8491K4270N9178J5081l555O7181J3189m1570J4405L1115K7495
$$ 406004 363779 462270 486540 545718 560799 557244 624425 637614 596044 610449 641564 669059
16230F69059J0523K3755o561P9445M8767p3475r584N5064j2771m5194M2472R8247
$$ 669059 679582 703337 696776 776221 824988 751513 741929 796993 784222 739028 781500 879747
16218H79747N117l7007k3309Q6936M2140n7949L7958j0724J3679j221j6024J29483
$$ 879747 884864 847857 824548 911484 953624 895675 933633 922909 936588 935367 919343 1048826
16206A048826l0387l7219m0170N3679R7144j7552l2096L4295M03j16759j0943
$$ 1048826 1018439 981220 941050 994729 1091873 1074321 1042225 1076520 1076923 960164 949221
16195I49221P2476L7069K9187N2053O7019j083l854Q055k2327L9037k3404l7157
$$ 949221 1021697 1058766 1087953 1140006 1207025 1205942 1202088 1210143 1187816 1226853 1203449 1166292
16183A166292j843O1657K9712p940k6957N2437J0200q9815L8584P8190L3576P7640
$$ 1166292 1164449 1226106 1255818 1247878 1220921 1273358 1283558 1193743 1232327 1310517 1344093 1421733
16171A421733n9205K8450O5343n6112r607K0965j895J5537q6347k6650L5909M2865
$$ 1421733 1362528 1390978 1456321 1400209 1390602 1411567 1409672 1425209 1338862 1312212 1348121 1390986
16159A390986o75O4910O9992m1312o0257P2443k2923P080M0962j04809Q7223P2464
$$ 1390986 1390311 1455221 1525213 1483901 1423644 1496087 1473164 1480244 1521206 1416397 1503620 1576084
16147A576084l8752j9628N654J4831k3588q0985P4314m8034m4552P6811J7731
$$ 1576084 1537332 1517704 1523358 1538189 1514601 1433616 1507930 1459896 1415344 1492155 1509886
16136A509886J0847P2635M6895p1831q1064N514M3637J9300P0247K1313j04236
$$ 1509886 1520733 1593368 1640263 1568432 1487368 1492882 1536519 1555819 1626066 1647379 1543143
16125A543143M0913O9840m664M6908K4866l7074p6766N386O5699j133q099k4538
$$ 1543143 1584056 1653896 1649232 1696140 1721006 1683932 1607166 1612552 1678251 1677118 1669019 1644481
16113A644481L6613M0258p1418l1596K856M0494o8271N4697L8547o9337K7492
$$ 1644481 1681094 1721352 1649934 1618338 1621194 1661688 1593417 1648114 1686661 1617324 1644816
16102A644816j1509K0850K0042q0358J878L8952R6064r1483k2811J4917k5786
$$ 1644816 1633307 1654157 1674199 1593841 1595719 1634671 1730735 1639252 1616441 1631358 1605572
16091A605572R4845K504j2522L9199k2461n4288L1451q505N408K0091q3375K1244
$$ 1605572 1700417 1702921 1690399 1729598 1707137 1652849 1684300 1675795 1681203 1701294 1617919 1639163
16079A639163K7721J1429Q4841L742k0209o4306j4935Q881j0714O7184J4595o0683
$$ 1639163 1666884 1678313 1763154 1766896 1746687 1682381 1667446 1676327 1665613 1732797 1747392 1686709
16067A686709O9351l8350m8078Q9973o7779l2312p125J0916P1732n5462M4485
$$ 1686709 1756060 1717710 1669632 1759605 1691826 1659514 1652389 1663305 1735037 1679575 1724060
16056A724060M6023m8371L9125K2277j27838R1849N624j3441K5214j08838J01668
$$ 1724060 1770083 1721712 1760837 1783114 1655276 1747125 1752749 1739308 1764522 1655684 1757352
16045A757352o2502j2463J68331o9478l1249L3652j46037Q007L0583O8391J13886
$$ 1757352 1694850 1682387 1850718 1781240 1749991 1783643 1637606 1645613 1676196 1744587 1858473
16034A858473p8201O614Q915K4186M851q6082l1378J25741q4392k795N2480l1537
$$ 1858473 1780272 1786886 1795801 1819987 1824838 1738756 1707378 1833119 1748727 1745932 1798412 1766875
16022A766875N5971j06120l1477N5489l2282J15R9549l0133l9791K6541p0550
$$ 1766875 1822846 1716726 1685249 1740738 1708456 1708571 1808120 1777987 1738196 1764737 1694187
16011A694187J13735l5047L8839q4198n7593Q9771j12213p581J00232j7072Q7379
$$ 1694187 1807922 1772875 1811714 1727516 1669923 1759694 1647481 1639900 1740132 1723060 1810439
16000A810439N1604j17843N9108l2879m0988j729n8160J05466P419m4416O4013
$$ 1810439 1862043 1744200 1803308 1770429 1729441 1727712 1669552 1775018 1782437 1738021 1802034
15989A802034o8722l7676L589J1402P5092n2107m7345J36661j6845j8845n648
$$ 1802034 1733312 1695636 1699225 1710627 1785719 1733612 1686267 1822928 1806083 1787238 1781590
15978A781590o7987j7345N1315k6905Q1737l4303K9101l0147p3352J02929m7663
$$ 1781590 1713603 1696258 1747573 1720668 1802405 1768102 1797203 1767056 1693704 1796633 1748970
15967A748970L8012j6590m3982n628k1652o1108J48167r7240M505J32855j38824
$$ 1748970 1786982 1770392 1726410 1720782 1699130 1638022 1786189 1688949 1693454 1826309 1687485
15956A687485J13410L0770q4092L1772P506k8705M7538q9943P1648j3390P68Q8062
$$ 1687485 1800895 1831665 1747573 1779345 1786851 1758146 1805684 1715741 1787389 1773999 1774767 1862829
15944A862829j19997q079N3705J5290j110l9631j415M8040j01225M2016P8446
$$ 1862829 1742832 1734753 1788458 1803748 1802638 1763007 1761592 1809632 1708407 1750423 1828869
15933A828869r5017R3406l1010k6949O6337p6555K3010K1500p0152O4210q6347
$$ 1828869 1733852 1827258 1796248 1769299 1835636 1759081 1782091 1803591 1733439 1797649 1711302
15922A711302m8742R8676m3311M5100k6907m2038L0471k3477P5481L7154q1098
$$ 1711302 1662560 1761236 1717925 1763025 1736118 1694080 1724551 1701074 1776555 1813709 1732611
15911A732611R365k6222l0840Q9652J4271L4984l0428m2713M2227J9871k9089
$$ 1732611 1741976 1715754 1684914 1774566 1788837 1823821 1793393 1750680 1792907 1812778 1783689
15900A783689O6239o6766P5145j7993n1755K1904m0417n6425L7878k5038J8235
$$ 1783689 1849928 1783162 1858307 1840314 1788559 1810463 1770046 1713621 1751499 1726461 1744696
15889A744696L5919m2951K9152j37087N8823O6320l0003R927K7010K0882M2663
$$ 1744696 1780615 1737664 1766816 1629729 1688552 1754872 1724869 1734796 1761806 1782688 1825351
15878A825351l092P0929r2047p6073L9488N563R113R477j15748Q7359K2752p3172
$$ 1825351 1822259 1893188 1801141 1725068 1764556 1770119 1779232 1788709 1672961 1760320 1783072 1709900
15866A709900J16088p635j19593Q1121K9822l0230K7736R553Q197p5378p090P8396
$$ 1709900 1825988 1818353 1698760 1779881 1809703 1779473 1807209 1816762 1824959 1749581 1742491 1820887
15854A820887J880M1077m7003o1097P4846o2252O510M4549m5994J7250m747L6746
$$ 1820887 1822767 1863844 1816841 1755744 1830590 1768338 1774848 1819397 1773403 1790653 1785906 1822652
15842A822652P9329j53678j1699N3177O48j940j6449J0124J6756p3574K5028l3861
$$ 1822652 1901981 1748303 1736604 1789781 1790429 1788489 1772040 1782164 1798920 1725346 1750374 1716513
15830A716513k0522Q2322n2976K5661K7969P087n2263n5695J1307N6475J290k6814
$$ 1716513 1695991 1778313 1725337 1750998 1778967 1786054 1733791 1678096 1689403 1745878 1747168 1720354
15818A720354L6476r5036M3960P4216m2911r594K5020N8391J3665J8489q939n5712
$$ 1720354 1756830 1661794 1705754 1779970 1737059 1727465 1752485 1810876 1824541 1843030 1834091 1778379
15806A778379J1490K9781p5345R5318l7444R23j4923m62L005N715j5534O4579
$$ 1778379 1789869 1819650 1744305 1839623 1802179 1803102 1788179 1787717 1790722 1796437 1780903 1845482
15794A845482J2906j1711M8106p9939K9405N2017j4243j379r7755O353R8574j8078
$$ 1845482 1858388 1846677 1894783 1814844 1844249 1896266 1882023 1880644 1782889 1789242 1887816 1869738
15782A869738M8258o8774j56365O3131K7444O4669m5735m3012N3905j4739m9266
$$ 1869738 1917996 1849222 1692857 1755988 1783432 1848101 1802366 1759354 1813259 1798520 1749254
15771A749254k247R0762R159m9531K4330O0317m6566l4697m032p9484j8691L3014
$$ 1749254 1747007 1837769 1846928 1797397 1821727 1882044 1835478 1800781 1796749 1717265 1698574 1731588
15759A731588j6796J66459r584p4170o080m7516o836J4043o658Q03L2068l5953
$$ 1731588 1714792 1881251 1871667 1797497 1791417 1743901 1737065 1751108 1744450 1745253 1777321 1741368
15747A741368K7857L0242m2305J17359j7932m373l3321o392j671m7117K2127j573
$$ 1741368 1769225 1799467 1757162 1874521 1856589 1852216 1818895 1812503 1810832 1763715 1785842 1784269
15735A784269q6732J0376L953L8384k9938o0333O7202P300k6418P8354n8605K577
$$ 1784269 1697537 1707913 1711866 1750250 1720312 1659979 1727181 1734481 1708063 1786417 1727812 1730389
15723A730389L2023n4967L1098Q7776N0911j18102r0603j0640l2484N6925J07836
$$ 1730389 1762412 1707445 1738543 1826319 1877230 1759128 1668525 1657885 1625401 1682326 1790162
15712A790162N3072j9550P087m6852L7499K9933p9120O5721j223j9311K7804Q0677
$$ 1790162 1843234 1823684 1830771 1783919 1821418 1851351 1772231 1837952 1836729 1817418 1845222 1925899
15700A925899J3132m1224j02901j14952N8940J14617J850m4824l4934m4168n735
$$ 1925899 1939031 1897807 1794906 1679954 1738894 1853511 1855361 1810537 1775603 1731435 1725700
15689A725700N7943O6010L8831j7635o2394M7331j2618m0764k2797m8239q054
$$ 1725700 1783643 1849653 1888484 1870849 1808455 1855786 1843168 1802404 1779607 1731368 1723314
15678A723314k2383J01055M9166p7729m990m0883k2642J4506j8773n2555O7617
$$ 1723314 1700931 1801986 1851152 1773423 1768433 1727550 1704908 1719414 1700641 1648086 1715703
15667A715703O6542m0068J9402N6633O68k801r381m2524L372K0483O9081Q199
$$ 1715703 1782245 1742177 1761579 1818212 1818880 1816079 1806698 1764174 1767546 1788029 1857110 1865309
15655A865309l6590o4543J6786M7873k8451J5576J0998n3383K6367l919M1278
$$ 1865309 1828719 1764176 1780962 1828835 1800384 1815960 1826958 1773575 1799942 1796023 1837301
15644A837301n097L2077l9944l8295k7152M0064J6066q6688J3873N7975L4812
$$ 1837301 1832204 1864281 1824337 1786042 1758890 1798954 1815020 1728332 1742205 1800180 1834992
15633A834992m2064L934J1442k5939m4293P0150M2913K74m0894L0860J8844j13522
$$ 1834992 1792928 1796862 1808304 1782365 1738072 1808222 1851135 1851409 1810515 1841375 1860219 1746697
15621A746697K8325P5008m4832q6970q252O2986p960K8616P2029p8789L6548N1406
$$ 1746697 1775022 1850030 1805198 1718228 1709976 1772962 1765002 1793618 1865647 1786858 1823406 1874812
15609A874812L5822N1525k5614j16696k5062j7941p1710R1340Q4032n9629n47
$$ 1874812 1910634 1962159 1936545 1819849 1794787 1776846 1705136 1796476 1880508 1820879 1820332
15598A820332J0084Q926n8127j9994l029p5033n947J09091j1087o6500N6591O7643
$$ 1820332 1830416 1839342 1781215 1761221 1758192 1683159 1677212 1786303 1775216 1708716 1765307 1832950
15586A832950n7970l3819j3845R8670N975L7791k3064m2344q0144J8144K5659
$$ 1832950 1774980 1741161 1727316 1825986 1831961 1869752 1846688 1804344 1724200 1742344 1768003
15575A768003n18K7553j9986J15169j3502j1173p3546Q614K7390R187J1303J58
$$ 1768003 1767485 1795038 1775052 1890221 1876719 1865546 1792000 1800614 1828004 1837191 1848494 1848652
15563A848652j4254k6935m9685K8331k1760L6244K0644m845n3815K3207J690k3067
$$ 1848652 1834398 1807463 1757778 1786109 1764349 1800593 1821237 1816392 1762577 1785784 1787474 1764407
15551A764407j869Q8955j957N6957m4479m3279N0686j309l4088o4170M8859O5550
$$ 1764407 1762538 1851493 1849536 1906493 1862014 1818735 1869421 1868112 1834024 1769854 1818713 1884263
15539A884263r6858M7050R5210k3442o0806n2224O1121m5621l7154L6557l0309
$$ 1884263 1787405 1834455 1929665 1906223 1845417 1793193 1854314 1808693 1771539 1808096 1777787
15528A777787l1122J9712q793l5616j8475M0796K7731j2433j3362L1915l5287
$$ 1777787 1746665 1766377 1757584 1721968 1703493 1744289 1772020 1759587 1746225 1778140 1742853
15517A742853Q5383q3545j5701P8250j8667K3560k245j2607p4676k5110P0267
$$ 1742853 1828236 1744691 1728990 1807240 1788573 1812133 1809888 1797281 1722605 1697495 1767762
15506A767762J22369q1877n9347j3490N4883J05935l3191j221m5254J8811k5297
$$ 1767762 1890131 1808254 1748907 1735417 1790300 1896235 1863044 1861823 1816569 1835380 1810083
15495A810083n4087J1799J5455j5282n2224J09631m1488M7329L7118m1562k9928
$$ 1810083 1755996 1767795 1783250 1767968 1715744 1825375 1783887 1831216 1868334 1826772 1796844
15484A796844J5513k0508O3783k6184L0177j4354j12232Q4717L6759o0002M7015
$$ 1796844 1812357 1791849 1855632 1829448 1859625 1845271 1733039 1817756 1854515 1794513 1841528
15473A841528K9775j08826O7808Q2619K9316Q291j4032r1299M0476J05236p5786
$$ 1841528 1871303 1762477 1830285 1912904 1942220 1950511 1936479 1845180 1885656 1990892 1915106
15462A915106j0811j2960m8736R0023m6071o8438M7793M1037l4784N4210m3979
$$ 1915106 1904295 1891335 1842599 1932622 1886551 1818113 1865906 1906943 1872159 1926369 1882390
15451A882390j0j9265l9580J7444p339k4959Q229o2424k757N341o065K5481n7932
$$ 1882390 1882380 1863115 1823535 1840979 1833640 1808681 1816910 1754486 1751729 1757070 1751005 1776486 1718554
15438A718554K1616J08460n8058J5513L0389k4574O941M8959M0220p1208l0588
$$ 1718554 1740170 1848630 1790572 1806085 1836474 1811900 1818841 1867800 1908020 1836812 1806224
15427A806224J07762M0573r8916l465o7688q581j8085K9497Q0802k3148n8632
$$ 1806224 1913986 1954559 1855643 1852178 1784490 1775909 1757824 1787321 1868123 1844975 1786343
15416A786343J1482J1486L7609o8611k9707N8178j3162l6122k016n071R271Q954
$$ 1786343 1797825 1809311 1846920 1778309 1748602 1806780 1793618 1757496 1755480 1750409 1759680 1768634
15404A768634J2716J5333p4143N4592J08459j9144n0024L7349j24512N0312N1351
$$ 1768634 1781350 1796683 1722540 1777132 1885591 1866447 1816423 1853772 1729260 1779572 1830923
15393A830923n498K1756k3055L7494L2685P745m8487m5001P1734p1005k0734O0213
$$ 1830923 1825425 1847181 1824126 1861620 1894305 1902050 1853563 1808562 1880296 1809291 1788557 1848770
15381A848770j4386j628P914o0008O4873O0177M8402o7408p6128K9200M7348j468
$$ 1848770 1834384 1832756 1840670 1780662 1845535 1905712 1954114 1886706 1810578 1839778 1887126 1885658
15369A885658k4700l8857k6346P5166L8409K7058p7486p63N0723j08613k4134
$$ 1885658 1860958 1822101 1795755 1870921 1909330 1936388 1858902 1858139 1908862 1800249 1776115
15358A776115M7687J5218L4056m2691N97N0982J7789l4760m9044j742K7121n4617
$$ 1776115 1823802 1839020 1873076 1830385 1830982 1881964 1899753 1864993 1815949 1814207 1841328 1786711
15346A786711M4713M818j1433Q209M573o638K1214n6472p905M3493l0198L9551
$$ 1786711 1831424 1836242 1824809 1833018 1837591 1830953 1852167 1795695 1787790 1831283 1801085 1840636
15334A840636M2609M2076K2029l0491M8860o3201j972o1332l7182k898L5358l1293
$$ 1840636 1883245 1925321 1947350 1916859 1965719 1902518 1900546 1839214 1802032 1799134 1834492 1803199
15322A803199k0455P0039L0823L6349l3747k8207P4765k8166l2355L1330j3110
$$ 1803199 1782744 1852783 1883606 1919955 1886208 1858001 1932766 1904600 1872245 1903575 1890465
15311A890465l8005l8745J1000N7620n6836L1580L1372j5424j2882k7887m0036
$$ 1890465 1852460 1813715 1824715 1882335 1825499 1857079 1888451 1873027 1860145 1832258 1792222
15300A792222N3072o998M3042M0271M111k257j64877J04782J4191o6197K4843
$$ 1792222 1845294 1838296 1881338 1921609 1925720 1923463 1758586 1863368 1877559 1811362 1836205
15289A836205j1895L7689N2040l8182n6143M0606m0620O6170M2736k6407m5055
$$ 1836205 1824310 1861999 1914039 1875857 1819714 1860320 1819700 1885870 1928606 1902199 1857144
15278A857144j3657L5247j7570m6641n604p2322Q5991P3013o7801L3399J871l0806
$$ 1857144 1843487 1878734 1861164 1814523 1808919 1736597 1822588 1895601 1827800 1861199 1863070 1832264
15266A832264N557J0523l4511J6972m2253L8464r374L6731Q2982p7531P1461M4509
$$ 1832264 1837821 1848344 1813833 1830805 1788552 1827016 1817642 1854373 1937355 1859824 1931285 1975794
15254A975794m0074J0957l8518J2954k9030k7603J4274j9118q0419J9919N0171
$$ 1975794 1935720 1946677 1908159 1921113 1892083 1864480 1878754 1859636 1779217 1799136 1849307
15243A849307R3229m624K7747o0637k3613n3793m8181j7699J17810K1220o4861
$$ 1849307 1942536 1937912 1965659 1905022 1881409 1827616 1779435 1761736 1879546 1900766 1835905
15232A835905J29184m6462q1631K0636j2266m021K1062k5526o2961K0180O6259
$$ 1835905 1965089 1918627 1836996 1857632 1845366 1841345 1862407 1836881 1773920 1794100 1860359
15221A860359J1633k9316O931O1144l9106p4238r33L3900N4021l8090J05266q5015
$$ 1860359 1871992 1842676 1849607 1910751 1871645 1797407 1796474 1830374 1884395 1846305 1951571 1866556
15209A866556J3515N1887k9322n349n7891j06481O671J35735P7255k2084N2031
$$ 1866556 1880071 1931958 1902636 1897287 1839396 1732915 1739586 1875321 1952576 1930492 1982523
15198A982523k8461n4118m4169Q3863L1328j17327J0054R905M6766P97k5334K8393
$$ 1982523 1954062 1899944 1855775 1939638 1970966 1853639 1863693 1873598 1920364 1921161 1895827 1924220
15186A924220l1143m5229K6592o1320J6084j373m0007k7840N3168O4142k9833
$$ 1924220 1893077 1847848 1874440 1813120 1829204 1827831 1787824 1759984 1813152 1877294 1847461
15175A847461M7591K07j8423m5614N8648N7058m266j18792n5730M2398K2734M4849
$$ 1847461 1895052 1895259 1876836 1831222 1889870 1946928 1942662 1823870 1768140 1810538 1833272 1878121
15163A878121L5640L1192n5103q5618m7797Q7108L239J4995j3179L8438j4089
$$ 1878121 1913761 1944953 1889850 1804232 1756435 1843543 1846782 1861777 1848598 1887036 1872947
15152A872947j2368N6592O8565q0930R5225n8829N6607p0463k9905K5844J0307
$$ 1872947 1860579 1917171 1985736 1904806 2000031 1941202 1997809 1927346 1897441 1923285 1933592
15141A933592j01042o3989k4020J32871Q6654P303k240q4865p053k3256L9640
$$ 1933592 1832550 1768561 1744541 1877412 1964066 1971369 1969129 1884264 1877211 1853955 1893595
15130A893595j0043J0302n7211M7067l4352M0053n562r9275k6017K2925M5890
$$ 1893595 1883552 1893854 1836643 1883710 1849358 1889411 1883849 1784574 1758557 1781482 1827372
15119A827372o4601J1778j3844N2778j3855l8650M9259L4314M3429m5972J21817
$$ 1827372 1762771 1774549 1760705 1813483 1799628 1760978 1810237 1844551 1887980 1842008 1963825
15108A963825k0425n1997R0351m9506j6506n7154r3306N4061Q6200m5740r816
$$ 1963825 1943400 1891403 1981754 1932248 1915742 1858588 1765282 1819343 1905543 1859803 1849987
15097A849987O9108j8522m474J9385k989k1303m5760K3081L257R185O5744m9993
$$ 1849987 1919095 1900573 1896099 1915484 1912495 1891192 1845432 1868513 1871770 1880955 1946699 1896706
15085A896706n595N226k6970N2583j4575q276M0806m6134J1108J0492p5282k1284
$$ 1896706 1891111 1896337 1869367 1921950 1907375 1899099 1939905 1893771 1904879 1915371 1840089 1818805
15073A818805j7677J6842j0221l939Q9782J9374o6833L7876k9001k2207L4715
$$ 1818805 1801128 1817970 1807749 1803810 1893592 1912966 1846133 1884009 1855008 1832801 1867516
15062A867516j3561M5505l4080o8995R2326L2585l3474N2971o5242j0136J1703
$$ 1867516 1853955 1899460 1865380 1796385 1888711 1921296 1887822 1940793 1875551 1865415 1877118
15051A877118N9693J2106l304p5794j6079J6846N7820j7091j6459o8454O7087
$$ 1877118 1936811 1948917 1945613 1869819 1853740 1870586 1928406 1911315 1894856 1826402 1893489
15040A893489J3004n4015K6514r506K7124o273r614j10149J3640P3259M2666o2152
$$ 1893489 1906493 1852478 1878992 1869486 1896610 1890337 1880723 1770574 1784214 1857473 1900139 1837987
15028A837987l6413L6446l7548M4613R7480J0137j15407J0970j2055J1326k5090
$$ 1837987 1801574 1838020 1800472 1845085 1942565 1952702 1837295 1848265 1836210 1847536 1822446
15017A822446l3569M4618K8007J9374L4913L7070N8657j07499O390l0287L8749
$$ 1822446 1788877 1833495 1861502 1880876 1915789 1952859 2011516 1904017 1910407 1880120 1918869
15006A918869N7630l7696O329m6317m1918m0551N0674R1942l9740R493p0514R017
$$ 1918869 1976499 1938803 1945132 1898815 1856897 1816346 1867020 1958962 1919222 1928715 1858201 1867218
14994A867218Q8307m2937O3826l9588p1059K6179N2132j0350n4991o0179j3380
$$ 1867218 1955525 1912588 1976414 1936826 1865767 1891946 1944078 1933728 1878737 1818558 1805178
14983A805178K6167P2755L1412l839J3569K0317n4472k2489L9530K2189j01750
$$ 1805178 1831345 1904100 1935512 1931673 1945242 1965559 1911087 1888598 1928128 1950317 1848567
14972A848567l8275K2383Q0713J7297j07542K123L6163j4332m6269N2081R9904
$$ 1848567 1810292 1832675 1913388 1930685 1823143 1825266 1861429 1847097 1800828 1852909 1952813
$$ [...]
##END NTUPLES=NMR SPECTRUM
##END=
