##TITLE=1H_CG-1132
 CDCl3, 8 sc, 
 6.3.2020
##JCAMPDX= 6.0         $$ Bruker NMR JCAMP-DX V2.0
##DATA TYPE= NMR FID
##DATA CLASS= NTUPLES
##ORIGIN= UXNMR, Bruker Analytische Messtechnik GmbH
##OWNER= root
$$ XWIN-NMR		Version 3.5
$$ Fri Mar  6 13:57:19 2020 Russian Standard Time (UT+4h)  she@DPX200
##.OBSERVE FREQUENCY= 200.1315
##.OBSERVE NUCLEUS= ^1H
##.DELAY= (6, 6)
##.ACQUISITION MODE= SIMULTANEOUS
##.ACQUISITION SCHEME= undefined
##.AVERAGES= 8
##.DIGITISER RES= 18
##SPECTROMETER/DATA SYSTEM= spect
##.PULSE SEQUENCE= zg30
##.SOLVENT NAME= D2O
##.SHIFT REFERENCE= (INTERNAL, D2O, 0, 15.7039)
##AUDIT TRAIL= $$ (NUMBER, WHEN, WHO, WHERE, WHAT)
$$ ##TITLE= Audit trail, XWIN-NMR		Version 3.5
$$ ##JCAMPDX= 5.01
$$ ##ORIGIN= Bruker BioSpin GmbH
$$ ##OWNER= she
$$ F:/spectra/data/she/nmr/H-F/1/audita.txt
$$ ##AUDIT TRAIL=  $$ (NUMBER, WHEN, WHO, WHERE, WHAT)
(   1,<2020-03-06 13:56:17.68 +0400>,<she>,<DPX200>,
      <created by zg, POWCHK disabled, PULCHK disabled
       configuration hash MD5:
       00 E9 B6 7A A2 85 ED C7 34 08 36 98 17 FE 4E 26
       data hash MD5: 16K
       9A F1 93 30 D3 6B D4 DD 95 EC 61 36 31 58 E6 A0>)
$$ ##END=
$$ 
$$ hash MD5
$$ 8E 87 F4 80 90 19 59 D2 05 66 98 4A 93 7D 24 80
##$RELAX= 
##$RELAX= 
##$RELAX= 
##$RELAX= 
##$RELAX= 
##$RELAX= 
$$ Bruker specific parameters
$$ --------------------------
##$DU= <F:/spectra>
##$EXPNO= 1
##$NAME= <H-F>
##$PROCNO= 1
##$TYPE= <nmr>
##$USER= <she>
##$AMP= (0..31)
100 100 100 100 100 100 100 100 100 100 100 100 100 100 100 100 100 100 
100 100 100 100 100 100 100 100 100 100 100 100 100 100 
##$AQSEQ= 0
##$AQ_mod= 1
##$AUNM= <au_zg>
##$AUTOPOS= <>
##$BF1= 200.13
##$BF2= 200.13
##$BF3= 200.13
##$BF4= 200.13
##$BF5= 200.13
##$BF6= 200.13
##$BF7= 200.13
##$BF8= 200.13
##$BYTORDA= 1
##$CFDGTYP= 0
##$CFRGTYP= 5
##$CHEMSTR= <none>
##$CNST= (0..31)
1 1 145 1 1 1 1 1 1 1 1 1 1 1 1 1 1 1 1 1 1 1 1 1 1 1 1 1 1 1 1 1 
##$CPDPRG= <>
##$CPDPRG1= <>
##$CPDPRG2= <>
##$CPDPRG3= <>
##$CPDPRG4= <mlev>
##$CPDPRG5= <mlev>
##$CPDPRG6= <mlev>
##$CPDPRG7= <mlev>
##$CPDPRG8= <mlev>
##$CPDPRGB= <>
##$CPDPRGT= <>
##$D= (0..31)
0 1.2 0 0 0 0 0 0 0 0.06 0 0.03 0 0 0 0 0.0002 0 0 0 0 0 0 0 0 0 0 0 0 
0 0 0 
##$DATE= 1583488576
##$DBL= (0..7)
120 120 120 120 120 120 120 120 
##$DBP= (0..7)
150 150 150 150 150 150 150 150 
##$DBP07= 0
##$DBPNAM0= <>
##$DBPNAM1= <>
##$DBPNAM2= <>
##$DBPNAM3= <>
##$DBPNAM4= <>
##$DBPNAM5= <>
##$DBPNAM6= <>
##$DBPNAM7= <>
##$DBPOAL= (0..7)
0.5 0.5 0.5 0.5 0.5 0.5 0.5 0.5 
##$DBPOFFS= (0..7)
0 0 0 0 0 0 0 0 
##$DE= 6
##$DECBNUC= <off>
##$DECIM= 24
##$DECNUC= <off>
##$DECSTAT= 4
##$DIGMOD= 1
##$DIGTYP= 9
##$DL= (0..7)
0 120 120 120 120 120 120 120 
##$DP= (0..7)
150 150 150 150 150 150 150 150 
##$DP07= 0
##$DPNAME0= <>
##$DPNAME1= <>
##$DPNAME2= <>
##$DPNAME3= <>
##$DPNAME4= <>
##$DPNAME5= <>
##$DPNAME6= <>
##$DPNAME7= <>
##$DPOAL= (0..7)
0.5 0.5 0.5 0.5 0.5 0.5 0.5 0.5 
##$DPOFFS= (0..7)
0 0 0 0 0 0 0 0 
##$DQDMODE= 0
##$DR= 18
##$DS= 0
##$DSLIST= <SSSSSSSSSSSSSSS>
##$DSPFIRM= 0
$$ [...]
##$SUBNAM2= <"">
##$SUBNAM3= <"">
##$SUBNAM4= <"">
##$SUBNAM5= <"">
##$SUBNAM6= <"">
##$SUBNAM7= <"">
##$SUBNAM8= <"">
##$SUBNAM9= <"">
##$SW= 24.9337058887773
##$SWIBOX= (0..15)
0 0 2 0 0 0 0 0 0 0 0 0 0 0 0 0 
##$SW_h= 4990.01996007984
##$TD= 16384
##$TD0= 1
##$TE= 0
##$TE2= 300
##$TE3= 300
##$TEG= 300
##$TL= (0..7)
0 120 120 120 120 120 120 120 
##$TP= (0..7)
150 150 150 150 150 150 150 150 
##$TP07= 0
##$TPNAME0= <>
##$TPNAME1= <>
##$TPNAME2= <>
##$TPNAME3= <>
##$TPNAME4= <>
##$TPNAME5= <>
##$TPNAME6= <>
##$TPNAME7= <>
##$TPOAL= (0..7)
0.5 0.5 0.5 0.5 0.5 0.5 0.5 0.5 
##$TPOFFS= (0..7)
0 0 0 0 0 0 0 0 
##$TUNHIN= 0
##$TUNHOUT= 0
##$TUNXOUT= 0
##$USERA1= <user>
##$USERA2= <user>
##$USERA3= <user>
##$USERA4= <user>
##$USERA5= <user>
##$V9= 5
##$VALIST= <valist>
##$VCLIST= <CCCCCCCCCCCCCCC>
##$VD= 0
##$VDLIST= <DDDDDDDDDDDDDDD>
##$VPLIST= <PPPPPPPPPPPPPPP>
##$VTLIST= <TTTTTTTTTTTTTTT>
##$WBST= 1024
##$WBSW= 4
##$XGAIN= (0..3)
0 0 0 0 
##$XL= 0
##$YL= 0
##$YMAX_a= 686340
##$YMIN_a= -345423
##$ZGOPTNS= <>
##$ZL1= 120
##$ZL2= 120
##$ZL3= 120
##$ZL4= 120
##$ABSF1= 10
##$ABSF2= 0
##$ABSG= 5
##$ABSL= 3
##$ALPHA= 0
##$AQORDER= 0
##$ASSFAC= 0
##$ASSFACI= 0
##$ASSFACX= 0
##$ASSWID= 0
##$AUNMP= <proc_1d>
##$AZFE= 0.1
##$AZFW= 0.1
##$BCFW= 1
##$BC_mod= 2
##$BYTORDP= 1
##$COROFFS= 0
##$CY= 11.3945322036743
##$DATMOD= 1
##$DC= 2
##$DFILT= <>
##$DTYPP= 0
##$F1P= 16.9975609425685
##$F2P= -3.02152046262296
##$FCOR= 0.5
##$FTSIZE= 0
##$FT_mod= 4
##$GAMMA= 1
##$GB= 0.15
##$INTBC= 1
##$INTSCL= 1
##$ISEN= 128
##$LB= 0.24
##$LEV0= 0
##$LPBIN= 0
##$MAXI= 10000
##$MC2= 0
##$MEAN= 0
##$ME_mod= 0
##$MI= 1.114404
##$NCOEF= 0
##$NC_proc= 0
##$NLEV= 6
##$NOISF1= 3.799351
##$NOISF2= 2.8
##$NSP= 1
##$NTH_PI= 0
##$NZP= 0
##$OFFSET= 15.70392
##$PC= 1
##$PHC0= -9790.745
##$PHC1= 21.00082
##$PH_mod= 1
##$PKNL= yes
##$PPARMOD= 0
##$PSCAL= 0
##$PSIGN= 0
##$REVERSE= no
##$SF= 200.130013532006
##$SI= 16384
##$SIGF1= 3
##$SIGF2= 2
##$SINO= 400
##$SIOLD= 16384
##$SREGLST= <1H.CDCl3>
##$SSB= 0
##$STSI= 0
##$STSR= 0
##$SW_p= 3612.71676300578
##$SYMM= 0
##$S_DEV= 0
##$TDeff= 0
##$TDoff= 0
##$TI= <>
##$TILT= no
##$TM1= 0
##$TM2= 0
##$TOPLEV= 0
##$USERP1= <user>
##$USERP2= <user>
##$USERP3= <user>
##$USERP4= <user>
##$USERP5= <user>
##$WDW= 1
##$XDIM= 8192
##$YMAX_p= 0
##$YMIN_p= 0
$$ End of Bruker specific parameters
$$ ---------------------------------
##NTUPLES= NMR FID
##VAR_NAME=  TIME,          FID/REAL,        FID/IMAG
##SYMBOL=    X,             R,               I
##VAR_TYPE=  INDEPENDENT,   DEPENDENT,       DEPENDENT
##VAR_FORM=  AFFN,          ASDF,            ASDF
##VAR_DIM=   8192,          8192,            8192
##UNITS=     SECONDS,       ARBITRARY UNITS, ARBITRARY UNITS
##FACTOR=    0.0002004,     1,               1
##FIRST=     0,             0,               0
##LAST=      1.6414764,     0,               0
##MIN=       0,             -345423,         0
##MAX=       1.6414764,     686340,          0
$$ Real data points
##PAGE= N=1
##DATA TABLE= (X++(R..R)), XYDATA
$$ [...]
2801E950o914o85Q12k012L393O473j466n549k505N45K493K228j225r52J932l75
2817B143m764P66M899j498l001M057K186m885l441K862K445R8P3j114o75M06j771
2834a214p32M076J302m385J73M058k464n945K507N463j90j523r78k774k053J690
2850b989L563L223L89o874n549M117O088o67q54J473l970m939L774O031l39k683
2866b06k055l91J494J203j483R88K989k015m223K686K964l375l18N142l6m850
2882a486j564K771K044J066r45k319K7L29j343J683L935k606n540K342N467k062
2898A799l566J109R80r48J373J619j947k442j982J084N761K722n614n346K596
2913b802K014o03L384K895m809n468K081L482J433P19j193j498L87j458k039L663
$$ y = [5950, -964, -1649, -837, -2849, 544, 7017, 5551, 2, -2503, -1958, 535, 2763, 1538, 586, 2518, 2143, -2621, -1855, 3044, 1546, -1455, 2602, 4788, -97, -3538, -676, 1769, 1867, 1940, 826, 151, 557, -1214, -1946, 2130, 3432, -953, -780, 3278, 814, -5131, -2624, 2839, 2649, 1126, 148, -2626, -4679, -2989, 574, 3797, 4186, -2688, -8237, -4120, 1968, 1301, 447, 1920, -2050, -6989, -3215, 2816, 2477, -206, -2261, -2652, -1158, 45, -1438, -450, 2539, 524, -3699, -1013, 1951, -1424, -1742, 3400, 3364, -1486, -3050, -279, 1765, 2831, 1886, -433, -406, -77, -1420, 263, 4198, 1592, -3948, -1606, 3861, 1799, -1767, -658, 322, -626, 747, 2366, 419, -2023, -4005, -2921, 2840, 5562, -52, -5398, -2802, -788, -1391, 1993, 4888, 79, -5389, -3308, 174, 1607, 2326, 1133, -365, 22, -1436, -3475, 188]
2929A88M947k488l086J459j157l686K559O659P43m186l180j896J624L860J822
2944D182o26o18l413m069L409O336k470m191K016J566k506m92J449r88o57J733
2960F61J142j49j830m559m49O042L246l367j667j57l351j541N539M634k668k801
2976a275r95j251N56J608J110J870J424l613m890J777K870r5K635L773m558p005
2992f059n1M975L399K293k072m522k232J155J677L738K664m158n629K095M165
3007A438j652j415K725j53j786R19J85j668k46P49J075K776J85m528k239L702
3023F7J303r59K616R16m243k355K856P74L77J432M71r55o64k157j852L334M564
3040E525q45k723q4l447k422M667O382k134m696j876j434J350M186R71j855j641
$$ y = [188, 5135, 2647, -439, 1020, -137, -3823, -1264, 5395, 6138, 1952, -1228, -3124, -1500, 2360, 4182, 3556, 2938, -475, -4544, -1135, 5201, 2731, -1460, 556, 2122, -384, -876, 573, -415, -1072, 661, 1803, 1654, -176, -4735, -5184, 858, 4104, 737, -930, -1087, -4438, -5979, -440, 4194, 1526, -1275, -2270, -3521, -2965, -1357, -247, 1623, 3047, -566, -5456, -3679, -809, -904, 1731, 5504, 946, -6059, -6110, -1135, 2264, 4557, 2485, -2037, -4269, -3114, -1437, 2301, 4965, 807, -4822, -2727, 1438, -214, -1629, 1096, 943, -843, 76, 261, -1407, -1653, -904, 171, 2947, 3132, -1396, -3635, 67, 1370, 411, 3027, 3943, -300, -2655, 201, 975, 1352, 2784, 3255, 2300, 1636, -521, -2373, 961, 5525, 4680, 1957, 1873, -1574, -3996, 671, 7053, 4919, 223, -1653, -3087, -1737, 2449, 3420, 1565, -76]
3056g6k477j240L105L495k925k716J363O15k032J074J580j954l34J229J01p63
3072a955J56j066k16K793M54k403k4K540j546p67K373K36k079J316J639j468j058
3089a075J096J77J130K393j482l654Q16J471M18K671J123m056m095K273L216R31
3105C353Q24k129l871l84K995J221J76O24k702l338K667K380j166k8M82j288j916
3122b100K070l8q02J479N18j921o95P88m65K66K756j029l081M89J383n35R32J800
3140A815k246k074J673J115l58N99j149k122J173K843o01j138P06j471j135L116
3156G46K201k536j657J97n66P26L211l59k588l91Nn34K297K230j811j521M50m66
3174c66q39K155J976k133l26K60j908J13K858N48j540K54r81k236J459L095m20
$$ y = [-76, -2553, -3793, -688, 2807, -118, -2834, -1471, -856, -2888, -1814, -234, -2188, -2522, -1293, -1192, -1955, -1799, -2865, -3081, -288, 166, -2237, -2261, 279, -1267, -2034, 339, 575, -1504, -188, 1451, -17, -1075, 21, 198, 1328, 3721, 2239, -1415, -599, 872, 1290, 3961, 5084, 1028, -3067, -794, 2422, 3353, 4177, 2048, -1823, -2207, 788, 2009, 2185, 2809, 107, -3231, -564, 1816, 650, 622, 1104, -184, -2100, -30, -68, -870, 609, 1127, -794, -1489, -701, -1166, -900, 1856, 827, -2254, -1765, -382, -917, 15, 1815, -431, -2505, -832, 283, -75, 524, -625, -2747, -1574, 1269, 668, -470, 236, -1235, -2370, 746, 2947, 411, -1246, -1049, -1615, -889, 2322, 1963, -625, -1016, -1011, -1545, 752, 2982, 1171, -350, 100, -366, -1205, 950, 2926, 793, 467, 727, -1181, -1068, 1790, 2338, 798, 1052, 71, -2165, -706, 2389, 1969]
3191A969j939J69j707p64K776J918k064j142Q5r38M13L243j092k855O19M81l44
3208a172J361J281k721j312J684O86l1Q67j01k347N33J785k91j11K153j800k237
3225a773J607J223n03R15J099j983j725J626M81k60K035k9k795n87J229L2J177
3242A769J770k130k932R12J260N5Q49P87k960j813J839J574p41M68p17k420N42
3259a888J814j98l9J2j323j562J898J531j547R4R07k325p34K574N01p46M4n75
3277a562j391R06J944n2o48P26j566j290K464J549j115K35J68j562L1K355O48
3294A840j374J77O0j550J885J961j108j134O29q92k80J896Q74j490o0j40j412
3311a18Q01K546r08j741K59k19j208J714J897k007j948L05k76j51K416P85k372
$$ y = [1969, 30, 199, -1508, -2272, 504, 2422, 358, -784, -699, -1637, -1224, 2019, 927, -1928, -1309, -828, -1172, 189, 1470, -1251, -2563, -879, -193, -224, 643, 542, -1805, -1272, 513, 222, 111, 2264, 464, -1773, -166, 1057, 554, 1469, 2568, 585, -1140, 486, 967, 707, 2742, 2713, -82, -669, 560, 592, 1769, 3539, 1409, -1523, -611, 649, 704, 1553, 2340, -620, -2433, -594, 980, 239, 707, -10, -2430, -1888, -74, -272, -311, -299, -1622, -3184, -1286, 245, -1302, -1208, -301, -2626, -3360, -786, -285, -1031, -987, -1562, -2953, -2047, -103, -155, -803, -77, -1643, -2933, -469, 1080, -35, 200, 368, -1194, -1163, 1192, 1840, 466, 643, 703, -847, 1038, 2999, 1891, 757, 1386, 494, 214, 2110, 2984, 1494, 1434, 1294, -118, 683, 3229, 2321, 580, 839, 620, -588, 1126, 3023, 1016, -932, -627, -903, -1054, 1362, 2147, -225]
3328b25j416j66n36J928K052j725j732N06k94j160J824K742j882k284J144J55
3344a069m07J060J299j056j8p41q53J382K070j460j114J969k71j756R32K380j645
3361G02j859J432Q42K03J65j030j035N09N24l25J418Q03l167k207K421K024j295
3378A25N31P14l154j400J885K247J82n29k109j828J256J618m58J586R53l205k720
3395d306K655K244j064R7J297j289j889L61J363J026J025j439j601J225O11j805
3411a489J221K973j850k902J728K310j427q33N99j66K79J006m8K28n08k060p73
3428a712L612K593l417j991J632p57j089K708K336k271k435p47J476J771M53j791
3444C71K36R23k471j640L693K388l290j852K149J5k533Q62K616k25j859j466k
$$ y = [-225, -1641, -1807, -2343, -415, 1637, -88, -1820, -1314, -1608, -2768, -944, 1798, -84, -2368, -1224, -1069, -1476, -416, 883, -173, -191, -932, -1785, -403, 1667, 207, -907, 1062, 791, -965, -33, 2347, 702, -1157, 275, 1117, 1320, 1485, 455, -580, -71, 453, 128, 1546, 2349, -818, -3025, -604, 1420, 125, 656, 1370, -1784, -3184, -1299, 948, 1130, 601, -1508, -3336, -2080, -462, -920, 666, 1619, -1586, -4306, -1651, 593, -471, -374, 923, -366, -2255, -1894, -531, 495, 1520, 81, -1520, -295, 316, -1489, -268, 2705, 855, -2047, -319, 1991, 564, -269, 330, 164, 443, 1449, 1401, 1629, 1121, -939, -1712, 1900, 4493, 1076, -915, 717, -40, -1129, 1579, 3915, 1644, -791, -1538, -62, 1709, 2162, 371, 607, 1530, -941, -2581, 1112, 3500, 210, -1642, 507, 522, -2011, -1149, 1467, 1242, -617, -2083, -2085]
3461b085J766R00j822J85J479k200k788L493L199k738l067J506J428m68J48N96
3477d68k10j180p71P64L941r2m340q32L930M38k308J228K801k489k864K294K554
3494B396m69j223m08P55J097j409j156K957J429l924j642L950J179l816K43L229
3510C188r55l231J94K546J195j366k195j46J361r05j063K757K075n167l196L618
3526a290L168j768j635J440n59k053n46K718J825r60l490N13L416l81l525J399
3542a728L776k279l213K684L149k466k553J960K195k44k145q9K394O30l378m77
3558a784M401P19m196o10L813j265l449K071M571j422m093r10K010J701l67n27
3574F63J076J16m366k032O115L142m627k628K575J03k901J258L607L25l704j795
$$ y = [-2085, -319, 581, -1241, -1056, 423, -1777, -4565, -1072, 2127, -611, -3678, -2172, -744, -1212, -1064, -468, -678, -1858, -2629, -1865, 2076, 1984, -2356, -3188, 742, 1180, -1128, 100, 2901, 412, -2452, -158, 2396, 1927, 704, 296, 1051, 2148, 739, -417, 2540, 3969, 45, -1597, 2353, 3532, -284, -41, 3188, 2233, -998, -804, 1742, 2937, 1571, -624, -770, 591, -314, -1377, 1380, 3455, -1712, -4908, -1290, 1878, 110, -1525, -85, -644, -2697, -3243, -525, 1300, 340, -3150, -2637, 779, 398, -3127, -1728, 2048, -231, -3444, -760, 2389, -77, -2630, -670, 1525, 1281, -864, -953, 1441, 2071, -1307, -1784, 2617, 3336, -860, -1470, 2343, 1078, -2371, -300, 4271, 2849, -1244, -2154, -144, 1557, 1190, 663, 1739, 1855, -2511, -4543, 1572, 4714, 87, -2541, 34, 137, -2764, -1506, 2101, 2426, -1278, -3073]
3590c073K157K203j450k559K464L021l132l619L764K575l417j981L547J936l030
3605e94j943K421J296j102j612J044L893q98m817K30L794k27k878L045L022m039
3621F35m384J978M030N34j337o91L86q45k716M76N298J610n203k493L819J78l298
3638b023J469M067j732l885j11K545R92j856r45K181J494l139k408L312K275l742
3654a506j350M253J428m046j731L041P45j644m53K228R53k342l176J356M316m03
3670A669k836J701J457l977k865M297M329j782l188j72L21q41l7K319K805j277
3686A923m858p98L774Q55k792J919K708k712l569J404L357o52j342M76J397j75
3702I15j603j401K546J755k545p88L530J68m441l57L762Q39k052K34J534q86k531
$$ y = [-3073, -916, 1287, -163, -2722, -258, 2763, -369, -3988, -224, 2351, -1066, -3047, 500, 2436, -594, -2537, -116, 1180, 78, -1534, -490, 3403, 2505, -2312, -2082, 1712, 1485, -1393, 1652, 4674, 635, -3749, -1771, 2259, 2793, 1456, 765, 1151, 306, -2410, -1934, 3364, 4974, -229, -2722, 1097, 1275, -2023, -554, 3513, 1781, -2104, -2215, 330, 1322, -534, -1479, 702, 2196, -943, -3351, -39, 2236, -1506, -2856, 1397, 2825, -1221, -2952, 89, 834, -810, -1263, 965, 1918, -424, -3600, -2244, 2072, 1669, -1167, 534, 1991, -1986, -4851, -554, 3775, 1993, -1195, -1367, -1046, -1887, -1924, 395, 3200, 1923, -2935, -3733, 41, 896, -1896, 23, 2731, 19, -3550, -2146, 1211, 559, -783, -307, 1090, 915, -688, -2089, 457, 2212, -333, -1121, 2409, 2577, -1864, -2221, 1541, 2380, 328, 562, 2096, 1210, -1321]
3719a321M4K268K367o61l232K64J294k056r48M458J964l739l124J261J011k58
3735d08J120J685m77k079l087J089L141J583k518l89J321k107k020K885L226k517
3751D48j684Q69P93o23o79M54Q10L40j407n06J777K83k902J82L680j52k925L67
3769h75J495j238j117J308J901l71j626j781Q68J535n55l16K129O32m184j291
3785c486K888J528q99M88N18k145j487J042K292J446n86k991r78K352j82J78J720
3802A698P15l006j374K610J486j440k15L84k65j18r2j66Q50N1j296p0K015o37
3820A130k096P20J351q56j174J370J12j164K3j61K97L60O3o50K42L20j654o74
3838b441K522R64j592p88N31j037K68K596O49j572j440m44K72K381J144j352j053
$$ y = [-1321, -1277, 991, 3358, 2697, -535, -271, 1023, -1033, -1981, 2477, 4441, 702, -2422, -1161, -150, -408, 712, 2397, 1920, -159, -3246, -2157, 984, 2567, 49, -340, 981, -1126, -3146, -261, 2965, 448, -1236, -367, 426, -197, -876, -422, 388, 728, -679, -1185, 592, 875, -2027, -1845, 1835, 1683, -1242, -875, 620, -618, -1735, -427, 1474, 1103, -523, -2304, -1436, 99, -456, -772, 1357, 1989, -2195, -3486, -598, 930, 31, 519, 1037, -1108, -2595, -1553, 739, 2185, 1599, -1392, -2370, -18, -200, -22, 1698, 2413, -593, -1967, 643, 2129, 689, 474, 858, 593, 475, 383, 217, 1067, 1118, -178, -248, 1767, 1130, -966, -246, 1105, 249, -925, 445, 557, -607, -584, -745, -448, -88, -25, -675, -433, -113, -1767, -2441, 81, 1045, -547, -1335, -804, -1841, -1573, 1023, 1672, 100, -1340, -1784, -1512, 869, 2013, 661, -392]
3855c92k66n55M96K565R71k464r55P27N6N42J096n18o36J0J02q37J050P47j474
3874B65K90N44q23j155J198J251j128l25K28j043J81J226m8j284N19p75m10J423
3892A34M92j347r08Q42M53m11J336r60j323l89J329J008J31Q0j869j054J719J466
3910G29m26K27o0j940k66K113L20l20L80m07j617N63J019J94J07J076j235j199
3928g42N25J79l7J647K68j775j216Q21L47O82J052o12j932N1N28M13K33Q10j711
3947d69r05J296N62o12P4J11j640Q95J258k50j021j61j38j57J423P67j397p29
3965a093L97j40j57J682j62j328q0O67q45N52J343k01o60K1o32o94J486J149p67
3984E38p0j73j203n04K718Q82j100q71m25n60M35J606M69r45o22r25M35J461O78
$$ y = [-392, -658, -1213, -717, 1848, 2819, 355, -600, 127, 183, 725, 1821, 1303, 667, 677, 779, -58, 992, 1739, 265, 555, 1099, 276, -879, 319, 1570, 442, 117, 345, -698, -517, 709, 661, -623, -104, -879, -1289, 134, 626, -721, -1629, -787, -334, -745, 591, -369, -1692, -2081, -752, 256, 387, 467, -1402, -2456, -737, 729, 303, 530, 470, -1470, -1736, 377, 697, 377, 757, 350, -1267, -704, 315, 509, 616, 1692, 457, -742, -217, -38, -75, 1572, 1840, 65, -1151, -330, 17, 699, 1751, 1139, -793, -742, -214, 199, 432, 1242, -469, -1374, -78, 484, -128, -54, 57, -1583, -688, 570, 320, -701, -862, -1000, -1157, 266, 1033, -364, -1093, -696, -836, -993, 689, 527, -801, -881, -214, -1059, -507, 836, 635, -25, -4, -636, -1330, 156, 1305, 538, 468, 295, -908, -1412, 1306, 2188, 1088, 217, -208, -768, -333, 1273, 1742, 797, 175, -750, -315, 1146, 1824]
4003A824j615R8N50j099k75K002J76k484L02J199j57j61M3o50mK65k1P9Q95m03
4023E64j672K86J199n64o91J434J20j753m45P77N97M61K87j202o83K74o7L80K018
4042A320l01k584p79J661M88m2J056k35j906o10J057J077P46n26j267j64J357
4059C48j19r10J931J4k164j84K117K18j140r9P79p75o6L39L15N65p33j559O07
4078e16K161p31j668J634N51k565q04K703J272k244o19R4O3K31N6O46N04n32k841
4097b605P78L145j92k397M86J758k102k53J747J539j783j245l7J584J204j273
4113C54q15J565K0k438M9L677O6l042o2K622r01j549J026J534n26j919r23J999
4131G37J633j722j629J854O39k628n99L275P55l581q27K198O21j310l99J308J33
$$ y = [1824, 209, 307, 857, -242, -517, 1485, 1661, -823, -521, 678, 521, 360, 403, -247, -251, 14, -7, 72, 967, 564, -1108, -822, 377, -187, -878, 556, 676, -1077, -1522, -745, -148, 313, 600, -602, -1285, -1011, -1078, -698, 1320, 1019, -1565, -2344, -683, -195, -237, 819, 584, -1322, -1932, -875, 202, 948, 422, -845, -1009, 348, 229, -681, 1250, 1264, -900, -1084, 1033, 1251, 111, 12, 791, 16, -50, 289, 604, 1169, 436, -1123, -516, 1645, 914, -754, 880, 1431, -1134, -1938, 765, 2037, -207, -826, -732, -669, -438, -382, 264, 768, 236, -2605, -1827, 1318, 1126, -1271, -785, 973, -1129, -1382, 365, 1904, 121, -1124, -1161, 423, 1627, 354, -461, 1104, 1124, -1314, -1265, 2412, 2478, -564, -626, 1996, 1095, -454, 572, 2106, 1580, -339, -1262, 737, 2370, 648, -981, 873, 1512, -1116, -1715, 1560, 2315, -1266, -2093, 105, 726, -584, -983, 325, 458]
4148D58j865j174K078K102j732k976J677K376k260j098K735J334k795j680J840
4163i80J934q02j359O85J194p09k317J012L465q00l685P47L481j234k309K091
4179D14J755j872k193J262K254J45k605q07K433J265k893r0L167o4m334N76L854
4196B267J32l214l46K585n42k141N89K287R33l012k294K632K499k440j346L065
4212A654L97m313j436M589J894k522j445J279L25j860p05K551K979k825l841J645
4228a634L611j726k757K954K050k814k739K932K470k343j714J505K430o43l224
4243a642R9L583p63k949R61M384k252m237J191L847o91k278R58J979j410l119
4259b339K84L594J414k624j762J931Q4l781R97N339N61m814k085K196J265j532
$$ y = [458, -1407, -2581, -503, 1599, -133, -3109, -1432, 944, -1316, -2414, 321, 1655, -1140, -2820, -980, 954, 152, -1207, -522, 672, -37, -2354, -1342, 2123, 1323, -2362, -1615, 1866, 632, -1677, 414, 2169, 297, -1896, -634, 1620, 1765, -840, -1647, 786, 2051, -842, -932, 2235, 2171, -2163, -1587, 2267, 2399, -815, -1161, 1424, 882, -1259, -670, 1617, 2550, -462, -2756, -124, 2375, -65, -1411, 1654, 2051, -2262, -3698, 891, 2785, 263, -1182, 97, 422, -1438, -2143, 408, 3387, 562, -3279, -1634, 1977, 251, -2506, 448, 2498, -316, -3055, -123, 2347, 4, -1710, -205, 2225, 1582, -1642, -1543, 2040, 1277, -1672, -711, 3673, 1421, -2816, -1625, 2222, 1531, -747, 211, 2190, 780, -2339, -2055, 1539, 2953, 329, -1433, 498, 582, -3199, -2202, 3137, 3698, -1116, -3201, -1005, 260, -1272]
4275a272Q38K310m3l738k062K785L495k055j990K631J114l597k198L911K220k877
4291e28r94K193O88k739j669K386K895j030k522N77K397k422k738L046M448k688
4307A300l316J572J791k231j886K807L272p57l536j094J806P14j347J546M034
4322D675k367o023L9M903J262k259M70R99j683k790J008L388J892l190j865K132
4338E91J057l168o64M080J634m032j452K697J28k572J72L171J131l039k145J429
4354i82K506j620j997K821K611l543l110L004J902k817l39K938J462l093k658
4369b915J428K112O33j170M58J462l033k813K780M637o40l973L22J615j717q74
4385a688K638K187j206l063l32J850J064j805j58K778j94l653p27L649k0k448
$$ y = [-1272, -434, 1876, 1833, -1905, -3967, -1182, 2313, 258, -1732, 899, 2013, -1584, -3782, 129, 2349, -528, -1522, 671, 1359, -1380, -3049, -663, 2232, 1202, -1320, -743, 1654, -768, -3506, -460, 3988, 1300, -2016, -444, 1347, -884, -2770, 37, 3309, 2552, -984, -2078, -272, 442, -905, 641, 4675, 2308, -3715, -3676, 1227, 2489, 230, 700, 1699, 16, -2774, -1766, 1622, 3514, 324, -1541, 591, 1648, -1520, -2184, 1896, 3530, -502, -1954, 743, 871, -1701, -1529, 1642, 2773, -266, -2411, -982, 1524, -96, -2093, 728, 3339, -204, -3314, -310, 1592, -1225, -1564, 1374, 2836, -257, -2915, -1487, 625, 1258, 88, 546, 2008, -1025, -3838, -1058, 3579, 2939, -1034, -712, 903, -814, -1688, 950, 3137, 1931, -1132, -1464, 386, 1450, -355, -513, 2265, 2071, -1582, -2309, 1340, 1320, -1128]
4401a128L45K581j426k083n0K087Q24j611j317J639J624k593j635K540J517k248
4417i34m77K703k91l147n86K485J572l89j532J15O3n28p95K248K508k538l066
4434b589J391K845j482j070K123K52j607j091J384J062p17q78L13J278l14j959
4450a059M87K369n24k467N72J870r49j301J223O40j095q47J46J812L43j621j321
4467a722J356J094j104j67K095p11k884N15K631N21j705m42J58O2M96J58O68M75
4485A494j448j094J090J902j414j082J203O07j567l25J697m42k85l45L5O13j25
4502E14p52K67Q68n01j823N25K205j070r13P78K12j229M98J233P6o66j229m70
4520a477J087J395m46p86N04m74j186Q65K011l84j928l0P25k06L00P06k63l20
$$ y = [-1128, -783, 1798, 372, -1711, -1761, 326, 1150, -461, -1778, -139, 1485, -1108, -2743, -203, 1314, -934, -1411, 1292, 1001, -2146, -2732, -247, 1325, 936, -596, -481, -418, -946, -1741, 507, 3015, 477, -2589, -1198, 1647, 165, -905, 1218, 1470, -137, -1228, 156, 1218, 501, -377, -64, 1214, 900, -1059, -572, 1797, 1273, -1194, -622, 1248, 299, -1002, 221, 861, -234, -1081, -935, 877, 1220, -401, -1722, -366, 728, -376, -543, 1552, 841, -2043, -1528, 1103, 1624, -81, -523, -365, -303, 193, 351, 1019, 1494, 46, -1048, 42, 1944, 530, -552, 651, 1258, -309, -634, 1063, 621, 336, -9, 26, 639, 514, -238, 29, 897, 396, -1427, -902, 1303, 233, -680, 98, 310, -919, -421, 812, 888, 222, -1007, -1477, -390, 1005, 559, -227, 277, -197, -1383, -518, 1493, 1109, -819, -849, -124, -330, -30, 676, 413, 93]
4538I3l11n04N30R09q35o50P48N82r17j77Q26r5p32L91N65q06N07j49k66J26K91
4559A26j092P92J259o57j471N86Q34o10L79P93p74j224j40J073M11Q37m23j317
4577f18O7M48K02M57R11j131j617O31J129j19J53M22j152l48P20L03j68L63k98
4596C55r50J97N22m1m65R89m36n65K3O26k49K51K15r36k05N23L33n02R51n45p45
4617f54K72P26L21n34K2l40o81P83Q62l67m31J71q80J94J075J66p44M27l54o75
4637f41P51Q99l87p52J86j43m72N32N79k98l44o0l94L03O43pr61M10m5j093P92
4658e02J161m97m51r9l8m11J009M85r56l23L72m94J12J197Pj098L14J06p82Q51
4678c7J105q63p26O0Q41o39P28N20q97m64K66j39L46J321j101o81oM78l19N95
$$ y = [93, -218, -722, -192, 717, -118, -768, -20, 562, -355, -532, 294, 199, -533, -142, 423, -383, 124, -25, -291, -165, 126, -966, -174, 1085, 428, -1043, -457, 377, -233, 146, 939, 165, -1059, -1199, -126, 285, 1122, 699, -618, -551, -103, 99, 556, 1467, 336, -1281, -650, 479, 360, 513, 935, -217, -565, 155, 458, 290, 653, 355, -595, -398, 124, 83, -382, 607, 171, -394, -371, 255, 6, 257, 472, -464, -669, -146, 187, -315, 636, 91, -654, -382, 344, 665, 131, 153, -187, -868, -85, 777, 410, -21, 150, -730, -536, 539, 705, -39, 388, 34, -641, 110, 1009, 622, -130, 56, -87, -559, -27, 552, 254, -90, -150, -544, -241, 402, 395, -566, -156, -201, -1294, -502, 659, 162, -289, -388, -426, -837, 172, 657, -299, -622, -250, -744, -632, 565, 572, -526, -212, -106, -888, -37, 1068, 205, -521, -461, 380, -259, 469, 989, 92, -372, -106, -245, 101, 1422, 321, -360, -366, 112, -207, 388]
4698C88O43p74p47K46Q2K07P10n54r36J52O89m12J65R44p14j572P90Q77l52M79
4718C11k4r87k64O56q8N72N00q90q53L46Q80k95N64R51r67j670L96J280J79j76
4738D21m6k43o86J11N24Q48K31j140j252P98J682r81n17J267q17p44K27J042L4
4757G59o12o39M65J62K37l69j01N49m51j233J358J041j242n33P76J29r10K65P48
4776C99J37o74l18J84L99M69m70j71O89r43j290J295J962o32j702K93L28m06J67
4795b84J117K29j273r63j82J888J160j595q44J093m79q06N18J965n09k233L86
4812h12J305l87m00k5N49N51r95j047J321J114j884p5J720K08k063m28K155J81
4830I88j401k64P36O91n76o78J17J096r12r37J631J402j938j918J551J705p18
$$ y = [388, 1031, 257, -490, -244, -162, 45, 755, 201, -735, -583, 106, -306, -141, 803, 89, -1483, -693, 184, -168, 311, 287, -700, -964, -308, -396, 176, 676, -214, -1067, -721, 159, -136, 428, 1379, 412, -1258, -862, 418, 597, 421, 375, 132, -554, -443, 81, 929, 1160, 20, -1232, -434, 1248, 267, -250, 1017, 200, -544, -317, 725, 759, 147, -492, -27, 135, 372, 3, -98, 451, 0, -1233, 125, 1166, -76, -609, 167, 296, -614, -349, 399, 536, -138, -456, -272, 127, 596, 126, -45, 644, -299, -1589, -294, 1668, 1036, -666, -373, -45, -451, -284, 833, 1062, -211, -1174, -1356, 532, 1692, 97, -747, 346, -133, -939, -421, 1544, 1035, -1198, -812, 493, 106, -294, -319, 230, 781, -214, -1261, 60, 1174, -710, -785, 935, 1143, -920, -1348, 807, 988, -413, -677, 59, 750, 174, -504, -387, 709, -203, -1140, 491, 1893, -45, -1963, -412, 1293, 575]
4847E75o10L95k52j371p7J610J708j146j949n31J709M70r28O98J480j721k334
4864b274R89K421k15j169M79O62q00j354M4K041P07j332j080J560R3k210L66L213
4882B141l35k579l30J681J59j584K5J320Q99j548q17J134O12j637j084K814J912
4899B783k723j939J258M03l41M54J405K16k598j913J578K610k2j730L77J104j569
4916f47k055K210L358k260j962J536O49j635r54J702K189o25k456n35J768j2j208
4933i37R53K590j465l311P19K885m34k325Q80J709j03j981l30J374O36j643N1
4950g32K472K28l389j434K794J780j822J3J563j047k720L25K936J415j858j778
4966a254O96J041j564p22K661J881k337k414J696Q34j327k36K427J070k641k169
$$ y = [575, -35, 360, 108, -1263, -1340, 270, 1978, 832, -1117, -1648, 61, 531, -397, 301, 1781, 60, -2274, -1285, 1136, 921, -248, 231, 893, 93, -1261, -1217, 824, 1531, 199, -881, 679, 772, -1438, -1072, 2141, 1806, -773, -1103, 578, 737, -847, -822, 498, 1397, -151, -968, 166, 778, -859, -1943, 871, 2783, 60, -1879, -621, -218, -559, -105, 1300, 1516, -1082, -2995, -1417, 1193, 1171, -559, -182, 922, -647, -2702, -492, 2866, 606, -1356, 180, 829, -806, -1760, -58, 2131, 1506, -950, -1485, 283, 271, -937, 16, 2606, 1141, -2170, -1451, 1434, 1000, -1325, -445, 1264, 1161, -820, -1150, 224, 860, -783, -732, 1740, 1968, -1421, -2855, -61, 1719, -103, -90, 1473, 426, -2294, -1969, 967, 2382, 524, -1254, -558, 483, -1081, -1803, 858, 2739, 402, -2012, -316, 518, -809, -1045, 1382, 2452, -189, -2358]
4982b358Q87K508O9j654P49J244j385k801K013L072j322k953J334K466j352k028
4998a511O67J745j4j386J06J874r94k593Q8L480J171k797r76J810p38j938J787
5015b19K563n52k813n34J591K97r83m03K380O27k706j722K291J460j997j65K440
5032A555m61l123l41K353J813j380j453R09O22r70j101J732J826j704k285K052
5048D4J907k151j827J705J516q58q01P60M51q70j539J194K863m51k922k16J794
5065E99j08j531R37K773j502k662L43J847j38q34N68J204l70k495p94K325J414
5082A576j805m08J580l66k609P23K619R5k000q51J297M30q83o16J508O11j347
5099d46q03J602J220k516j176K170J505j584q11R55M1j002k39J926R52j358k058
$$ y = [-2358, -1471, 1037, 1106, -548, 201, 1445, 60, -2741, -728, 2344, 1022, -1931, -597, 1869, 517, -1511, -844, 901, 887, -499, -393, 1481, 487, -2106, -2018, 1462, 2633, -164, -1140, 670, -68, -2006, -219, 2344, 1792, -1021, -1555, 36, 333, -650, -1053, 1327, 1954, -752, -2474, -183, 1277, -720, -885, 1555, 1094, -2029, -2370, -17, 1796, 416, -1037, -128, 494, -476, -1577, 155, 1981, 277, -2008, 44, 1951, -200, -2027, -322, 1194, 336, -465, 295, 746, -124, -1663, -469, 2394, 1943, -979, -1195, 599, 491, -1040, -103, 2670, 1168, -1494, -1151, 696, 558, -276, 292, 1496, 1126, -1369, -2163, 162, 1576, -229, -637, 943, 577, -2032, -1309, 1310, 1405, -595, -1446, -149, 281, -602, -1218, 290, 901, -446, -1249, 353, 1573, -943, -2119, 51, 1556, -28, -839, 116, 157, -845, -1084, 842, 1794, 436, -1622]
5116a622K03K119l12j073J237J349j882k203J587J859n17q70R00m52l21j132M47
5133f83J774P93k276l92J271j97j136O65J797q91k135K90J495K08r77J69Q57r7
5151E35q44L6Q02j20j057k27J725O97j656r81J228Q9n25K16J133j82j795r7K34
5170g89J691M0j126N68L92j498j041K083J382j453o48M12j56q81L03J440O12r19
5188D12j327l38J341L96q57M30Q52q42j459J051J219o18o78j7L92j19k5K47J5
5207G5J80o03l43J354j28j107m46J525m35m33L54M53o18o04O26J78L44j79l84
5226a91j90K09k22j20P42O55j231o12P32Q4k69O00L87l83o67J08K16N72Q2k98
5246B04m05k62J52r5R58K49q55o74N09L44J81p2L34n44k22K15J07K34J93q08j
$$ y = [-1622, -1419, 700, 388, -685, 552, 1901, 19, -2184, -597, 1262, 745, -125, 775, 323, 2, -1130, -683, 1091, 1884, -392, -784, 487, 290, -846, -181, 1616, 725, -1410, -1120, 375, 583, -394, -225, 632, 535, -309, -273, 529, 409, -648, -875, 850, 1547, -109, -1090, 138, 227, -298, -82, 1051, 869, -926, -1023, -789, 902, 942, -184, 384, 776, -722, -1763, 320, 1702, 249, -399, 13, -143, -1024, -721, 719, 1331, 412, -915, -1253, 88, 484, -373, 57, 909, 67, -1392, -341, 878, 260, -418, -435, -43, -162, -187, 60, 75, 255, -348, -691, 663, 535, -572, -1018, 507, 72, -361, -7, 446, -172, -776, -150, 28, 372, 193, -191, -381, -172, -394, -514, 228, 883, -348, -960, -228, -144, -413, 187, 574, 191, -476, -368, -152, 420, 502, 204, -201, -463, -311, -406, 552, 801, -54, -728, -219, 125, 306, 234, 568, 24, -198, 17, 124, 358, 551, -257, -258]
5267b58N56k45j96L43M42q93l37O93M47k46L8k86k51K15L91m96L7M21n96n01Q37
5288A15O28l39j63n6n19j89M41L79k5k28m05l46N08M87j0j96M86q62n75J112P65
5309A008o47l81L03q14P9R80p2j62O2p54k56M54O66o97J20j26l91j7P15M61p14
5330a83K6k19k21K70K50q8j22K01l06k72Q04M36p95m6J75l9k08N71J45l33l02
5351b56L89l39O66jl42m47L45k6m8N08L28o83l64N65k71J53L74J0o01l81L28N06
5373D13J00L23n94p38M20J08J5P25j12r26l57P98j95k3J8K47o14pR7k82O23L62
5395D01l08l76L48lk47M94K39q93k37O66R0k96N28l11m41j52N29Q9k50O36r16
5416d10j63P86L56p80M3N33o22l09P44M29l9m31n65l9M49L91l20J31K24o74k4
$$ y = [-258, 298, 53, -143, 200, 642, -251, -588, 105, 552, 306, 344, 58, -193, 22, 413, -83, -46, 375, -221, -722, 115, 743, 404, 241, 185, -334, -523, -82, 297, 272, 44, -361, -707, -199, 288, 278, 82, 568, -294, -869, 243, 1008, 361, -20, 283, -531, -452, 528, 456, 294, 356, -398, -654, -200, 466, -231, -111, -237, -628, -645, 70, 531, -183, -157, -376, -597, -327, -77, -165, -287, -86, -392, -664, 140, 576, -219, -265, -90, -129, -337, 234, 379, 46, -256, 133, -206, 460, 459, 117, -330, 15, -11, -59, 449, 777, 94, -270, 295, 24, 177, 551, 561, -40, -421, -93, 413, 513, 836, 242, -496, -76, 32, 47, 772, 660, -266, -623, 175, -20, -43, -25, 222, -392, -399, -302, -584, 39, 401, 93, -283, 65, 62, -185, 309, 548, -345, -582, 84, 174, -122, 406, 95, -346, -498, 31, 120, -130, 506, -410, -573, 213, 569, -211, -168, 365, -257, -566, 178, 607, 568, 137, -428, -467, -18, 373, 53, 184, 408, -266, -290]
5437b90M02M52o04K38K24p49J0M34L67q4l23p5n74P03K95o37M15J78p73l69J082
5458C22O03o95p61N14k02j80N42j79L04k21p08j29J220K3j165L60O13n48n14R06
5478A05M96r19m41N52J93K19k21j49J06J87p61J70R81J85j082k57J026k3o98M70
5498A39N93j97j275Q4P46Q51j33j077K59J25n64m31J738K32j437p29J016L79p17
5517c98K35L47J61o26o06M54J425n76j467O94R81n34r30Q38O41p50j083J284O71
5536G61q21o19M52K11K18o99M03J247m21k100L63K098k91j308N98P63q96q35Q01
5555g5J360k58r35q38O15O16n47j68J230K88j994p56K008K87j398J35J394q91
5573G3q34P9J067K21q44l98M14Q06p46j068R87J107j064r73J433P25j888n78J189
$$ y = [-290, 112, 564, -40, 198, 422, -327, -317, 117, 484, 400, 77, 2, -572, 131, 426, -211, 204, 382, -391, -760, 322, 925, 230, -531, -17, -219, -399, 143, -36, 268, 47, -661, -790, 430, 453, -712, -352, 261, -287, -801, 105, 601, -318, -759, -207, -14, 205, -16, -165, -59, 128, -633, -463, 518, 703, -379, -636, 390, 367, -331, 139, 732, 535, -740, -656, 90, 941, 808, -269, -10, 115, -449, -880, 858, 1090, -347, -1076, -60, 319, -398, -163, 184, 345, -281, -887, -433, 992, 416, -1051, -357, 624, 90, -840, -2, 639, -111, -1194, 90, 761, -60, -679, -227, -16, 202, -497, -94, 1153, 732, -1368, -1005, 1093, 802, -506, 92, 855, -41, -876, -75, 1285, 1027, 92, -746, -131, 485, -62, -230, 1000, 1288, -706, -1462, 546, 833, -565, -430, 964, 73, -761, -682, 385, 606, -238, -636, -222, 584, -162, -1230, -243, 864, -200, -1173, 260, 985, -903, -1481, -292]
5592b92Q04p40k68M97M31q07j290J217K126p70j706K83R86j092o12J584J495j618
5610B28j732M93J115n2j61M96P08o55k040K74K441N53k228J66J627r88j973P24
5628a004K388o08j093l05Q25L05j315P2J441M38j129p64J391K76j814j95J912
5645H21L77j315k82J44M33j008O4J759Q25j377j837P00J487o08j008J818N31j963
5663d39j781J671J892q67q63P95R7r93j039J232J921o73j636J54J129q05j335
5680a540J713J646j130j740O64J204n52j042N08J395K26j806o40J438L06j536
5696h86R2K497k24k407j69J248K84j010Q71Q94l37j837j293J684J857q35j104
5713f75R71p1j968m27K928M58j347j056J023j02j223L74J427J035j365j569M33
$$ y = [-292, 512, -228, -496, 1, 432, -375, -1665, -448, 1678, 908, -798, -515, 471, -621, -1233, 351, 1846, 228, -1504, -1011, 104, 52, -109, 387, 1095, 440, -1600, -1326, 1115, 1668, -560, -394, 1233, 245, -1728, -1004, 1384, 776, -317, -622, 203, 508, -807, -735, 706, 1144, 15, -749, 642, 918, -896, -1091, 821, 1198, -117, -399, -255, 178, -830, -766, 993, 1818, 441, -1396, -696, 791, 183, -825, 993, 1524, -439, -2220, -549, 1343, 476, -387, 408, 505, -488, -1527, -295, 1626, 953, -683, -529, 600, -205, -1540, 173, 1819, 689, -1051, -387, 817, 265, -777, -269, 1126, 1352, -454, -1094, 344, 650, -886, -794, 1703, 1479, -928, -1097, 151, 435, -575, 296, 1190, 853, -984, -2277, -593, 1264, 429, -675, 296, 225, -1743, -2170, 758, 1216, -131, -1187, -164, -266, -1489, -1115, 312, 1347, -18, -1587, -1154]
5730a154J557p28o65J225J237j958j168J531J200q73j027R47R19p45q48K65J334
5747A049j45j355M06J598o22k188M59K199m06j025N83O29j074j259N16J840J69
5764A374j224p06O99J74r04l24K427j09j881p20J268j8o46O35J061l90j525o18
5782a427Q39J355o94o42N58O26j401k75J429P56j530r24J359N79p75m16M64O99
5800E80o87l01N29N47q53j018N09J808o11j166P38P82j088o62J156N19l01p62
5818b81l00P52k75m57L67J124j3k152P0J315N71r42L43N95n16j382N87J107J06
5837F19o37m43M02M39o51j14N40L34j081l70J587J97j128q06J115q5j12K44K57
5856C07L7n69r09J046Q31k99j080L40O34p54j43J068K12q60o27Q25l21J33J86
$$ y = [-1154, 403, -325, -990, 235, 1472, -486, -1654, -123, 1077, 204, -823, 124, 1043, 298, -550, -285, 1049, 904, -451, -45, 1553, 931, -1257, -798, 1401, 995, -30, 553, 1182, 108, -1151, -635, 1205, 1374, 150, -556, 143, 317, -587, -911, 1516, 1407, -474, -1194, 74, 56, -590, 45, 1106, 716, -809, -1427, -588, 767, 73, -569, -11, 615, -786, -1061, 368, 1124, -406, -1330, 29, 608, -167, -583, -119, 580, -107, -408, 121, 668, -185, -1203, -694, 1114, 503, -663, 75, 857, -231, -893, 263, 782, 481, -281, -581, 171, -104, -561, -194, 930, 917, -1235, -1165, 150, 721, -221, 122, 717, 201, -1181, -594, 513, 619, -18, -461, -59, 380, -271, -385, 155, 489, -592, -962, 625, 822, -306, -1112, 3, -82, -194, 50, 307, 344, -225, -1134, -88, 743, 444, -636, -296, 338, -416, -559, 509, 721, -139, -766, 59, -262, -129, 57]
5875E7J89K32l42r19j40J593M4p38o9N70p44k05R56K32n35o53M90N1K58k34j38
5896d5M30m1o25L95M55k77p52j59R22Q6l74Q7l3m01m64N18O38O4j20o55L93P0
5918A12m17j2Q64L09j312j24K95L18k45L51L7m73j87M4J82P52L7j007J14N14k61
5939a09j29M91K65p08j89N90P5l15j0O0l44N51j86j6O4l1p90L90Q14j37m03Jm4
5962a10l11J79P39j31j64K16j060L78L29N59m63JN9q20J06Q68J73n15K03P6q54
5983e42j8N47N99m78j90o03P7O07J06j49J43K73p85J66Q65o5n04J05j89j99L10
6004G6M44l58k29L02l92q1P18l6n39j63L80k66J53M49j97p42K94K55l45N84O2
6025C69l16k64L56j88M3N09q8n37k73P7r6P03K16m42m09J11j49J64P77j30l75
$$ y = [57, 246, 478, 136, -783, -923, 670, 714, -24, -93, 477, -267, -472, 484, 716, 181, -472, 18, 69, 327, 93, -45, 385, 344, -281, 114, 569, 292, -460, -619, 303, 389, 15, 102, 69, -332, -796, -278, 360, 424, 304, -351, 42, 112, -305, -317, 547, 856, -456, -580, -285, 33, -212, 139, 176, -297, -484, -440, -258, 494, 531, -476, -362, 152, -109, -238, 253, 518, -190, -379, 211, 286, -29, -39, 21, -323, 228, 42, 26, 90, 59, -731, -341, 473, 336, -67, -66, -110, -421, -242, 497, 366, 202, 418, -642, -264, 65, 624, 161, 162, 221, -599, -493, 375, 548, 33, 236, 312, -542, -560, -13, 586, 108, -82, -685, -608, -1, 105, -44, 99, 372, -413, -247, 618, 553, 49, 154, -35, -234, 76, 520, 162, -67, 235, -157, -238, 480, 444, -95, -258, 122, -144, 9, 458, 261, -481, -187, 68, -277, 307, 369, 53, -211, 145, -43, 0, 509, 421, -116, -389, -312, -408, 295, 511, 69, -340, -229, -378, -214, 563, 433, 58]
6046E8k17K43k22m9O97M3p99L19p2K56J34J05k8n27L01m4l8K60L52q59l26K21
6068a92M90l44L04j13p04M12J71L03j77L5m31K47J23k58j00K71J48o59j93O11
6088e6J74j11j0k64q9k19Q90j8j22j5n82m85R17R9m75N33j07o47R2R39m53K28
6110B19k36l8l29N17J47j00K6r6m19j28Q45j75j89p0L40m85K7R35k88l45j40k60
6132b42L38K83N4n66OK70m19j2Q09m2p26m9N33p27K3P91J2m48r1j60q3O88l7j2
6156A93jq8p09M71M69K09q21QP52p46K49K37k75j5m0j59J63M50q1j039J73Q71
6178B71k53k29P71n24o57O8J034k23k18J8K62l54m11L08M03L24j28j030K20L09
6198c9m6K8P20K00j349q9J50O09j03L31k34M5n81p6L10Q56m9j277M0M27K50n12
$$ y = [58, -159, 84, -138, -187, 510, 553, -246, 73, 1, 257, 391, 496, 468, -59, 242, 198, 160, 420, 772, -87, -413, -192, 298, -46, 258, 145, -559, -147, 24, 327, 150, 185, -246, 1, 124, -134, -234, 37, 185, -474, -667, -56, 118, 7, -3, -267, -356, -575, 315, 297, 175, 160, -422, -907, 10, 109, -366, 167, 60, -587, -495, 444, -9, 219, -17, -55, -384, 133, 280, 180, 206, 110, -309, -437, 408, 233, 44, -26, 314, -171, -144, 791, 503, 158, 18, -242, 96, 379, 433, -133, -127, 143, -276, -288, 521, 479, -247, -296, 237, -490, -467, 324, 336, -112, -203, -363, -446, 242, 205, 193, 192, 104, -605, -134, 335, 544, -277, -269, 483, -263, -14, 223, -52, -67, -107, -266, -103, 347, 266, -773, -600, 271, 18, -211, 560, 36, -621, -553, 481, 258, 40, 58, 320, -34, -445, -137, 266, 590, 462, -568, -348, -39, -85, -57, 663, 863, -486, -575, -425, 184, 81, 412, 178, 223, -358, -434, -124, 732, 683, -594, -554, -127, 123, -389]
6220c89M00N88r46O4N63P9n15j68k42O00M45k90m21J16o3m49M95J239o33j119
6240f46M6L42K89n5L55J05J14o66n06L63Q16l35k64L81J92j221r2J145N45n15
6260C93p91K20j11j31L63P49R8n29j089L51J068j24j028Q15M33p70m03P50K70
6279E34n62o31P95O19m25q94j47Q39J11n60K49O39l96j216M21J097j1n11L92j3
6299C30o93k34R7O21O56n04n71L23l79m11K76J680J12j569m99K88N42k27O93n2
6319D79p4o93o63Q71J056o25r00R35L47j022l80J089J65r78K78P36M2q80n01N27
6339a91O00K7m88j2L28n49n06O08R88m88o52K61J93p24k88Q18O79J64j220k20
6359f72j1O49l87P31O84l51j771K74J330J27n32J50L54p04q62O48P34K36p07k57
$$ y = [-389, 11, 599, -347, -283, 280, 359, -156, -324, -566, 34, 479, 189, -232, -116, -179, -628, -133, 1106, 473, -646, -600, -258, 31, -24, 331, 436, 550, -116, -622, -259, 557, 222, -42, 339, 531, -690, -782, 363, 908, 393, -398, -178, -289, -420, -57, 692, 790, 261, -828, -477, 591, 467, -561, 254, 687, -83, -486, 264, 534, -28, -659, 136, 755, 330, -564, -711, 128, 239, -321, -72, 567, 171, -1045, -624, 473, 462, -49, 343, 330, -363, -597, -500, 121, 777, 273, -298, 25, -354, -765, -489, 1191, 1303, -266, -765, -477, 65, -162, 531, 479, 405, -288, -951, -80, 976, 351, -549, 386, 733, -289, -669, 420, 585, -393, -115, 621, 663, -217, -718, -191, 409, 436, -52, -64, 264, -285, -791, -183, 805, 317, -335, -74, 119, -605, -893, -75, 604, 768, -452, -672, -683, -34, -421, 310, 994, 643, -1128, -854, 476, 603, 71, 221, 575, -129, -991, -343, 391, 627, -80, -337]
6379c37N18J30n17l17O10N21l99k87N19qj239M84O72K43l35o01Q8N27p72j92O69
6400b3Q18m41j113O87k21o14L03Q93O05q75o45k17P43K26K14J11J73q41j209R90
6420d36J278j60r98K01N80p13k35O84L69j61p61J66M11j55m20M3P96J98q46k84
6440d43R26m56n38M55P27p3q01K0J72K68p50j9R63K14q31l02M22M18o80L11J093
6461A096l19j612k10J245J98l00K90l18m03j33j13P51R95p24r79K61N74p30k35
6480f66J315j78o95j13J41K11o8m93M79O46m45p90j3P15J10m51M44K91l80q96
6500h36M07O29m30J50J59L82p4p86l50N57P98m82N0M02l88p19J73J233Ro98r9
6521H7j49o4J65K82K98J9o66q98Q09Q63q03k98P94O5r42Q3Q19J62o01q1J71j33
$$ y = [-337, 181, 311, -206, -523, 87, 608, 209, -78, 441, 433, -806, -322, 350, 593, 258, -343, -255, 272, -500, -692, -23, 795, 354, -759, -72, -293, -907, -604, 289, 894, 19, -626, -843, -100, 126, 340, 451, 624, -217, -1426, -436, 842, 682, -316, -115, 465, -248, -483, 201, 570, 409, -352, -186, 225, 70, -350, -307, 489, 687, -159, -443, 483, 27, -511, -56, 671, 598, -203, -183, -11, 257, -493, -512, 451, 665, -166, -468, -46, 372, -308, 3, 1096, 777, -835, -1045, 200, 398, 98, 388, 70, -333, -466, -579, 172, 1167, 443, -536, -275, 299, -431, -666, 649, 471, -224, -337, -196, 15, -53, -546, -67, 579, 134, -656, -669, 46, 156, -295, 149, 440, 60, -836, -429, 200, -230, -80, 79, 461, 387, -399, -749, -192, 606, 124, 174, 576, 188, -531, -358, 875, 884, 186, 87, -62, -126, 39, 321, 619, 638, -28, -926, -117, 746, -57, -355, 439, 504, -438, -355, 464, 626, 25, -56, 115, -18]
6543a8jo20K93N35j18n76N38K83m82k60k6Q09o40m1N12J87q68R8K68K89jkn18
6566c59j89L38k4L11N25Kj314L82K39RK94K33l95Nj60j07N27J98o6p97Q3M67p42
6589e40N06N90n14k2l92K32Q8j7K03o3J33k94j29m9O49j82n15Q6L91l88l9M52
6611A86m7n36K5M44K5m3L3l93J87L16k06j73L89L3p84M49L99J02m58m7J07rKj0
6635iJ09J12r6m49O7M26j02j51L04p8p32N52L43k04q6l7j97k21M83J94j50N5R0
6658B23n58O4M31j09K6L9m86l9M69K07j22L0m29K2J12J24K33j2n7j41k23J21M95
6681D20M5l47o8j45j44M12J80j73k56JJ2r2O55n32o7K32k62k6J48L95j53q61M65
6704a61j97J35K95K89l80k10J06j37L45j65J78k90J26L52k71j8K12l06j39K55
$$ y = [-18, -19, -639, -346, 189, 71, -505, 33, 316, -166, -426, -452, 357, -283, -324, 188, 375, -493, -395, -127, 162, 161, 159, -359, -548, -210, -234, 77, 602, 604, -710, -328, -89, -80, 214, 447, 52, 57, -103, -210, 317, 515, 449, -348, -265, 202, -540, -34, 556, 42, 20, -372, -140, -52, -69, 134, 71, 204, -90, -219, -268, 381, 199, -316, -230, 161, -227, -266, 186, 139, -397, -372, 72, 97, 54, 87, -306, -119, 197, -9, -182, 207, 240, -544, -95, 304, 406, -52, -99, 8, -1, 1, -9, 100, 212, 116, -333, -266, 160, 58, -93, 211, 133, -599, -47, 296, 92, 6, -31, -228, -449, 34, 228, 78, 133, 223, -335, -271, 160, 51, 77, 116, -370, -409, 60, 267, 145, 175, -254, -232, -120, 4, 237, 225, 168, 27, -196, -75, 420, 465, 118, 50, -95, -239, 173, 353, 180, -76, -75, -63, -155, 500, -32, -99, 133, -129, -155, -7, 388, 235, -626, -161, -358, -223, 72, 361, -19, -229, -123, -260, 85, -80, 98, -192, -66, 286, 15, -3, 209, -97, -236, 19]
6724A9K7j05M53M5o25K16L6n1o4N14q0p94N03k50O61r1m6k94l95M68j50q6N22
6747D33j24n40Q0K08j77J4L30k97j50j5M96m21J56j21J3l55L95R5M1O6J4k31j52
6770b42K90J80j80J30k66m24L47K46r8K0pj96l14P14r0J81k09l29o2q7O45r4l35
6793a80L80l58k50N43J49r1j18K51n62p7N37j43P6l3j76j40K3M36j77o3L9j37
6815g1J35l3m6j38J88j45k93N27O9J42j42J30k50J5o6K75o7k74p4K87k87M15R1
6838C88k96l49J26J32Q2M87l50o58l5K05P2L61L35m47l86K16Q1J50L9J69o28J77
6860a29J61m52L13L26m2l62K18m9l13O4M45j56o09N43j81K67j2l83J59P5%K80
6882A63r8j5k9j51J60K57M0n11M68k62o61O09J05j1J42m93k21K02L62J90r4O4
$$ y = [19, 46, -59, 394, 439, -186, 30, 66, 15, -49, 465, 385, -409, 94, -156, 505, 414, 368, 74, -321, 147, -3, -89, 433, 309, -231, -151, 57, -120, -106, 224, -73, -223, -238, 258, -163, -7, -128, -115, -470, -75, 20, 61, 127, 141, -90, -242, 48, 228, 48, 178, -88, -512, -165, 81, -17, 3, -4, -200, -514, 200, 110, 291, 82, -247, -309, -396, 249, 155, -180, 200, -158, -408, 135, 284, 193, 75, 326, -236, -313, 224, 81, 157, 124, -52, -192, -169, 267, 90, 27, 66, -71, 64, 31, -15, -153, 35, -110, -403, 124, 193, 335, 193, 323, 73, 88, 22, 297, 230, -44, -118, 169, -118, 297, 388, 92, -257, -131, 1, 83, 570, 220, -438, -473, -268, -196, 165, 500, 53, -333, -117, -36, 114, 153, 322, -306, -129, 32, -420, -107, 219, 177, -185, 33, -16, -329, -265, 180, 24, -585, -42, -223, 44, 32, -351, -192, -117, -117, 163, 65, 50, 21, -130, 30, 287, 327, -184, 284, 22, -639, -30, 75, 64, 206, -287, -508, -306, 56, 246, 152, 216]
6904B16m38k64O62p8K01J35Ql68j70l28N63k19J75j68L6j62M14k82l8M82o46j66
6926d35L83J63k8k00L43k73J5rn4K65Rm19l9M51R9j02m54J43l7j33K96L97j33
6949B48m94j30J38N66K36n13j58Q0k48l04P23K86L0n90L85k65l09K33M24l42L12
6970C08k54k27R0Q4j36K71M6J99n75M0K53j37k94J32M39k1L33k97l81k28R3J37
6992a25K93L43o48k65O9M51k4j26M77n80q50P03J46K50K43k08m24K39j65k73P14
7013B40L36l66p47K25N9l9J16K72K77k19l06q5J4Q9NJ22L39p1m54j9K41K60n72
7036b83P31lj97o59j70O12j63Q50k27K4l77o02K66K35O61p01K67J65p37m76Q08
7057B4O95l86k02j67k00k46L61k4M20L40n60n61K17L21m7j0L28k11r02K89K66
$$ y = [216, -222, -486, 176, 98, 299, 434, 442, 74, -96, -424, 139, -80, 95, -73, -37, -199, 215, -67, -105, 377, -269, -435, -52, 111, 83, -117, 226, -47, -32, -41, -95, 170, 179, -240, -279, 172, 271, 169, -285, -142, -179, -312, -16, 381, 248, -246, -376, -238, 328, 564, 51, -107, -27, -275, -579, 144, 430, 460, -130, 255, -10, -319, -86, 338, -4, 308, 54, -173, -83, 1, -135, 136, 182, 381, -194, -154, 99, -38, -332, -200, 239, 218, 551, 254, -127, -355, -262, -125, 168, 511, -137, -402, -333, 118, 94, -32, 445, -135, -985, -282, -136, 114, 357, 149, -275, -36, -201, -474, 240, 576, 210, -537, -312, -253, -292, -176, 96, 373, 154, -152, -237, -223, -134, -129, -7, 332, 261, -193, -212, 29, 289, -283, 448, 445, 248, -411, -581, 31, -132, 718, 491, 515, 138, -464, -198, 37, 698, -3, 264, 429, -308, -784, 24, 719, 333, 131, -36, -236, -482, -121, -145, 275, 615, 55, -506, -289, 32, -15, -25, 303, 92, -810, -521, -255]
7078b55L69l1j12K46k44k15j43K44J91Q9J9K13J9n20m35P28O1K07j01J57l56n49
7100d18k0L76M71J86p07k57J60j8J96L57M22m88o26O2rM56j39L76j87l87j45J12
7122b27K82J95m72P2K48k50n32N36N69m42p0J93j77l38M72m43L37R1K38n74L52
7143F0J96o86J13N84R6j74k15K61l58j72M13K09l8l09j76m23M31L11M4Q7K6p80
7165e00k00K21O45jmj41j76l2R3Q8M3K69l93k16J43M93o28K05N34m22k84j47Q99
7188D89m19k46J71m50M44K75r9j64R5m36J13J87N04l78l43J75J62k40L49J16J47
7209D52o31j36K02J6M23J91l81j49j25k7M11J43k03k96J26j4k75N69r2j21K17
7230C00o25K29J14N48l29l5P6k1l26L36M5n08P6L97l99L7J50R8q6m69n4J8N71
$$ y = [-255, 114, 83, -29, 217, -27, -242, -385, -141, 50, 139, 158, 371, 390, -130, -565, 163, 224, 431, 330, 487, 131, -418, -438, -62, 409, 595, -112, -369, -209, -227, -31, 326, 748, 260, -366, -304, -313, 143, 4, 380, 193, -194, -339, -227, 55, 250, -222, -150, 98, -152, -684, -148, 421, -21, -91, 102, -75, -413, 59, -384, -47, 44, 282, -292, 60, 256, -430, -317, 267, 363, 189, -26, 235, -123, -295, 118, 327, 289, -20, -196, -619, -188, 123, 167, 254, 280, -500, -700, -479, 166, 165, 161, 20, -156, -188, -95, -7, 36, 305, -88, -304, -161, 332, -296, -91, 443, 21, -263, -410, 489, 70, -176, -5, -455, -11, 264, 165, 1, 96, -340, -227, -40, 464, 86, -257, -82, 80, -160, 189, 305, 452, -179, -315, -113, -97, 326, 517, 136, -13, -138, -165, 246, 389, 186, -110, 16, 2, -273, 296, 204, 83, 300, -325, -96, 18, 566, 237, 202, 278, 257, -69, 267, 312, -196, -120, 277, -122, -85, 65, 163, 77, -392, -446, -428, 143]
7253A43J22l10m71L70O3k71M48J39n24r5K17P3J3K61j57j99J90l59J85L67L4k94
7275e5k09J65k68qM41O9Pm70L57k26L12R3j6k94K25j62pL03J08n71l89P18n4q9
7299b0r8R2rj01M46Q5p2n0k20q41M08P69j02j04l11k49k9N95j4K86k14mm82O2
7323a77N22k22J84l52j41J54m8J16k41L36o0m0l36O62j11k52K50j03k73J21N92
7344E81n35j15K11k01J26K0r9J04p1k3n0j36L84K55p51J38q7j6L07P81p40J4k9
7367F8j86M5K96m8n50L40j24mj9M78k74J9j82r9l7M35K63n29m17Q80o26K47q0
7390a04M41o57J66j84L35j14N57m1q16L98j19J29N6K67m96K91j81J92j05L91l39
7411F7k16j2L34N8J63k53k64j24N8N55k25K9m1o8n51O31K49k93L52n96j75JL91
$$ y = [143, 265, -45, -516, -146, -83, -354, 94, 233, -291, -386, -169, -96, -83, 178, 21, -178, 12, -347, -162, 205, 239, -55, -264, -99, -367, -375, 66, 135, 142, -328, 29, -197, 115, 208, 192, -102, 123, -39, -46, 257, 365, -206, -595, 123, 69, -20, -118, -26, -35, -136, 310, 395, 323, 273, 53, -788, -380, 389, 287, 183, -128, -377, -406, 189, 175, 461, 247, 243, -239, -177, 345, 123, 307, -45, -186, -32, -80, 36, -205, 131, 71, 31, -305, 357, 246, -6, 244, 141, -132, -11, 581, 46, -69, 142, -59, 67, 87, -12, 92, 21, -2, -52, -188, 196, 451, -300, -162, -249, -265, 42, 823, 83, 97, 68, -118, -73, 223, 175, -375, -35, -159, -163, -182, 296, 22, 41, -141, -240, -277, 158, 421, -108, -525, 355, -271, -24, -104, 337, -320, -154, -338, -3, -117, 440, 399, -417, -19, -138, -9, 47, 314, -182, 109, -72, 120, 15, 406, 67, -149, -161, 173, 231, 394, 141, -123, -247, -189, 366, 141, 170, 129, 61, -490, 141, 390, 97, 449, -147, -322, -321, 70]
7434G0K94n2k01k72j89M38r5Q1J33R6o18q0J21N08k79L00J57q04K64K34R7k03
7456@N24o84n04P40J93k97nl2r8J14L62m86L30j43J38l99K85J02k42k21L01K0
7478bj42L17J45j27k07K3k13J48L41k6j82p3K30p24N69J42q1j03k09j33o3N94
7500B24R1k83j03P6j12J16L14m14N8J46j23k93K82L24j69k68J86k59r4L74Qk80
7522a99J58k41J45M43k07k36QJ62j74L11O5j38j49j28K03J2J86J02n15j79K02
7543a69J53KL18J17o28q2J16j16M21J03j86k30p2M79j37n5M71P1r32M61k48O5
7565g8j53L13j65l26L54K00j96K39l57J3j34K76ln2r6J2%J24K42j8k08j13j80
7588c06j1L89P1Ro4l9m62N77nJ72k18j59m13L62J40J7L29k83J35l36k82O25M3
$$ y = [70, 364, 312, 111, -161, -350, 88, -7, 74, 207, 303, -315, -395, -274, 234, -45, 255, 412, -392, -128, 106, 203, 0, 524, -160, -664, 76, 269, -28, -33, -65, -163, -49, 313, -173, 157, 14, 152, -247, 38, 140, -102, -323, -22, -2, -144, 173, 318, 191, -16, 7, -206, -58, 283, 257, 75, 2, 232, -492, 77, 219, 138, 35, -174, -307, -370, 224, 315, 32, -71, 5, -107, 9, 323, -91, -33, 113, -10, -303, -21, 303, 134, -134, 52, -207, -301, 73, 81, -199, -41, -282, -137, 306, 99, -137, -129, 33, -141, 170, 235, 97, -52, -180, 23, 35, 221, 323, -192, -371, -169, -16, -14, 304, 421, -207, -289, -173, -289, 132, 235, 49, -181, -253, 226, 89, 34, 505, 576, -356, 105, -143, -78, -231, 82, -83, -409, -55, 145, -51, 188, -169, -156, -290, -14, -17, -69, -165, -153, -153, -29, 213, 195, -13, -126, -306, -317, 72, 143, 152, 88, 49, -413, 164, 159, 331, 113, -46, -459, -97, 43, 60, 389, 106, 241, -95, -377, 248, 291]
7611B91L2j05N0l66n5M30J02m81K09jk87M35L0k90j2q6K34j34m0J91l28J2O9J17
7635A7J65j8k39j99r2J92K94K4K09l76k78J3L3K95J57R4m91j49O1J04K68K83l1
7658C36m26K5j88j22L06K83m4j41Q1j55R4J96J77m85J53O0l87J05N19k64K5j54
7680fJ05k0j6j19k82N2M59j44p8o6q9k79K12M42j58K59k78q4m15K61M68k40J81
7703A65j10l10l49P12j34L71j44o6m49N05j29j11K59N2l65k7K83j56JK98M8m76
7725a32L60k79M0l8J94k36J65R8L40l41j50J30j86J78j05K65k7m6n95J85N47J59
7747E26k51m02J29m32K36M71r3k62j07j50J56O2K85k9q0k73J69j21J10J01q0Q3
7769D8L8p3k68K86k75K23j2j21j66L9K21J66k15k4j84L26k21M93m27k25L48J83
$$ y = [291, 323, 218, 268, -98, -153, 277, 379, -102, 107, 106, -181, 254, 284, -6, -18, -104, 130, -4, -44, 147, -181, -169, -100, 17, 182, 164, -75, -274, -366, -174, 120, 144, 353, -23, -301, -288, -255, 40, 197, 291, -200, -349, -288, -184, 84, 367, 336, -90, -65, -253, -375, -69, 214, 170, 29, 110, -45, 49, 245, 422, -63, 90, 150, -237, -132, 387, 123, 148, -6, 99, 79, 63, -56, -338, -286, 173, 29, -49, -115, -204, -483, -271, 171, 13, 272, -6, -90, -505, -244, 224, -16, 165, 55, -255, -604, 108, -26, 345, 201, 135, -314, 191, 62, -49, 210, 262, -103, -130, 153, -3, -2, 296, 344, -132, 228, -51, -11, -49, 145, -91, 74, 172, 512, 171, 21, 151, -35, 143, 38, 303, 276, 230, -365, -180, 367, 526, 275, -127, 2, -430, -194, 277, 184, -78, -185, -335, -179, -117, 168, 139, 59, -214, -45, -166, -56, 45, -35, 48, 86, 13, -255, 31, -244, -21, -33, -154, -320, -281, -60, 106, -109, -133, -317, 9, -212, 281, -146, -371, -23, 160]
7791A60m74M75Q3p86O06j65L76k12M00n93q0J74P1J9M12k70M6l82j02L84l8L75
7813D79r1m26r6j41J88M00l8r9j71m5J97l81L10L59k24l00L0j29J48K64k36k69
7835b71K22L19o2l92L93m61n2K56L0L74n76O3N6o4N90P4k77r0k80J64Q0K09k24
7858H1J29J7m37j26M78M38n31L43k67m63K00J72M4o4K18m73j41L81o8L2j9J95
7880A39l56j14L86K78m85k15L01k27J95L21k82o3J20Q2l47L00J48n46O4J1JL02
7902A3J87J61l64k30J30K04k73M58k06k03j94L14j11L86J98n82J37O3K1l88M88
7923B09K84k92l06J25J67m1K11j10m38J55j27j2L03L92n14K5L3J8J6K47P4n65
7945a46J47Q7O5J59j61o17N43Q1k69M6j53J93j41k2n0K26j8J04k89J02J44J25
$$ y = [160, -314, 161, 244, -542, 64, -101, 275, 63, 463, -130, -210, -36, 35, 54, 466, 196, 242, -140, -242, 142, 104, 479, 388, -38, -134, -275, -87, 313, 275, 176, 5, -40, 157, -224, 86, 445, 221, -79, -49, -178, -30, 234, -2, -271, -49, 270, 208, -184, 209, -252, -304, -48, -18, 356, -220, -157, -101, -165, 425, 499, 222, 132, -148, 16, 96, 305, 81, 210, 227, -210, -336, 142, 580, 49, 392, 125, -338, -138, 34, 78, 14, 232, -241, -382, -1, -69, -37, -56, 139, -217, -331, 55, 333, -152, -367, -66, -293, -98, 223, -59, -122, -2, 80, -267, 33, 181, -365, -301, -290, -289, 13, 200, 361, -3, -233, -103, 101, -172, 286, 80, -123, -317, -3, -114, 272, 470, -112, 25, 88, 109, -279, 209, 493, 201, -105, 20, 187, 146, 357, 247, -191, -36, -163, -175, 128, 520, 6, 31, 64, 82, 98, 345, 419, -146, 1, 88, 153, 312, 151, -466, 77, 158, -111, -65, -218, -25, -166, -188, -238, -12, -30, 74, -215, -113, 31, 156]
7967A56k99R5L7Lm11N41j0j87J46k05k94J65K10J37l0k96L1K15K8J79J34j51p5
7990A19m46L63j29M39l65P8k35J82l17M37L9j75j7j03Q3j7P0L23l85P4k28o2L33
8013F1M6o5n6q1q8J83J34o0L0k50M02n89M58J05j80k86K83k36M62m0Q8l28O5j63
8037a05j50M57K26k94m93M16l2k3O2m7j91p7k0K42p1K14M5o6l63j31L54L1K2j02
8061i6K02n0J70m84M62n0l14K24j90J11P1K33k90p8N2l62J99j2L29j53j50J45
8083c1L36l15J01Q8m93P4M56j04Q6l64L9K1J08J28j24JJ28k26p0J12J79l01J00
8106g1Q4k5k03L46J97p5k85j29k34J36O23j15j72l6k80n8K82M12n81J15k5o7K25
8129F4K08l64j3K34j56k28L09K70j05o9j06k94K41L26k06m6K47k37l52L2N74k66
$$ y = [156, -143, -48, -11, -8, -419, 122, 112, -75, 71, -134, -428, -263, -53, 84, 54, -242, -211, 4, 32, 211, 345, 194, 119, -327, 36, -93, 346, -19, 59, -176, 6, -311, 126, 165, -10, -27, -130, -47, -64, 6, 329, -56, 18, -210, -272, 61, 107, 42, -14, -95, -183, 0, 134, 74, 104, -146, 256, -333, 125, 230, 50, -236, 47, -189, 273, 233, 321, -7, 58, -105, -255, 202, 428, 134, -359, 57, 25, 2, 64, 17, -174, -251, -271, -29, -100, 114, 159, 93, -270, -401, -47, -16, 6, -96, 106, 56, 226, -258, 204, 154, -160, 64, -126, -15, 56, 289, -1, -79, -27, -389, -190, -202, 127, -26, -176, -31, 305, -10, 91, 179, -314, -240, 216, 112, 198, -166, -127, -106, 2, 130, 6, 7, 135, -91, -161, -49, 130, -171, -71, 13, -12, -215, 131, 328, 253, -32, -161, -395, -259, 364, 249, 77, 41, -239, -297, -15, 397, -184, -69, -94, -161, 64, 272, -92, -105, 129, -27, -255, 54, 324, 219, 150, 44, -250, -9, 317, 111, 65, 312, 75, -277, -245, 329, 63]
8151F3j26k31L98n15M90K14j40l20L0J77m42P17m21R0Q8m51K77K32Q0j09j21j36
8173a56L7J91J50O7o39j31J04M22j6J78k64k87N1J17K32l5J24l58
$$ y = [63, -63, -294, 104, -411, 79, 293, 153, -167, -137, 40, -402, 315, -106, -16, 72, -379, -102, 130, 210, 101, -20, -156, -119, 72, 222, 289, -350, -481, -377, 45, 29, 207, -57, -344, -293, -176, 56, 21, 145, -213]
8191b13
$$ Imaginary data points
##PAGE= N=2
##DATA TABLE= (X++(I..I)), XYDATA
0@%%%qJ6j6J6k4L2m0N5o9Q6j04J23j50J82k17K58l04L59m17M81n59O45p38Q40
27D47r57J089j231J387j559J747j956K184k436K712l012L343l707M106m545N031
43B643n572O175o845P599q462R449j0588J1931j3535J5488j7935K1105k5393L1552
57A7612m1205N8639r9972L68892L82374o23272j93198J53552J07219q6069J93342
68B37914K41949j09151m22796j14292K66704J72961j84840m6990K53687L8997
78C34143l92659j84079K54464J69801j28878P664J59348j11497l53834o9341L15134
89B66K37254j37855k05596L8850O3911j71574q3487K70477J96651k10352j87478
100a88933J42513P4037k12863p2822K80140K22859j43380k58480l6249J08109
$$ y = [0, 0, 0, 0, -8, 8, -8, 8, -16, 16, -24, 31, -38, 48, -56, 67, -83, 99, -118, 140, -164, 195, -222, 259, -300, 345, -393, 447, -510, 579, -652, 735, -824, 923, -1033, 1151, -1285, 1427, -1585, 1758, -1949, 2157, -2388, 2643, -2929, 3246, -3599, 4000, -4462, 4987, -5601, 6330, -7205, 8283, -9652, 11453, -13940, 17612, -23593, 35046, -64926, 303966, 686340, 63068, -130130, 23422, 130641, 44572, 237914, 479863, 370712, -52084, -166376, 100328, 273289, 88449, 41459, 295146, 334143, -58516, -242595, 11869, 181670, 52792, 60456, 219804, 108307, -245527, -314868, 266, 237520, 99665, -105931, -67081, -3170, -174744, -258231, 12246, 208897, -1455, -188933, -46420, 27617, -185246, -258068, 22072, 244931, 101551, -156929, -193178, -85069]
110h5069O059L846K14755J57144k74181l67977J01483L48765M8972j37465M0287
121E6619N4890j78629j65198J38904K46309L323j83950l1960J39523l5807k26991
132a82967J0207K89347Q6077k04518p5193R5266o5511j42488J18969K56315J487
143A86991k42300j27648J16445J10854o6885l9878J39339M9905j95350r8255J71056
154D274P5207j60067j9190K10504M9795k16662j35572J12116J40542p473m7125
165F349M1686K621j65556r6079K05862K13936j24552k10958M7907J09428p0022
176c9378m6806J29185P7926j15392j09614O0323J00117m0403r5817O9048J55075
187A44264n1211j96191J45J60567J2923p6705O5323P2041j21670j28008Q9555
$$ y = [-85069, -79010, -75164, 139591, 296735, 22554, -345423, -243940, 104825, 153797, 16332, 56619, 111509, -67120, -232318, -93414, 152895, 156218, -27732, -59692, 79831, 44024, -182967, -172760, 116587, 202664, -1854, -77047, 18219, -47292, -189780, -70811, 185504, 186991, -55309, -182957, -66512, 44342, -22543, -62421, 76918, 126823, -68527, -166782, 4274, 79481, -80586, -99776, 110728, 160523, -56139, -191711, -79595, 60947, 53474, 6349, 48035, 50656, -114900, -210979, -5117, 208819, 84267, -126691, -78784, 30644, -39378, -86184, 43001, 120927, 5535, -104079, -43756, 56361, 15958, -79859, -10811, 144264, 93053, -103138, -102993, 57574, 70497, -6208, 59115, 131156, 9486, -118522, -28967]
198b8967J65557M612j25414n1646P6718L8388p5179j4141J04936k48j35151N763
210c4772J47994j1517j59131j5424J28718L5232p9785m0984K9913O720m9852q982
222e1870R0141L7888j27299r1327J10424R7019q8875p1113P3498K9737q0135j7397
234h9309P6700K6500n8825l8922M4889N3852m2720p5174N2676J10000l5466j06554
246h2353K4799P2347l3176k1289Q4920L2009r7755p0706N7201R7377K1737o0827
258B4284m4041K5043R649l1033L8875Q2965m5188j15495K2807J02462o728o5074
270a474P848L2426j5775k3213J0146K4963k931m4089j3872O0908K5416p6145l4873
283e0665O8597K0747o0269j003N0809j7173m7201J1734L3140m76k0558j0681K0594
$$ y = [-28967, 136590, 141202, 15788, -35858, 40860, 79248, 4069, -10072, 94864, 94616, -40535, -34772, 113222, 101705, -57426, -72850, 55868, 91100, 11315, -29669, 244, 6964, -42888, -51870, 38271, 76159, -51140, -142467, -32043, 64976, -23899, -95012, -21514, 8223, -71912, -89309, -12609, 13891, -44934, -83856, -38967, 14885, -27835, -103009, -50333, 59667, 24201, -82353, -57554, 14793, -18383, -39672, 45248, 77257, -20498, -91204, -34003, 63374, 85111, 24284, -19757, 5286, 14935, -16098, 22777, 105742, 60554, -54941, -32134, 70328, 63600, -1474, 6374, 38800, 23025, -188, 9958, 34921, 31990, -12099, -25971, 34937, 60353, -15792, -50665, 17932, 38679, -21590, -22593, 28216, 11043, -36158, -24424, 8716, 8240, -12318, -22999, -2405]
296b405K5027l3556m9926L5868O2345k1383l6399K1138p945n1485K1010P9135
308D1424J4608n1878m5174j2251L0505M8249Q084j8447p068k8408l4779M1860
320a3275O6548k1427n2214J0778J5848j9722M212K3890m459j0441K314p846r00
333f694J2231j1219q573L0840N614m3183l741L7897m068k3346J3963N850k0192
346a4621P306J9140j0076j1572n08o346J5485L2388j7658m2756P761K3710l269
359a016J3191K1870k9509l7495J5642K6283O474J2513m825l4007o848K1589K728
372F590O652K3484j5297l8381N851K1388m691J0396J8519k4207k7964J3487J1606
385G433k253J6306K185l1666q120J8785l339q70J9176j1101l0955P605J6879r034
$$ y = [-2405, 22622, -10934, -60860, -24992, 37353, 15970, -20429, 709, -7236, -58721, -37711, 41424, 56032, 4154, -41020, -53271, -22766, 25483, 33567, 15120, 8052, -20356, -55135, -13275, 53273, 31846, -20368, -9590, 6258, -13464, -9252, 14638, 10179, -262, 2052, -5794, -6694, 5537, -5682, -14255, 16585, 22199, -20984, -24725, 13172, 9104, -14242, -279, 5571, -14621, -7315, 11825, 1749, -9823, -10331, -16677, -1192, 31196, 13538, -29218, -21457, 2253, -1016, 12175, 34045, 4536, -32959, -17317, 8966, 15440, 27953, 23128, -10879, -17727, 3862, 6590, 13242, 36726, 21429, -16952, -11101, 10287, 5596, 15992, 34511, 10304, -17660, -4173, 7433, 5180, 21486, 23671, -7995, -16115, 2670, -669, -1539, 17637, 6536, -24419, -16814, 65, -8969]
399h969M733J4054k1617j9231J9426R522q287J0530n61k9376l0K7066n8p018R208
414f08j4419k3368K0028K5740q300l450L861k1151p054L2533J2657j5399J354
427B424k669k0389R870K8721n548j1798R143j0088j6901K1521K2176j3168o567
440F727M619j6374k560K9109P591j8500k781n994j6494J8904L1930j4820k5545
453d188M346j997q090K3353J6764k1286j3977L711o948M867K3324m886j9849O449
467A593j244k0926J4836L2203j3797k4266P191k81j0919J9167J9934j3882j5433
480e824n816p080J7255L0205j2672k8322Q069N226j6107J7489L1024k2439l4523
493b3515J2637J9199k463J08k045j2232K866N981p882R751J5208k5672k3517K9902
$$ y = [-8969, -4236, 9818, -11799, -31030, -11604, -2082, -10369, 161, -400, -29776, -29806, -2740, -2798, -9816, -608, -15027, -38395, -18367, 7373, -927, -4377, -516, -21667, -28721, 3812, 16469, 1070, 2424, -245, -20634, -10764, 17957, 12409, 611, 9754, -334, -17235, 4286, 26462, 13294, 6727, 11346, -5028, -7588, 21521, 29112, 10612, 7831, 1837, -14657, 4247, 36177, 21357, -4188, 158, -1839, -9929, 13424, 30188, 8902, -5075, -1364, -8312, -3445, 19879, 14993, -4856, 1593, 349, -20577, -5741, 26462, 12665, -11601, -4410, -4691, -15610, 3557, 23491, 9609, -5824, -11640, -18720, -1465, 28740, 16068, -12254, -4185, 1041, -15066, 2423, 33447, 11008, -23515, -10878, 8321, 5858, 5966, 3921, -8311, -5445, 536, -7346, 2405, 17613, -8059, -31576, -1674]
507a674J8303k8801m964K5664j0795k8221Q146K0229K168l755j1677j0047R787
520a5637L986j2213J7909K7653l0795m1804K5026L5975j2714p987J6399j1633
532e835k8570M963K8893K2527o55l2481k3997K5813K4106j3871O400K7496k6087
545H702m5144K3180M5921p935k1935O723N716r776p816K254K0104J7432k2989
558A4437k4280K7087J6113l9151q340N1290O709m7914n280L4644j715k6511r33
571c844K1157J4153j5183k3861J4294K5287l2457l4280N1370N1577n0039n6691
583c8517K7157K8030k4396N03M1964N117n3578m4590K2964O2034J1202m7222j0415
596a9747K9312k9668n1231M7617P6617l0633p0110J0736L2541k4057k0945L7633
$$ y = [-1674, 16629, -12172, -17136, 8528, -2267, -30488, -22342, -2113, 55, -3700, -15377, -25424, -15637, -11651, -23864, -5955, 21698, -9097, -50901, -25875, 10100, -2614, -10601, 5798, -5835, -34405, -29442, -549, 21978, 21323, -11158, -35155, -9342, 14764, 893, 7293, 34789, 8702, -36442, -13262, 32659, 24724, 2789, 9512, 15228, 5452, -2364, -110, 19994, 37426, 14437, -9843, 17244, 33357, -5794, -14134, 37156, 43865, -4049, -9329, 25315, 23600, -2911, -3844, 17313, 31466, 16283, -7578, 6716, 32003, -454, -34734, 16636, 68213, 18174, -38517, -11360, 16670, -7726, -7223, 34741, 39858, -13720, -58310, -35346, 26688, 37890, -9332, -19747, 9565, -20103, -71334, -23717, 52900, 22267, -47843, -37107, -4566, -28623, -49568, -11935]
608a1935M2326j8482n7064j4868M5238J7329l6928J0931O1628j9068q4284P623
620e7554P6881P75m8408J8346M5182k0874n0049L142M7414J6032l4734q702N2378
633C9829Q494q1903l1589Q3798M7571n1360j9720L9046k0626o7940R454Q3193
645C8247L7025n0640n9816N642K9951j8819j8497O1634M9045p3591q1511L9341
657d1989N7109k6902j5619N3361J8787o7433n4851L0652O5634J1950l7179n52
669g032L2001l0862o0832L9114Q9852j5454o9995J9641N0831l4418n1673L3837
681d990O4311j325m5030p642L1925q529n5015J2192R2413J7422q9713l2706N5966
694B9279k781n5569L1836Q4462j2611r2223l5829M3879L2383k0303l715M7063
$$ y = [-11935, 30391, 11909, -45155, -60023, -14785, 2544, -34384, -23453, 38175, 19107, -65177, -57554, 19327, 20102, -28306, -9960, 35222, 14348, -35701, -32559, 14855, 30887, -3847, -12549, 39829, 48323, -33580, -65169, 18629, 66200, 14840, -4880, 34166, 13540, -54400, -44946, 38247, 75272, 24632, -35184, -29542, 409, -18410, -36907, 24727, 73772, 181, -81330, -41989, 15120, -11782, -27401, 25960, 44747, -22686, -77537, -46885, 18749, 30699, -6480, -7032, 24969, -5893, -66725, -27611, 62241, 46787, -23208, -3567, 47264, 12846, -38827, -4990, 59321, 57996, 12966, 5324, 37249, 28720, -26295, -14103, 78310, 95732, 6019, -26687, 29279, 26498, -29071, 2765, 87227, 74616, -17607, -53436, -9557, 22826, 2523, -1192, 45871]
706D5871M078r4417n4161Q0148P0193m6158l5487M5211k503q2154j7466Q2402
718d443N0908l9188m7037J1698K3131l1502l1387N6709O9439m3471p6258K8195
730c3206N2507l9758l7314O1699N3367m3648n3353J5545L2149j4689k5830L3878
742A347O3200j9109q9014j4784O8301J2550l7882L1844N5023m9506q8267J1776
754e4521P4986K2991k6342o524J7780k0422n9594k579Q8180M8751o3377m9132
766b9803L5945P687n2271J2881Q2497J1705p1659l4372L5418K4624k4770j4959
778a7077M2216L4761n0065n8312L6235N0429l9487l4854N9829L8305o6891n4088
790e8999L9314M0048k2341k1094L2865K9277m3367o7487J6796P5302N325m9535
$$ y = [45871, 49949, -44468, -98629, -18481, 51712, 5554, -29933, 15278, 12775, -69379, -86845, -4443, 46465, 7277, -39760, -28062, -4931, -36433, -67820, -11111, 58328, 14857, -61401, -33206, 19301, -20457, -57771, 3928, 57295, 13647, -39706, -24161, 7988, -6701, -32531, 1347, 64547, 45438, -43576, -58360, 9941, 22491, -15391, 16453, 71476, 21970, -66297, -54521, 20465, 43456, 17114, 10590, 28370, 7948, -51646, -54225, 33955, 82706, 19329, -29803, 6142, 13829, -38442, -25561, 56936, 68641, -3018, -37390, -1972, 22652, -2118, -17077, 25139, 59900, 9835, -48477, -12242, 38187, -1300, -36154, 23675, 61980, -4911, -58999, -19685, 20363, -1978, -23072, 9793, 39070, -4297, -71784, -54988, 20314, 25639, -23896]
802b3896J5704L9724n6967p0824N1966R3844o834o0849j0644J8234j5745k2307
814d8594L5649O8262k818q1465k9584N9880K1654m4210J3361O7361j3525p8228
826c2257n704N6170J0400k8420Q055L5642n878n3699k2685M9584L8185l6697k6299
839a3603M4191J0756o6394k0822O2096K4562m2557j0689L3365l447m8470j8777
851d9789M3736M6184j8957m5779M939K0898l3330k1072O4074M9730n4914o2823
863e7103K0906L5762p176l671K7675J1806l3793m1364J3360N4835J1400l9476
875f839j938L5883j8433m7082K2222N5641p015l5976N650J7101j4896j9098J3050
888a730L4663Q478l7693k4159K8348J8816l0067p739L9380J459m3125m21L5816
$$ y = [-23896, -8192, 31532, -25435, -96259, -44293, 49551, 42717, -18132, -28776, -10542, -26287, -48594, -12945, 55317, 52499, -28966, -58550, 1330, 22984, -21226, -7865, 59496, 45971, -32257, -37961, 18209, 28609, 189, 8244, 43886, 38008, -15691, -38376, 11208, 49393, 12696, -13603, 30588, 41344, -25050, -45872, 16224, 40786, -1771, -12460, 20905, 17458, -31012, -49789, -6053, 40131, 21174, -24605, -19666, 1232, -32098, -53170, 10904, 60634, 5720, -57103, -36197, -435, -7611, -11282, 16393, 28199, -5594, -46958, -33598, 21237, 32637, -6839, -8777, 27106, 8673, -38409, -16187, 39454, 32439, -3537, 2113, 19214, 4318, -14780, -1730, 32933, 41411, 3718, -20441, 7907, 26723, -3344, -11083, 28297, 29756, -13369, -13790, 22026]
901B2026o286l4749K963L2528J1996k3102k7443M854K0788o924j0048K9801J3007
914B9411n0859l2725M3592L6495k2208j7087J2379j810k0330j496K3558K0745
926A9665j1506l0961o65K8531l937k5978J8888L4032k2248l6540J3721K3747p170
939d21l537J5962J474k0729j8131Q367L3830J5126k8335k3438J6868P995j5115
952a0084J2727K6229j8462l3353J2832K8359k813j6856n655O400J1983L48j0968
965F87J275M923j6928l035L4192J1279l7100j8852K1736J1051o493M945M620j0711
979A589r571p19O852J4415l27j6949K846J4359j6469k0381K2450K6554j1313j6911
993c575j820q296m547K0453K0215k431j8676k5345p258K9987K6554j0656j5665
$$ y = [22026, 15740, -19009, -16046, 16482, 28478, 5376, -22067, -17213, 3575, -3349, -13397, 16404, 29411, -21448, -54173, -10581, 25914, 3706, -13381, -1002, -2812, -23142, -24638, -1080, 19665, 8159, -22802, -23467, 5064, 1127, -24851, -5963, 28069, 5821, -30719, -16998, 6749, -421, -3958, 12004, 13478, -7251, -25382, -17015, 16815, 31941, 3606, -19832, -2964, 5031, -10084, 2643, 28872, 10410, -22943, -10111, 18248, 15435, -1421, -7076, -676, 11307, 11655, 687, 1962, 6885, -10043, -13078, 21114, 32393, -4707, -23559, -1823, 9228, 2735, 7680, 12300, 1589, -7982, -8701, -1849, 12566, 12239, -4710, -1864, 12495, -3974, -24355, -1905, 24649, 13336, -3575, -5395, -13691, -18238, 2215, 22430, 19999, 1323, -24022, -31280, -1293, 25261, 14605, -1060]
1006a060j404j3154r186K6276K3306j6285k0077J732M090K019N504k769l607O467
1020A852l64q103O219M150j5688r27K4103K643j9158k409O128m745K269J0988
1034F958j929n677J552m857l351Q808J345q001J0937J1381j7230j6179R315Q069
1048A141K747J3174L20k4873j4511R544J4498J6870P425k3380k7023N836J8453
1061B21R709R939k199k7244j3424J8186J4533j844Q71m531j2400L969R931o581
1075h64m012R541J076m880M495m308j3887O984J7510k392p931j62o412m886J4233
1090D105O658j2455l498O766k375K60N990r562j1030J3012J3832m537o966o843
1104f643j2627O198K5406O437j6072j1181q797l696K0706K1634r912j8640m406
$$ y = [-1060, -2464, -15618, -24804, 1472, 24778, 8493, -11584, -9852, -5762, -3743, 1761, -1008, -4615, 1852, 1488, -6615, -396, 3754, -11934, -12861, 11242, 13885, -5273, -7682, -1554, -6299, -4030, 6958, 5029, -648, 904, -3953, -7304, 1504, 2849, -5152, 5785, 17166, -64, -16243, -6928, 1141, 3888, 17062, 17382, -7491, -22002, -12458, 2040, 18910, 26335, 2955, -24068, -18232, 221, 9930, 19869, 17670, -9574, -22998, -4812, 9721, 7877, 8748, 4217, -8183, -4214, 5717, -864, -4876, 4665, 5741, 861, 5356, 1048, -12839, -5855, 11655, 9263, 1332, 1170, -5242, -10128, 4105, 10763, -1692, -5190, 1576, -799, -539, 5451, -4111, -15141, -2129, 11703, 7166, 200, -6643, -19270, -13072, 12334, 18771, 2699, -8482, -17279, -20975, -269, 21365, 11453, -7187, -11593]
1117a1593l251L167J9155Q408j3490p415N95n153L280J4358l35p416M080k177
1131B213j2064M203J3020j488j092O278j0176j2441R331J1402j629J692j42j3750
1145d643l228J4592M638n571n7m573p541J0992J1646j1579j0606N876P55O65J2451
1160A3817j225k0280o116J2610P061N980J754j6391j3670R497J0928Q41O487j615
1174I678k0034p119J6713O183m565M330l15j1774j932N061m33N391R403p198j1150
1189g761K829q40m090J5141J2854j5321j6332M838N267K219J0148N12j4400n255
1203a0191M286L589Q249M432j4967q625J4295N467r803K339O691j2827m777J6101
1217D259O505j1381p277q41K237R121K920q028R30J508j3562j678K4009N286k0365
$$ y = [-11593, -14844, -11677, 7478, 15886, 2396, -5019, -4424, -9577, -6297, 8061, 7726, 310, 4390, 2213, -9851, -5648, 7372, 5884, 4792, 11070, 894, -11547, -2216, 9186, 7557, 9249, 9107, -4643, -7871, 6721, 11359, 5788, 5731, 1158, -6383, 4609, 16255, 4676, -5930, -54, 701, 1366, 13817, 12592, -7688, -13804, -1194, 5867, 11847, 13601, -2790, -16460, -6963, 3965, 4806, 11293, 9678, -10356, -17475, -762, 5421, 856, 5186, 4871, -6903, -8835, -3774, -4207, 1184, 10587, 3389, -7761, -4932, -5772, -9862, 5279, 18133, 2812, -13520, -8682, -3415, -1196, 8952, 9464, -4936, -10191, -5905, -2316, 5933, 10365, -4602, -13227, 1068, 6535, -3268, -929, 5762, -7065, -11842, 4259, 10764, -617, -7894, -8735, -6498, 2623, 5543, -2485, -1555, -47, -13609, -15287, 8722, 14008, -6357]
1232f357k983J1127p344q818J3012J2293k924r531r857o88J1254N158m094R015
1246I263M100k3655j2633K4823J6945j3501n607P667o808j0134P994J1401J992
1259A1847n840r718M81J2817j088j4949O263J4586j0944j1596J6211P880j9817
1272c867p865J4607P244m515k946k275o87k482p142N479K2042j04k7374o125J7027
1287A017q85p746J6834J1982j9427k0052L749J4976J0096q63p758L31R98j6239
1301a2987n578K7881J6193k2334j2932J4017j753j7109Q132K2118Q47j6786j0767
1314a1058M656J0826l394j2284J0734J8829j5872k2042J5319J5210k1247j1487
1326b1810K7563J6559k1207j9893M117R126J59r57J2544J5082j8147l8389L934
$$ y = [-6357, -9340, 1787, -5557, -14375, -1363, 10930, 8006, -1525, -11382, -12070, -816, 4342, 248, 9263, 13363, -10292, -22925, 1898, 18843, 5342, -265, 7402, 594, -9540, -1546, 9855, 11847, 6007, -3711, -3230, 9587, 8499, -6450, -187, 14399, 3455, -8141, 8070, 15950, -3867, -11732, 2875, 10119, 5604, 2658, 383, -304, -2786, -9928, -4449, 17593, 17489, -9885, -16010, 1017, 132, -7614, 9220, 21202, 1775, -18277, -14528, 448, 10544, 9681, 1923, 2254, 3252, -12987, -18565, 9316, 25509, 3175, -9757, 4260, 2507, -14602, -6470, 15648, 16495, -291, -11058, -6402, 4424, 1030, -11254, -520, 18309, 2437, -19605, -4286, 10924, -10323, -21810, 5753, 22312, 1105, -18788, -14671, -5545, -5386, -6343, 6201, 21283, 3136, -35253, -31319]
1339c1319M1445P604k1356P657J2594k8611k5715K5289L6060m27k0694q301M072
1352a702l457j2522J0378L6090M726m0374j5332K5815K549k1112J5843L3995j2852
1365B2045l8667l350K2132O320q789K237J6248k39l0145j4684K9307J7977k5245
1378d853o928L4699K302m4979j4419L2566J7329r764P14J0700j1152l2468j1180
1391c7433L7859M1459j5022l8651P06J2746k0631n977M4335K5572l5156l3362
1403b3555Q796J3896m940j57K1142J8362k0854m1660l079L5609J0982j6235J1455
1416I762J6976l2524l7741K2192M0769j720k0622K76Q024r902j8676M634K9428
1429A0876R695k4902q070K3126p095l7415O982M8468Q316l2152j0157J0958q713
$$ y = [-31319, 10126, 17730, -3626, 4031, 16625, -11986, -37701, -12412, 23648, 23221, 2527, -5774, -1702, -5159, -17681, -7303, 28787, 33513, -6861, -22193, 3622, 6171, -14941, 902, 34897, 22045, -16622, -19972, 2160, 8480, -309, 1928, 18176, 17937, -12208, -26892, 2415, 20392, -4853, -11781, 22918, 25220, -19759, -34178, -1612, 15717, 5953, 6667, 17367, 6215, -26253, -37433, 426, 41885, 26863, -11788, -11082, 1664, -18967, -24944, 19391, 44963, 9807, -23555, -14759, -863, -5803, -5960, 15182, 33544, 12690, -28970, -32049, 3560, 14542, -1693, 9762, 26738, -5786, -43527, -21335, 19434, 17714, -2908, -2632, 5392, -4510, -23186, -18552, 10876, 20571, -4331, -12401, 10725, 3630, -33785, -26803, 21665, 29981, -2171, -12328, -1370, -10083]
1442a0083j4587J6792L5662O939l7033l1123J6654K5347j0541m154L2315M243
1454C0431m9096k2570L5517K3678j4423m161J7091l179l2141j8240K6644L7260
1466B6811m885k9444R96J2385k2893j6426L8751L3480k9118l4250J2678J7831
1478E916j0567r098J6135J6366j0403k3209K719K2887n819k5518J4682L8341r950
1491B2482m0522O85K4319l652r306J9302J6262k0711l0211L48K9939J5535j6683
1504G787j0078J6681k012l2522l08L9750R729k8248n832J5811q521k1956R073
1517a0646L0032R082k4909k3958R067J9086o921q591K1209P912l4095j7311L2605
1530B562K0245k2864j4682J4799Q403j2063p919J0177J1077j1442j6366J3978
$$ y = [-10083, -24670, -7878, 27784, 34723, -2310, -33433, -16779, 8568, -1973, -6127, 26188, 30431, -18665, -41235, -5718, 17960, 3537, -624, 16467, 13288, -18853, -37093, -10449, 26811, 21926, -7518, -6522, 5863, -17030, -33456, 5295, 38775, 9657, -24593, -11915, 5916, -4651, -13749, 2386, 18752, 8349, -14860, -12141, 10746, 4927, -20591, -5909, 32432, 22482, -18040, -17355, 6964, 3312, -5994, 13308, 29570, 8859, -21352, -21004, 8935, 24470, 7787, -2291, 14390, 12378, -20144, -20452, 19298, 29027, 779, -5053, 10758, 2237, -19719, -10646, 19386, 28468, 3559, -20399, -11332, 7754, 833, -7758, 13451, 21363, -12732, -30043, 2562, 22807, -57, -14739, 60, 8463, -3600, -11519, -1342, 9735, -1707, -18073, -4095]
1542d095K4735j4601l0772J1669K7729j0218j7995J4989J2054k0221j4358J5901
1554e183J8756n478j7600j373J6182o54j9851L618K8604k626l0648J106K4209
1567I062n638j7971J2432J8454j1619k1065J075J9536R317j3048j0537J0822N482
1580F302j7532r27K7144K423l1465o200K6223O924j6000k046Q628k094r543M08
1594g755J3960Q541j4906j7239J2187J8148j1810j2764J6944Q472k1161p932J9097
1607C782P752j2128m818P140M533o130q088N976J4736m578j7956M565J7717p630
1621D873j4167J1489J1812j4330r578J2506J0382n753r745j667O351N015n471
1634A717j441J0665l605j9319J874K3022R66j7508J68Q545o282m874Q437O809
$$ y = [-4095, 20640, 6039, -24733, -13064, 14665, 4447, -13548, 1441, 13495, -6726, -21084, -5183, 13573, 8095, -9505, -10878, 5304, 4650, -15201, -11583, 17021, 14395, -16253, -15147, 9062, 3424, -14547, -2115, 16339, 4720, -16345, -15270, 4266, 13583, 535, -10002, 820, 6302, -11230, -12157, 14987, 17410, -14055, -20255, 5968, 12892, -3108, -5154, 3474, 1380, -8163, -7755, 6205, 14746, -160, -17399, -5212, 12936, 1126, -11638, 5306, 13778, -7383, -15315, 3782, 11534, -594, -5412, 1728, 6261, 131, -7957, -1981, 12755, 8177, -9779, -5214, 12503, 4873, -9294, 2195, 14007, -323, -9901, 2605, 12987, 7234, -2511, -4178, 2173, 7188, 1717, 276, 10941, 7336, -11983, -10109, 12913, 13879, -3629, -3461, 5084, -1198, -6072, 2365, 9174]
1648I174l847r263n048O886R928o480q183Q913M223j5491k966J7569L046j2846
1662d385j435O668k812m605L699N424K423n383j0160K618J3417k062r917N440
1676a070N739j1001l595J3917L913j1503l637N259K296J010j6k692Q51K17o769
1691g081K541J3238j409j3848M42P257n315m88J1099J721j1116m561K403M182
1705i35N920K95o618j164K596m270J303J1253j169j4278J044R720l33l114L513
1720C763k291n734K372L721J200L721k404q708M12P883j759k140Q062o72j2183
1735d757j427P258J406J682L830o340p978K033M078K781O483k215j2945k515R755
1750A129K928r09L524m874j0779K409R926J448j255r97o765k892P146L175k169
$$ y = [9174, 5327, -3936, -8984, -2098, 7830, 1350, -6833, 2080, 6303, -9188, -12154, 5415, 8461, -4385, -5820, 848, -1964, -6569, -2870, 2554, 4977, -406, -10566, -7948, 5469, 3407, -6510, -1070, 4669, -6332, -9927, 3990, 7903, -3600, -7237, -1978, 318, 1328, 1312, -1380, -529, -312, -7081, -4540, 8698, 7289, -6559, -6117, 1140, -4175, -4663, 6436, 8157, -2959, -7520, -5117, -935, 4985, 5280, -1338, -2502, 94, -4176, -2873, 8380, 7211, -7067, -6023, 3697, 3364, 250, 3763, 1472, -4262, -1890, 1831, 3031, 6752, 4348, -4360, -3948, 3935, 2176, 36, 8098, 7426, -4757, -6184, 1074, 2480, 4162, 7992, 1652, -6326, -4293, -215, 2566, 9049, 6834, -6111, -8626, 1129, 4057, 3148, 6672, 1798, -8981, -6572, 3354, 4802, 3547, 2550, -4215, -7107, 39, 3214, 1045]
1765A045J938q05p532J210Q806j655n934K834J145l712L164L509n084k444L065
1780d50j247J78O114p49p365J252K050m360K612Q209j510o227J01k397l485P087
1796a87Q744k973n739k828n253J693J2502M101p457m626l128l160P460J1587l383
1811G353j0047j472LM93Q019M347q122m883L389J33L26M048j870m997L675L220
1827C615o055j524M377j386m76N957k602q234J735N231k012O63K810m128k548
1842d577M808L59n268Q74K765r06L852L577q331p863N158O314L038M484l369j3659
1858h744l253J0328O787K170Q61q467r817M803R192J706L44o90p174k564O089
1873A571J886k676L892J756o416j622K872k841J16Q310J452p923l199n8p21N865
$$ y = [1045, 2983, 2178, -5354, -4144, 4662, 3007, -2927, -93, 1052, -2660, 504, 4013, -1071, -3515, -450, -1697, -1519, 4595, 3846, -3519, -2267, -217, -4577, -1965, 6244, 4734, -1493, -1392, -3789, -7274, -187, 8557, 5584, -155, -2983, -8236, -6543, 5959, 10060, 2603, -2023, -5151, -8311, -851, 10736, 7353, -2694, -4166, -4163, -3670, 4349, 8696, 574, -4309, -920, -787, -461, 3587, 1717, -3280, 395, 3615, -2440, -3964, 413, -973, -1449, 4508, 1906, -6328, -4593, 638, -1374, -711, 2099, -2029, -4577, 231, 590, -4678, -3804, -1039, -1945, 1907, 5484, -2847, -10710, -5552, 762, 3800, 8284, 4915, -8744, -11997, -1669, 5118, 7288, 8149, -318, -10135, -5332, 3860, 5566, 5910, 5220, -1954, -4518, 1571, 3457, 781, 4673, 6429, 13, -1609, 1263, -1578, -1462, 6848, 8300, 377, -2822, -2880, -3601, 2264]
1889B264P364m412p977j221p48K155Q478O40r858j976N940n11k525L795k105m978
1905e675N043P481l430p105l281n86P802R863k742j0410l345q9j13J0235R722
1920A3370p455j2639L46L648Q54N474L075l614l320j672m105J400P949J135j632
1935B814K460m701j1445J294J3567N187k703l357q474p725O840J1722L672k602
1949F549q056r905K816J1293K307m981J025l19o467J538P468m120o325N173O864
1964D860J98m174q273m748P602R997j93j340j191j1700p406J2786J4163l862o664
1979E5j281l260l013K417M864M996M018m859q850q74J119j504R613J5369n490
1994A3320k0445o956P457Q141Q634O846p805j4476o015N714J2219Q945n703j0691
$$ y = [2264, 9628, 5216, -2761, -3982, -4730, -2575, 5903, 6543, -3315, -5291, 649, 138, -2387, 1408, -697, -5675, -632, 6849, 3419, -3686, -6967, -7553, 249, 10112, 7370, -3040, -6385, -6474, -6587, 3648, 13370, 5915, -6724, -6378, -2730, -1876, 3598, 6673, 3059, -261, -1933, -6038, -4638, 3311, 4446, 2814, 5274, 573, -10872, -9578, 3989, 9176, 6473, 3116, -5358, -13083, -6243, 5479, 9151, 6549, -1507, -11412, -8596, 2697, 5004, 23, 1048, 729, -5738, -4200, 3268, -852, -7177, -2004, 4860, 5058, 884, -7389, -12137, -4535, 5462, 5269, 3929, 2738, -8962, -16368, -3582, 10581, 6719, 55, -1226, -4486, -7499, -5082, -218, 4778, 8796, 3937, -4913, -5787, -4668, -6172, 3441, 18810, 13320, -7125, -14081, -6624, 1517, 10151, 16997, 9192, -5284, -11299, -5585, 6634, 15579, 9876, -815]
2008h15Q22K840m976J277R142q47p380L985M142r012q258M826R576N216k221q647
2024c30n979M04M59L717J1671K622j5389r206P617L457m439M535Q549k478q183
2039b973n491k083L952P274M725K453j734j3895j3171R959J9156L697n852n013
2053A004r029p845P977J4988M867n707r188o786L120P542l36o78N030j645p772
2068d458J063M493n202k118R930O007o216p864m413J159P389N217j870j012j877
2083B28q087j962J1038M688p538j16P412l103q906j427M767N856N162p81o236
2098I95n161n206M17J4711J2771r037j6992p66O135J913N459P447n545j1452k212
2113f523N797O062O83n584j463N535m6q031N93P588k607m504O790L451r976n061
$$ y = [-815, 7, 2847, -2129, -852, 8290, 7443, 63, 4048, 8190, -822, -9080, -4254, 5322, 10538, 8317, -330, -6309, -5905, -5446, -1729, 9942, 12564, -2825, -12031, -4414, -957, -5396, -861, 7688, 5210, -2973, -8464, -10547, -6595, 679, 5404, 7857, 6123, -7772, -20943, -10984, 8172, 11869, 6017, 1004, -8025, -15870, -7893, 7095, 11962, 6255, -2933, -9719, -6599, 943, 607, -71, 4959, 3314, -4458, -3395, 1098, -4104, -6222, 3708, 9715, 3499, -4365, -8778, -7619, -230, 4987, 3117, 2105, 228, -7859, -9821, 1217, 5905, -1633, -1749, 5663, 2560, -6346, -7773, -3006, 2850, 8012, 7231, 995, -4166, -9372, -8955, 5756, 18527, 9490, -7502, -8268, -2133, -220, 5239, 12686, 7141, -4311, -6523, -726, 5336, 6019, 435, -1028, 4507, 4461, -3570, -2977, 4611, 2004, -2500, 4290, 7741, -2235, -7296]
2129g296O547N211j917k206j172N53J459l349j553N750P79o327K888P898o544
2144G21j0671M117R824J208k209j402n385l895K949O514O055m30j1306p816P538
2159d188Q880k577j743K934n055o251N627O924k894n078J90J902K482j65l584
2174b596p82M207j447l011N112K925p571k122O793P47n527J566M583k07j308k338
2190i76k803K247M541Q7N93J101o843p146P940J0903k688o829q27j895r26N634
2206B113M784k375m411l713p57O275L997n541m238M186N81m250L062L777n507
2221b017l870M797K761k083p62j296j044K238N08j848K391K499m648k738M684
2236d28L76l345L802N202m571n548O37K122K803M468m65n452k736k14J025P108
$$ y = [-7296, -749, 4462, 2545, 339, -833, -280, 1179, -2170, -3723, 2027, 2806, -3521, -633, 7265, 721, -9950, -5833, 3991, 5199, 2990, 1588, -3797, -7692, -4743, 1771, 7826, 7396, -3910, -11726, -4188, 4692, 2115, 372, 3306, -1749, -8000, -2373, 4551, 1657, -3421, -3231, -1329, 1153, 988, -2596, -3378, 829, -618, -3629, 1483, 4408, -3163, -5285, 1508, 2255, -3272, -1706, 2877, 2670, 1362, -976, -3779, -1532, 3009, 3096, 3689, 4790, -2053, -9199, -1259, 9644, 6956, 127, -700, -2595, -3521, 2113, 6897, 4522, 111, -3602, -4359, 1916, 5913, 372, -3866, 320, 901, -3349, -287, 3490, -2017, -5887, -1090, 1671, -412, -1174, -2470, -3514, -1276, -768, -2616, -225, 2274, -2374, -5112, -428, -52, -3397, 405, 5607, 1036, -4512, -3875, -1753, 1050, 5518, 5053, -399, -3135, -3349, -2324, 4784]
2252D784N217o966p291K688K422q40M028K189n642m131L081J972O55P17k608l297
2268c022L174K097l411P90J992l892k364N293J849l937J67Q57k933j93L119M89
2284G5p2J599k858m126K462M076r21J284J522n379l371M657M272r72N17p21m747
2301b703k30N049J258m18R90l330l464L362M332k340m67J496l688j749N025K284
2317E407l688j197J77k368K494L506j686l142K74j389j243M829K699m667k458
2332b452J117j889L01N095J032m024j609l52k103K376M872j314k765j28k657j454
2348e954M613M212l037j947Q19k825o48N077J926l448o50M95k126K213K910k401
2364g71j753K117m15j741L739R20m549q51L633k95J27K395j371m061M74K567O98
$$ y = [4784, 10001, 3035, -4256, -1568, 854, 14, 4042, 6231, 589, -3542, -461, 1511, 2166, 2883, 275, -3022, 152, 2249, -1162, -372, 1620, -2272, -4636, 657, 2506, -1431, -1264, -407, -3340, -3533, -414, 75, 3, 1602, -1256, -5382, -2920, 1156, 235, 1519, 3041, -2338, -5709, -1052, 3220, 2248, 2765, 2044, -2703, -2933, 2116, 3374, 2956, 3946, 616, -2848, 514, 4846, 2506, 2039, 3535, -153, -1902, 3123, 5407, 1719, 522, 699, -1669, 825, 4331, 2645, -497, -223, -1612, -2855, 1974, 4673, 6, -2452, -1335, -3224, -2923, 2172, 3204, -820, -2429, -2781, -4884, -2508, 2364, 1050, -1715, -1843, -4500, -5954, -1341, 2871, -166, -2113, -1294, -4119, -4767, 310, 2236, -1212, -1862, -1367, -3493, -1280, 1630, -771, -2524, -407, -822, -2563, 1176, 2096, -2453, -3304, 329, 34, 161, 2556, 1185, -2876, -2402, 165, 863]
2381H63K235J095m503l505K894K455M63L524p81o812q71M382J365J14K525k075
2397C368m686O44K542J37K133J530m040k575K026N6r39M148O52m940j901K439
2413E94n34M44L376j320m719O9K214l77J730O78m583k081M229J345j657P39j272
2430a125l960K059N610r81k876j22j439j178M004L254l241j509o5k074P20N198
2446B275K95l332Q1l96k938K358M641p97j898J37k491k590L949L479j662p67o36
2463b92m040j36N234J984k183n2k230l660K450N159l11k420r08j936j097M701
2479B63K519l136j507M23j717J184N359j149m647P28J714q51K292J854l294k001
2495a966K637Q45m55K499o67l634k6L368n67mK046k012l223K111J398j436J796
$$ y = [863, 3098, 4193, -310, -3815, -921, 1534, 1997, 5521, 4740, -2072, -2943, 1439, 2804, 2918, 5443, 3368, -1318, -674, 1868, 2005, 4138, 5668, 1628, -947, 1079, 1135, 196, 4344, 4996, 56, -1845, 594, 60, 504, 3880, 2560, -2159, -2090, 124, -253, 1477, 2155, -2428, -4509, -280, 1065, -592, 147, -1125, -5085, -3026, 2584, 1603, -1273, -1395, -2834, -4012, -8, 3246, 5, -1504, -1569, -3643, -2923, 2275, 2570, -762, -681, -1077, -4015, -1657, 2984, 2187, 289, 426, -2065, -4655, -706, 2773, 1111, 344, -292, -4332, -4468, 766, 2750, 567, 515, -1715, -5375, -2925, 2234, 1923, -497, -1405, -3341, -4438, 263, 2782, -354, -1861, -1438, -3155, -1971, 3388, 2239, -2408, -1680, 34, -817, 1475, 3329, 35, -1966, 671, 1516, 1061, 3560, 2893, -741, -767, 2601, 2034, 2030, 4076, 2064, -1159, 952, 2350, 914, 2710]
2512B710K463l228l775J871L43R41L329J83n378j851J279L00K793L594l575o023
2528d024R27K670P19K198J104n223k751K969J668k67K008j664m397Q09L505k08
2544D3q63J141k065j641K997Q79k390R47J514k410j008L395l45k162J691M28k505
2561b354M25K379q69M06J202k555k308L804K381j703K8k0m078m23N732J617k391
2578A273j76j996l212K709N304l58k107j317k301r96M722J803k064m13p03l116
2594b948R51M982o27l289R17P56k950R86K867n39j164O16j843o79K794O40k330
2611h60J116P26l117P63L997r81l014J131R97k198J946L136k304k564M25J01R10
2628B10L433q42l633J08M09j281K913M075k279n640O85J525n05K512K234l004
$$ y = [2710, 5173, 1945, -1830, 41, 384, 1325, 4654, 4837, -541, -2392, -1113, -813, 1980, 5574, 1999, -4024, -3097, -427, 292, 2490, 3594, -1629, -4380, -1411, 257, -10, 1998, 334, -4063, -3254, 251, 43, -820, 321, -1744, -3385, -388, 491, -1899, -952, 562, -1848, -2856, 539, 194, -1968, -277, 151, -2354, -1929, 450, -419, -13, 1189, -1366, -3674, 130, 2511, 808, 836, 816, -3262, -3685, 2047, 3664, 1273, 1097, -899, -4111, -1402, 3902, 3544, 1437, 120, -2181, -3177, 1545, 3348, 1284, 871, 168, -2948, -1997, 2985, 2358, -931, -14, 742, -2208, -1222, 1645, 1106, -58, 558, -1285, -1964, 830, 1470, -860, 256, 982, -2135, -1372, 2625, 1644, -1370, -239, 758, -1440, 506, 3642, 1338, -1226, -801, -700, 210, 3643, 2801, -832, -724, -315, -1596, 1317, 5392, 3113, -2527, -1842, -317, -822, 1690, 3924, 920]
2644I20k821K57Q7J258L251r33l940L46J273j600R93L170j733l299J597J561j445
2661a058P85J010k085m98K017O2o01J986j322l885J877L279j054J82J253k976
2677a028l277J890L559O60O80j590m677j87L402J294N97K290k813o164J165M959
2693G60N96l56J396k708l626R52K571J592J574j262l916N51K758q13p15L384j80
2710B558l992J782L088k419k168J489J575L69R85o80k652K49l51m93M090K853
2726F283m348m033J503O22j804K898M452k591m845j325p17J312L847K022j279
2741A997j930m798m007M421Q014m11m785j091k000k521K992O326p5l128j934j874
2757d804R53L362q63o42K921M18m110l89L935j524j373L934K575k399k695k47
$$ y = [920, -1901, -1644, -1557, -299, 2952, 2019, -1921, -1575, -302, -1902, -909, 2261, 528, -2771, -1174, 387, -1058, -273, 737, -1348, -1846, 171, 233, -368, 1618, 296, -3589, -1712, 1567, 513, 695, 1948, -1028, -4305, -2415, 1144, 1804, 2484, 894, -3783, -3970, -568, 726, 1323, 3613, 800, -5364, -4199, 760, 1356, 1000, 2396, -312, -3938, -2986, -415, 1177, 2751, 1489, -2427, -1876, 882, 69, -646, 2738, 2558, -1434, 348, 3436, 1017, -1151, 338, 1913, 2282, 3267, 2587, -65, 184, -167, -660, 3430, 6283, 1935, -2098, -595, 27, -1777, 1121, 5573, 2982, -1863, -3188, -3905, -2593, 1254, 3276, 1997, 67, -4731, -8738, -4317, 3697, 3286, -1499, -2590, -4590, -7111, -4119, 2207, 2132, -996, -2930, -4804, -3851, -489, -1352, -1994, 927, 1345, -2765, -3154, 781, -743, -2116, 1818, 4393, 1994, -701, -948]
2773i48l12J993K748l08k13L81l561k865M120L662k059L1K508l179n686J312M256
2790A880K084J475j401m426k724k1J625N793M497n330q840P11M180L15J824M309
2806E951l032p026r46L593K853J203j437k090R99L1l541J095M714r95l895K682
2822A59K552m993l106M355K856q99j426r58n37O51q68o6L371R16m171q55M108
2839A089j998n042L306N940q74m493o26j250j53L338L341Q70k071n938k861O284
2855a138O434k091l503N98k407l111M601O182j850m448j506J120K006J101j062
2870I26J45K319k247l877K556L892k683j692L849K15n336o70L828J443l04j554
2886H10k229J18J528k62N25K923k395n320K627N727k596m214J296K376q57N06
$$ y = [-948, -1260, 733, 3481, 3173, 2960, 3341, -220, -3085, 1035, 4697, 2638, 2669, 5177, 1998, -3688, -2376, 1880, 3964, 5439, 4038, -388, -3112, -3133, -1508, 4285, 8782, 3452, -5388, -4677, -497, -182, 1642, 5951, 2919, -4107, -5053, -1460, 1393, 2596, 1159, -931, 68, 99, -3442, -2347, 2367, 1372, -2523, 159, 2711, -2282, -5388, -1033, 1823, 924, -502, -1460, -1997, -1346, -2214, -2280, 1091, 2007, -2164, -3019, 1089, -909, -5951, -2645, 3295, 2421, -2072, -2698, -3948, -4101, -763, 2578, 3448, 1377, -4561, -7422, -1138, 5296, 3205, -298, 300, -2107, -5218, -617, 5565, 3715, -733, -2239, -1119, 887, 1988, 926, 1071, 3390, 1143, -2734, -178, 3714, 1031, -661, 3188, 3403, -1933, -2603, 1225, 2668, 2364, 810, -1419, -1301, 227, -35, 490, 3413, 1018, -4302, -1675, 4052, 1456, -2758, -1462, 914, 57, 563]
2902E63J033k324k086M07K139M292Q63o338m668M509M388j414J489R42m953m089
2918e247L951N008M05j481j876j719P43rn42L111L729l342m905J548J354k587
2934a859K278N558j172o253k666R50K654M180j2l091j860j861j861L865N657k687
2950A820n786J743K625k225r10K085M2r77J095J124j681j870j957J206N553L064
2966D951n610l440J797o34l55N293L529m599m577N74J029J225J803J035k74J29
2982A876l202l975L155N106l62q7J618m800n733K706O881K447j503l429m544k11
2998d057L957K478J315M61m425m849L408M972j931j974K049M70k051O09N36j236
3014b68k90K258M59J005j208m230q28M535K408k358K67O46l685j828L610K074
$$ y = [563, 1596, -728, -2814, -2407, -268, 4024, 4887, -1451, -6119, -1610, 2778, 1364, 2853, 3795, -1158, -5247, -1296, 3712, 4117, 2636, 760, -959, -216, -225, -767, 2344, 6073, 2731, -2174, -626, 728, -1859, 419, 5977, 4805, -1448, -4114, -3164, -510, 3670, 3658, 567, -1293, -3154, -5015, -1150, 4507, 1820, -3966, -2223, 402, -1823, -2733, -648, -606, -1583, -488, 636, -1045, -2915, -4872, -3666, 1887, 4951, -659, -4099, -2302, -2936, -3291, 2002, 5531, 932, -3645, -3071, -2042, -817, 986, 2021, 1747, 1876, -1326, -5301, -2146, 2960, 2598, 2511, 4129, -671, -6404, -3698, 3183, 5630, 4127, 698, -3846, -4057, -100, 2378, 3693, 4154, -271, -5120, -1712, 3260, 1329, -645, 1404, 1874, -177, 432, 968, -268, -558, 1700, 2159, 3164, 1956, -2274, -3102, 1433, 3841, 1483, 1750, 2396, -1289, -3117, 493, 2567]
3030B567j090J04J42j648j377p11j68K993L490k546m133l89n80p93M808M648l941
3047A376o314n42J731K374L238m76l297j908k04L78L100L147l252l424K081J768
3063b24j357O67J737j690q32J815L79o64L59n8m36K204Q65k766m69K723l90j563
3081C00J889O43j960K77J642j583j119J269R49k87J055j713l300J262K652L45
3097B321l96J2l455k682L162M181q91j102k188k963O96M200J319j568q33k074
3113b261j929L230K848j549j563J091j134j398K060Q18j028Q92L14j981l13K054
3129A51m91k37K001n01l488O09K992n65n16J195j739k219K452K053j008l42o32
3146b85j422J261L157j180k455O08k16n82K993J634l321k177J351O20R23K102
$$ y = [2567, 1477, 1581, 1723, 75, -1302, -2013, -2181, 812, 4302, 1756, -2377, -2766, -3346, -4139, 669, 5317, 1376, -4938, -5480, -3749, -1375, 1863, 1387, -1910, -3818, -4022, -3644, -544, 2603, -649, -4073, -1992, -224, -1581, -914, 823, -867, -1699, 116, 495, -169, 190, 132, -304, 1900, 2765, -1, -470, 2253, 1863, 300, 2189, 2832, 872, 1149, 2791, 1208, 89, 1358, 2307, 2020, 3075, 1362, -1938, -676, 1976, 2321, 1925, 1937, -1518, -4200, -1038, 3143, 2252, 1150, -1038, -4001, -3305, 895, 2214, 646, -187, -2261, -4190, -960, 1888, 339, -1224, -133, -1267, -2665, -605, 213, -815, 77, 391, -1590, -1903, 151, -340, -577, 1424, 923, -2565, -1956, 1036, 471, -45, 1150, -589, -2808, -356, 1697, 689, 347, -285, -1707, -446, 2711, 1531, -924, -316, -532, -1114, 1879, 3513, 192, -1985, -634, -14, 909, 3011]
3162C011q72l338k14J435q4J556J606k415k097J200O28r44J808J312k202j640
3178a250J076m00k64K668K14k518l22N1j206J382K985j342k585o1K0m23K718J275
3196B018k427j704Q35J1M75K076o77k689L35J985k29M00P89k015j280K461J121
3213A485r88O38r3j788J80K419j03q80P57r73j858J776J881r93m05O87j762j318
3231a338J580J529q51K87j80k456m39K243K61j27O01j877k671J531K594p28O9
3248B8Q1k358j338K861J635j923M2l25j701O25K678M7j480J22q19r68K324J480
3266A011j568n62J073j254p12K905O50j509k3R3q81J120K075m94j418O77l56j299
3284d72K367J649j781m93K17j015R3K653k5k244Q2O9q22J077K247j636k114O37
$$ y = [3011, 2139, -1199, -1413, 22, -62, 1494, 3100, 685, -1412, -212, 416, -528, 1280, 2592, 390, -1250, -174, -574, -838, 1830, 2044, -474, -796, -745, -1951, -569, 2416, 1074, -1511, -1572, -1552, -1975, 743, 2018, -409, -2113, -1278, -1267, -792, 1284, 607, -2082, -1747, 238, 9, 409, 1198, -817, -2097, 364, 1485, 497, 1135, 1042, -746, -566, 1853, 1750, 870, 1627, 654, -1204, 572, 2453, 1460, 1055, 1742, -20, -1338, 242, 1771, 920, 1207, 1027, -1429, -1868, 375, 636, 509, 1110, -767, -3438, -1907, 687, -41, 28, 109, -2249, -3587, -726, 909, -1014, -972, -1297, -2998, -2373, 305, 352, -1128, -1006, -1825, -2793, -469, 1011, -557, -1119, -46, -1300, -2012, 893, 1543, 34, 11, 104, -777, 343, 2418, 1924, 506, 1183, 827, -472, 1895, 3544, 1763, 1270, 1487, 472, 565, 3218, 3193, 949, 1031, 1100, 278, 1355, 3602, 1966, -148, 489]
3302D89j03m23J043O16j550q06L35m18J94K049p65k872O57P16j113J406J699k290
3320a136k109R64J038l44J808M35l026j053J585N36J323J331j729k136R50J132
3336d31m44J624J772k201k708J678J496q63J013P47r38o54o4j26O29K334j648
3353A216k096J779Q77k307O82K077j776k005J164J639q30l20n00j243J010J003
3369C70n58J28O65k399j956L004K989k354r23M90j810p74K617K429r43j666j518
3386b209n98K156J776n44J30N39k249k478L336K940j999n48J139j212j878J560
3402a39J587Q31n02j448j402J172J513j415K33K597j625l244K265K370j743j711
3418f61J179M4K7O56l32l82n67j220k72L492J531m006k330J845J112j071K124
$$ y = [489, 386, -37, 1006, 1622, 72, -734, -399, -817, -623, 1426, 661, -2211, -1554, -838, -1951, -545, 1154, -1136, -3245, -2281, -1243, -1587, 221, 656, -2370, -3423, -1838, -1302, 21, 1352, -377, -2513, -1563, -431, -875, 749, 2521, 320, -2388, -710, 786, -77, 936, 1683, 745, 91, 27, -99, 530, 2864, 1216, -880, 899, 1776, -531, 151, 2228, 452, -1553, -389, 1250, 420, 100, -400, -1643, -633, 370, -188, -60, 605, -1794, -3750, -746, 2243, -111, -1034, -544, -2354, -3128, -511, 1918, 975, -691, -2209, -2807, -651, 1125, 581, 711, 1250, -999, -3477, -141, 2799, 800, 252, 1391, 179, -1699, -139, 1448, 2279, 1777, 329, -1073, 99, 1612, 197, 430, 3027, 1402, -1842, 423, 2793, 1050, -661, 518, 562, 589, 1245, 913, 531, -36, -1256, -1528, 1964, 3495, -511, -2841, -996, 116, -955, 1169]
3435A169J668k960k661N21K016R64J27j835o69J415j413j501L280K080l593k114
3451c506K818N09k270R77K650q70k197o63M38K468K76j845n70J957j200j929L133
3468A76L369l238l535K935K351j311n20J036m16n63n69J423K198j72m190o44M251
3485B581R62l143P58K328k369l031L188K467j182k198l62Q70N88j308o86K044
3501A507J242l698j998M031J144l548o23L244r46l309P91K870N09k010k307K65
3517b836K410l80j212K445J282m894k393M923L711k820k384J462K01j809Q34K655
3533A195J120k321k167L07L921p3l571J470L187j642l671K400L455k466k591K137
3549F90K211r00k410j87K287L85l111j85M085O30m944k01L834p02l717J859M204
$$ y = [1169, 2837, -123, -2784, -2263, -247, 717, 844, -991, -1660, -245, -1658, -3159, 121, 2201, -1392, -3506, -688, -179, -2449, -1472, 1178, 308, -1889, -2552, -2114, 354, 630, -1215, -1785, 172, -1028, -2957, 176, 3545, 307, -3228, -293, 2058, 747, 227, 1263, 847, 284, -285, 1138, 3336, 3164, -1026, -1670, 2581, 3543, 400, 1158, 3486, 1117, -1914, 1274, 3741, 2559, 361, -1, 869, 1457, 149, -537, 1507, 2749, -949, -2947, 1084, 2228, -1320, -1943, 1301, 355, -2954, -2163, 707, 1216, -794, -3101, -2836, -426, -806, -2018, 427, 1709, -3185, -5578, -655, 3056, 236, -2148, -686, -485, -2294, -1460, 1195, 2315, -6, -2173, -1866, 2055, 1982, -1589, -119, 3068, 1426, -2245, 155, 3610, 1144, -1447, 690, 2901, 2001, -409, -596, 1691, 2076, -1035, -1220, 2865, 3495, -1449, -1650, 2184, 1482, -2235, -376, 3828]
3566C828k385l973m56L279J485p65j725P97n6l181o30N843K331n400l225L472
3582g61J527k752R32L364n72l685p83J874K727j336k241J584K842k909l181L454
3598H4L224l578k227M071J601l601j640K281K074j375j843J415K740j440m387
3613b601M83M709j67l271J381K492l643m090L301M349k69k841j109N16k12j192
3629b164R70M067K46n710k005M145J790k884M12L262j800m129J170K877P97j980
3645i36p86J629J158k388j731K820K595l350j586L698J599m730j190L358J401
3660A561j884j00J527J93k607j830J806M495j046l496N88K164k735k480N007L697
3676D860l369l484J51J488Q1M94J570J217j921m129P0M798J089k891k57K706k208
$$ y = [3828, 1443, -2530, -2986, 293, 1778, 1013, -712, 85, 29, -3152, -3782, 2061, 4392, -1008, -4233, -761, 766, -1986, -1054, 2310, 1738, -1947, -2730, -856, 1871, 535, -1706, -122, 2720, -189, -3370, 84, 3308, -270, -2497, 1574, 3175, -426, -2066, 215, 2289, 914, -929, 486, 3226, 1786, -2601, -2118, 2591, 2424, -847, 534, 3026, -617, -4707, -1406, 2943, 2674, -167, -1276, -760, -972, -2164, -1194, 2873, 3119, -2591, -4596, -451, 1339, -1545, -1133, 2129, 329, -3800, -2630, 247, 1044, -936, -1722, -93, 1065, -1323, -3054, -234, 2361, -989, -2575, 1123, 2722, -2008, -3198, 160, 1561, -323, -423, 1104, 1297, -1310, -3140, -1334, 3161, 2115, -1381, -793, 1371, -1364, -3844, 1163, 4860, 1491, -1993, -1842, -354, -273, 221, 1791, 3008, 1087, -3042, -2972, 1826, 2915, 24, -233, 2473, 265]
3693B65l383K478L933j227k332O82J030m30j555j9J709J513k231j380K901N77
3709B531m348j69M349L63k802j73J354r26j935O61K808J034j659l035j74J949
3725a72n47j108L771J377m526l310K872K044r9J28J208j587k185j052J771L630
3741B215L96l296j008J575o75j751K978K728k883k496J460J635j015n37L31Q57
3757E14P5j156p90J593M35k210J81K909O6l389k6K368q45j098J705J099j152j493
3775a214m15P29J943n35o00R77L75l375q55M008J779j945p73L70j188o77J345
3792e1K359M87j609k624l02K741R91j128P40M83k912j270K918J723j918r28O11
3809C11k0o81L11L51J01r6r74m59J759o9k578O60J854j023j113J350L66j304j59
$$ y = [265, -3118, -640, 3293, 2066, -266, 416, 1446, 1016, -539, -558, 1151, 2664, 433, -947, 1954, 2531, -1817, -1986, 2363, 2726, -76, -249, 1105, 179, -1756, -1095, 1713, 2747, 1088, -1947, -2121, -172, -719, -1827, 1944, 3321, -1205, -4515, -1643, 401, 302, 430, 1638, 51, -2134, -3186, -1415, 2215, 2611, -685, -1693, -118, -793, -2544, 434, 3162, 279, -2217, -757, 878, -137, -674, -343, 514, 589, -567, -1357, 236, 671, -1539, -1358, 1551, 1617, -1772, -1798, 570, -275, -1373, 332, 1431, 279, -1214, -1629, -900, 1043, 508, -92, 885, 1260, -2115, -2970, 1038, 2817, 872, 99, 469, -719, -1396, -51, 2308, 2795, 1186, -1438, -1740, 1001, 1992, 864, 1604, 2087, -825, -2095, 823, 2546, 628, -300, 311, 291, -390, -79, 272, 373, 277, -697, -1156, 603, 534, -2044, -1384, 470, -553, -1666, -316, 50, -1254, -1413]
3828a413O85j68M03N79o78N9O40j371J65J919J083j981j373J371J33J3K028j84
3846A910j823j157Q64R56J882J58j967j476O74N49N7K065m27k261j037J568K63
3863G98j92Q31p74j108L05j23k77O77N40j450j02P55o43j217J525J398j573q30
3881a460P85o55L57J183r2j589K64K28o12J329J194k078p74J381Q18m62K45k55
3899a93j257M93K051J32o36k90j174n36J940J577p69r12l20r36M03K066L42j570
3917D11J28m97n12L07J445n07m5O87j367j153O67J149j11K92K65k010r61J506
3935c06R02j06N81j147j805N06J348R3O7K9j260n65J444J188j251k81J41m72K64
3954f30J453J7j900K95N51j54J154M62j486r73J080K59J31R48J60k091K96J110
$$ y = [-1413, -728, -896, -493, 86, -592, -533, 107, -1264, -1099, 820, 1903, -78, -1451, -80, 53, 66, 2094, 1910, 87, -1070, -206, 750, 2632, 2790, 823, -653, 21, 570, 627, 2692, 2265, 4, -1033, 535, 798, 606, 1437, 663, -445, -140, -263, -540, 137, 677, -773, -875, -120, -763, -1980, -455, 943, -630, -1460, -675, -1330, -973, 210, 118, -1471, -1207, -979, -1591, -262, 932, -1146, -1920, -539, 279, -183, 62, -193, -1450, -957, 1094, 1226, 590, 300, -874, -1410, 530, 2107, 1338, 426, 106, -830, -427, 1639, 1981, 411, 539, 42, -470, -163, 1282, 775, 730, 1417, 50, -1103, -436, 713, 602, 894, 1159, -851, -1812, -306, 596, 490, 1071, -76, -1881, -1375, -27, 66, 133, 162, -1098, -1663, -219, 969, -282, -563, -422, -894, -630, 823, 840, -1060, -765, -214, -368, 786, 1248, -238, -1211, -131, 128, 259, 1207, 1367, -724, -428, 682]
3972F82l89K19J423q84j057k97L27m36J479N82q58p06J45o79n2K392O17k087r17
3991d96L83n79P39J411p5j857n32J8N61J402K71j778o35P53L71o39J448k29j805
4010a268m41J828J04q59J36K7n14M00L62m62Q12m17j379N12J501l78r16R68L09
4029C25j762p5J247P04l20j12o63n84N14O54J90J381l46l053J1K610O25q52L15
4048H09k63j280l90J790R34l14p68q29K8J166J50q79P13K28j896l26K699p3j765
4067b66j32R31o27m68O72K44L52j070n72J69J795k90k067J211J012k164o21K598
4085G07R07k378n42L16O90M84J12j49P04q07j742J016K918p08k595K51J975p62
4103C97j291K134J170j761j488L69J625O44j161j207J590J30k247L1L319l73l187
$$ y = [682, 293, 512, 1935, 1051, -6, -303, 24, -412, 1067, 1649, 791, 85, 230, -449, -501, 1891, 2508, 421, -496, -113, -692, 47, 1458, 1383, -474, -1006, -988, -427, 975, 1246, -532, -1167, -414, -43, -682, 766, 537, -1268, -1709, 119, 223, -636, -500, -473, -987, -587, -225, -687, 125, -292, -1671, -1159, 342, -36, -952, 16, 325, -1437, -1512, -265, 439, 119, 7, -656, -1240, -726, -72, 118, 1499, 1153, -1900, -1889, 721, 1346, 494, 809, 546, -734, -1124, 666, 1600, 1286, 518, -311, -283, 883, 1033, 154, 867, 1095, -801, -1127, 1572, 1499, -266, -398, 533, -94, -562, 110, 354, 706, -364, -936, -767, 1028, 738, -1329, -118, 894, -1270, -1891, 707, 1614, -764, -1306, -990, -300, 184, 296, 147, 851, 44, -1698, -682, 2236, 1528, -1067, -816, 1159, 397, -894, 1240, 2410, 649, -839, -470, 1155, 1799, 638, -569, 1021, 1151, -1096, -1065, 2254, 1881, -1306]
4120a306J61K073l5j941Q77J356j322j327j1J714J150j981j587J552J413k517
4136a731p20L186J002l664j077K776J363j735m94J143l1j163r40K053J965j776
4152A57k826J890K691j846j714K287J701l358j473K791K438j720j750O49J222
4167A139k93k002J343K784j332l313M26L588r64k447J756J530j811k228J700K853
4183B729q19k909m60K493J176k623j035L010Q8l919N23M340j93m052l37K919j25
4200H06j724J29K111p5k488j952L126K344k130k181K501J106m093n86M743J543
4216C180l593j795J434J165j122j56J821J595k422l208J936L870j880l036K291
4231H0K625l244k070K837K165k175j931J601K391j167l163N76L186m4l128Q85
$$ y = [-1306, -1145, 928, 893, -1048, -171, 1185, -137, -1464, -1475, 239, 1389, -592, -2179, -627, 786, -1731, -2451, 735, 1737, -1927, -3004, -228, 1135, -600, -1094, 49, 18, -1145, -2085, -32, 1933, 157, -2669, -779, 1912, 66, -1648, 639, 2340, -1018, -2491, 300, 2738, 1018, -732, -83, 1139, 846, -1156, 187, 2971, 1639, -1674, -1248, 2340, 1376, -1071, 685, 2215, 404, -1824, -124, 2729, 1910, -999, -1459, 1034, 2210, -413, -1448, 1562, 1650, -2269, -1746, 2594, 2401, -1651, -1988, 931, 806, -918, -789, 1322, 1247, -1241, -3193, -67, 2277, 147, -2034, 467, 1573, -2520, -3106, 1637, 3180, -413, -2208, -774, 391, -731, -887, 934, 2529, 107, -3101, -1165, 2705, 825, -2211, 80, 2705, -539, -2609, 228, 2393, 218, -1713, -112, 2279, 1112, -2051, -1475, 1711, 1667, -1461, -576]
4247e76L331j663m323J405M419r84l215Q24J959j434k652J115L351J208l484k204
4263b923K301J003k894Q72M688k80n494j696M104J599j934J29K674j502l374q60
4279c587L509L332k300k985K014J901l183j969M456K142l150j631K443N13k769
4294a264r65L144K276j395l021J55K438r00k901K994L750k818m045J595K633j991
4310c15j183K727K376j879l860l95K981J341j759L36K496k380m692J054N806P25
4326C379l274p65J548j617k073K277L096N04l548k119K269J522k247p22L697Q23
4342B750m310j452L181R11k290R3K935J72l225j360J668K389j426j578K115J770
4358B343k776k909L062K358k193j136K792Q17l310k163K324L090J22k053o21Q40
$$ y = [-576, 2755, 1092, -3231, -1826, 2593, 1609, -1606, -782, 1177, -257, -2909, -1794, 1557, 2765, -719, -2923, -622, 381, -2513, -1641, 3047, 2767, -2727, -4423, -319, 1280, -654, -525, 2149, 647, -2727, -3587, -78, 3254, 954, -2031, -17, 1884, -1299, -3268, 1188, 3330, 180, -1451, 992, 1505, -1264, -2229, 915, 3191, 1796, -1225, -1070, 1368, 468, -2433, 561, 4311, 1493, -2552, -957, 1676, -315, -1498, 1229, 3605, 1726, -2134, -2529, 452, 1793, 34, 370, 2866, 486, -4206, -3152, 2654, 3379, 105, -660, 888, -729, -2802, -525, 2571, 3075, -473, -2592, -323, 1199, -1048, -1770, 1927, 2750, -1560, -3012, 169, 1080, -1210, -1117, 1818, 1990, -1235, -2595, -927, 1462, 36, -1542, 573, 2343, -433, -3342, -280, 2078, -115, -1251, 1541, 2358, -952, -3115, -791, 2299, 2421, 368, -253, 587]
4374E87j622k091L114M511j860m759L8K922r66j017K371J240k067k794L76K542
4390E25L55j558p18K626k25l357l00L523K43k620M21K171j318k287J041K053K84
$$ y = [587, -1035, -3126, -12, 4499, 2639, -2120, -2082, 840, -126, -1143, 1228, 2468, 401, -2393, -2017, 525, 880, -678, -1396, 1230, 1005, -2352, -2652, 871, 1114, -1506, -1085, 1086, -232, -2519, -1478, 575, 859]
$$ [...]
8191a77
##END NTUPLES=NMR FID
##END=
