##TITLE=1H_CG-1132-1
 CDCl3, 8 sc, 
 6.3.2020
##JCAMPDX= 6.0         $$ Bruker NMR JCAMP-DX V2.0
##DATA TYPE= NMR FID
##DATA CLASS= NTUPLES
##ORIGIN= UXNMR, Bruker Analytische Messtechnik GmbH
##OWNER= root
$$ XWIN-NMR		Version 3.5
$$ Fri Mar  6 14:02:58 2020 Russian Standard Time (UT+4h)  she@DPX200
##.OBSERVE FREQUENCY= 200.1315
##.OBSERVE NUCLEUS= ^1H
##.DELAY= (6, 6)
##.ACQUISITION MODE= SIMULTANEOUS
##.ACQUISITION SCHEME= undefined
##.AVERAGES= 8
##.DIGITISER RES= 18
##SPECTROMETER/DATA SYSTEM= spect
##.PULSE SEQUENCE= zg30
##.SOLVENT NAME= D2O
##.SHIFT REFERENCE= (INTERNAL, D2O, 0, 15.7039)
##AUDIT TRAIL= $$ (NUMBER, WHEN, WHO, WHERE, WHAT)
$$ ##TITLE= Audit trail, XWIN-NMR		Version 3.5
$$ ##JCAMPDX= 5.01
$$ ##ORIGIN= Bruker BioSpin GmbH
$$ ##OWNER= she
$$ F:/spectra/data/she/nmr/H-F/1/audita.txt
$$ ##AUDIT TRAIL=  $$ (NUMBER, WHEN, WHO, WHERE, WHAT)
(   1,<2020-03-06 14:01:50.23 +0400>,<she>,<DPX200>,
      <created by zg, POWCHK disabled, PULCHK disabled
       configuration hash MD5:
       00 E9 B6 7A A2 85 ED C7 34 08 36 98 17 FE 4E 26
       data hash MD5: 16K
       34 C2 1E 04 C8 CA 4C A4 74 BA 0D C9 48 CD B0 80>)
$$ ##END=
$$ 
$$ hash MD5
$$ 42 D1 26 03 8C B2 4C A8 56 3C 17 F5 E6 45 1C CB
##$RELAX= 
##$RELAX= 
##$RELAX= 
##$RELAX= 
##$RELAX= 
##$RELAX= 
$$ Bruker specific parameters
$$ --------------------------
##$DU= <F:/spectra>
##$EXPNO= 1
##$NAME= <H-F>
##$PROCNO= 1
##$TYPE= <nmr>
##$USER= <she>
##$AMP= (0..31)
100 100 100 100 100 100 100 100 100 100 100 100 100 100 100 100 100 100 
100 100 100 100 100 100 100 100 100 100 100 100 100 100 
##$AQSEQ= 0
##$AQ_mod= 1
##$AUNM= <au_zg>
##$AUTOPOS= <>
##$BF1= 200.13
##$BF2= 200.13
##$BF3= 200.13
##$BF4= 200.13
##$BF5= 200.13
##$BF6= 200.13
##$BF7= 200.13
##$BF8= 200.13
##$BYTORDA= 1
##$CFDGTYP= 0
##$CFRGTYP= 5
##$CHEMSTR= <none>
##$CNST= (0..31)
1 1 145 1 1 1 1 1 1 1 1 1 1 1 1 1 1 1 1 1 1 1 1 1 1 1 1 1 1 1 1 1 
##$CPDPRG= <>
##$CPDPRG1= <>
##$CPDPRG2= <>
##$CPDPRG3= <>
##$CPDPRG4= <mlev>
##$CPDPRG5= <mlev>
##$CPDPRG6= <mlev>
##$CPDPRG7= <mlev>
##$CPDPRG8= <mlev>
##$CPDPRGB= <>
##$CPDPRGT= <>
##$D= (0..31)
0 1.2 0 0 0 0 0 0 0 0.06 0 0.03 0 0 0 0 0.0002 0 0 0 0 0 0 0 0 0 0 0 0 
0 0 0 
##$DATE= 1583488909
##$DBL= (0..7)
120 120 120 120 120 120 120 120 
##$DBP= (0..7)
150 150 150 150 150 150 150 150 
##$DBP07= 0
##$DBPNAM0= <>
##$DBPNAM1= <>
##$DBPNAM2= <>
##$DBPNAM3= <>
##$DBPNAM4= <>
##$DBPNAM5= <>
##$DBPNAM6= <>
##$DBPNAM7= <>
##$DBPOAL= (0..7)
0.5 0.5 0.5 0.5 0.5 0.5 0.5 0.5 
##$DBPOFFS= (0..7)
0 0 0 0 0 0 0 0 
##$DE= 6
##$DECBNUC= <off>
##$DECIM= 24
##$DECNUC= <off>
##$DECSTAT= 4
##$DIGMOD= 1
##$DIGTYP= 9
##$DL= (0..7)
0 120 120 120 120 120 120 120 
##$DP= (0..7)
150 150 150 150 150 150 150 150 
##$DP07= 0
##$DPNAME0= <>
##$DPNAME1= <>
##$DPNAME2= <>
##$DPNAME3= <>
##$DPNAME4= <>
##$DPNAME5= <>
##$DPNAME6= <>
##$DPNAME7= <>
##$DPOAL= (0..7)
0.5 0.5 0.5 0.5 0.5 0.5 0.5 0.5 
##$DPOFFS= (0..7)
0 0 0 0 0 0 0 0 
##$DQDMODE= 0
##$DR= 18
##$DS= 0
##$DSLIST= <SSSSSSSSSSSSSSS>
##$DSPFIRM= 0
$$ [...]
##$SUBNAM2= <"">
##$SUBNAM3= <"">
##$SUBNAM4= <"">
##$SUBNAM5= <"">
##$SUBNAM6= <"">
##$SUBNAM7= <"">
##$SUBNAM8= <"">
##$SUBNAM9= <"">
##$SW= 24.9337058887773
##$SWIBOX= (0..15)
0 0 2 0 0 0 0 0 0 0 0 0 0 0 0 0 
##$SW_h= 4990.01996007984
##$TD= 16384
##$TD0= 1
##$TE= 0
##$TE2= 300
##$TE3= 300
##$TEG= 300
##$TL= (0..7)
0 120 120 120 120 120 120 120 
##$TP= (0..7)
150 150 150 150 150 150 150 150 
##$TP07= 0
##$TPNAME0= <>
##$TPNAME1= <>
##$TPNAME2= <>
##$TPNAME3= <>
##$TPNAME4= <>
##$TPNAME5= <>
##$TPNAME6= <>
##$TPNAME7= <>
##$TPOAL= (0..7)
0.5 0.5 0.5 0.5 0.5 0.5 0.5 0.5 
##$TPOFFS= (0..7)
0 0 0 0 0 0 0 0 
##$TUNHIN= 0
##$TUNHOUT= 0
##$TUNXOUT= 0
##$USERA1= <user>
##$USERA2= <user>
##$USERA3= <user>
##$USERA4= <user>
##$USERA5= <user>
##$V9= 5
##$VALIST= <valist>
##$VCLIST= <CCCCCCCCCCCCCCC>
##$VD= 0
##$VDLIST= <DDDDDDDDDDDDDDD>
##$VPLIST= <PPPPPPPPPPPPPPP>
##$VTLIST= <TTTTTTTTTTTTTTT>
##$WBST= 1024
##$WBSW= 4
##$XGAIN= (0..3)
0 0 0 0 
##$XL= 0
##$YL= 0
##$YMAX_a= 610936
##$YMIN_a= -185789
##$ZGOPTNS= <>
##$ZL1= 120
##$ZL2= 120
##$ZL3= 120
##$ZL4= 120
##$ABSF1= 10
##$ABSF2= 0
##$ABSG= 5
##$ABSL= 3
##$ALPHA= 0
##$AQORDER= 0
##$ASSFAC= 0
##$ASSFACI= 0
##$ASSFACX= 0
##$ASSWID= 0
##$AUNMP= <proc_1d>
##$AZFE= 0.1
##$AZFW= 0.1
##$BCFW= 1
##$BC_mod= 2
##$BYTORDP= 1
##$COROFFS= 0
##$CY= 11.3945322036743
##$DATMOD= 1
##$DC= 2
##$DFILT= <>
##$DTYPP= 0
##$F1P= 16.9975609425685
##$F2P= -3.02152046262296
##$FCOR= 0.5
##$FTSIZE= 0
##$FT_mod= 4
##$GAMMA= 1
##$GB= 0.15
##$INTBC= 1
##$INTSCL= 1
##$ISEN= 128
##$LB= 0.24
##$LEV0= 0
##$LPBIN= 0
##$MAXI= 10000
##$MC2= 0
##$MEAN= 0
##$ME_mod= 0
##$MI= 1.114404
##$NCOEF= 0
##$NC_proc= 0
##$NLEV= 6
##$NOISF1= 3.799351
##$NOISF2= 2.8
##$NSP= 1
##$NTH_PI= 0
##$NZP= 0
##$OFFSET= 15.70392
##$PC= 1
##$PHC0= -9789.805
##$PHC1= 18.80082
##$PH_mod= 1
##$PKNL= yes
##$PPARMOD= 0
##$PSCAL= 0
##$PSIGN= 0
##$REVERSE= no
##$SF= 200.130013532006
##$SI= 16384
##$SIGF1= 3
##$SIGF2= 2
##$SINO= 400
##$SIOLD= 16384
##$SREGLST= <1H.CDCl3>
##$SSB= 0
##$STSI= 0
##$STSR= 0
##$SW_p= 3612.71676300578
##$SYMM= 0
##$S_DEV= 0
##$TDeff= 0
##$TDoff= 0
##$TI= <>
##$TILT= no
##$TM1= 0
##$TM2= 0
##$TOPLEV= 0
##$USERP1= <user>
##$USERP2= <user>
##$USERP3= <user>
##$USERP4= <user>
##$USERP5= <user>
##$WDW= 1
##$XDIM= 8192
##$YMAX_p= 0
##$YMIN_p= 0
$$ End of Bruker specific parameters
$$ ---------------------------------
##NTUPLES= NMR FID
##VAR_NAME=  TIME,          FID/REAL,        FID/IMAG
##SYMBOL=    X,             R,               I
##VAR_TYPE=  INDEPENDENT,   DEPENDENT,       DEPENDENT
##VAR_FORM=  AFFN,          ASDF,            ASDF
##VAR_DIM=   8192,          8192,            8192
##UNITS=     SECONDS,       ARBITRARY UNITS, ARBITRARY UNITS
##FACTOR=    0.0002004,     1,               1
##FIRST=     0,             0,               0
##LAST=      1.6414764,     0,               0
##MIN=       0,             -185789,         0
##MAX=       1.6414764,     610936,          0
$$ Real data points
##PAGE= N=1
##DATA TABLE= (X++(R..R)), XYDATA
$$ [...]
2567C133K431m700n409K460M005K02M18j493m999m63O858K162n242k971J764J813
$$ 3133 5564 864 -4545 -2085 1920 2122 2540 1047 -3952 -4415 2443 4605 -637 -3608 -1844 -31
2583c1J258j101l403L59L560M36k252Op87j456L605L773m175n841K654M580J264
$$ -31 1227 126 -3277 -2918 642 1078 -1174 -1168 -1955 -3411 194 3967 -208 -6049 -3395 1185 2449
2600B449o91k937l657J804N660P62k587k693j489J428N469J016n822k306L755
$$ 2449 1758 -1179 -4836 -3032 2628 3390 803 -1890 -3379 -1951 3518 4534 -1288 -3594 161
2615A61J068J79N74k385k708L474L741k205l826l87J862K781J961m139m564K367
$$ 161 1229 1408 1982 -403 -3111 363 4104 1899 -1927 -2314 -452 2329 4290 151 -4413 -2046
2631b046N042k59j819j685k538Q40N229J522n050k956J199J261L210O70m538l591
$$ -2046 2996 2737 918 -767 -3305 -2465 2764 4286 -764 -3720 -2521 -1260 1950 2620 -1918 -5509
2647e509M507L338j827j903n71o33K339K664k124l831J295L012J594K79l083m449
$$ -5509 -1002 2336 509 -1394 -1965 -2598 -259 2405 281 -3550 -2255 757 2351 2630 -453 -4902
2663d902K601P316j38m948j749M92J040M047K017m404m375K416M111J183j250
$$ -4902 -2301 5015 4877 -71 -1820 -1328 -288 3759 5776 1372 -3003 -587 3524 4707 3457
2678C457l469j491M367K818l925j965J818l14k50L264n59n319l47N712J404l615
$$ 3457 -12 -1503 2864 5682 1757 -208 1610 1296 1046 4310 3751 -1568 -1915 3797 5201 1586
2694A586k779r52L075L789j272n387r25J837J327K643J136n704n442M393O283
$$ 1586 -1193 -2145 930 4719 3447 -1940 -2865 -1028 299 2942 4078 -1626 -7068 -2675 3608
2709C608j410l529j402q19J327K805n83k480p46Q66N16J445r89l985J075O146
$$ 3608 2198 -1331 -2733 -3552 -2225 580 -3 -2483 -3229 -2363 -1847 -402 -1391 -5376 -4301 1845
2725A845l81n701q86K588J267J137N45k940k516K415K593M91j20l972k654M646
$$ 1845 1464 -4237 -5123 -2535 -1268 -131 414 -2526 -5042 -2627 -34 457 337 -3635 -6289 -1643
2741a643N975l264n863O18L073P88J461Rl433j082K042J088P04k13k616q98M319
$$ -1643 4332 1068 -4795 -4177 -1104 -316 1145 1154 -2279 -3361 -1319 -231 473 260 -2356 -3254 1065
2758A065J285n661j144M657J356k422n24j020k002J959L634L77l452k581r20M171
$$ 1065 2350 -3311 -4455 202 1558 -864 -1388 -2408 -4410 -2451 1183 1560 -1892 -4473 -5393 -1222
2774a222L948l338m828K373L148j976o03L155k469l809L662M368k479m098j49
$$ -1222 2726 -612 -5440 -3067 81 -1895 -2498 657 -1812 -5621 -1959 2409 -70 -4168 -4317
2789d317L192L073j416m179Q00M396j177l048K548J947l907m35O604K85o507k171
$$ -4317 -1125 1948 532 -3647 -2847 1549 372 -2676 -128 1819 -2088 -2523 4081 4366 -2141 -4312
2805d312M964L516o22k795j647J431J389p36J243K597l474m450L919N097m259
$$ -4312 652 4168 3546 751 -896 535 1924 1188 2431 5028 1554 -2896 1023 6120 1861
2820A861l875L846L159l361k032J023J083K92K93o21Q5j618k632K334N451k059
$$ 1861 -2014 1832 4991 1630 -402 621 1704 1996 2289 1668 1753 135 -2497 -163 5288 3229
2836C229p133O62O167r75l249J281O64k852N9K980J107j615l570q76L769K987
$$ 3229 -3904 -3242 2925 1950 -1299 -18 646 -2206 -2147 833 1940 325 -3245 -4121 -352 2635
2852B635m089k601L977J484m990n24N052p79l175R54J557j632j171J142K189J217
$$ 2635 -1454 -4055 -78 1406 -3584 -4108 944 165 -3010 -2056 -499 -2131 -3302 -2160 29 1246
2868A246k612m460K095N000j013l153J580R03m165K78N298N83m414j377J702J942
$$ 1246 -1366 -5826 -3731 1269 256 -2897 -1317 -414 -4579 -4301 997 1580 -2834 -4211 -2509 -567
2884e67J40j233p13J762j56k760R35M203j810m663K916L457l522k218L515K321
$$ -567 -427 -1660 -2373 -611 -767 -3527 -2592 1611 -199 -4862 -1946 1511 -2011 -4229 -714 1607
2900A607k731j846L96J938J439j199j289J411N83l623Q51N733m64o220K66M596
$$ 1607 -1124 -2970 -2574 -636 803 -396 -1685 -274 309 -3314 -2463 3270 2806 -3414 -3148 1448
2916A448j61k101J624P51j685j039Q65J908J091k193k453K975K694l367k229M426
$$ 1448 1287 -814 810 1561 -124 -1163 -298 1610 2701 508 -1945 1030 3724 357 -1872 2554
2932B554J114l850l42L660o30k399J392J587j051j422m46J385K961j375m160R45
$$ 2554 3668 -182 -524 3136 2506 107 1499 3086 2035 613 167 1552 4513 3138 -1022 -77
2948g7L531j499k016L255O37m475p43L977J226k176j168M83Q95O9j258p81K262
$$ -77 3454 1955 -61 3194 3831 -644 -1387 2590 3816 1640 472 955 1850 1919 661 -120 2142
2965B142L20l010P3L178j807l081L028K470k929k631J780J549l74O6j802o94J556
$$ 2142 2462 -548 -475 2703 896 -2185 843 3313 384 -2247 -467 1082 708 774 -1028 -1722 -166
2982a66k35r57K144k88m274l43N310M61m524o78K012q03K61J171k00j532l07j89
$$ -166 -401 -1358 786 498 -3776 -4119 1191 1652 -2872 -3550 -1538 -2341 -2080 -909 -1109 -2641 -2948 -3137
3000c137L98J639j336k103K148K098l531k352L711K160k224k96R4j760K8K715
$$ -3137 -2739 -1100 -2436 -4539 -2391 -293 -3824 -6176 -2465 -305 -2529 -2825 -2731 -4491 -4463 -1748
3016a748J233j084j654k036P26M538P69m269r46L215n38p31K413j8l468M87L036
$$ -1748 -515 -1599 -3253 -5289 -4563 -25 744 -3525 -4471 -1256 -1794 -2525 -112 -130 -3598 -3111 -75
3033g5P58j308r21p97J780J952j527k099K602J959k580n25K037j212n87L210J432
$$ -75 683 -625 -1546 -2343 -563 1389 -138 -2237 365 2324 -256 -781 1256 44 -543 2667 4099
3050D099l658j932J175K065J993n3l272j557K567J415k94R80m81m267R06M752
$$ 4099 441 -1491 -316 1749 3742 3689 417 -1140 1427 2842 2548 3528 3047 -1220 -314 4438
3066D438k58l590P2J912m75L76J33j623K27J729k75r20k2r24r35L187J573l888
$$ 4438 4180 590 662 2574 2099 2475 2608 985 1212 2941 2666 1746 1724 800 -135 3052 4625 737
3084G37k603K890K397j282l72j105j762J204L067r77j852n21j260Q85L403l71
$$ 737 -1866 1024 3421 2139 1767 662 -1100 104 3171 2194 342 -179 -1439 -554 2849 2478
3100B478m006j04K323O6n86M56j335q74K181J044k541j215J071l8J317J045k677
$$ 2478 -1528 -1632 691 757 171 627 -708 -1582 599 1643 -898 -2113 -1042 -1080 237 1282 -1395
3117a395l085K792K754o56j497o22j785N47L802K38l214r83R44Q09J553J69l281
$$ -1395 -4480 -1688 1066 410 -1087 -1709 -3494 -2947 855 1093 -2121 -3104 -2160 -1351 202 371 -2910
3134b910r46L419M19k379O86K97j378J149K055j726k757J982J693J77n48j956
$$ -2910 -3856 -437 -18 -2397 -1711 -1414 -2792 -1643 412 -1314 -4071 -2089 -396 -219 -767 -2723
3150b723j614K406L364j334k885k84N20N98K717L16l728j772K669J473K86L8j628
$$ -2723 -4337 -1931 1433 99 -2786 -3070 -2550 -1952 765 1081 -2647 -4419 -1750 -277 9 47 -1581
3167a581k025K336J847j623n97P68m91J0J650j200k292K295K783j709j810K95
$$ -1581 -3606 -1270 577 -1046 -1643 -875 -1366 -1356 294 -906 -3198 -903 1880 171 -1639 -1344
3183a344k94J003K732k28l882o01K132J498J302l25l358j833L709K159j212o81
$$ -1344 -1638 -635 2097 1869 -2013 -2614 -482 1016 2318 1993 -1365 -3198 511 2670 1458 777
3199G77r43j357J536K815j357k378R42J120p57J46L64j638M03K194m27k470o6
$$ 777 -166 -1523 13 2828 1471 -907 35 1155 398 544 908 -730 -327 1867 1440 -1030 -1096
3216a096J385J6J213k68l304q04L308J244j061q87j524j453K146L392j716l447
$$ -1096 289 305 1518 1250 -2054 -2858 450 1694 633 -254 -1778 -3231 -1085 2307 591 -2856
3232b856O53P47L31J372p73k532M3K037J18q57K94j100l50K602K5l165j65K821
$$ -2856 -2203 -1456 -1125 247 -526 -3058 -3015 -978 -860 -1717 -1423 -2523 -2873 -271 -246 -3411 -3576 -755
3250g55M1m39M54j342j389K529J806r44j705n4j47J771K484j555k481M07J403
$$ -755 -714 -1153 -699 -2041 -3430 -901 905 -39 -1744 -1798 -1945 -174 2310 755 -1726 -1319 84
3267H4NJ148N49k506n94L204N87k500RJ222n3J32M96j682k34J879M97n11j42j111
$$ 84 89 1237 1786 -720 -1314 1890 2477 -23 -14 1208 1155 1287 1783 101 -133 1746 2243 1732 1590 479
3287D79j748K561K788k198l147R05J213P6J322l28l030m42K220N03j78l86r20
$$ 479 -1269 1292 4080 1882 -1265 -360 853 929 2251 1923 -1107 -1549 671 1174 996 610 -310
3304c10q18J531P65j451m94J908j089n5J242o71j777J831K158j990k114J053J446
$$ -310 -1128 403 1168 -283 -777 1131 42 -13 1229 558 -1219 612 2770 780 -1334 -281 1165
3321A165M06J327j264k317R39J723k3Q73L76k451j501L308J988j843j628R83p98
$$ 1165 1571 2898 1634 -683 256 1979 1956 2829 3205 754 -747 2561 4549 2706 1078 2061 1263
3338A263N25J824n97j511O49L39j152N45J018j146r2J417j346j581Q66J194o22
$$ 1263 1788 3612 3015 1504 2153 2492 1340 1885 2903 1757 1665 3082 1736 155 1021 2215 1593
3355A593O81n06k189r31L350M40j846k04p07j333J760J840j817j429L67j43L0
$$ 1593 2274 1768 -421 -1352 1998 2438 592 388 -319 -1652 108 1948 131 -1298 -931 -1074 -1044
3372a044J466l8k425K24J186j27n7P96r02j402K018L91k200M89K595p15j670P03
$$ -1044 422 384 -2041 -1817 -631 -758 -815 -19 -921 -2323 -305 86 -2114 -1625 970 255 -1415 -712
3390g12O7n78J356N42o58n38j82l55J682J961j672k418J021J784j234N18J720
$$ -712 -645 -1223 133 675 17 -521 -703 -1058 624 2585 913 -1505 -484 1300 66 584 2304
3407B304j408j502J174J038n06j99j14m30Q60L06j400m91J972l34j443P55M96
$$ 2304 896 -606 568 1606 1100 901 787 357 1217 1523 123 -368 1604 1270 -173 582 1078
3424A078j962L06K135p37k030P33Q22l35M80m76j421L48J202p95O14R28j655j866
$$ 1078 -884 -578 1557 820 -1210 -477 345 10 490 14 -1407 -1059 143 -652 -38 890 -765 -2631
3442b631J906K375j284j513Q10L95p94N35R29n50N21o2j207N92J155j050K53K625
$$ -2631 -725 1650 366 -1147 -337 58 -736 -201 728 178 699 637 -570 22 1177 127 380 3005
3460C005p77l424P85K465J22o82N15r16j110J044J166Q0L75j597j656J832K487
$$ 3005 2228 -1196 -411 2054 2176 1494 2009 1093 -17 1027 2193 2273 2648 1051 -605 1227 3714
3477C714j763k034J540M30j958M48K095r97j800M34N67j21n8o17j12J093n10k471
$$ 3714 1951 -83 1457 1887 -71 377 2472 1475 -325 109 676 555 497 -120 -232 861 351 -2120
3495b120J068K560q49k639J238L50k045Q70K467l84k390j225P98J500J158j347
$$ -2120 -1052 1508 659 -1980 -742 -392 -2437 -1567 900 516 -1874 -3099 -2301 -801 357 -990
3511i90j541P17O4r71P87K429j732k964J787K177j336j770J652P08o57l30o30
$$ -990 -2531 -1814 -1750 -2721 -1934 495 -1237 -4201 -2414 -237 -1573 -3343 -1691 -983 -1640 -1970 -2600
3528b600Q05J142q50q36J106M0k101Q28L564p92l598L83L087n14r56M00j04n64
$$ -2600 -1795 -653 -1503 -2339 -1233 -1193 -3294 -2466 1098 306 -3292 -2909 178 -336 -1292 -892 -996 -1560
3546a560K23Q39O54K62j578j677K678J879k012j562K239L87k322J065J744r44
$$ -1560 -1337 -498 156 418 -1160 -2837 -159 1720 -292 -1854 385 772 -1550 -485 1259 315
3562C15j051J024Q82r47m87k39J682J696j444l026J392K632n44j096J372m27k474
$$ 315 -736 288 1170 223 -264 -503 1179 2875 1431 -1595 -203 2429 1885 789 2161 1734 -740
3579g40R29K494O67j970q00O39M00R64j181n98J684K50k161J71J787j150j092
$$ -740 189 2683 3350 1380 580 1219 1619 2583 1402 804 2488 2738 577 748 2535 1385 293
3596B93K226J084k717j144J767Q17k3k79j760J67J587k57r16L99j34k026Q38L158
$$ 293 2519 3603 886 -258 1509 2326 2303 2024 264 431 2018 1761 845 1244 1110 -916 -78 3080
3614C080j042l039N0J684J05m7L02r48n69L71o02O02J134p04j612R40J128k243
$$ 3080 2038 -1001 -951 733 838 791 1093 145 -424 -53 -655 -53 1081 377 -1235 -295 833 -1410
3632a410j086L212R16j810j319k14k10J282J101o78o06q14j383R65L006p73l289
$$ -1410 -2496 716 1632 -178 -1497 -1711 -1921 -639 462 -216 -822 -1636 -3019 -2054 952 179 -3110
3649c110K98K485o03j219J009j91j219L74J125r0o81m01m05J258Q28j632r33K500
$$ -3110 -2812 -327 -930 -2149 -1140 -1331 -2550 -2176 -1051 -1141 -1822 -2223 -2628 -1370 -542 -2174 -3107 -607
3667f07r1k325K01J623j64p15J609K30k103n46J489J424R80j572k405P06K933
$$ -607 -698 -3023 -2822 -1199 -1363 -2078 -469 -239 -2342 -2888 -1399 25 1005 -567 -2972 -2266 667
3684F67L0j369Q44L93j956M39K656m09j800M70J578k96l97l23j00J615R09j334
$$ 667 697 -672 172 565 -1391 -952 1704 1295 -505 -35 1543 1247 850 527 427 2042 2951 1617
3702A617j347J903l24r43J672J086k113j127K100J125j325p49K33J59J019K16
$$ 1617 270 2173 1849 906 2578 3664 1551 424 2524 3649 2324 1575 1808 1967 2986 3202
3718C202j173k20M26p51K32K706j424k901P93J881m66j383Q31N45o10j51k23n72
$$ 3202 2029 1809 2235 1484 1716 4422 2998 97 890 2771 2305 922 1753 2298 1688 1537 1314 742
3736G42N59M15m15O35J3k273o10K719J183k464p84J066o18j26J199K47j350n17
$$ 742 1301 1716 1301 1936 1949 -324 -934 1785 2968 504 -280 786 168 42 1241 1488 138 -379
3754c79J10J87J423m10k058J025J709j322j498R13J164j567M0J519j151j047J073
$$ -379 -269 -82 1341 931 -1127 -102 1607 285 -1213 -300 864 -703 -663 856 -295 -1342 -269
3771b69P15k68n69p02Q7J674M31k025r63J536n8l33J876p1k604n25K256K42k05
$$ -269 446 178 -391 -1093 -1006 668 1099 -926 -1889 -353 -411 -744 1132 1061 -1543 -2068 188 430 225
3790B25N2q54n03P85K59j01P15n6j354L22R30m26r54J397Q65j722r94J257N18
$$ 225 277 -577 -1080 -295 -36 -137 578 522 -832 -510 420 -6 -960 437 1302 -420 -1414 -157 361
3809C61L4O84j180q85Q71M67q1M64j3j383m11J967J030j780j58N58j273J351Q98
$$ 361 395 1079 -101 -986 -115 352 271 735 722 -661 -1072 895 1925 145 -13 545 -728 623 1521
3828A521r59n31L63o3m26J077M84j041O9J360j307m91Q53M98n70L55rj479N07
$$ 1521 562 31 394 331 -95 982 1466 425 494 1854 547 56 909 1407 837 1192 1183 -296 211
3847B11K010p42o29J09o94o55J739R61j352p27O89k93m4J468n63j738O67O53j96
$$ 211 2221 1479 850 959 265 -390 1349 2310 958 231 920 627 583 2051 1488 -250 417 1070 874
3866H74j76M51j174J00J142o19j129N13R90r98j14M02m57p96J181O65j217m58
$$ 874 698 1149 -25 75 1217 598 -531 -18 972 -26 -140 262 -195 -991 190 855 -362 -820
3884h20O9m14Q42J048j206j426P60L74m73M13M65j549k64J549p7r68K42J00m82
$$ -820 -751 -1165 -323 725 -481 -1907 -1147 -773 -1246 -833 -368 -1917 -2181 -632 -709 -1677 -1435 -1335 -1817
3903a817N59N47q88p64J562p6p88L58j56o07J351J063j362j045R19M90P5R35J26
$$ -1817 -1258 -711 -1599 -2363 -801 -877 -1665 -1307 -1463 -2070 -719 344 -1018 -2063 -1144 -654 -579 356 482
3922D82k216J15J767L65n02K71n42r51J544N63r24L33K86l86o56R33J59r24O97
$$ 482 -1734 -1619 148 513 11 282 -260 -1211 333 896 -28 305 591 205 -451 482 641 -283 414
3941D14M93j281J96M76j17n6Q21p42j862R89J354m4l79k62j283J1J486J09n61
$$ 414 907 -374 -178 298 181 125 946 204 -1658 -669 685 641 262 0 -1283 -1272 214 323 -238
3960b38k50q5j383J339J414r61r03O27K66n97J001K24p57j77O89l93n25J093J90
$$ -238 -488 -573 -1956 -617 797 -164 -1067 -440 -174 -771 230 454 -303 -480 209 -184 -709 384 574
3979E74n55O02l23j095P70J470r8q94J63o24k43J691J141j790j266Q60N67k7R90
$$ 574 19 621 298 -797 -27 1443 1345 451 614 -10 -253 1438 2579 789 -477 383 950 923 1913
3998A913o46j258J82P69l41M15L20j130o45J353O5j209L16Q91r90m87Q04n24n81
$$ 1913 1267 9 191 960 619 1034 1354 224 -421 932 997 -212 104 995 5 -482 322 -202 -783
4017g83P28K64j053l37J80j49J018N48j378j422Q87J012p17N12L85j206p72J313
$$ -783 -55 209 -844 -1181 -1001 -1150 -132 416 -962 -2384 -1497 -485 -1202 -690 -305 -1511 -2283 -970
4035i70K19o58M86l25j39M92L69q51l10J472o45m53N48K58n42M10J056j161r39
$$ -970 -751 -1409 -923 -1248 -1387 -895 -526 -1377 -1687 -215 -860 -1313 -765 -507 -1049 -639 417 -744 -1683
4054a683J152O98m4P16o32j214O72J448l13j15L0m81n51J161J076j457k29O29
$$ -1683 -531 167 123 839 207 -1007 -335 1113 800 685 715 234 -317 844 1920 463 234 863
4072H63j45m69P41l90l27J111m50q66K39P21o54j9R18n68j586M85J668q2n24m49
$$ 863 718 249 990 600 273 1384 934 68 307 1028 374 355 1273 705 -881 -396 1272 1190 666 217
4092B17j031M57J705l30r39K80j73j012J126J436j088j237P97N94o65K21Q81n85
$$ 217 -814 -357 1348 1018 79 359 186 -826 300 1736 648 -589 208 802 137 358 1239 654
4110F54l07M99n86K56O39k77n20O00k8j126N88J917q79j413O08O01n70K59J097
$$ 654 347 846 260 516 1155 878 358 958 930 -196 392 2309 1430 17 625 1226 656 915 2012
4129B012j008j064M92j74R23O80j342j316J293N95r23P0J165r49j768J268M33
$$ 2012 1004 -60 432 258 1181 1861 519 -797 496 1091 168 238 1403 454 -1314 -46 387
4146C87l18j61K39o51j96L2m41O81P10j73j808L68P95o69J50J049p80j522O54
$$ 387 69 -92 147 -504 -700 -668 -1109 -428 282 109 -1699 -1331 -536 -1205 -1055 -6 -786 -2308 -1654
4165a654R95k82k04j05n52L47J072p39p53J135n33r71J045J030j099q66J217K78
$$ -1654 -659 -941 -1145 -1250 -1802 -1455 -383 -1122 -1875 -740 -1273 -2244 -1199 -169 -1268 -2134 -917 -639
4183f39p44k0P51O4l60k56o36Q71R81n03n26J262l20j398K28J857o5j015J39l7
$$ -639 -1383 -1403 -652 -588 -948 -1204 -1840 -969 12 -491 -1017 245 -75 -1473 -1245 612 547 -468 -329 -366
4203c66k02L20Q69l94K73n39m30M90J437p99q70R61P93j505l88J562j52m83J44
$$ -366 -568 -248 621 227 500 -39 -469 21 1458 659 -211 750 1543 38 -350 1212 1060 577 721
4222G21J39J86r9L27l27N63J61j355N99J537l32j679N49Q35r07J16J049J48j398
$$ 721 860 1046 947 1274 947 1510 1671 316 915 2452 2120 441 990 1825 918 1034 2083 2231 833
4241H33n36P76M46L65j18j228N67K19q87J03J772l45k117N19J037o89m86Q92K53
$$ 833 297 1073 1519 1884 1766 538 1105 1324 437 540 2312 1967 -150 369 1406 717 231 1123 1376
4260A376j071p69l5P26R28m07j406N62N90j293O8J412K08k412K43J726l22o62
$$ 1376 305 -464 -499 227 1155 748 -658 -96 494 -799 -731 681 889 -1523 -1280 446 124 -538
4278e38k0l6l00J58K13q6M30m56j001L51J415p24j108J502l1j465k86J720l2o37
$$ -538 -558 -594 -894 -736 -523 -609 -179 -635 -1636 -1285 130 -594 -1702 -200 -231 -1696 -1982 -262 -294 -931
4298i31J20m34j15j10N67L8O33r3k302K47K104l2j193N25M34j374J5J456j14n34
$$ -931 -811 -1245 -1360 -1470 -903 -865 -232 -325 -2627 -2380 -276 -308 -1501 -976 -542 -1916 -1901 -445 -559 -1093
4318a093k64J87m6O38m31n24J051M39j340n35J773j48j152M43J180r29n16J275
$$ -1093 -1357 -1170 -1216 -578 -1009 -1533 -482 -43 -1383 -1918 -145 -293 -1445 -1002 178 -751 -1267 8
4336HJ7k13r6l23J13J670n47j230Q29N15q54n1J978k56j908L63R18L38k22L05
$$ 8 25 -188 -284 -607 -494 1176 629 -601 228 743 -111 -162 1816 1560 -348 15 933 1271 1049 1354
4356A354P7k64K23o89p5R78Q9q04O61M94j267l90J613O00j064p94L51m15L92K89
$$ 1354 1431 1167 1390 701 626 1604 1693 889 1550 2044 777 387 2000 2600 1536 742 1093 678 1070 1359
4376A359j51j69J34o20j25J328k26j824L46J140n20o79N20K13r75K67L74j39k47
$$ 1359 1208 1039 1173 553 428 1756 1530 -294 52 1192 672 -7 513 726 -249 18 392 253 6
4395FM05k95k36J28o06k09J085M60j966j85Q51K75m34O24o1j137l34J111P1L23
$$ 6 411 116 -120 8 -598 -807 278 738 -1228 -1413 -562 -287 -721 -97 -158 -1295 -1629 -518 -447 -124
4415a24k02r31m9R38j4q19N42M89q14o6P28p1o94M92r7L1P1q0l61O87R24j491
$$ -124 -326 -1257 -1306 -368 -382 -1201 -659 -170 -984 -1050 -322 -393 -1087 -595 -692 -661 -590 -670 -1031 -344 580 -911
4437i11q55J175J050q93J61R6j228n5J757M00j156l25l25J69N52J320j304m91
$$ -911 -1766 -591 459 -434 -273 -177 -1405 -1460 297 697 -459 -784 -1109 -940 -388 932 -372 -863
4455h63Q85k96j24O12J80j456Q44N51l15l93N80K02m50M54k37l93M12O68l19k21
$$ -863 22 -274 -398 214 394 -1062 -218 333 18 -375 205 407 -43 411 174 -219 193 861 542 321
4475C21Q3n40j73J446N90k070m06J470q8o0O18l49r49N79L34j28M71jr58L65Q74
$$ 321 404 -136 -309 1137 1727 -343 -749 721 633 573 1191 842 -107 472 806 678 1149 1148 190 555 1429
4496A429n41o76N59O53n02j40M07j116O3J368n54q76%M09K1K64Q19j210q75J147
$$ 1429 888 212 771 1424 922 782 1189 73 136 1504 950 74 74 483 504 768 1587 377 -498 649
4516F49K5k82L77k23q13J43J134n88n49L9N38p84O18j37o78L78N73m91m32N36
$$ 649 674 392 769 546 -267 -124 1010 422 -127 -88 450 -334 284 147 -531 -153 420 -71 -503 33
4536C3l8k39O02l1j118m52Q42K67k20L78n32j237R08Q93o86pK85n54j43P58K96
$$ 33 -5 -244 358 327 -791 -1243 -401 -134 -354 24 -508 -1745 -837 56 -630 -637 -352 -906 -1049 -291 5
4557Eq76p7M38j83j7J58l01k34R37k66r18L80P23j90J02N8l46o40J194N84j38
$$ 5 -871 -948 -510 -693 -710 -552 -853 -1087 -150 -416 -1334 -954 -231 -421 -319 -261 -607 -1247 -53 531 393
4578C93n06J06o82N00J183k00q90j55N04m46Q51K72j112LQ56K6o03L90M37n64
$$ 393 -113 -7 -689 -189 994 794 -96 -251 253 -193 658 930 -182 -179 677 703 100 490 927 363
4598C63J63L49j003N6J042ln36o8j40k64L66R21r64o95M01K65k33P08J61j024
$$ 363 526 875 -128 -72 970 967 431 363 223 -41 325 1246 282 -413 -12 253 20 728 889 -135
4618a35l12P57j42j1N89r26n44O76M32l93M8Q17p32k98N97j31m68O31L90q60j07
$$ -135 -447 310 168 157 746 -180 -724 -48 384 -9 39 856 124 -174 423 292 -176 455 845 -15 -122
4639a22Q95m63j54J008p35p40L21P72k47K8N97j132k20R14l14m53N62m3p67L30
$$ -122 773 310 156 1164 429 -311 10 782 535 563 1160 28 -192 722 408 -45 517 474 -293 37
4659C7O20l49n78O51K8j111M30N61m95k13Q77l54j107Q86J26k27Q4M0r60jO41
$$ 37 657 308 -270 381 409 -702 -272 289 -206 -419 458 104 -1003 -117 9 -218 -134 -94 -1054 -1055 -414
4680d14J30m33N01o79m05P26M72q20n15N82j4l93J95O40n41M65k38m68j7R80k9
$$ -414 -284 -717 -216 -895 -1300 -574 -102 -922 -1437 -855 -869 -1262 -1067 -427 -968 -503 -741 -1209 -1226 -246 -275
4701b75q00P42K66j154P30O71l48l19N76n90o0O32N33p97rM96l10K19L77j97o88
$$ -275 -1075 -333 -67 -1221 -491 180 -168 -487 89 -501 -561 71 604 -193 -202 294 -16 203 580 383 -305
4722c05O89K69p87L97Q32p42l48O40n4l17O15L81q52m58K93o3P07M64p15p98L01
$$ -305 384 653 -134 263 1095 353 5 645 591 274 889 1270 418 -40 253 190 897 1361 646 -152 149
4743A49N53n85O39K88n95n96N15L02l29P04m51p71J06O05L5o05O52m5l78k32L42
$$ 149 702 117 756 1044 449 -147 368 670 341 1045 594 -177 -71 534 569 -36 616 571 193 -39 303
4764C03j78L34N96j087m71J084Nl73O39n91m67NQ16P9m57M70r07J58J94M79o64
$$ 303 125 459 1055 -32 -503 581 586 213 852 261 -206 -201 615 694 237 707 -200 -42 152 631 -33
4785c3M06P0o07l36O87R4o29M18K2p98K88N63j68k97M82k67p27N76j01R1m13J58
$$ -33 373 443 -164 -500 187 281 -348 70 92 -706 -418 145 -23 -320 162 -105 -832 -256 -357 -266 -679 -521
4807e21n53P8P72L34j068M43K68q80K2J069n96k89N67l28m50K78M11n0m25Q81
$$ -521 -1074 -996 -224 110 -958 -515 -247 -1127 -1105 -36 -632 -921 -354 -682 -1132 -854 -443 -493 -918 -37
4827c7q19k45Q25K64j010P13j16p37N93R72o03n41K26K07l64N45M65n51l29N06
$$ -37 -856 -1101 -276 -12 -1022 -309 -425 -1162 -569 403 -200 -741 -515 -308 -672 -127 338 -213 -542 -36
4847c6L01p71P76l41k03M91K85o30k40Q21K03q56M84J68k27K5N36R2r76K89K52
$$ -36 265 -506 270 -71 -274 217 502 -128 -368 453 656 -200 284 452 225 250 786 878 -98 191 443
4868D43J61P17m29o14rM67n8K57J41j48o81L99O12o94K97L13j89n40R8O5o0Q62
$$ 443 604 1321 892 278 269 736 678 935 1076 928 247 646 1258 564 861 1174 985 445 543 608 548 1410
4890A410l56n96J03n3J41N5L96o35o41L46P11j64k58J21n71K57M18K40q46Jk40
$$ 1410 1054 458 561 508 649 704 1100 465 -176 170 881 717 459 580 9 266 684 924 78 79 -161
4911a61l63O32P15r07l00M56R0p49K10O43l90l53L39j80m06M54k1k41N46o23o98
$$ -161 -524 108 823 -84 -384 72 162 -587 -377 266 -124 -477 -138 -318 -724 -270 -291 -532 14 -609 -1307
4932a307K91J030j41m55j97J24m93O99M82o17n2J8jj57L46J6p05O69K22p89J67
$$ -1307 -1016 14 -127 -582 -779 -655 -1148 -449 33 -584 -636 -618 -619 -776 -430 -414 -1119 -450 -228 -1017 -850
4953h50N92k20l53M56P4o52L19P44m09l65K58O0P4M83j38n38k19Q61o92O10P67
$$ -850 -258 -478 -831 -375 -301 -953 -634 110 -299 -664 -406 -346 -272 211 73 -465 -684 177 -515 95 862
4974H62j336k37K23Q73o94J63K56m5m03K29J44l90O77J77n88L93j17q29P36Q73
$$ 862 -474 -711 -488 385 -309 -146 110 65 -338 -109 35 -355 322 499 -89 304 187 -642 94 967
4994I67o32n88K21N18k05M11L65m66m99N95k18M05K87p02k70L80N47m32m66P98
$$ 967 335 -253 -32 486 281 692 1057 591 92 687 469 874 1161 459 189 569 1116 684 218 1016
5014A016q6o49M69K10l46L68J58l22n12L3J84j4Q62l73r47j95P70J94l32O67r38
$$ 1016 930 281 750 960 614 982 1140 818 306 339 523 509 1371 998 51 -144 626 820 488 1155 217
5035B17m56J46R32p87M14j52o84L61K00N5l25R9k58k48K34K76m43m25Q84l64l61
$$ 217 -239 -93 839 52 466 314 -370 -9 191 246 -79 20 -238 -486 -252 24 -419 -844 40 -324 -685
5056f85M4L63J59k04j50l98j58Q12K27n49k28o2m41Q30O38l96n36k10K65J26M75
$$ -685 -641 -278 -119 -323 -473 -871 -1029 -217 10 -539 -767 -829 -1270 -440 198 -198 -734 -944 -679 -553 -78
5077g8K0n51M5M51m94J96J91L3n43K16N75q18L48L87O7n29N78n95J23O57L60r34
$$ -78 -58 -609 -564 -113 -607 -411 -220 -187 -730 -514 61 -757 -409 -22 45 -484 94 -501 -378 279 639 -295
5099b95l23L86O3r8O08l56o30L33R23m70k65K30n05J81M31L25o47K8K87j14q7
$$ -295 -618 -232 -169 -267 341 -15 -645 -312 611 141 -124 106 -399 -218 213 538 -109 -81 206 92 5
5120EL14k62o5M78J37p28k59O31jJ31L10m87j69J13J50p0M26j21n70K2O48k31
$$ 5 319 57 -8 470 607 -121 -380 251 250 381 691 204 35 148 298 228 654 533 -37 -15 633 402
5142D02j58Q7L72o60P9N15k83j74M25j47m60L65l09J12M03L78j054n1P45p9k66
$$ 402 244 331 703 43 122 637 354 180 605 458 -2 363 54 166 569 947 -107 -158 587 508 242
5163B42O4jp95L54Q17j54p47J24k70K70M73j91o57K34L05j80m73M69M07m54L42
$$ 242 306 305 -490 -136 681 527 -220 -96 -366 -96 377 186 -471 -237 68 -112 -585 -116 291 -163 179
5184A79k06n64K85PL52l16kl12j11M96J93m82p5p4m66K54P30J91j224K68O89k33
$$ 179 -27 -591 -306 -299 53 -263 -265 -577 -688 -192 1 -481 -556 -630 -1096 -842 -112 79 -1145 -877 -188 -421
5206d21J04j3j75pmq3J8M64k86k49N0M93m41Q1P09J7p44J14o9L9K67O43o50k87
$$ -421 -317 -330 -505 -512 -516 -599 -581 -117 -403 -652 -602 -109 -550 -469 240 257 -487 -373 -442 -403 -136 507 -143 -430
5230d30j70L60O28k51k5m91r1O47K28l54L85m51k89L06N66n71j18P32n19m93N35
$$ -430 -600 -240 388 137 112 -379 -470 177 405 51 436 -15 -304 2 568 -3 -121 611 92 -401 134
5251A34QR0L86K47r01j52P32j83ML78k31r58N12P22k44j80k62ON8P49m78n22J56
$$ 134 142 232 618 865 -36 -188 544 361 365 743 512 -446 66 788 544 364 102 108 166 915 437 -85 71
5274G1K08j92J77K89k38l01K74o0M1k85K65k32L08N18q52m75N78L1k36L45o4n93
$$ 71 279 87 264 553 315 14 288 228 269 -16 249 17 325 843 -9 -484 94 125 -111 234 170 -423
5296d23K85M30rl01Q2m09P3O05Q7k89l76M38K9l79O7j79K9p9L92l89j55N22j44
$$ -423 -138 292 283 -18 64 -345 -272 333 420 131 -245 193 222 -157 -90 -269 -240 -319 73 -316 -471 51 -93
5319i3J28k03r0p04O04O89n23l24n2pN1N60np09j15O18J01k19K52l19l55O16k00
$$ -93 35 -168 -258 -962 -358 331 -192 -516 -568 -575 -524 36 31 -678 -793 -175 -74 -293 -41 -360 -715 -99 -299
5342b99m33L76J39j80l4K9j20j23M77N62m13o40K15J6L37O66m85p85J77P54l63
$$ -299 -732 -356 -217 -397 -431 -402 -522 -645 -168 394 -19 -659 -444 -428 -91 575 90 -695 -518 236 -127
5363a27L14n4m66j8P09j46k74J87L14o75L4O40j53k48M58J6l70J71K4j32J69N14
$$ -127 187 133 -333 -351 358 212 -62 125 439 -236 -202 438 285 37 495 511 141 312 336 204 373 887
5385H87o66m80P25R7k5n5k00j44p9Q45l49j62J18k92o21N17L61k1l50qO2M0J92
$$ 887 221 -259 466 563 538 483 283 139 60 905 556 394 512 220 -401 116 477 456 106 98 160 200 392
5408C92ko9k77L35j17q6J65l01J12K58j56l29j82O22%l65J2k43l56Q21L79q57
$$ 392 390 321 44 379 262 176 341 40 152 410 254 -75 -257 365 365 0 12 -231 -587 234 613 -244
5430b44l41P41m82J26N81m03n14L27L08l13J00K79m29m4L63j15p89R34K11o57
$$ -244 -585 156 -326 -200 381 -22 -536 -209 99 -214 -114 165 -264 -308 55 -60 -849 85 296 -361
5450c61o5O8l88K36M95J91o77K12l09m2N55P0n02k92O77j12k88K12K58m82m9R7
$$ -361 -426 -358 -746 -510 -15 176 -501 -289 -598 -640 -85 -15 -517 -809 -132 -244 -532 -320 -62 -544 -593 -496
5472d96J99M0K09k49J27j28k1l17N68M88n39k58J93j01Q1M74q0l78n12M99K43
$$ -496 -297 -257 -48 -297 -170 -298 -319 -636 -68 420 -119 -377 -184 -285 -204 270 190 -188 -700 -201 42
5493D2L1K26m55l56O53J62k59L2J44k59r1L70k8m88M00K33m27J16L86m95L29J85
$$ 42 73 299 -156 -512 141 303 44 76 220 -39 -130 240 212 -276 124 357 -70 46 432 -63 266 451
5515D51R9r33N52K94J80jn3m81l45Q23L29o30p7R6m67M45L50m41K65j58P1k16
$$ 451 550 -383 169 463 643 642 589 108 -237 586 915 285 208 304 -163 282 632 191 456 298 369 153
5537A53K26K84n33P5L83n80k75L52L25q4o8p7p65M48N29k8m59O5j48j50O96J64
$$ 153 379 663 130 205 588 8 -267 85 410 326 258 181 -584 -136 393 365 -94 -29 -177 -327 369 533
5559E33j64r68M69J01k07L45J1k50l45N81n61K0L09l07O7M54j99m81L18L07j59
$$ 533 369 -599 -130 -29 -236 109 120 -130 -475 106 -455 -435 -126 -433 -366 88 -111 -592 -274 33 -126
5580a26m28K02J22k48J16j5k14J68p9p2O25M5n35m46O71L63n27J55K09p35M45
$$ -126 -554 -352 -230 -478 -362 -377 -591 -423 -502 -574 51 96 -439 -885 -214 149 -378 -223 -14 -749 -304
5601c04J71K8k08L52k64k43L40K04m28K26L81j59n94L60K28j57L5L82l41l96K86
$$ -304 -133 -105 -313 39 -225 -468 -128 76 -352 -126 255 96 -498 -138 90 -67 -32 350 9 -387 -101
5622a01n1K09K95m53j13K67K81n11j3K72k08q5M67K22n43k0K77K49n66J62R0n32
$$ -101 -152 57 352 -101 -214 53 334 -177 -190 82 -126 -211 256 478 -65 -85 192 441 -125 37 127 -405
5644d05J004k34n91M75K47o7l35L44m71j81M09M61k07k81k81J8J57O09j3n08K50
$$ -405 599 365 -226 249 496 429 94 438 -33 -214 195 656 449 168 -113 -95 62 671 658 150 400
5665D00p9j35l10O56n10Q4N40k46n30m8N56KR3n07J06l33O39k29m64J16L38l76
$$ 400 321 186 -124 532 22 106 646 400 -130 -178 378 380 473 -34 72 -261 378 149 -315 -199 139 -237
5687b37K20O04m51o33M65J05k7J04n9o18L1L49lJ07L6J57o76M32j98k34K86N19
$$ -237 -17 587 136 -497 -32 73 46 150 91 -527 -496 -147 -150 -43 -7 150 -526 -94 -292 -526 -240 279
5709B79o2n90j73k90M95L60n4k46l03k2M1L64J32K4n73L40N00p22J04J01K01k50
$$ 279 217 -373 -546 -836 -341 19 -35 -281 -584 -606 -565 -201 -69 -45 -618 -278 222 -500 -396 -295 -94 -344
5731c44L77j78m66L01J38M15m70L44k46l00M79J43l20m6K15P7n7j48k44J68P0
$$ -344 33 -145 -611 -310 -172 243 -227 117 -129 -429 50 193 -127 -173 42 119 62 -86 -330 -162 -92
5752i2O21r8m07K2k96N63L4J36m32K25k42m3J14Q0o6J08K14J40m09j65N0K50L19
$$ -92 529 431 24 46 -250 313 347 483 51 276 34 -9 105 185 119 227 441 581 172 7 57 307 626
5775F26m2n58k26O80j76j0L03k43l51j92M95N5j88o4L18l77L59q1k75m4K80R4
$$ 626 584 26 -200 480 304 294 597 354 3 -189 306 361 173 109 427 50 409 328 53 9 289 383
5797C83k11K37k19l23N98k6m04j54L85k00J44K3m78J36M05J81r4n78J87o68O08
$$ 383 172 409 190 -133 465 439 35 -119 266 66 210 233 -245 -109 296 477 383 -195 -8 -676 -68
5818f8Q83m87o51j63M77r9R2p1j65o6%M12l46L7J05Q1K18Q2p45k41Q19l9m63j17
$$ -68 815 328 -323 -486 -9 -108 -16 -87 -252 -318 -318 94 -252 -215 -110 -29 189 271 -474 -715 104 65 -398 -515
5842e15L83k83M10L71o01l42L08j51L24P2l09m00K92M46K30m24K88l99j06L50
$$ -515 -132 -415 -5 366 -235 -577 -269 -420 -96 -24 -333 -733 -441 5 235 -189 99 -300 -406 -56
5862e6j48N15o32J60K76l36k2J37o7K13K55j78m82J32q4K45J05j4k73K93L44q0
$$ -56 -204 311 -321 -161 115 -221 -243 -106 -173 40 295 117 -365 -233 -317 -72 33 19 -254 39 383 303
5884C03J45k60j05l89O01L3k54l30N17m8p7L80l61l41N38k32k6j75L85j07M5L10
$$ 303 448 188 83 -306 295 328 74 -256 261 213 136 516 155 -186 352 120 94 -81 304 197 242 552
5906E52k68n27N29L7K3k0N5k93K47L34q3l88n7o4j36O1N31k02l86L19j84q6N98
$$ 552 284 -243 286 323 346 326 381 88 335 669 586 198 141 77 -59 2 533 331 -55 264 80 -6 592
5929E92m51r2J85K14l50k33J45K07n3n8K0k82K29K17j51k55J43l32K72K33J81
$$ 592 141 49 234 448 98 -135 10 217 164 106 126 -156 73 290 139 -116 27 -305 -33 200 381
5950C81m11k82K52j38R6L32l61n9J50J78k07n17N86l73M4N2J77o37O30L11l78
$$ 381 -30 -312 -60 -198 -102 230 -131 -190 -40 138 -69 -586 0 -373 -329 -277 -100 -737 -107 204 -174
5971a74l80J27L4K19M55o61j30L52j93j09L26R9l51k06N24j30J53j77rl33K97
$$ -174 -554 -427 -393 -174 281 -380 -510 -158 -351 -460 -134 -35 -386 -592 -68 -198 -45 -222 -231 -564 -267
5992b67K79J68p24M41l5m7o0j07M88l05K5K12k95K34Q9k68M36k51k27J18L41L51
$$ -267 12 180 -544 -103 -138 -185 -245 -352 136 -169 -144 68 -227 7 96 -172 264 13 -214 -96 245 596
6014E96o62K27l56L16L84m98K08j51J65N6j87P8J52j13k0N7k68p8M85J3k41K23
$$ 596 -66 161 -195 121 505 7 215 64 229 285 98 176 328 215 195 252 -16 -94 391 404 163 386
6036C86m70J65L46k17M5k69J71l73J79L72J42j80k53k8L17l14K16r7L5M0k24o
$$ 386 -84 81 427 210 255 -14 157 -216 -37 335 477 297 44 16 333 19 235 138 173 213 -11 -17
6058a7MK0J05k65K28j6j24R2L51j2m77P6%k79P92K08r90L11K2q6J73M2j82k47
$$ -17 -13 7 112 -153 75 59 -65 27 378 366 -111 -35 -35 -314 478 686 -304 7 29 -57 116 158 -24 -271
6082b71N3K89k53K72J8m32o4L44J86l01K58k17%j73J39k78L06K67j41k66J47j19
$$ -271 -218 71 -182 90 108 -324 -388 -44 142 -159 99 -118 -118 -291 -152 -430 -124 143 2 -264 -117 -236
6104b36J17J44J23m59MM80k29p4j45j00qM02k01R3m0j60J22J55R7k07j17l5N05
$$ -236 -119 25 148 -311 -307 173 -56 -130 -275 -375 -383 19 -182 -89 -129 -289 -167 -12 85 -122 -239 -274 231
6127B31k81k86M81K5m90O72k28m99K36M01j47O3j28p2k92P61k0k26k59J73kO8
$$ 231 -50 -336 145 170 -320 352 124 -375 -139 262 115 178 50 -22 -314 447 427 201 -58 115 113 181
6149A81K10k93k33M9M55l56N8K36l0k41J99N4o40L92K09j25o6k90j30L47M76n2
$$ 181 391 98 -135 -86 369 13 71 307 277 36 235 289 -351 41 250 125 59 -231 -361 -14 462 410
6171D10l76k3p0m4M02L94p65l52N05o9K82M7k94k35J20M75k83j21L0M0j32M20
$$ 410 34 11 -59 -103 299 693 -72 -424 81 12 294 341 47 -188 -68 407 124 3 33 73 -59 361
6193C61nn75J19L80J37n84m3R6J49L04m25M0m26N81j75j04M23m50j38k7M31J2
$$ 361 356 -219 -100 280 417 -167 -210 -114 35 339 -86 -46 -472 109 -66 -170 253 -197 -335 -362 69 81
6215H1l59P2k49N31o6K16j98j88p1o0L64q2o3k15N92Qp88Q3J85j15L88Q4l36O7
$$ 81 -278 -206 -455 76 10 226 28 -160 -231 -291 73 -9 -72 -287 305 313 -475 -392 -207 -322 66 150 -186 -119
6239a19J25R2r4J03l55l04J78O53k24m75M60P1J12m84j2n4j26O96k68k63K55L
$$ -119 6 98 4 107 -248 -552 -374 279 55 -420 40 111 223 -261 -273 -327 -453 243 -25 -288 -33 -30
6261c0L9K07L2n07k24P87k30j16L9K9l79M82M58m31l34K7l4J49L51j52k28J4K53
$$ -30 9 216 248 -259 -483 304 74 -42 -3 26 -353 129 587 156 -178 -151 -185 -36 315 163 -65 -51 202
6284B02Nl8L48m21j67K07P9k28K15L70n54J20j18l0j23M30K27m01m1k10j29P29
$$ 202 207 169 517 96 -71 136 215 -13 202 572 18 138 20 -10 -133 297 524 123 82 -128 -257 472
6306D72m1k19m48K52J42R1L4m8o04l2O00J67m4k08P7l41J61l4O5k43M11m5l45
$$ 472 431 212 -236 16 158 249 283 235 -369 -401 199 366 322 114 191 -150 11 -23 42 -201 210 165 -180
6329a80k28Q7L63M16r6o19l36M39L69p3K89j83p25qP57J65l75k95L29k19k51K86
$$ -180 -408 -321 42 458 362 -257 -593 -154 215 142 431 248 -477 -485 272 437 62 -233 96 -123 -374 -88
6351h8K01r3J10l05J89q7j67j34K79L39j81l80M57Q4j62q7k21k31M44J12k27j48
$$ -88 113 20 130 -175 14 -73 -240 -374 -95 244 63 -317 140 224 62 -25 -246 -477 -33 79 -148 -296
6373b96p5pK86M63J8o04N1Q5j38L14r6j7j45J21r8l9J51K62j97L19J43j193K54
$$ -296 -371 -378 -92 371 389 -215 -164 -79 -217 97 1 -16 -161 -40 -138 -177 -26 236 39 358 501 -692 -438
6396d38L22N65m26l0l02P9O9M57O5m44n8j68K43K44k74j53j88N19J07KK56l94
$$ -438 -116 449 23 -7 -309 -230 -161 296 361 -83 -141 -309 -66 178 -96 -249 -437 82 189 191 447 53
6418E3k16L7P17m15j28q6k02K31K68p6m09K92J16k95l89M29R0J24K59O7n60m7
$$ 53 -163 -126 591 176 48 -38 -240 -9 259 183 -226 66 182 -113 -502 -73 17 141 400 467 -93 -140
6440a40J00K96Q9k57j75n9p3L04j15j37J48P6j74O23o26l08M92J16p7k04n0J69
$$ -140 -40 256 345 88 -87 -146 -219 85 -30 -167 -19 57 -117 506 -120 -428 64 180 103 -101 -151 18
6462A8k6P7L4l65L4KL7m9L02m86K43n5L8j04j33M6L7j65L02q5J20K92m92J57J04
$$ 18 -8 69 103 -262 -228 -226 -189 -238 64 -422 -179 -234 -196 -300 -433 -387 -350 -515 -213 -298 -178 114 -378 -221 -117
6487a17j83J44K00j37j52j64M12k42M1J6J84l84l1L25K73j01k74k90K12L05J02
$$ -117 -300 -156 44 -93 -245 -409 3 -239 -198 -182 2 -382 -413 -88 185 84 -190 -480 -268 37 139
6508A39l10J24m9j58o2K99M3j10k3N30n61j3L45l53M12J27l09j94J40j19J90l17
$$ 139 -171 -47 -96 -254 -316 -17 26 -84 -107 423 -138 -151 194 -159 253 380 71 -123 17 -102 88 -229
6530b29J89n5l9K20J15j37QR2k03L11K7j55k61L57k40L55J10j00k77l56Q43l78
$$ -229 -40 -95 -134 86 201 64 72 164 -39 272 299 144 -117 240 0 355 465 365 88 -268 575 197
6552A97j11J11K21n30L64l27J96R3K41j6o88M3J98J59J57j08j66j24K45O5J05
$$ 197 86 197 418 -112 252 -75 121 214 455 439 -249 -206 -8 151 308 200 34 -90 155 220 325
6573C25k39o1K05O3k8J19n70J66K95k39J40j47mK90j80p5k75L35k90L09K9k62
$$ 325 86 25 230 293 265 384 -186 -20 275 36 176 29 25 315 135 60 -215 120 -170 139 168 -94
6595i4l14K95J14K26j15k7n16l5M54L36k22l33K12k33j67M27r4j32J87Mj46J01
$$ -94 -408 -113 1 227 112 85 -431 -466 -12 324 102 -231 -19 -252 -419 8 -86 -218 -31 -27 -173 -72
6617g2k29kr2L73j09n28L95o3N59m84J35k50M2O58j87j98l87J84M1M04j46m47
$$ -72 -301 -303 -395 -22 -131 -659 -264 -327 232 -252 -117 -367 -325 333 146 -52 -439 -255 -214 190 44 -403
6639d03K65O0o5J22j60J98k51J39J59j69l0l6L87k54K53k75n4J48N53m12l52O7
$$ -403 -138 -78 -143 -21 -181 17 -234 -95 64 -105 -135 -171 216 -38 215 -60 -114 34 587 175 -177 -110
6661a10J41l9N40j84l67k6j01N57j31k10J7j05M5J74j83k46J52K63n6K8k0j17
$$ -110 31 -8 532 348 -19 -45 -146 411 280 70 87 -18 27 201 18 -228 -76 187 131 159 139 22
6683B2o9N28n83oQ8r4J27N85m69k62k4O4L84j03j43k54K94K55m8n79K3M3j02K82
$$ 22 -47 481 -102 -108 -20 -114 13 598 129 -133 -157 -93 291 188 45 -209 85 340 292 -287 -264 -221 -323 -41
6707d1K86k70l97J91M8j46L10m5k10M37L6j53n10M08p7K70J29k42l19q2L78J66
$$ -41 245 -25 -422 -231 -183 -329 -19 -64 -274 163 199 46 -464 -56 -133 137 266 24 -295 -377 1 167
6729A67k81o6l96K90L47j93J25l1j36K98l69K04n3l42J40K31q7k57M25k90O1L34
$$ 167 -114 -180 -576 -286 61 -132 -7 -38 -174 124 -245 -41 -94 -436 -296 -65 -152 -409 16 -274 -213 121
6751A21j00m90P6M00J76l36Rk67k6M11Q1l71J3j7L7P08j82n65J14r5K86J26kK75
$$ 121 21 -469 -393 7 183 -153 -144 -411 -437 -26 55 -316 -303 -320 -283 425 243 -322 -208 -303 -17 109 107 382
6775C82k04k59K66j31l02J57K90j63k9J48n61L36N02k06j02k88J27J70J65L27
$$ 382 178 -81 185 54 -248 -91 199 36 7 155 -406 -70 432 226 124 -164 -37 133 298 625
6795F25o62k95L09J78J7N2k38r6j57O13j46M0n02K20J95j43J50m39KL52L7k97
$$ 625 -37 -332 -23 155 172 224 -14 -110 -267 346 200 240 -262 -42 153 10 160 -279 -277 75 112 -185
6817a85K24j09L93k24n5l68J30K14J5R7J67n50J5o0N77L3m73k07J22J22O04n06
$$ -185 39 -70 323 99 44 -324 -194 20 35 132 299 -251 -236 -296 281 314 -159 -366 -244 -122 482 -24
6839b4k5m9J06j8J42k8k44n2N37j23l65l2N8K04p8J70m71l42M63M26n7k97O7m34
$$ -24 -49 -98 8 -10 132 104 -140 -192 345 222 -143 -175 -117 87 9 179 -292 -634 -171 255 198 -99 -32 -466
6863d66M6M28L94o24O7M0k22O0K85k67J03j64M15j40l40j0K16K49Qj16l76N59
$$ -466 -420 8 402 -222 -155 -115 -337 -277 8 -259 -156 -320 95 -45 -385 -395 -179 70 78 -38 -414 145
6885A45j56j06M48m19l53J23N49k01l91R8J32j16N80k97p04M49J92O4P7L00m26
$$ 145 -11 -117 331 -88 -441 -318 231 30 -361 -263 -131 -247 333 36 -668 -219 -27 37 114 414 -12
6906a2p4P7P5l95K23mK46l70L77o7k18PJ58J89l49k23J94Q4L61j67l33J46j1M4
$$ -12 -86 -9 66 -329 -106 -110 136 -234 143 76 -142 -135 23 212 -137 -360 -166 -82 279 112 -221 -75 -86 -42
6930d2L29j09n81J63K77K06n51L57k38m3K02J09J92k89j9k67M35K02K94q76K12
$$ -42 287 178 -403 -240 37 243 -308 49 -189 -232 -30 79 271 -18 -37 -304 131 333 627 -249 -37
6951c7L67n49J03J07K98k15K97j50m02K01N23m00l54L32l11M1O06j03k86Jk31
$$ -37 330 -219 -116 -9 289 74 371 221 -181 20 543 143 -211 121 -190 -149 457 354 68 69 -162
6972a62P3J04PM2j78j04M04k19L2k11j7K54K8j26k72O4M04m2L47l16k64k55P09
$$ -162 -89 15 22 64 -114 -218 186 -33 -1 -212 -229 25 53 -73 -345 -281 123 81 428 112 -152 -407 302
6995C02k49j97J12M5jJ19J41m95Q5J99K67k34J09j24q0N9l1K1j70N15n7j68j73
$$ 302 53 -144 -32 13 12 131 272 -223 -138 61 328 94 203 79 -1 58 27 48 -122 393 336 168 -5
7018eL73n33L7N82L05o24k19K90J71L2L3j77J1k04K17J08j24J37l68K77j0m03
$$ -5 368 -165 -128 454 759 135 -84 206 377 409 442 265 276 72 289 397 273 410 42 319 309 -94
7040i4o9L97M73l11j91j69Q9J75k55n5J91O2k81L30P7k74O9j09L47k81J53o6J13
$$ -94 -163 234 707 396 205 36 125 300 45 -10 181 243 -38 292 369 95 164 55 402 121 274 208 321
7063C21l67K14j16J45q5k01L17J25j9J54m94K72J55n66K84J63p0K38j49j77j91
$$ 321 -46 168 52 197 112 -89 228 353 334 488 -6 266 421 -145 139 302 232 470 321 144 -47
7084d7j03M56J35m4k67m69L8M85O6m46L92Jk39j71M27j23j22K09j40p9j90R4J90
$$ -47 -150 306 441 397 130 -339 -301 184 250 -196 196 197 -42 -213 214 91 -31 178 38 -41 -231 -137 53
7107E3O2P4m14J3L27j15j04k01J11k34Q00l31M6n17n7K24m0K25L0pk67m4O4J76
$$ 53 115 189 -225 -212 115 0 -104 -305 -194 -428 372 41 87 -430 -487 -263 -303 -78 -48 -55 -322 -366 -302 -126
7131a26K96m72m88P60k25k57K19K75J36j68j80r0o6J42N07n53P7K2Q8N1K17k81
$$ -126 170 -302 -790 -30 -255 -512 -293 -18 118 -50 -230 -320 -386 -244 263 -290 -213 -191 -103 -52 165 -116
7153a16k78L86RK34l22P6k62M75K63m40j03J14J3j56K91j40k63J64j0O0j0j3J68
$$ -116 -394 -8 1 235 -87 -11 -273 202 465 25 -78 36 49 -107 184 44 -219 -55 -65 -5 -15 -28 140
7176A40J0j12J25m3o9l3J66q0J24n5k83m1N17l70kJ77k69l10K43K55oP1o7m2J09
$$ 140 150 38 163 120 51 18 184 104 228 173 -110 -151 366 -4 -6 171 -98 -408 -165 90 84 155 88 46 155
7201A55l99J95k71M12K69n29j36K81M2ON5j47l09L14K82J7j67P9j96J38q2j07
$$ 155 -244 -49 -320 92 361 -168 -304 -23 19 25 80 -67 -376 -62 220 237 70 149 -47 91 9 -98
7223i8l0J9J70r0k76L70l7l67J89J02j31J97J1L1j22R5j9j73K42j29j32K03J84
$$ -98 -128 -109 61 -29 -305 65 28 -339 -150 -48 -179 18 29 60 -62 33 14 -159 83 -46 -178 25 209
7246B09o03L61K21K35j005J53M20j82L86J77l76k46J7K51k18J34k6Q2l31L62l0
$$ 209 -394 -33 188 423 -582 -429 -9 -191 195 372 -4 -250 -233 18 -200 -66 -92 -10 -341 21 -9
7267in83M21J72k6k2q7J22J3L24k80k47J48m13M54J55j86k8l77L12M79j64j64
$$ -9 -592 -171 1 -25 -47 -134 -12 1 325 45 -202 -54 -467 -13 142 -44 -72 -449 -137 342 178 14
7289A4K05n34L06K28k0j35O9q7j2K68o7o16K43O17k70k96K62N6O0J47j88j52r7
$$ 14 219 -315 -9 219 199 64 133 46 34 302 235 -381 -138 479 209 -87 175 231 291 438 250 98 1
7312AJ68n9K77j79j15n8K21M60n28J35k24l57M39K92l25j54L7K50j33K11j15n37
$$ 1 169 110 387 208 93 35 256 716 188 323 99 -258 181 473 148 -6 31 281 148 359 244 -293
7334b93J74K53J25l64J83MQ8k9K30l90O2L82j7l19j86k2J4K44J62l36j56J81n6
$$ -293 -119 134 259 -105 78 82 170 141 371 -19 43 425 408 89 -97 -119 -105 139 301 -35 -191 -10 -66
7357f6N6P25n90l71p7N47k10k78R8n9M59J43n28r0oP04k28j37Q0m65Q1L30K44
$$ -66 -10 715 125 -246 -323 224 14 -264 -166 -225 234 377 -151 -241 -247 457 229 92 172 -293 -212 118 362
7380C62l52l0l01J47k4J40J03m04J22J62K56j30L2nq7L43M5l89j37L93j04J27
$$ 362 10 -20 -321 -174 -198 -58 45 -359 -237 -75 181 51 83 78 -9 334 379 -10 -147 246 142 269
7402B69j60j27lK13L6m8o25L87k92M00M30m47m13L18M0K25Lk13k85J32M49P7k17
$$ 269 109 -18 -21 192 228 180 -445 -58 -350 50 480 33 -380 -62 -22 203 206 -7 -292 -160 289 366 149
7425A49j26k49L11j28M50j56m12L51j75K94k32j66J97K36kk29k37K03M1p3N86
$$ 149 23 -226 85 -43 407 251 -161 190 15 309 77 -89 108 344 342 113 -124 79 120 47 633
7446F33r18r1N29L2j32K46j60l23k9P59k94r8l11J87J35O1n2K69m13J58j82M32
$$ 633 -285 -376 153 185 53 299 139 -184 -213 546 252 154 -157 30 165 226 174 443 30 188 6 438
7468D38l04n2j52j16N80m51L5q1Q5J68oj89K48J7R4p6l37OP2l12L12L76m41N7
$$ 438 134 82 -70 -186 394 -57 -22 -103 -18 150 144 -45 203 220 314 238 -99 -93 -21 -333 -21 355 -86 -29
7492b9J56o4j37L60k0l55RL23j82l85K88K29k73K34j12k63L23J48J31n10L70j18
$$ -29 127 63 -74 286 266 -89 -80 243 61 -324 -36 193 -80 154 42 -221 102 250 381 -129 241 123
7514A23J24j09N8k53j7J93k15l2K81j93j25K33R3mJ6r5k7j67J03R2l44L21N08
$$ 123 247 138 196 -57 -74 119 -96 -128 153 -40 -165 68 161 157 173 78 51 -116 -13 79 -265 56 564
7537E64l79j8k44j1m2N59M0o66L97K7J3oJ45l19k63L3N74k67P0o9j31q0K73K65
$$ 564 185 167 -77 -88 -130 429 469 -197 200 227 240 234 379 60 -203 -170 404 137 207 138 7 -73 200 465
7561D65k10J54m46JJ22kj1k25J47J47k00j15J30Q5m9K1k17K49O3M5m12L2J40j43
$$ 465 255 409 -37 -36 86 84 73 -152 -5 142 -58 -173 -43 42 -7 14 -203 46 109 154 -258 -226 -86 -229
7585b29L48M3l26j1L04q5k99L10J50n36K26N6q7J50K6J41P6n69J04j77L36K00
$$ -229 119 162 -164 -175 129 44 -255 55 205 -331 -105 -49 -136 14 40 181 257 -312 -208 -385 -49 151
7607A51j22j32n2J80k66L23j55j66K11J53K7j87J81l41k92P32k4l00L12M7l53
$$ 151 29 -103 -155 25 -241 82 -73 -239 -28 125 152 -35 146 -195 -487 245 221 -79 233 280 -73
7628g3k24K60l34M01j18J18n7l70L51NJ52j1k40j19k8R7J02k78K55j14j55L04
$$ -73 -297 -37 -371 30 -88 30 -27 -397 -46 -41 111 100 -140 -259 -287 -190 -88 -366 -111 -225 -380 -76
7650g6k45Q5K16KP7k95Q4J2j40J01N0n7p7K35j87N97l14k14K42n6J90k16J41j
$$ -76 -321 -236 -20 -18 59 -236 -152 -140 -280 -179 -129 -186 -263 -28 -215 382 68 -146 96 40 230 14 155 154
7674A54m12J22L22l74o3L56l76M2L77J58n69L99J47k58n2P9Nl6J16Mopj29j7L00
$$ 154 -258 -136 186 -188 -251 105 -271 -229 148 306 -263 136 283 25 -27 52 57 21 137 141 135 128 -1 -18 282
7699B82k46J13k03K66N0k25p2J66l87q1N62j15J19j10r9k26O81k17l33j35L94
$$ 282 36 149 -54 212 262 37 -35 131 -256 -337 225 110 229 119 20 -206 475 258 -75 -210 184
7720A84k43J97j28l19M52j75k7J70j57J71L35k83J38o49K91j62N25r2l18J63r7
$$ 184 -59 138 10 -309 143 -32 -59 111 -46 125 460 177 315 -334 -43 -205 320 228 -90 73 -24
7741b4J33J80qm14P7J05L04m16J52j93O1J09r1J22n1j96K0KL57k00l93L58L15
$$ -24 109 289 281 -133 -56 49 353 -63 89 -104 -43 66 -25 97 46 -150 -130 -128 229 29 -364 -6 309
7764C09l34J1j49j52K97K20n74k65L00L40p0O1J3l87Q1m3J86K69j61Qj95K57K71
$$ 309 -25 -14 -163 -315 -18 202 -372 -637 -337 3 -67 -6 7 -380 -299 -342 -156 113 -48 -40 -235 22 293
7787B93l08l83M99q0k90J89l6j77L51K75o14J30j19J52L84P3j77l34P8L94k70
$$ 293 -15 -398 101 21 -269 -80 -116 -293 58 333 -281 -151 -270 -118 266 339 162 -172 -94 300 30
7808C0L8M60p03R5L01j16r6j98N01j60M0k32M28n1m39M30p3l0m7k37M65K1J5q32
$$ 30 68 528 -175 -80 221 105 9 -189 312 152 192 -40 388 337 -102 328 255 225 178 -59 406 427 442 -390
7832c90L75K02r9N0k88l3qK53L80l14l3J07k76L25q8k73k83N60J00l02nK48j65
$$ -390 -15 187 88 138 -150 -183 -191 62 442 128 95 202 -74 251 163 -110 -393 167 267 -35 -40 208 43
7855D3K39m7M7l19P5J43k15J4m2m77L11J69J55j72nJ04q2P3l0j28l21m4J29N06
$$ 43 282 235 282 -37 38 181 -34 -20 -62 -539 -228 -59 96 -76 -81 23 -59 14 -16 -144 -465 -509 -380 126
7879A26K64l76k85N6J86k34k4J51M1o2P3j17j67L9P5M44l71j4p0J96Q8j75J52
$$ 126 390 14 -271 -215 -29 -263 -287 -136 -95 -157 -84 -201 -368 -329 -254 190 -181 -195 -265 -69 19 -156 -4
7902dn85M58K08k25OK7l12J28K92P3m64J94j72L10K60n4k78J99j28P7J36r0m02
$$ -4 -589 -131 77 -148 -142 -115 -427 -299 -7 66 -398 -204 -376 -66 194 140 -138 61 -67 10 146 56 -346
7925c46L84M7K97m13l71K81j72L19J69n8q0lj70J81j87R6k83K93K83r2m29J43
$$ -346 38 85 382 -31 -402 -121 -293 26 195 137 57 54 -116 65 -122 -26 -309 -16 267 175 -254 -111
7947a11M17R8o85P32n65J14j71K57J79Q7r1j51oJJ55n52J26M72m4j69j66j47K47
$$ -111 306 404 -281 451 -114 0 -171 86 265 352 261 110 104 105 260 -292 -166 306 262 93 -73 -220 27
7970B7L05l7l04J53k4k79L95L35p92J29l9P22n03J97l15m2L10N8k75k04J31L75
$$ 27 332 295 -9 144 120 -159 236 571 -221 -92 -131 591 88 285 -30 -72 238 296 21 -183 -52 323
7992C23l21J64k51j83M25Q3j35j47j05j16J7J33K59o92M23R6j48o0J89k00L54
$$ 323 2 166 -85 -268 157 240 105 -42 -147 -263 -246 -113 146 -546 -123 -27 -175 -235 -46 -246 108
8013A08Q7l21NJ63k13J82q1j4j69K07J54m0M5l68L1P4J4L90l23k70J55J89N6L3
$$ 108 195 -126 -121 42 -171 11 -70 -84 -253 -46 108 68 113 -255 -224 -150 -136 254 -69 -339 -184 5 61 94
8037I4J25j48m50N30K21m84o2J2J55j29K26p6j65o4K39k44J69J62q1n9J36j26
$$ 94 219 71 -379 151 372 -112 -174 -162 -7 -136 90 14 -151 -215 24 -220 -51 111 30 -29 107 -19
8059a9j81L60k12L83j02j74j66J33K46j62J55n78J10L53J4j26o0p7J25K85l33
$$ -19 -200 160 -52 331 229 55 -111 22 268 106 261 -317 -207 146 160 34 -26 -103 22 307 -26
8080b6J89k68J68J82k91qQ0l9J57j48J45k39j46K17j8J17k29R5l1k2L29Qk06j07
$$ -26 163 -105 63 245 -46 -54 26 -13 144 -4 141 -98 -244 -27 -45 72 -157 -62 -93 -115 214 222 16 -91
8104i1K76m30J03q8K41k44J85M7j87K73l43N04k15J65k68J07j82K19l90J70L25
$$ -91 185 -245 -142 -230 11 -233 -48 -1 -188 85 -258 246 31 196 -72 35 -147 72 -318 -148 177
8125A77o81O95l91L5l1j26K83j74K20Rl35R7K01R9k69L42k91N3O9j75j54L45K9
$$ 177 -504 191 -200 -165 -196 -322 -39 -213 7 16 -319 -222 -21 78 -191 151 -140 -87 -18 -193 -347 -2 27
8148B7j29k51O1K67R5j88J8P9l12N24n55J39N1l16L69j14M10k74K05k11N1j50
$$ 27 -102 -353 -292 -25 70 -118 -100 -21 -333 191 -364 -225 -174 -490 -121 -235 175 -99 106 -105 -54 -204
8170b04J78J2%l6j18m9J22j21J00P7R8k28J76j42J74k45M04j19J34n46L64
$$ -204 -26 -14 -14 -50 -168 -217 -95 -216 -116 -39 59 -169 7 -135 39 -206 198 79 213 -333 31
8191C1
$$ Imaginary data points
##PAGE= N=2
##DATA TABLE= (X++(I..I)), XYDATA
0@%%%qJ6j6J6j6K4l2M0n6P2q8J05j27J53j81K14k54L00l50M06m69N39o17P07q04
$$ 0 0 0 0 -8 8 -8 8 -8 16 -16 24 -32 40 -48 57 -70 83 -98 116 -138 162 -188 218 -251 288 -329 378 -426
28d26R11j032J163j308J468j641J832k046K278k532K811l116L452l823M233m686
$$ -426 485 -547 616 -692 776 -865 967 -1079 1199 -1333 1478 -1638 1814 -2009 2224 -2462
44b462N191n756O392p116P943q898J0022j1365J3000j5047J7692k1264K6388l4406
$$ -2462 2729 -3027 3365 -3751 4192 -4706 5316 -6049 6951 -8096 9596 -11668 14720 -19686
58a9686M8862q3149L09519L55390l55370q7633P4181R1576o4359j294j2806n9532
$$ -19686 29176 -53973 255546 610936 255566 167933 242114 333690 269331 268037 255231 195699
70A95699j13297N69O4610J0501j02446J0517J57110O2835j56063p9667J13496
$$ 195699 82402 82971 147581 158082 55636 66153 223263 286098 130035 50368 163864
81A63864R5523l7170j6480l884q0280q0970M1080N7403n4338j23111l3913Q8672
$$ 163864 259387 222217 205737 201853 121573 40603 81683 139086 84748 -38363 -72276 16396
93A6396O3758q5108r7907M9435R8692J1990N129L2888n5946r3261N6736J36377
$$ 16396 80154 -4954 -102861 -53426 45266 57256 62385 95273 39327 -53934 2802 139179
105A39179j2541j41586o9891N1767N1580m6029q3377N308P4188K661n3887J4011
$$ 139179 126638 -14948 -84839 -33072 18508 -27521 -110898 -105590 -31402 -28741 -82628 -68617
117f8617L5517l4783K532J14387N7288r8749r3847L6368Q7383K5289n5360o8522
$$ -68617 -33100 -67883 -65351 49036 106324 7575 -86272 -49904 37479 62768 7408 -61114
129f1114n849K9649j3095k4670J1072p464k5457N1942P2450m9843r9369K4992
$$ -61114 -66963 -37314 -50409 -75079 -64007 -71471 -96928 -44986 27464 -22379 -121748 -96756
141i6756J13673N4015l6926o8289l6505K3626L6598j971j5473j8976m2615r140
$$ -96756 16917 70932 34006 -34283 -70788 -47162 -10564 -12535 -28008 -46984 -89599 -98739
153i8739N6859M994q7327j9249J00412N9604m9945n4669l115K1895L6270L4137
$$ -98739 -41880 -36886 -124213 -143462 -43050 16554 -33391 -88060 -91175 -69280 -33010 1127
165A127J594l4248n5790k7335N7647O7128m7443q6450K9654P8821j5557n2374
$$ 1127 2721 -31527 -87317 -114652 -57005 10123 -37320 -123770 -94116 -15295 -30852 -83226
177h3226J4074L6929J6392K4279J8103k1114k8749R401M9739M9171k1575p9937
$$ -83226 -69152 -32223 -15831 8448 26551 5437 -23312 -13911 35828 84999 63424 -16513
189a6513j3387P6861K8118n6391k5064K3046q8J679L6571M203m8111j9418L9797
$$ -16513 -29900 46961 75079 18688 -6376 16670 16582 18261 54832 59035 10924 -8494 31303
202C1303M8635Q548m5160m7245K1774M6913j5637l8206P575L107k9563J814K2554
$$ 31303 79938 88486 43326 -3919 17855 64768 49131 10925 18500 21607 -7956 -6142 16412
215A6412k5668l3168K7440L8920j0218l9751k7836J7657N6296J8226n0333l5208
$$ 16412 -9256 -42424 -14984 23936 13718 -26033 -53869 -36212 20084 38310 -12023 -47231
227d7231J7724Q641k363K1811l662n1203j4658M3474J9376k4073j9224J7J6932
$$ -47231 -29507 -20866 -23229 -1418 -5080 -56283 -70941 -27467 -8091 -32164 -51388 -51371 -34439
240c4439K5024l874k5110N154J6815p979O100K4632k0863m1167K0346M0702j8899
$$ -34439 -9415 -13289 -38399 -33245 -16430 -24409 -18309 6323 -14540 -55707 -35361 5341 -13558
253a3558l8461L149K0787J1570l572k2635j1673K1740J7198l591Q974j059l5919
$$ -13558 -52019 -48870 -28083 -16513 -20085 -42720 -54393 -32653 -15455 -19046 -10072 -11131 -47050
266d7050l829N4258J7875m3910j8798K1518N834o423O411J071n786K67k078M276
$$ -47050 -50879 3379 21254 -22656 -41454 -19936 -14102 -20525 -14114 -13043 -18829 -18562 -20640 -16364
280a6364J8453n022k2530J6465L1143j9692k7529K1414J9792j6862m886R687j2342
$$ -16364 2089 -2933 -25463 -8998 22145 2453 -25076 -3662 16130 -732 -5618 4069 -8273
293h273j0419J5202R460p420p743j0520K249K7181N589k8137o84K6516o456j8475
$$ -8273 -18692 -3490 5970 -1450 -9193 -19713 -17464 9717 15306 -12831 -13515 13001 6545 -11930
307a1930J8846J4966j9112p253J1396k827k653J0713j416p676M886k778n967J8216
$$ -11930 6916 21882 2770 -4483 6913 4086 1433 12146 10730 3054 7940 5162 -805 17411
321A7411J2777j9245n120K1175l562j4359J6411J4624j6525p936P410l393o5J1819
$$ 17411 30188 10943 5823 26998 23436 9077 25488 40112 23587 15651 23061 19668 19603 31422
335C1422n103j2546N071j231j1491J3682J6517j8158j6390J0070K445m391J4404
$$ 31422 26319 13773 18844 17613 6122 19804 36321 18163 1773 11843 14288 9897 24301
348B4301J724k6866p866J6877M824l258m74j4915r502J9011Q445j9851j790J5472
$$ 24301 26025 -841 -8707 8170 12994 9736 9262 -5653 -15155 3856 12301 -7550 -9340 6132
362F132n087q095Q375k744p810J6519J0116j9564j1008R551K818O994J2509j6336
$$ 6132 1045 -7050 1325 -1419 -9229 7290 17406 -2158 -13166 -3615 -797 6197 18706 2370
376B370k6945Q480K3017J611j501n413k4216m434L2254J4824k1185j4282l175
$$ 2370 -24575 -16095 6922 8533 7032 1619 -22597 -27031 5223 20047 -1138 -15420 -18595
389a8595r9J7706J3984k2326k1478J4723J3105o370k217m819j2317J3619K2088
$$ -18595 -18694 -988 12996 -9330 -30808 -16085 -2980 -9350 -11567 -16386 -28703 -15084 7004
402G004j4712k5244Q536J7856O004N449j0937k5653O977L5787Q458j8241j1368
$$ 7004 -7708 -32952 -24416 -6560 -556 4893 -6044 -31697 -24720 11067 19525 1284 -10084
415a0084r139L351L1723J7001k8961k4837J2883J7408J1275O205j9051k3545J7523
$$ -10084 -19223 -15872 15851 32852 3891 -20946 -8063 9345 20620 26825 7774 -15771 1752
428A752L0865m537j9712n540J46J3483K1581j2329l4176M154L0698Q266j0397
$$ 1752 32617 28080 8368 2828 2974 16457 38038 25709 -8467 -4313 26385 34651 24254
441B4254j2482j7056N328L6548J2263l0871k1411P392J5705J9970O615k9924k5649
$$ 24254 11772 -5284 44 36592 48855 17984 -3427 3965 19670 39640 46255 16331 -9318
454i318K1795K9234k015j1712j1883j2298J5705L1416p375l2820l575J9195J4702
$$ -9318 12477 41711 39696 27984 16101 3803 19508 50924 43549 10729 7154 26349 41051
467D1051O058j4727l1406M119M1450J2041k9326k2377m518J2306L1647J0478m1200
$$ 41051 47109 32382 976 5095 46545 58586 29260 6883 2365 14671 46318 56796 15596
480A5596l5346J7139L2705J0403j1483l2061k2436K4641L4910r602k8681q731
$$ 15596 -19750 -2611 30094 40497 29014 -3047 -25483 -842 34068 24466 -4215 -12946
492a2946O42J0671K3549n798l9336r015L4096J9190j3774k2647j5694J1679L6210
$$ -12946 -12304 -1633 21916 16118 -23218 -32233 1863 21053 7279 -15368 -31062 -19383 16827
505A6827Q323l4139k4264R024J9953K4118O383m0765l8587K9670N1448j943l5964
$$ 16827 25150 -8989 -33253 -24229 -4276 19842 26225 -14540 -53127 -23457 27991 26048 -9916
518i916k2255j176K1865K9411n521l4240j6133J1987K0593J7320j3917m0105k140
$$ -9916 -32171 -33347 -11482 17929 12408 -21832 -37965 -25978 -5385 11935 -1982 -42087 -44227
531d4227M4165J1182l4458j6652J0989O994J0584R075k2511l1613Q359L5957J9182
$$ -44227 -62 11120 -23338 -39990 -29001 -22007 -11423 -2348 -24859 -56472 -48113 -12156 7026
544G026j8525m2458j7832M2338M4390k0665m3698m452J7156J5155K0809l039m2190
$$ 7026 -11499 -53957 -71789 -29451 14939 -5726 -49424 -53876 -36720 -21565 -756 -3795 -45985
557d5985j6767L8079L5187q674k9486j9586J2879L7381J2255k8272j9325J2100
$$ -45985 -62752 -24673 10514 1840 -27646 -47232 -34353 3028 15283 -12989 -32314 -20214
569b0214J4519J2755O613k4178k7645K6468M4572o897l8939j5750J1684K7901
$$ -20214 -5695 7060 13673 -10505 -38150 -11682 32890 25993 -12946 -28696 -17012 10889
581A0889K5388j1939l9715j4489K3000K8654J5519j5322m3198j0185M6784L0555
$$ 10889 36277 24338 -15377 -29866 -6866 21788 37307 21985 -21213 -31398 15386 45941
593D5941k9875l3511L562K1272J8159j402k9848k0552J8998K3919j91r736j9733
$$ 45941 16066 -17445 -13883 7389 25548 24146 -5702 -26254 -7256 16663 16472 6736 -12997
606a2997k4528J3569M2921J061m6291k5142J9260K7649O926k3274l4460J374L0985
$$ -12997 -37525 -23956 18965 20026 -26265 -51407 -32147 -4498 2428 -20846 -55306 -53932 -22947
619b2947J1610j3691j4950k0185q704L3494L2226k8058m4019N162K9785J1462
$$ -22947 -11337 -25028 -39978 -60163 -68867 -35373 -3147 -31205 -75224 -70062 -40277 -28815
631b8815q644j7264j2051J4205K3537k448k1503j5352K734K9314L2466k1114n3109
$$ -28815 -37459 -54723 -66774 -52569 -29032 -31480 -52983 -68335 -65601 -36287 -3821 -24935 -78044
644g8044P91M8069J7559j4342n941q280j5220J3940L5010M743k9562k2916J6234
$$ -78044 -77253 -29184 -11625 -25967 -31908 -40188 -55408 -41468 -6458 -1715 -31277 -54193 -37959
657c7959M0549P051m4495k4934L7035L1911j8709j7527M689q431p919K5874J8805
$$ -37959 2590 9641 -34854 -59788 -22753 9158 -9551 -27078 -22389 -30820 -38739 -12865 5940
670E940k6106l0035R143L0178J0222k6576l1025J4155M0480K182k9984j2422Q36
$$ 5940 -20166 -50201 -41058 -10880 -658 -27234 -58259 -44104 -3624 -1442 -31426 -43848 -43012
683d3012J133K5261K9540k2040m6434K43L7389K1205n140j7199j2206Q243J6185
$$ -43012 -41879 -16618 12922 -9118 -55552 -55309 -17920 3285 -1855 -19054 -31260 -23017 -6832
696f832K458j007J363q911J604K8220P045l7111j3330M0737K8707j8159k3595
$$ -6832 -4374 -5381 -4018 -12929 -11325 16895 23940 -13171 -26501 14236 42943 24784 1189
709A189n81J3857J7466M057r752m864R62j184J6017K2043k0830l8742J5506M7712
$$ 1189 608 14465 31931 35988 26236 21372 22334 21150 37167 59210 38380 -362 15144 62856
723F2856J862l3763j4382Q047P980P815L756m980j0076j3397k178K1394R469k9182
$$ 62856 64718 30955 16573 24620 32600 40415 44171 39191 29115 15718 13540 34934 44403 15221
737A5221j5640K9959J2008l5483j9215K2133J2400p845j596l837j8680j1430J3567
$$ 15221 -419 29540 41548 6065 -13150 8983 21383 13538 11942 8105 -10575 -22005 -8438
750h438K4091M029l2712k9621K1301L2178j7246k9250J4443J6469j9591q434J8646
$$ -8438 15653 19682 -13030 -42651 -21350 10828 -6418 -35668 -21225 -4756 -24347 -32781 -14135
763a4135k619k3941L853K5739M258k2967j8276J2476K5625j835k3419L029J9427
$$ -14135 -16754 -40695 -36842 -11103 -6845 -29812 -48088 -35612 -9987 -11822 -35241 -32212 -12785
776a2785q955j2310K0921J0486k8733o739L5713J3863k9022j8318J4473J9278
$$ -12785 -21740 -34050 -13129 -2643 -31376 -38115 -2402 11461 -17561 -35879 -21406 -2128
788b128K892r565l976N333o060j1930J6053K4037j6635k8074J5345K2105j8730
$$ -2128 764 -8801 -12777 -7444 -13504 -25434 -9381 14656 -1979 -30053 -14708 7397 -11333
801a1333j7612J9477J5983j2204j3939m01M867M238j595p12Q332l283k1745j306
$$ -11333 -28945 -9468 6515 -5689 -19628 -20029 -15162 -10924 -12519 -13231 -4899 -8182 -29927 -31233
815c1233K6707N241k1507k395J1189m259m349R610R38q388J214N308Q62L490j810
$$ -31233 -4526 715 -20792 -23187 -11998 -16257 -20606 -10996 -10058 -18446 -17232 -11924 -11062 -7572 -9382
830i382p977N812J0535o056l295J4545J028j7425J235J7350K678m728K237j617
$$ -9382 -17359 -11547 -1012 -7068 -10363 4182 5210 -12215 -10980 6370 9048 4320 6557 4940
844D940m142K968K047L293J0195k310j8117M44J7472l329j1661J1255J0229j6135
$$ 4940 798 3766 5813 9106 19301 16991 -1126 -682 16790 13461 1800 13055 23284 7149
858G149j4074Q687J1834J800n777r277l99O582n372n597J4012M830k3029q507
$$ 7149 -6925 1762 13596 15396 9619 342 -57 6525 1153 -4444 9568 14398 -8631 -17138
872a7138K2330O055j9018n168J0035J00l783N39k306k981o42j521L644N514j0305
$$ -17138 5192 11247 -7771 -12939 -2904 -2804 -6587 -6048 -8354 -11335 -11977 -13498 -9854 -4340 -14645
887a4645j2218J4006J2282j8563j3010J7133R778j2465l568M548o332l233J1545
$$ -14645 -26863 -12857 -575 -19138 -32148 -15015 -5237 -17702 -21270 -16722 -23054 -26287 -14742
900a4742Q018n008j2528r762J0253K2187k894k2503M62J4637l897m784J2681J75
$$ -14742 -6724 -11732 -24260 -34022 -23769 -1582 -4476 -26979 -26517 -11880 -15777 -20561 -7880 -7705
914g705j7402J883J8826J945j3071p156N791J4955N796j6256j2728J3582J3497
$$ -7705 -25107 -23224 -4398 -2453 -15524 -22680 -16889 -1934 3862 -12394 -25122 -11540 1957
927A957n263j550J666j2177l367K3527J0466j9554j5588O940J3326Q892k510j5671
$$ 1957 -3306 -4856 -3190 -15367 -18734 4793 15259 -4295 -19883 -12943 383 9275 6765 -8906
941h906o718J0925P691k32K011p439j5217R271K2513m719k1694P85J3949M527
$$ -8906 -15624 -4699 2992 2760 4771 -2668 -17885 -8614 13899 9180 -12514 -11729 2220 6747
955F747j957o627q939N903J6152J299r888o625n656O173K3430O642k8440j7367
$$ 6747 4790 -1837 -10776 -4873 11279 12578 2690 -3935 -9591 -3418 20012 26654 -1786 -19153
969a9153J8424J9302N10o203j1384r361J0504J7450j133j1152p415k797J0305
$$ -19153 -729 18573 19083 12880 1496 -7865 2639 20089 18956 7804 389 -2408 7897
982G897J5748q096k2091L476J9072Q52j0228l877m455J281J6077N214j8542j4538
$$ 7897 23645 15549 -6542 -3066 16006 16858 6630 2753 -1702 -421 15656 20870 2328 -12210
996a2210O127J4215J2540m172k6615j3312K2563K2120o955j5080j0058m546J2625
$$ -12210 -6083 8132 20672 16500 -10115 -23427 -864 21256 14301 -779 -10837 -15383 -2758
1009b758K1933m647k5423p870J3145J2497M808r993j8102J675K0564N056j4309
$$ -2758 19175 14528 -10895 -18765 -5620 6877 11685 1692 -16410 -14735 5829 10885 -3424
1022c424p481Q8L312J3363N900k0580j6687J3081K0250J459j1005j7487p595J8628
$$ -3424 -10905 -10817 -7505 5858 11758 -8822 -25509 -12428 7822 9281 -1724 -19211 -26806 -8178
1036h178K2509p916k3450q112O327J4830J4677q658k7861m434K3322J3218o897
$$ -8178 14331 6415 -17035 -25147 -18820 -3990 10687 2029 -25832 -30266 -6944 6274 -623
1049f23j2205j0673K699K0230Q502j8500j3736P230J1328Q137k50j7130j2989
$$ -623 -12828 -23501 -20802 -572 7930 -10570 -24306 -17076 -5748 2389 2139 -14991 -27980
1062b7980J6682K2268m450j7162q725J297J5294J9117q010k7156m319J8506J4156
$$ -27980 -11298 10970 6520 -10642 -19367 -18070 -2776 16341 8331 -18825 -23144 -4638 9518
1075I518K175j0836j9488q98K5296J2627j5556j5011n44Q805J4783M312j9303
$$ 9518 11693 857 -18631 -19529 5767 18394 2838 -12173 -12717 -3912 10871 15183 -4120
1088d120j5284J4104J8567j033r938j1225n840J6312K1485p105k5016n841J2972
$$ -4120 -19404 -5300 13267 12234 2296 -8929 -14769 1543 23028 15923 -9093 -14934 -1962
1101a962J5248Q519r737k3571k902K3331J4119o937j2426j1487N79K1239J3172
$$ -1962 13286 21805 12068 -11503 -14405 8926 23045 16108 3682 -7805 -7226 14013 27185
1114B7185j7599j8631N822J3217O679j185j3627j2618J2393J9933m477j8530p284
$$ 27185 9586 -9045 -3223 9994 16673 15488 1861 -10757 1636 21569 17092 -1438 -8722
1127h722M782J3999J3425j1927k5535j533K0967J2048l892j1564j7047k410K4252
$$ -8722 -3940 10059 23484 11557 -13978 -15511 5456 17504 13612 2048 -14999 -17409 6843
1140F843J5421j5496j9681l007Q694J4487O638j5577j7743P683J6049R43n482
$$ 6843 22264 6768 -12913 -15920 -7226 7261 13899 -1678 -19421 -11738 4311 5254 -228
1153b28p576p947Q091J7942l972k0857l054J3308R859J990r254j7687M93K3465
$$ -228 -7804 -15751 -7660 10282 6310 -14547 -17601 -4293 5566 7556 -1698 -19385 -18892 4573
1167D573J0803j3482j4867n201O622J9122Q872j9521j8228P295J4432N506p6r777
$$ 4573 15376 1894 -12973 -18174 -11552 7570 16442 -3079 -21307 -14012 420 5926 5850 -3927
1181c927j4731N870J9835K007j3129p757R32Q253J2021m100j9293j078J8091O262
$$ -3927 -18658 -12788 7047 9054 -4075 -11832 -10900 -2647 9374 5274 -14019 -15097 2994 9256
1195I256p637o548o211Q84J5898R270j3612j4962J474J0919J1983L652j7717j7057
$$ 9256 1619 -4929 -11140 -10256 5642 14912 1300 -13662 -12188 -1269 10714 14366 -3351 -20408
1209b0408J1903K0677j312j0830n224l815M406J4839K049j5128o604Q173Q191
$$ -20408 -8505 12172 10860 30 -5194 -9009 -4603 10236 12285 -2843 -9447 -1274 6917
1222F917L831m682j2048l89J6168N903j0226n267L89n68J0630J2504j2367k0134
$$ 6917 10748 6066 -5982 -6371 9797 15700 5474 207 596 28 10658 23162 10795 -9339
1236i339O604J9564M052q726q615l885P177J0692j669n618j949n109P23J5673
$$ -9339 -2735 16829 20881 12155 3540 -345 6832 17524 15855 10237 8288 3179 3902 19575
1250A9575M128k0217q749J7998Q628j2353o563L616J034J532K074n053n964k25
$$ 19575 23703 3486 -5263 12735 21363 9010 2447 6063 7097 8629 10703 5650 -314 -539
1264e39K002O673M399j4725j5954J1006J8519o231j3584n04j553l367R249P711
$$ -539 1463 8136 12535 -2190 -18144 -7138 11381 5150 -8434 -8938 -10491 -13858 -4609 3102
1278C102j1383j1667L322P404L536l771q403j6J0219l92j0620J499P245m402j748
$$ 3102 -8281 -19948 -16626 -9222 -5686 -9457 -17860 -17876 -7657 -8049 -18669 -17170 -9925 -14327 -16075
1293a6075R334l287j2845M088J3004K91p274l398j706O272R692k841r584J22M095
$$ -16075 -6741 -10028 -22873 -18785 -5781 -5490 -12764 -16162 -17868 -11596 -1904 -4745 -14329 -14207 -10112
1308a0112R32P359M441j1492q408R632Q564k118K48k072o296L123P616k545k944
$$ -10112 -9180 -1821 2620 -8872 -17280 -7648 916 -1202 -954 -3026 -9322 -6199 1417 -1128 -4072
1323d072O242n66p515K826M908m487o3P745j251p392j726J865L872N848l003r301
$$ -4072 2170 1604 -5911 -3085 1823 -2664 -2727 5018 3767 -3625 -5351 -3486 386 6234 3231 -6070
1339f070L068Q169o783l200J2250N28j4530J109J4275J19r981j416N771L575l94
$$ -6070 -3002 5167 -1616 -4816 7434 7962 -6568 -5459 8816 8935 -1046 -2462 3309 6884 6490
1354F490l638P86O406m256r058R413J3894r091j1956R477O533r717k49J3554R12
$$ 6490 2852 3638 10044 5788 -3270 6143 20037 10946 -1010 8467 15000 5283 5034 18588 19500
1369A9500j0612k264O305L231j132k153M010N950o072j1865P819J3612q150q724
$$ 19500 8888 6624 12929 16160 15028 12875 16885 22835 16763 4898 12717 26329 18179 9455
1383I455J1964L509j7787m031J8446N954j4003p888O159O323l300r027J425J0417
$$ 9455 21419 24928 7141 3110 21556 27510 13507 5619 11778 18101 14801 5774 7199 17616
1397A7616l760j4729M936J4913j0968j7642J0940J6751j0277j4935M241Q343j401
$$ 17616 13856 -873 4063 18976 8008 -9634 1306 18057 7780 -7155 -2914 5429 4028
1410D028o130k535M219L900n509m765O707l94j2355L171J9324k089k1072l173
$$ 4028 -2102 -4637 -418 3482 -2027 -6792 -85 -479 -12834 -9663 9661 7572 -13500 -16673
1424a6673J2870L630j285K453k694p066j622N090Q477K844j0600o763J2628Q114
$$ -16673 -3803 -173 -1458 995 -1699 -8765 -10387 -5297 3180 6024 -4576 -11339 1289 9403
1438I403j4689p023J7148Q000j2522l983P755k145n416O481J0320j869j3810q591
$$ 9403 -5286 -12309 4839 12839 317 -3666 4089 1944 -3472 3009 13329 11460 -2350 -10941
1452a0941J3114J9407q537k2951M278J9602k669j0951N686L486j1991j907J7117
$$ -10941 2173 21580 13043 -9908 -5630 13972 11303 352 6038 9524 -2467 -4374 12743
1465A2743P199j3644j3890L398J6319N684j4447p344J2807L666j2594R09J1491
$$ 12743 19942 6298 -7592 -4194 12125 17809 3362 -3982 8825 12491 -103 806 12297
1478A2297n720r103J2249R630j5722j4371J1326J7519J792j3619j1643M605J1226
$$ 12297 6577 -2526 9723 19353 3631 -10740 586 18105 19897 6278 -5365 -760 10466
1491A0466M79j703N007p395j5639R898K3779n808k4469O37J9715K990j0612n006
$$ 10466 10945 9242 14249 6854 -8785 1113 24892 19084 -5385 -4748 14967 17957 7345 2339
1505B339L073L771M42j421K442l36j0904r71J8516N530k3355j0627K0099J2044
$$ 2339 5412 9183 9625 8204 10646 10310 -594 -1565 16951 22481 -874 -11501 8598 20642
1519B0642j1989r857O88J539L794O128n48q670r632r9J4400J2947j3754k1440
$$ 20642 8653 -1204 -516 1023 4817 10945 10397 1727 -7905 -8004 6396 19343 5589 -15851
1533a5851O384J7896j850j0473O75J78l818M775O004o083j0380J129R819Q301
$$ -15851 -9467 8429 6579 -3894 -3219 -3041 -6859 -2084 3920 -2163 -12543 -11414 -1595 6706
1547F706n220j8729l185J9094R749j1966q175J758j830L197J2275L42j6173p644
$$ 6706 1486 -17243 -20428 -1334 8415 -3551 -11726 -9968 -11798 -8601 3674 4016 -12157 -19801
1561a9801J0557J3543J334j2618j2555Q157J7207j775j2383m45L016j457O574
$$ -19801 -9244 4299 5633 -6985 -19540 -11383 5824 4049 -8334 -8779 -5763 -7220 -646
1574f46P597r658j3276P325J5320R88j0927r845L414J5019O083j2233r319M389
$$ -646 6951 -2707 -15983 -8658 6662 7650 -3277 -13122 -9708 5311 11394 -839 -10158 -5769
1588e769L799L087Q795k563j8915m336J9685J2051r240j3083k939P504J0207N64
$$ -5769 -1970 1117 9912 7349 -11566 -15902 3783 15834 6594 -6489 -9428 -1924 8283 8847
1602H847r005l325K520Q55N260N764r907j2557J1650J6629o903j6079l11R446
$$ 8847 -158 -3483 -963 -108 5152 10916 1009 -11548 102 16731 9828 -6251 -6562 2884
1616B884P060J266p174q681J494Q153N056K695p341j5448K385K1827O056j7470
$$ 2884 9944 11210 4036 -4645 -3151 5002 10058 12753 5412 -10036 -7651 14176 20232 2762
1630B762j0764O015O876M380K153o890r640J504R263N333k749j0133o739J0838
$$ 2762 -8002 -1987 4889 9269 11422 4532 -5108 -3604 5659 10992 8243 -1890 -8629 2209
1644B209J2909q619j4941L894J0001J060j282k749r296j288J3088P309p065j1139
$$ 2209 15118 6499 -8442 -4548 5453 6513 5231 2482 -6814 -8102 4986 12295 5230 -5909
1658e909n171O884J4939J728j6500q826Q901P303O42K32n627j0169M333J3647
$$ -5909 -11080 -4196 10743 12471 -4029 -12855 -3954 3349 3991 4223 -1404 -11573 -7240 6407
1672F407Q49j0646n999J990P621O586o547j1718K670J0366N81l125j603o514j878
$$ 6407 7256 -3390 -9389 -7399 222 6808 261 -11457 -8787 1579 2160 -965 -2568 -9082 -10960
1687a0960J2739P080j1156j1406L605R012O024j202j1046o452Q342Q722j269l314
$$ -10960 1779 8859 -2297 -13703 -10098 -1086 4938 3736 -7310 -13762 -5420 3302 2033 -1281
1701a281l914n325M017J2945j403j2840k210Q195M526n13l210o830J170J0469
$$ -1281 -5195 -10520 -6503 6442 5039 -7801 -10011 -1816 2710 2197 -1013 -7843 -6673 3796
1715C796K471o943m264r45J902J0065M647j2121j0399Q182J0844M7l114n575n880
$$ 3796 6267 -676 -4940 -5885 -3983 6082 10729 -1392 -11791 -3609 7235 7282 4168 -1407 -7287
1730g287N517J0637J02q152l531N30L901P723p55j1027j276R644J868m133j184
$$ -7287 -1770 8867 8969 817 -2714 -2184 1717 9440 8685 -2342 -3618 6026 7894 3761 2577
1745B577j658j101P195L972p864o519M118N636L048N36q377p446P364J1036j696
$$ 2577 919 -182 7013 10985 3121 -3398 720 6356 9404 9940 1563 -5883 1481 12517 10821
1760A0821o826l619k717M046J0211k32j1388l086N015K823J494J229o473m038
$$ 10821 3995 376 -2341 1705 11916 11684 296 -2790 2225 5048 6542 7771 1298 -2740
1774b740O349L524m520k076J561q63J909K500n736m740N672N378k843l114j677
$$ -2740 3609 7133 2613 537 2098 1235 3144 5644 -92 -4832 840 6218 3375 261 -1416
1789a416m087M202R136k689r575j600L697K465L913L93q755l780O143M438j344
$$ -1416 -5503 -1301 7835 5146 -4429 -6029 -2332 133 4046 4439 -4316 -8096 -1953 2485 1141
1804A141q53l843l558N142N240n128l567M075N71k921J963N10m320J896N340k001
$$ 1141 288 -3555 -7113 -1971 3269 -1859 -5426 -1351 -780 -3701 -1738 -1228 -5548 -3652 1688 -313
1820c13m598M58R80J379M577j632p262J19N702M27j76J898m856n079O541O138
$$ -313 -4911 -4453 -3473 -2094 2483 851 -6411 -6292 -590 -163 -339 1559 -3297 -8376 -1835 4303
1836D303l776l614J650n08o4M073l95l854J041K096j479J213J368l245L62N743
$$ 4303 527 -3087 -1437 -1945 -2009 2064 1669 -2185 -1144 952 -527 686 2054 -1191 -829 4914
1852D914j489n973K326M322k220j64L085k761l535L790L086j479p14n56k717J947
$$ 4914 3425 -2548 -222 4100 1880 1716 4801 2040 -1495 2295 5381 3902 3188 2632 -85 1862
1868A862M135j861k068K098j999k652M759L703m820k588M039o65k640K991J838
$$ 1862 5997 4136 2068 4166 2167 -485 4274 7977 3157 569 4608 3943 1303 4294 6132
1883F132k903j29P53k009J279K920k097j604L158q33m841L084M209k988k015K444
$$ 6132 3229 3100 3853 1844 3123 6043 3946 2342 5500 4667 -174 2910 7119 4131 2116 4560
1899D560k571k193M767K387l527k014P6k043K457M478k092n222O04J171p89L438
$$ 4560 1989 -204 4563 6950 3423 1409 1485 -558 1899 6377 4285 -937 -333 838 49 3487
1915C487J641o402k684M438J421k122J108o49l158J639J828k601o35L568j593
$$ 3487 5128 -1274 -3958 480 1901 -221 887 238 -2920 -1281 547 -2054 -2689 879 -714
1930g14l659K129R52l861K043N500k436n561j077K022L906L842m460p693K173
$$ -714 -4373 -2244 -1292 -5153 -3110 2390 -46 -5607 -6684 -4662 -756 3086 -1374 -9067 -6894
1945f894N689m18m86K385m412n248N207O903k870m920K10J196J895J936l137k680
$$ -6894 -1205 -1623 -2109 276 -4136 -9384 -4177 2726 -144 -5064 -4854 -3658 -1763 173 -2964 -5644
1961e644L472J835k115N41P55l680J671O903k229q081J481O992J23j142j55l564
$$ -5644 -2172 -337 -2452 -1911 -1156 -4836 -3165 3738 1509 -6572 -5091 1901 2024 882 727 -2837
1977b837k410N447N309n46m525n535k05R358N568q643o159N641L345k783R22J873
$$ -2837 -5247 200 5509 4963 438 -5097 -5302 4056 9624 981 -5178 463 3808 1025 1947 3820
1993C820m004j185N548J603l513k735j297L945O324k094r957j51Q029K363l063
$$ 3820 -184 -1369 4179 5782 2269 -466 -1763 2182 8506 6412 -3545 -3696 4333 6696 3633
2008C633j054k904k173O196N188m664n731L70K208M338L563n098q273K664P222
$$ 3633 2579 -325 -2498 3698 8886 4222 -1509 -1139 1069 5407 8970 3872 -4401 -1737 5485
2023E485P50k927j457l241N35N958Q68o807j882M308L270K92l171o568L80R276
$$ 5485 6235 3308 1851 -1390 -855 5103 5971 -836 -2718 1590 4860 5152 1981 -4587 -4207 5069
2039E069L068o300l579p09k209M300R090k831j1986k259Q596N824k331p189l985
$$ 5069 8137 1837 -1742 -2451 -4660 -360 8730 5899 -6087 -8346 250 6074 3743 -3446 -7431
2054g431O062O108m447m390K414q33l330O736N634r645q797P906R393l339q200
$$ -7431 -1369 4739 292 -4098 -1684 -2517 -5847 889 6523 -3122 -11919 -4013 5380 2041 -6159
2069f159j630M976N336r42n980j788J233L33N353O987q411j4768M539J6200K464
$$ -6159 -7789 -2813 2523 1581 -4399 -6187 -4954 -4621 732 7719 -692 -15460 -10921 5279 7743
2084G743r992l935J385J36K661M120l20n475l248L601P627j180j1399j826J3821
$$ 7743 -2249 -6184 -4799 -4663 -2002 2118 1798 -3677 -6925 -3324 4303 3123 -8276 -10102 3719
2099C719M978j1666n773O780K052j653M102J382p950l719O490Q407j304j0520
$$ 3719 8697 -2969 -8742 -1962 90 -1563 2539 3921 -4029 -7748 -1258 7149 5845 -4675
2113d675n472R696J0851n066r961N86L423n20M256O740p129j1476L481J1224K828
$$ -4675 -10147 -451 10400 5334 -4627 -4041 -618 -1138 3118 9858 2729 -8747 -5266 5958 8786
2128H786o451n478J543O543P41o275j394M785P85q61L354j914j0000M44J3752
$$ 8786 2335 -3143 -1600 4943 5684 -591 -1985 2800 3585 2724 6078 4164 -5836 -5392 8360
2143H360M690r716q688J422O734N543k299o221j302K647J89K956K691o718p922
$$ 8360 13050 3334 -5354 -3932 2802 8345 6046 -175 -1477 1170 1359 4315 7006 288 -7634
2158g634P578J0612m526j0344p68N533L483N27l518l580L59K805J131J985k870
$$ -7634 -56 10556 6030 -4314 -5082 451 3934 4461 943 -2637 -2278 527 1658 3643 773
2173G73p520J328J2873J063j3447n527P617O138n7j567m555m565J787N700M387
$$ 773 -6747 -5419 7454 8517 -4930 -10457 -2840 3298 3241 1674 -2881 -7446 -5659 41 4428
2188D428j561p884n205P805Q401o452q529M613O439k540l257J294j935j274M353
$$ 4428 2867 -5017 -10222 -2417 5984 -468 -8997 -4384 2055 -485 -3742 -2448 -4383 -5657 -1304
2203a304M252k372o638l299N050R627r00j1563l184Q665M056k910o47j008n562
$$ -1304 2948 576 -6062 -9361 -4311 5316 4416 -7147 -10331 -1666 2390 -520 -1167 -2175 -7737
2218g737K218Q613J912p298n420J850O705L921n059n692L614L967k704p64K834
$$ -7737 -5519 3094 5006 -2292 -7712 -5862 843 4764 -295 -5987 -2373 1594 -1110 -1874 960
2233I60j682l209N092M333o136o165M104P512J643m852o031l97P183L276k810
$$ 960 -722 -3931 1161 5494 -642 -6807 -2703 4809 6452 1600 -4431 -4828 2355 5631 2821
2248B821n26j450m640K373J0251l14j0517l002P191M513j697l332k183J165L578
$$ 2821 2295 845 -3795 -1422 8829 8515 -2002 -5004 2187 6700 5003 1671 -512 653 4231
2263D231l03j185J207j945l130N243M623o761n568N829O413l716m962j38J134
$$ 4231 3928 2743 3950 2005 -1125 4118 8741 1980 -3588 2241 8654 4938 -24 -162 972
2278I72K729K676j741k832k244q03L003O931k325j0096o54Q827J495n213p62J145
$$ 972 3701 6377 4636 1804 -440 -1243 1760 8691 6366 -3730 -4384 4443 5938 725 -37 1108
2294A108j369M74K593r4l255j456Q68L978J286o114l821O299M406n417m162L970
$$ 1108 -261 213 2806 2712 -543 -1999 -1131 2847 4133 -1981 -5802 497 4903 -514 -4676 -706
2310g06R42k402K430J393m458k877K645L657J529l212n459J114O156p4m563R13
$$ -706 236 -2166 264 1657 -2801 -5678 -3033 624 2153 -1059 -6518 -5404 752 678 -3885 -2972
2326b972K358m070j97N290k2o040M86M654J07k875j489M97L518J357l534k093
$$ -2972 -614 -4684 -4881 409 387 -5653 -5167 -513 -406 -3281 -4770 -4273 -755 602 -2932 -5025
2342e025L220K93k879L569L182o124l614O056M041k829l038K40P59J500J347j277
$$ -5025 -1805 -1512 -4391 -822 2360 -3764 -7378 -1322 2719 -110 -3148 -2908 -2149 -649 698 -579
2358e79j54Mk003P83M960p0n702Q93M672j281l442K893K308j721q11N79q70N09
$$ -579 -733 -729 -2732 -1949 3011 2941 -2761 -1868 2804 1523 -1919 974 3282 1561 750 1329 459 968
2376I68J897k42J48Q15l711r92M806L202m082k039K196q80j070L685J546l398
$$ 968 2865 2623 2771 3586 -125 -1117 3689 6891 2809 770 2966 2086 1016 4701 6247 2849
2392B849j656N77J047K154N51l136j320K535qj421K430J116m294j056L612M09
$$ 2849 1193 1770 2817 4971 5522 2386 1066 3601 3593 2172 4602 5718 1424 368 3980 4389
2408D389j970J309Q9k030L20O81r00J555J479l070j970K426J89j925K910J653
$$ 4389 2419 3728 3817 1787 2107 2788 1888 3443 4922 1852 -118 2308 2497 572 3482 5135
2424E135m439k459K531J743j70P89j664l234R28K475J02R0J26l648o46M062J024
$$ 5135 696 -1763 768 2511 2341 3130 1466 -1768 -840 1635 1737 1827 1953 -1695 -2341 1721 2745
2441B745l565l00J503j460O8K119j203j631J541N01k018M04J111j526J283J824
$$ 2745 -820 -1120 383 -1077 -1009 1110 -93 -1724 -183 318 -1700 -1296 -185 -1711 -428 1396
2457A396j994l364K502K289r27N75n30l393k47N258J160l615j233j07J03K999
$$ 1396 -598 -3962 -1460 829 -98 477 -53 -3446 -3693 1565 2725 -890 -2123 -2230 -2127 872
2473H72J661l420k199K610M68m85J006o27k472J768K913j995k255J558O01P9K383
$$ 872 2533 -887 -3086 -476 -8 -493 513 -114 -2586 -818 2095 100 -2155 -597 4 83 2466
2490B466j431m299Q24M636R76k070j154j726M4M129K216l757j861M81J96K661
$$ 2466 1035 -3264 -2440 2196 3172 1102 -52 -1778 -1734 2395 4611 854 -1007 -526 -330 2331
2506B331K790l308m606K943L738j243j714N51j077Q17K573j111l052R50K616j40
$$ 2331 5121 1813 -2793 150 3888 2645 931 1482 405 1222 3795 2684 -368 582 3198 3058
2522C058J17q59l612P38N388R25m034j778J43l51L752L524m640n748K036M645
$$ 3058 3175 2316 -1296 -558 4830 5755 1721 -57 86 -265 3487 7011 2371 -3377 -1341 3304
2538C304Q02j016k520k512J545L437o68j854Lj271r49L795N63n176r11N362M82
$$ 3304 4106 3090 570 -1942 -397 3040 2372 518 521 -750 -1699 2096 2659 -2517 -3428 1934 2416
2555B416l442j484J95M58L323Q83m245l435J608K902K103L65m828m195M036N186
$$ 2416 -1026 -2510 -2315 -1857 1466 2349 -1896 -5331 -3723 -821 1282 1647 -3181 -7376 -3340 1846
2571A846q91k471j110k847N10O401J087n909k909L433K836l9j403k487M15L668
$$ 1846 955 -1516 -2626 -5473 -4963 1438 2525 -3384 -6293 -2860 -24 -63 -1466 -3953 -3538 130
2587A30O02k797n13Q85k90K745K761m817n228M220N734m17l217k291j541K952
$$ 130 732 -2065 -2578 -1693 -1983 762 3523 -1294 -6522 -2302 3432 3015 -202 -2493 -4034 -1082
2603a082M855j15m485k356P05K126M225n56o102j746N185J805j857n21j154j704
$$ -1082 3773 3658 -827 -3183 -2478 -352 3873 3317 -2785 -4531 654 2459 602 81 -1073 -2777
2619b777L210L200l039m206J043L355J636m49l449l448L218N428j161l761j206
$$ -2777 433 3633 594 -3612 -2569 786 2422 1973 -1476 -4924 -1706 3722 2561 -1200 -2406
2634b406o41J981M330L27n223k735L588K400J272l74m444j898N236L500l061k855
$$ -2406 -3047 -1066 3264 3591 -1632 -4367 -779 1621 2893 2519 -1925 -3823 1413 4913 1852 -1003
2650a003J070R54J394J787k411l201K188L564K74j585k620k308L495N740j135
$$ -1003 67 1021 2415 4202 1791 -1410 778 4342 4616 3031 411 -1897 1598 7338 6203
2665F203o763j135K951K002J925M46m692l764L456M733n23l506k316j47L926K017
$$ 6203 -560 -1695 1256 3258 5183 5629 937 -2827 629 5362 4839 1333 -983 -1130 2796 4813
2681D813m204k633K714O15j067J762l81m412j23N810N83m672k359J144L429K293
$$ 4813 609 -2024 690 1305 238 2000 1619 -2793 -2916 2894 3477 -1195 -3554 -2410 1019 3312
2697C312k584n220j17M301J677J51n71m616l206N592O226k804n736J06J648J585
$$ 3312 728 -4492 -4609 -308 1369 1520 949 -3667 -6873 -1281 4945 2141 -3595 -3489 -1841 -256
2713b56J910m44l165L07J910J2N71p51k204J050N074o70n892l84M534J350p90
$$ -256 1654 1210 -1955 -1648 262 274 845 94 -2110 -1060 4014 3344 -2548 -2932 1602 2952 2162
2730B162o15j944j411K697K801q89j701k221j413M857M516m415o243J826M637
$$ 2162 1547 -397 -1808 889 3690 2801 1100 -1121 -2534 2323 6839 2424 -3819 -1993 2644
2745B644K39l84r23k500j171L306J140p42q50j848l83L574R19n175q63N168J325
$$ 2644 2883 2499 1576 -924 -2095 1211 2351 1609 759 -1089 -1472 2102 3021 -2154 -3017 2151 3476
2762C476l722j273O07r61J816L396j102l945j881J479L965K461l131n478L110
$$ 3476 -246 -1519 -912 -1873 -57 3339 2237 -1708 -3589 -2110 1855 4316 1185 -4293 -1183
2777a183M263k038j390K210j025k880K982L704k781m356J084M406J438k576l347
$$ -1183 3080 1042 -348 1862 837 -2043 939 4643 1862 -2494 -1410 2996 4434 1858 -1489
2792a489J170M269q82l825J760K712l417j086N407j18o674j144O012K677k947
$$ -1489 -319 3950 3068 -757 1003 3715 298 -788 4619 4501 -2173 -3317 2695 5372 2425
2807B425l490p08J792J807q19l30J458k905l717L809M523m262m577L870L235l613
$$ 2425 -1065 -1773 19 1826 1007 677 2135 -770 -4487 -678 3845 -417 -4994 -1124 2111 -1502
2823a502k830K278J248k49n4r33m86o18j146J806M001k117o818J752O894j057
$$ -1502 -4332 -2054 -806 -1055 -1109 -2042 -2528 -3146 -4292 -2486 1515 -602 -7420 -5668 1226 169
2839A69m567J064J469j795l86L331M65k540k001K56L520K451m104k996L950K522
$$ 169 -4398 -3334 -1865 -3660 -4046 -715 -250 -2790 -4791 -4535 -1015 1436 -2668 -5664 -1714 808
2855H08m370n58M594M5l792N97K317j064j225J608K022q8k495l123K667N267j169
$$ 808 -3562 -4120 474 519 -3273 -2676 -359 -1423 -2648 -1040 982 894 -1601 -4724 -2057 3210 2041
2872B041m596N56K658k546k3N042k07n187j022L542J752q44j477j73J418M90k055
$$ 2041 -2555 -1999 659 -1887 -1910 3132 2925 -2262 -3284 258 2010 1166 -311 -484 934 1424 -631
2889f31M68L515j388m239K313L712k784k888L697K663l159k485J844J970O47j460
$$ -631 -163 3352 1964 -2275 38 3750 966 -1922 1775 4438 1279 -1206 638 2608 3255 1795
2905A795j290Q69J086k439M79M762m83o578M28N773l93k945P04J132j668o87J275
$$ 1795 505 1374 2460 21 500 5262 4779 -1799 -1371 4402 4009 1064 1768 2900 1232 545 1820
2922A820J529P8k606j741K723K642l080k807L833J844m638p10M132n70k814O90
$$ 1820 3349 3427 821 -920 1803 4445 1365 -1442 2391 4235 -403 -1113 3019 2449 -365 325
2938C25K171j553j361rJ535J582j633l805Q18M275j064l397K422J135m040p76
$$ 325 2496 943 -418 -427 1108 2690 1057 -2748 -1930 2345 1281 -2116 306 1441 -2599 -3375
2954c375M589Q91l761o25M61R75O1j001o62J827O24l028k74L299j129l225K421
$$ -3375 1214 2105 -1656 -2281 -1820 -845 -784 -1785 -2447 -620 4 -3024 -3298 1 -1128 -4353 -1932
2971a932K765l361k434K338K126r15j086o57n36J594M12j019Q43J35k989M50M722
$$ -1932 833 -2528 -4962 -2624 -498 -1413 -2499 -3156 -3692 -2098 -1686 -2705 -1862 -1727 -4716 -4266 456
2988D56Q8m651o35K970on13R59o2j814M21P90J81J331l51k112J416K507k956k107
$$ 456 544 -4107 -4742 -1772 -1778 -2291 -1332 -1394 -3208 -2787 -1997 -1816 -485 -836 -2948 -1532 975 -1981 -4088
3007d088L878K887k955j699J163l82J98K530O33j675j647p26J766L641l3m042
$$ -4088 -210 2677 -278 -1977 -814 -1196 -998 1532 2165 490 -1157 -1883 -117 3524 3491 -551
3023e51r99L782L99k178J962L24k848J6L551N88k364q40M16J186J387j325k317
$$ -551 -1550 2232 2631 453 2415 2739 -109 -93 3458 4046 1682 842 1258 2444 3831 2506 189
3040A89J968K159k637j171K155k91j196J877J238l875k143K850K245J46j024l109
$$ 189 2157 4316 1679 508 2663 2372 1176 3053 4291 416 -1727 1123 3368 3514 2490 -619
3056f19o52K644J670j204k80p46k719R40M260p92m121J15K438k33o07J33j346
$$ -619 -1271 1373 3043 1839 1559 813 -1906 -966 3294 2502 -1619 -1504 934 701 94 227 -1119
3073a119j4J756k64j707M92K7p55K122J105l720j903L241K493j914j607p07n57
$$ -1119 -1133 623 359 -1348 -856 -829 -1584 538 1643 -2077 -3980 -739 1754 -160 -1767 -2474 -3031
3090c031J993K098r90k631m2J92R35K542n47m120K0L346K2r72L14m77j118J923
$$ -3031 -1038 1060 70 -2561 -2603 -2411 -1476 1066 519 -3601 -3581 -235 -213 -1185 -871 -1348 -2466 -543
3108e43J103k642q61J794J113k26J53k009j890L111L153k078k130j47J50R27L227
$$ -543 560 -2082 -2943 -1149 -36 -262 -109 -2118 -4008 -897 2256 178 -1952 -2099 -1949 -1022 2205
3125B205k17l886n18K208J281n6J47k875R5L130N75k923L10J271q54K50J691j677
$$ 2205 1988 -1898 -2416 -208 1073 1017 1164 -1711 -1616 1514 2089 -834 -524 747 -107 143 1834 157
3143A57k080K045J945o01q77j348q20K811K808k015l772O60J910N41J522K5l627
$$ 157 -1923 122 2067 1466 589 -759 -1579 1232 4040 2025 -1747 -1087 823 1364 2886 2911 -716
3160g16j624L607K176j403q19j272q56K080K190k207j249J293j6k55R39j110j742
$$ -716 -2340 1267 3443 2040 1221 -51 -907 1173 3363 1156 -93 1200 1184 929 1868 758 -984
3177i84K190K160j555k720O95J179L23J524p78l410k67K890J279m76r54k851p30
$$ -984 1206 3366 1811 -909 -214 965 1288 2812 2034 -1376 -1643 1247 2526 2050 1096 -1755 -2485
3194b485L741K173k620j966O8n9Q70K113j334l199R55J816o85m43J33j331J63
$$ -2485 1256 3429 809 -1157 -1089 -1148 -278 1835 501 -2698 -1743 73 -612 -1055 -922 -2253 -2090
3211b090K024o08k675L69J582L46l5k50k741l21L334J152k239j075k44p59K710
$$ -2090 -66 -674 -3349 -2980 -1398 -1052 -1087 -1337 -4078 -4399 -1065 87 -2152 -3227 -3471 -4230 -1520
3228a520K374k478l335J143K054J18J54j7k542N52K074J27j238M26j72p9K155
$$ -1520 854 -1624 -4959 -3816 -1762 -1644 -1490 -1507 -4049 -3497 -1423 -1296 -2534 -2108 -2280 -2359 -204
3245b04O39l486K20L106K97j537L38p71q53K457J823k233j715L79R79Q38J401
$$ -204 435 -3051 -2831 275 572 -965 -627 -1398 -2251 206 2029 -204 -1919 -1540 -561 277 1678
3262A678r28l271J145K231l96r3K00k247n22L096M69k828m21J869P6q56L76j091
$$ 1678 750 -2521 -1376 855 459 366 566 -1681 -2203 893 1362 -1466 -1887 -18 58 -798 -422 -1513
3280a513l42J421O68j389n79m24n93J959K122k800k873J977J982k61l08J13k160
$$ -1513 -1855 -434 234 -1155 -1734 -2158 -2751 -792 1330 -1470 -4343 -2366 -384 -645 -953 -840 -3000
3297c000n63K770J153j502o55j69l73J884R72j744p86J634J11p34R58n6j472J839
$$ -3000 -3563 -793 360 -1142 -1797 -1966 -2339 -455 517 -1227 -2013 -379 -268 -1002 -44 -100 -1572 267
3315B67J972j798k488J555J877m07M50j422j788J521J883l5p83qk030r99L612
$$ 267 2239 441 -2047 -492 1385 978 1428 6 -1782 -261 1622 1587 804 796 -1234 -2233 1379
3332A379J941l439j533R13L87J62J087p89k096J034P86r41k06J194j061o37J414
$$ 1379 3320 -119 -1652 -739 -352 -190 897 108 -1988 -954 -168 -1109 -1315 -121 -1182 -1819 -405
3349d05j003j387J400J013p46k61j28j378p3K865M02k697k64P71l19J574J344
$$ -405 -1408 -2795 -1395 -382 -1128 -1389 -1517 -2895 -2968 -103 299 -2398 -2662 -1891 -2210 -636 708
3366G08j498k107J145J111jJ011k69j676L22K055r2q43Q67o53j009J962Q44j900
$$ 708 -790 -2897 -1752 -641 -642 369 100 -1576 -1254 801 709 -134 733 80 -929 1033 1877 -23
3384b3K50K116l77k243R27P13k08P97O57j271p91Q56Q6Q94J078j630k665J433
$$ -23 227 2343 1966 -277 650 1363 1155 1952 2609 1338 547 1403 1489 2383 3461 1831 -834 599
3402E99K460j442m25J470j213j725J203J168q11q34K54j41M75J10j199o26K150
$$ 599 3059 1617 1192 2662 1449 -276 927 2095 1284 450 704 563 1038 1148 -51 -677 1473
3419A473o1k125M94J286j488k19K577o56k629N34J691j17j25o8j068M84J498o33
$$ 1473 1412 -713 -219 1067 -421 -640 1937 1281 -1348 -814 877 760 635 567 -501 -17 1481 848
3437H48m20Q44n66j909K367K453j701k232J219P24q66N33O83l09j99O9r45J58
$$ 848 428 1272 706 -1203 1164 3617 1916 -316 903 1627 761 1294 1977 1668 1469 1538 593 751
3455G51J376p74n84J914p40k789J82L036O8j737l94n8r51J136R66o55p10q20j353
$$ 751 2127 1353 769 2683 1943 -846 -664 2372 2440 703 309 251 -700 436 1402 747 37 -783 -2136
3474b136J574K160j644k661J562J196j918O7J533o33k213J048R68n30l46p1j64
$$ -2136 -562 1598 -46 -2707 -1145 51 -1867 -1800 -267 -900 -3113 -2065 -1097 -1627 -1973 -2044 -2208
3491b208P37k56j457O10K695q29k628P15J560j276K31K405p71k911m9J932J236
$$ -2208 -1471 -1727 -3184 -2574 121 -708 -3336 -2621 -1061 -2337 -2106 299 -472 -3383 -3432 -1500 -264
3508b64M24j435j876J581J203j186Q09J943j585k733K147K565j725j449J404J062
$$ -264 160 -1275 -3151 -1570 -367 -1553 -744 1199 -386 -3119 -972 1593 -132 -1581 -177 885
3524H85j161n09K70O94P73m16j009Q60O73j637N00L023o46l959P58L503k48j966
$$ 885 -276 -785 -515 179 952 536 -473 387 1060 -577 -77 2946 2300 -1659 -901 2602 2354 388
3542C88J15K82k36L70R07M07l26j620o54K142J980k275k368K762Q81k127o6K078
$$ 388 503 785 549 919 1826 2233 1907 287 -367 1775 3755 1480 -888 1874 2755 628 562 2640
3560B640n05j894J275O44r18m88N61N46P18j008k898J497K700k97k527J190j40
$$ 2640 2135 241 1516 2160 1242 754 1315 1861 2579 1571 -1327 170 2870 2573 46 1236 1096
3577A096j732O27K572n30k433k69R19O73L5q06j003J454L38j877m45J834m37j665
$$ 1096 -636 -9 2563 2033 -400 -669 250 923 958 152 -851 603 941 -936 -1381 453 16 -1649
3595a649J629J087k536j356J893J220m27r89j276R4K172k51j595N24R0j095L27
$$ -1649 -20 1067 -1469 -2825 -932 288 -139 -1128 -2404 -2310 -138 -389 -1984 -1460 -1370 -2465 -2138
3612b138K392p88l199L95L039k28j060J63p88l60Q76j57l14J523l49j797O66J204
$$ -2138 254 -534 -3733 -3338 -299 -527 -1587 -1424 -2212 -2572 -1696 -1853 -2167 -644 -993 -2790 -2124 -920
3630i20j376j352L049J090k550j369J049P23P82R35j156j299l58K48J111K471
$$ -920 -2296 -3648 -599 491 -2059 -3428 -2379 -1656 -874 61 -1095 -2394 -2752 -2504 -1393 1078
3646A078j279l157L69L158l23j785Q36O14r29K68J264l01q53l3M10P59O53j352
$$ 1078 -201 -3358 -2989 169 -154 -1939 -1103 -489 -1418 -1150 114 -187 -1040 -1073 -663 96 749 -603
3664f03p39K308M68k464J69K237J38j150O70O70j723k56J829J322n09j505j601
$$ -603 -1342 966 1434 -1030 -861 1376 1514 364 1034 1704 -19 -275 1554 2876 2367 862 -739
3681g39J330K425K20k047K85P10j451l7K754o11j911j38J730o30o92nq3J422K10
$$ -739 591 3016 3236 1189 1474 2184 733 696 3450 2839 928 790 2520 1890 1198 1193 1110 2532 2742
3700B742j717j048J577j3j167Q65R83k220r94J973J013j909q62O14J22P21j78
$$ 2742 1025 -23 1554 1541 374 1239 2222 2 -992 981 1994 85 -777 -163 -41 680 502
3717E02j456j3J37J17p5J291n85k817Q98K295o55j705M30J183r95j64j05j16P99
$$ 502 -954 -967 -830 -713 -788 503 -82 -2899 -2001 294 -361 -2066 -1636 -453 -1448 -1612 -1717 -1833 -1034
3736a034J39n65L9M38j794j81K785R18k705j324J930J62n28Q43J24j028j29M70
$$ -1034 -895 -1460 -1421 -983 -2777 -2958 -173 745 -1960 -3284 -1354 -1192 -1720 -877 -753 -1781 -1910 -1440
3754a440N03M83J3j905P68K043j009j708R84J591j334k74J334o03r40J118M88
$$ -1440 -937 -454 -441 -2346 -1578 465 -544 -2252 -1268 323 -1011 -1285 49 -554 -1494 -376 112
3771A12o35m30j20P19J143P4j977m42J700L28n98J003J44k016m95K666J029j938
$$ 112 -523 -953 -1073 -354 789 863 -1114 -1556 144 472 -126 877 1021 -995 -1490 1176 2205 267
3789B67o7l48l0J078K38j55k92O37q71o29J717l06q60R00R31j704j154J904M98
$$ 267 200 -148 -178 900 1138 983 691 1328 457 -172 1545 1239 379 1279 2210 506 -648 1256 1754
3808A754k12J27n53j259J003J290m43k23P4j222k01K098N09j725n55R09j92K43
$$ 1754 1542 1669 1116 -143 860 2150 1707 1484 1558 336 135 2233 2742 1017 462 1371 1179 1422
3826A422J020o22j151M09L43n41Q13J89j120l40J225o00p44P00J087j001k67j41
$$ 1422 2442 1820 669 1078 1421 880 1693 1882 762 422 1647 1047 303 1003 2090 1089 822 681
3844F81n65N45J446n66j466l0K04k02J220Q04j631j341R77M81m99P78j5j910J77
$$ 681 116 661 2107 1541 75 45 249 47 1267 2071 440 -901 76 557 58 836 821 -1089 -912
3863i12J568j99l46N8m65m47R34j11j382N04J299r54o64P20j26r62J420L80j300
$$ -912 656 457 111 169 -296 -743 191 80 -1302 -798 501 -453 -1117 -397 -523 -1485 -65 315 -985
3882i85l79O95M40j35N08o79j597J328J136j024M19M76j166n48J496M90p47n9
$$ -985 -1364 -669 -229 -364 144 -535 -2132 -804 332 -692 -273 203 -963 -1511 -15 475 -272 -331
3900c31O76q36M46R24q91k84J561J01j222p1O31k23P44L87j253o26J232N19l38
$$ -331 345 -491 -45 879 -12 -296 1265 1366 144 73 704 481 1225 1612 359 -267 965 1484 1146
3919A146P55m86j490k8J578J86q12J0m65n06J134N86j117n35O54r4m24P06J22
$$ 1146 1901 1415 -75 -103 1475 1661 849 859 394 -112 1022 1608 491 -44 610 516 92 798 920
3938I20r68L1Q42j380M8O22P1m61N53m78j384Q75J406l67q46k86n00O5J873J34
$$ 920 -48 -17 825 -555 -507 115 186 -275 278 -200 -1584 -709 697 330 -516 -802 -1302 -1237 636 770
3958G70j480l5K46l98R18J271r93j389N49R68k83J75O33j021l22R69L0o40N20
$$ 770 -710 -745 -499 -897 21 1292 299 -1090 -541 427 144 319 952 -69 -391 578 608 -32 488
3977D88O47q92L8j85n75N49J431n64j537M35J98m31O29J085j589j502J085P90
$$ 488 1135 243 281 96 -479 70 1501 937 -600 -165 33 -398 231 1316 -273 -1775 -690 100
3995A00j41Kn34j271O25R18l13j15K54j009l29J339k55j298L10J383q71q47Q75
$$ 100 -41 -39 -573 -1844 -1219 -301 -614 -729 -475 -1484 -1813 -474 -729 -2027 -1717 -334 -1205 -2052 -1177
4014a177J40m49N43L53j043l28N74L61L57M57j101j415J694Q76o23n3M08l30o32
$$ -1177 -1037 -1486 -943 -590 -1633 -1961 -1387 -1026 -669 -212 -1313 -2728 -1034 -158 -781 -834 -426 -756 -1388
4033a388J665L32j218O0N92k72L68N85n64k53J377m15o39L27P11p50L36J154r42
$$ -1388 277 609 -609 -549 43 -229 139 724 160 -93 1284 869 230 557 1268 518 854 2008 1066
4052A066j147Q63R93n68j85o2r71M84J617o17q99L89j33p87J133Q82j584q20Q06
$$ 1066 -81 782 1775 1207 1022 960 -11 473 2090 1473 574 963 830 43 1176 2058 474 -346 460
4071D60K96m53J88Q0m50M33o0p93o3J288o90r04J221l45j235O74J456m28j452
$$ 460 756 303 491 571 121 554 494 -299 -362 926 236 -668 553 208 -1027 -353 1103 675 -777
4090g77M58k9L50J041k57r79k71N96n00O67J676j607j203P39J169j132K8Q45o02
$$ -777 -319 -348 2 1043 786 -193 -464 132 -368 299 1975 368 -835 -96 1073 -59 -31 814 212
4109B12m01O66k93l26P82m7p15N01K28j210L80J669p41k015O14Q61m22J50N96
$$ 212 -189 477 184 -142 640 593 -122 379 607 -603 -223 1446 705 -1310 -696 165 -257 -107 489
4128D89p94r13Q4Q26q9K26r60j178J193R93r04l10P70m27j573J060R36k72j93
$$ 489 -305 -1218 -1134 -308 -397 -171 -1131 -2309 -1116 -123 -1027 -1337 -567 -994 -2567 -1507 -571 -843 -1036
4147a036M8j16l46K62j69L32Q13n95j208L53J538o72l21J021k96j176O83J182
$$ -1036 -988 -1104 -1450 -1188 -1357 -1025 -212 -807 -2015 -1662 -124 -796 -1117 -96 -392 -1568 -885 297
4165B97l32n37J21j54K57J047o06q01Q96O0o50Q12J115r54j002J031N16p00j22
$$ 297 -35 -572 -451 -605 -348 699 93 -708 188 248 -402 410 1525 571 -431 600 1116 416 294
4184B94Q38k39kj45l69M65Q75j07j108O91L55j511P89J685K46j954K4L23l0J6
$$ 294 1132 893 891 746 377 842 1717 1610 502 1193 1548 37 826 2511 2757 803 827 1150 1120 1136
4204A136P69l30k29k94m94L08J401o16j212R59Q33j607m82J461K41j179K6N54
$$ 1136 1905 1575 1346 1052 558 866 2267 1651 439 1398 2231 624 142 1603 1844 665 691 1245
4222A245m37J73R1N8j75j49q14K02J618r68j840Q09J158n39o42J356o84j670L24
$$ 1245 808 981 1072 1130 955 806 -8 194 1812 844 -996 -187 971 432 -210 1146 462 -1208 -884
4241h84J046M17j35q38r51M55P78p13M0J103o44j812m8J983m64j117J226L78j265
$$ -884 162 579 444 -394 -1345 -890 -112 -825 -785 318 -326 -2138 -2186 -203 -667 -1784 -558 -180 -1445
4260a445o00P71M50P93m31j454L24J113j056p7J805l38k052L50J552L4p65K7J00
$$ -1445 -2045 -1274 -824 -31 -462 -1916 -1592 -479 -1535 -1612 193 -145 -2197 -1847 -295 -261 -1026 -999 -899
4279h99n54O89J68j32N11n46q22J114J083o14j613J235N64j430J38J313L10p78
$$ -899 -1453 -764 -596 -728 -217 -763 -1585 -471 612 -2 -1615 -380 184 -1246 -1108 205 515 -263
4297b63o24K31K24L22N95J37k17m55j580Q58K047k43j557J92R35q99j68J421J27
$$ -263 -887 -656 -432 -110 485 622 405 -50 -1630 -772 1275 1032 -525 -333 602 -297 -465 956 1083
4316A083j067K58J01L48L78m91l59P50P11j352k68J686M9j133R2J088p36p22J102
$$ 1083 16 274 375 723 1101 610 251 1001 1712 360 92 1778 1827 694 786 1874 1138 416 1518
4335A518J60m80k48K11n6J241n26j190R8Q54o06j13J379l4j862q0J467Q7j016
$$ 1518 1678 1198 950 1161 1105 2346 1820 630 728 1582 976 863 2242 2208 346 266 1733 1820 804
4354H04J21K93k88k23o3n88O80L51j126L90L29r30q53J740M52j611p09O79j13
$$ 804 925 1218 930 707 644 56 736 1087 -39 351 680 -250 -1103 637 1089 -522 -1231 -552 -665
4373f65K88K32k45p31K33m9NN04J03j651M58J250n44o50N39L6p33J06O58m50k08
$$ -665 -377 -145 -390 -1121 -888 -937 -932 -428 -325 -1976 -1518 -268 -812 -1462 -923 -887 -1620 -1514 -856 -1306 -1514
4394a514M73m5n51L69N6l92J120M29j341p18J667O7p58Q25k27r40L2J365K04k51
$$ -1514 -1041 -1086 -1637 -1268 -1212 -1604 -484 -55 -1396 -2114 -447 -380 -1138 -313 -540 -1480 -1448 -83 121 -130
4414a30l49p55K84J315K10j438J70Q32o53k36R54J97p67J61L32k48q4L07m5J42
$$ -130 -479 -1234 -950 365 575 -863 -693 139 -514 -750 204 401 -366 -205 127 -121 -205 102 57 199
4434A99N11q17p90J322Q13j081k67P11o97m3J145R9j048j99L23j19L47P75r57
$$ 199 710 -107 -897 425 1238 157 -110 601 -96 -139 1006 1105 57 -142 181 62 409 1184 227
4453B27o19J221Ql25L8N32j037K74R42o60o15K85J004q80j29M85n68O27K69m06
$$ 227 -392 829 837 512 550 1082 45 319 1261 601 -14 271 1275 395 266 751 183 810 1079 673
4473F73n79K47p1l2R39J75j456n92J139K85m08L68j51r34J61J025o14j01O03j028
$$ 673 94 341 270 238 1177 1352 -104 -696 443 728 320 688 537 -397 -236 789 175 74 677 -351
$$ [...]
8191B95
##END NTUPLES=NMR FID
##END=
