##TITLE=1H_CG-1131-b
 DMSO, 8 sc, 
 2.3.2020
##JCAMPDX= 6.0         $$ Bruker NMR JCAMP-DX V2.0
##DATA TYPE= NMR FID
##DATA CLASS= NTUPLES
##ORIGIN= UXNMR, Bruker Analytische Messtechnik GmbH
##OWNER= root
$$ XWIN-NMR		Version 3.5
$$ Mon Mar  2 13:55:28 2020 Russian Standard Time (UT+4h)  she@DPX200
##.OBSERVE FREQUENCY= 200.1315
##.OBSERVE NUCLEUS= ^1H
##.DELAY= (6, 6)
##.ACQUISITION MODE= SIMULTANEOUS
##.ACQUISITION SCHEME= undefined
##.AVERAGES= 8
##.DIGITISER RES= 18
##SPECTROMETER/DATA SYSTEM= spect
##.PULSE SEQUENCE= zg30
##.SOLVENT NAME= DMSO
##.SHIFT REFERENCE= (INTERNAL, DMSO, 0, 15.7039)
##AUDIT TRAIL= $$ (NUMBER, WHEN, WHO, WHERE, WHAT)
$$ ##TITLE= Audit trail, XWIN-NMR		Version 3.5
$$ ##JCAMPDX= 5.01
$$ ##ORIGIN= Bruker BioSpin GmbH
$$ ##OWNER= she
$$ F:/spectra/data/she/nmr/H-F/1/audita.txt
$$ ##AUDIT TRAIL=  $$ (NUMBER, WHEN, WHO, WHERE, WHAT)
(   1,<2020-03-02 13:54:24.14 +0400>,<she>,<DPX200>,
      <created by zg, POWCHK disabled, PULCHK disabled
       configuration hash MD5:
       00 E9 B6 7A A2 85 ED C7 34 08 36 98 17 FE 4E 26
       data hash MD5: 16K
       CC 7C 0A CB 16 A6 3D 78 F4 FA 4A 4C 67 33 91 1D>)
$$ ##END=
$$ 
$$ hash MD5
$$ C8 91 EB 05 A2 44 AF A9 51 A2 DF 44 65 3B EC 9D
##$RELAX= 
##$RELAX= 
##$RELAX= 
##$RELAX= 
##$RELAX= 
##$RELAX= 
$$ Bruker specific parameters
$$ --------------------------
##$DU= <F:/spectra>
##$EXPNO= 1
##$NAME= <H-F>
##$PROCNO= 1
##$TYPE= <nmr>
##$USER= <she>
##$AMP= (0..31)
100 100 100 100 100 100 100 100 100 100 100 100 100 100 100 100 100 100 
100 100 100 100 100 100 100 100 100 100 100 100 100 100 
##$AQSEQ= 0
##$AQ_mod= 1
##$AUNM= <au_zg>
##$AUTOPOS= <>
##$BF1= 200.13
##$BF2= 200.13
##$BF3= 200.13
##$BF4= 200.13
##$BF5= 200.13
##$BF6= 200.13
##$BF7= 200.13
##$BF8= 200.13
##$BYTORDA= 1
##$CFDGTYP= 0
##$CFRGTYP= 5
##$CHEMSTR= <none>
##$CNST= (0..31)
1 1 145 1 1 1 1 1 1 1 1 1 1 1 1 1 1 1 1 1 1 1 1 1 1 1 1 1 1 1 1 1 
##$CPDPRG= <>
##$CPDPRG1= <>
##$CPDPRG2= <>
##$CPDPRG3= <>
##$CPDPRG4= <mlev>
##$CPDPRG5= <mlev>
##$CPDPRG6= <mlev>
##$CPDPRG7= <mlev>
##$CPDPRG8= <mlev>
##$CPDPRGB= <>
##$CPDPRGT= <>
##$D= (0..31)
0 1.2 0 0 0 0 0 0 0 0.06 0 0.03 0 0 0 0 0.0002 0 0 0 0 0 0 0 0 0 0 0 0 
0 0 0 
##$DATE= 1583142863
##$DBL= (0..7)
120 120 120 120 120 120 120 120 
##$DBP= (0..7)
150 150 150 150 150 150 150 150 
##$DBP07= 0
##$DBPNAM0= <>
##$DBPNAM1= <>
##$DBPNAM2= <>
##$DBPNAM3= <>
##$DBPNAM4= <>
##$DBPNAM5= <>
##$DBPNAM6= <>
##$DBPNAM7= <>
##$DBPOAL= (0..7)
0.5 0.5 0.5 0.5 0.5 0.5 0.5 0.5 
##$DBPOFFS= (0..7)
0 0 0 0 0 0 0 0 
##$DE= 6
##$DECBNUC= <off>
##$DECIM= 24
##$DECNUC= <off>
##$DECSTAT= 4
##$DIGMOD= 1
##$DIGTYP= 9
##$DL= (0..7)
0 120 120 120 120 120 120 120 
##$DP= (0..7)
150 150 150 150 150 150 150 150 
##$DP07= 0
##$DPNAME0= <>
##$DPNAME1= <>
##$DPNAME2= <>
##$DPNAME3= <>
##$DPNAME4= <>
##$DPNAME5= <>
##$DPNAME6= <>
##$DPNAME7= <>
##$DPOAL= (0..7)
0.5 0.5 0.5 0.5 0.5 0.5 0.5 0.5 
##$DPOFFS= (0..7)
0 0 0 0 0 0 0 0 
##$DQDMODE= 0
##$DR= 18
##$DS= 0
##$DSLIST= <SSSSSSSSSSSSSSS>
$$ [...]
##$SUBNAM2= <"">
##$SUBNAM3= <"">
##$SUBNAM4= <"">
##$SUBNAM5= <"">
##$SUBNAM6= <"">
##$SUBNAM7= <"">
##$SUBNAM8= <"">
##$SUBNAM9= <"">
##$SW= 24.9337058887773
##$SWIBOX= (0..15)
0 0 2 0 0 0 0 0 0 0 0 0 0 0 0 0 
##$SW_h= 4990.01996007984
##$TD= 16384
##$TD0= 1
##$TE= 0
##$TE2= 300
##$TE3= 300
##$TEG= 300
##$TL= (0..7)
0 120 120 120 120 120 120 120 
##$TP= (0..7)
150 150 150 150 150 150 150 150 
##$TP07= 0
##$TPNAME0= <>
##$TPNAME1= <>
##$TPNAME2= <>
##$TPNAME3= <>
##$TPNAME4= <>
##$TPNAME5= <>
##$TPNAME6= <>
##$TPNAME7= <>
##$TPOAL= (0..7)
0.5 0.5 0.5 0.5 0.5 0.5 0.5 0.5 
##$TPOFFS= (0..7)
0 0 0 0 0 0 0 0 
##$TUNHIN= 0
##$TUNHOUT= 0
##$TUNXOUT= 0
##$USERA1= <user>
##$USERA2= <user>
##$USERA3= <user>
##$USERA4= <user>
##$USERA5= <user>
##$V9= 5
##$VALIST= <valist>
##$VCLIST= <CCCCCCCCCCCCCCC>
##$VD= 0
##$VDLIST= <DDDDDDDDDDDDDDD>
##$VPLIST= <PPPPPPPPPPPPPPP>
##$VTLIST= <TTTTTTTTTTTTTTT>
##$WBST= 1024
##$WBSW= 4
##$XGAIN= (0..3)
0 0 0 0 
##$XL= 0
##$YL= 0
##$YMAX_a= 156733
##$YMIN_a= -76236
##$ZGOPTNS= <>
##$ZL1= 120
##$ZL2= 120
##$ZL3= 120
##$ZL4= 120
##$ABSF1= 10
##$ABSF2= 0
##$ABSG= 5
##$ABSL= 3
##$ALPHA= 0
##$AQORDER= 0
##$ASSFAC= 0
##$ASSFACI= 0
##$ASSFACX= 0
##$ASSWID= 0
##$AUNMP= <proc_1d>
##$AZFE= 0.1
##$AZFW= 0.1
##$BCFW= 1
##$BC_mod= 2
##$BYTORDP= 1
##$COROFFS= 0
##$CY= 11.3945322036743
##$DATMOD= 1
##$DC= 2
##$DFILT= <>
##$DTYPP= 0
##$F1P= 16.9975609425685
##$F2P= -3.02152046262296
##$FCOR= 0.5
##$FTSIZE= 0
##$FT_mod= 4
##$GAMMA= 1
##$GB= 0.15
##$INTBC= 1
##$INTSCL= 1
##$ISEN= 128
##$LB= 0.24
##$LEV0= 0
##$LPBIN= 0
##$MAXI= 10000
##$MC2= 0
##$MEAN= 0
##$ME_mod= 0
##$MI= 1.114404
##$NCOEF= 0
##$NC_proc= 0
##$NLEV= 6
##$NOISF1= 3.799351
##$NOISF2= 2.8
##$NSP= 1
##$NTH_PI= 0
##$NZP= 0
##$OFFSET= 15.70392
##$PC= 1
##$PHC0= -9785.698
##$PHC1= 11.80082
##$PH_mod= 1
##$PKNL= yes
##$PPARMOD= 0
##$PSCAL= 0
##$PSIGN= 0
##$REVERSE= no
##$SF= 200.130013532006
##$SI= 16384
##$SIGF1= 3
##$SIGF2= 2
##$SINO= 400
##$SIOLD= 16384
##$SREGLST= <1H.CDCl3>
##$SSB= 0
##$STSI= 0
##$STSR= 0
##$SW_p= 3612.71676300578
##$SYMM= 0
##$S_DEV= 0
##$TDeff= 0
##$TDoff= 0
##$TI= <>
##$TILT= no
##$TM1= 0
##$TM2= 0
##$TOPLEV= 0
##$USERP1= <user>
##$USERP2= <user>
##$USERP3= <user>
##$USERP4= <user>
##$USERP5= <user>
##$WDW= 1
##$XDIM= 8192
##$YMAX_p= 0
##$YMIN_p= 0
$$ End of Bruker specific parameters
$$ ---------------------------------
##NTUPLES= NMR FID
##VAR_NAME=  TIME,          FID/REAL,        FID/IMAG
##SYMBOL=    X,             R,               I
##VAR_TYPE=  INDEPENDENT,   DEPENDENT,       DEPENDENT
##VAR_FORM=  AFFN,          ASDF,            ASDF
##VAR_DIM=   8192,          8192,            8192
##UNITS=     SECONDS,       ARBITRARY UNITS, ARBITRARY UNITS
##FACTOR=    0.0002004,     1,               1
##FIRST=     0,             0,               0
##LAST=      1.6414764,     0,               0
##MIN=       0,             -76236,          0
##MAX=       1.6414764,     156733,          0
$$ Real data points
##PAGE= N=1
##DATA TABLE= (X++(R..R)), XYDATA
0@%%%%%%%%%%qJ6j6J6j6K3l1L2m0M8n5O4p3Q7j01J15j30J48j67J89k15K41k71
33a44L05l40L79m22M70n22N76o37P08p85Q67r61J067j183J314j467J642j847K091
52A111k385K752l222L852m742O107q502J3965n2069o149L6001l9194j9170m591
66g6236K9175K9914N234l1368k925K4772J3901q010J976L640N745N438o434j4705
80a9883J8791L0447q737l6610r560J9465K6991J2246k6249m2285M122M2683J5979
93B7400k4260k6241r471J3782K5887k18k9308r344J8300L174j0559P55N856L147
107a1100K441j2023j6095J6813L3396l734l1897j3250J4422K9149K1017j8898
119A0241m0332K78M0125K0725j4013j9625r508R008K3927L914k2229o516J5709
$$ y = [0, 0, 0, 0, 0, 0, 0, 0, 0, 0, 0, -8, 8, -8, 8, -8, 15, -16, 16, -24, 24, -31, 33, -40, 47, -54, 61, -69, 79, -88, 101, -114, 127, -144, 161, -179, 200, -222, 248, -274, 302, -335, 373, -412, 455, -506, 561, -622, 692, -775, 867, -980, 1111, -1274, 1478, -1744, 2108, -2634, 3473, -5029, 8936, -43133, -49282, -13281, -52475, -71645, -76236, -47061, -17147, -11913, -43281, -46206, -21434, -7533, -15543, -13567, -9927, -4182, 1256, -5178, -19883, -1092, 29355, 20618, -15992, -25552, -6087, 20904, 33150, 6901, -35384, -31262, 11421, 27400, 3140, -23101, -32572, -18790, 7097, 6879, -22429, -31773, -13473, -10299, -20858, -20103, -14247, -11100, -8659, -20682, -36777, -19964, 13432, 9698, -22199, -35449, -21027, 8122, 29139, 10241, -30091, -29813, 10312, 31037, 17024, -2601, -12109, -3101, 20826, 24740, 2511, -4005, 11704]
132A1704J742j1442j78N475M677K265j6157k1897J3362L3731j062l1556k0708
145c0044M198K3530K3026j2774l9213q526K9980J8818q483j5983j2137M145K0806
158b657N779j6595l256J4265k71j0780J996R463J0053O527j3657k2426J0516L4848
172B3805Q069k3065j9806n22K1162K6148m887l4648j2222K2711J7668l541j1425
185I447j3380k366J4619L422j5956l749J2160m055j5407n045M772R493O557j5830
199a5318k8576J943L0490J0389j9458k2947q751J4181K6467J26l0775j5120J6919
212d0430J5381P47o177j0553l176J3074N485j1478Q35J5111k27j3191m467O040
226c3026J3660J3827r506k6988q27K9634J6405j1034j8265j0879J0006K6799P501
$$ y = [11704, 13446, 2004, 1826, 7301, 11978, 14243, -1914, -23811, -10449, 23282, 22220, -9336, -30044, -25846, -2316, 20710, 7936, -31277, -39803, -9823, 8995, 512, -15471, -27608, -23463, -2657, 3122, -13473, -16729, -2464, -2735, -13515, -11519, -2056, 7997, 14524, 867, -21559, -11043, 23805, 31874, 8809, -10997, -11519, 9643, 35791, 30904, -3744, -15966, 6745, 24413, 20872, 9447, -3933, -6299, 8320, 11742, -4214, -7963, 4197, 142, -15265, -20310, -15538, -6045, 512, -15318, -43894, -41951, -11461, -1072, -20530, -43477, -52228, -38047, -11580, -11454, -42229, -57349, -40430, -25049, -24302, -30479, -41032, -44208, -31134, -25649, -37127, -36292, -21181, -21408, -34599, -39066, -33026, -19366, -5539, -15045, -42033, -42860, -13226, 3179, -7855, -26120, -36999, -26993, -194, 7307]
239G307k4151j5053J1261J2589K628j671p409l608R352K532j1494J113J5904J244
253E44j3462p358J873J2808J6271n912k7476o227K4624J8068m694j5755j4006
266b0702M382K4501J0965j7804j3913P923R049K164J086m789k607Q451J382j2723
280b635J269J7251L586j2736r796j650J1095J8681j925k6759j1389J8555J7022
293B0569n02j2444j6040k082J9472J1908j4956j2133M186M170QN35l146k886O788
308C447j048j3934o63J6423N168j0558j1340n442Q130K0126J747k4287j3506J3366
322a2371J5747L035p058j4929n635J5868J1747r603r939M122K350j136J432j826
336h196p75Q059j172j5444j768J6795Q014p939j0836q142M943K0487O664k0542
$$ y = [7307, -16844, -31897, -20636, -8047, -5419, -7090, -14499, -18107, -8755, -6223, -17717, -16604, -700, 544, -12918, -20276, -18403, -5595, 10676, 4764, -22712, -28939, -4315, 13753, 9059, -6696, -20702, -16320, 8181, 19146, 1342, -12571, -4648, 4401, 6565, 7651, 2862, 255, 8706, 10088, -2635, -1366, 15885, 19471, 6735, -3061, -4711, 6384, 25065, 23140, -3619, -15008, 3547, 20569, 20067, 7623, -8417, -10499, 8973, 20881, 5925, -6208, -2022, 2148, 2156, 2691, -455, -3341, 3447, 2399, -11535, -12198, 4225, 9393, -1165, -12505, -17947, -9817, 10309, 12056, -12231, -25737, -12371, 3376, 6411, -647, -15576, -21211, -5343, 6404, -3199, -13138, -9016, -6666, -7802, -6370, -8196, -8971, -912, -2084, -17528, -19296, -2501, 5513, -2426, -13262, -21404, -16461, 4026, 10690, -9852]
350i852j4830Q287J3480N837l438j2946o910J1842J0677p149o546M506Q04k329
364h567Q07j114R84Q905Lj5596m187J4975J0623m055r640j0402J541J9491R537
379A3305j5679j4578N007R971O052J420r997r000R085R104n834l720M920N95l912
394c261l9j277J573J0324P69j6009o296J2662J0863r66p423j2360k207J7615J1291
409A5259j1579j3342J534N932O115L534p886q753O353O473n523k786O407R5m082
424b249k099k588J215J1379K620j5507r004R399J0798J987m965j2727n562J4073
438c230J2129p842j1225o77K700M194M772m901p686M471M491o270j811O665J248
453b972m114k664m369P45J1744M522j3492j0326O337R111M577k133j1334q006
$$ y = [-9852, -24682, -16395, -2915, 2922, -516, -13462, -20372, -8530, 2147, -5002, -11548, -7042, -6238, -8567, -7760, -8874, -7890, 1015, 1018, -14578, -18765, -3790, 6833, 2778, -6862, -17264, -15723, 3768, 13305, -2374, -16952, -11945, -1974, 4078, 5498, -4499, -13499, -4414, 4690, -1144, -4864, 56, 651, -3261, -3300, -4577, -3004, 7320, 8089, -7920, -14216, -1554, 9309, 8343, 920, -11440, -13647, 3968, 15259, 3680, -9662, -8128, -2196, 3919, 7453, -433, -9186, -2833, 3640, -1883, -4669, 1738, 1833, -2249, -4348, -6936, -5721, 5658, 8278, -7229, -16233, -6834, 3964, 5951, 986, -11741, -17303, -3230, 8899, 1057, -10168, -10845, -8145, -3951, 821, -4080, -11766, -7295, -2804, -9074, -10885, -4220, -2972, -7086, -9750, -14119, -13374, -1630, 2892, -10600, -20926, -14589, -5478, -901, -3034, -14368, -22374]
467b2374J0604J2030m585q286o64KL013N874k668o163L884L794o760j482Q003
482e778K501k610k833n434k61J2718P009j1689j0055L912P346N560K180r797r533
497a6764P904J1100k383n289l44j115M19N129q99m196M595K162p358j954P804
512a189L649j054k458o387k210J2222Q848q369r061J407N204O451M627o333r350
527d003N857Q479l54k218J358j912j83M967L00k406N045K250p772k689P289M376
543A8384N12j649p835m935J0025R297o496q846j247J413L991N319n673j0044J495
558C711N683k524j410J218l693l960K018j308k939N256J942r316n382M453L985
573b266J224k96q059o703Q182R417l848o783j487r06M002O837k108p819J131M099
$$ y = [-22374, -11770, 260, -4325, -12611, -13275, -13273, -10260, -4386, -7054, -13217, -9333, -5539, -12299, -13781, -5778, -3277, -5887, -8720, -14154, -14415, -1697, 5312, -6377, -16432, -12520, -5174, 386, 2566, -7231, -16764, -8860, 2240, -143, -5432, -5776, -6891, -6472, -1343, -2242, -6438, -1843, 319, -7039, -8993, -1189, 2460, 1406, -1052, -7439, -9649, 2573, 11421, 3052, -6009, -4602, 602, 7053, 11680, 5347, -4003, 1854, 10333, 9979, 7761, 9119, 7207, 7024, 11991, 12291, 9885, 14930, 17180, 9408, 6719, 14008, 18384, 18896, 17247, 9412, 4477, 14502, 23799, 17303, 8457, 7210, 8623, 12614, 17933, 12260, 2216, 3711, 9394, 6870, 5460, 6678, 2985, -975, 1043, -265, -3204, 2052, 3994, -5322, -10704, -6251, -2266, -1042, -1338, -9397, -16100, -7918, 1499, -2349, -9132, -10619, -11525, -7523, -686, -2794, -10613, -9482, -5383]
589e383j312L56L640k058k614J513j217j272O290L168p917n494L689L666K159
604b786K051p369q423N324Q823j513m881k270l061J562O896o85o703n8K311l022
620a3804J038N176r81l117R48j851j483P748N037n886n456K452L789M329M395
635B334n153p417M101Q839Q91j705p90l890M40P528J765m316P87R99m196N55N158
652E930L2k465l02l765l200O299M937o119o113n04M03L314M436m741r675O84N840
669e009K8l61k69n239k271M977K481k321J244O10m596K28O150J815p16J560l730
686e419k696P274P652k650m047M67Q07M277P415j220p424M38N197J694K130J776
702A5671m347l602M254K265j422K573P21o597j901M498J174p01p6m987n359M482
$$ y = [-5383, -6695, -6339, -2699, -4757, -7371, -5858, -7075, -8347, -2057, 1111, -6806, -12300, -8611, -4945, -2786, -735, -8104, -16527, -11203, -2380, -3893, -8774, -11044, -14105, -12543, -5647, -6332, -13035, -13093, -10782, -13804, -12766, -7590, -8571, -11688, -10740, -12591, -14074, -6326, -1289, -7175, -12631, -10179, -6390, -2061, 2334, -2819, -10236, -6135, 2704, 3595, 1890, 1100, -2790, -2350, 5178, 6943, 2627, 3414, 4413, 217, 772, 5930, 5962, 3497, 3195, -570, -3770, 2529, 7466, 1347, -4766, -5270, -4867, -1553, 2883, -1858, -11533, -10849, -5009, -4981, -5342, -5611, -10850, -13121, -8144, -5663, -7984, -6740, -6130, -10726, -10498, -4348, -2533, -3249, -1689, -5419, -8115, -841, 6811, 4161, 114, 581, 1388, 5665, 13080, 11860, 4436, 4874, 10071, 11765, 13895, 15671, 11324, 7722, 11976, 14241, 12819, 15392, 16113, 9516, 7615, 12113, 13287, 12586, 12510, 7523, 2164, 6646]
718F646O133k654n228k053k956J677O945q18p831j901J729o71K015L283l770m759
734d213K256J489r75L369J408o568j652M073J929J137J545m093o198L747P040
749D294j059j886j855m346M46O999R52n645k263M55k067J910M488l786n038P7
765h324j93j173L767J699o805m447K837J114J393K649m222o729J664O751K42n71
781a0348o18n257l25P458L426k898o72L06j768L304O153k62l030J266j30L38N912
798B855M210m973k856K399J929K521N068k512o932J068N155J250J049p0n869k574
814A718N063L312k747k57j876m854J293N656r02l909q47k821j848M893L633m207
830A300m620Q8o00J659N627j618p184p82L390Q44K416J586n095l766M631L483
$$ y = [6646, 12779, 10125, 4897, 2844, -112, 1565, 8510, 7692, -139, -2040, -311, -982, 1033, 4316, 546, -4213, -1957, -468, -1443, 1926, 3334, -3234, -4886, -813, 1116, 2253, 3798, -295, -6493, -2746, 4294, 3235, 1349, -506, -4852, -4406, 2593, 3545, -2100, -4363, -3908, -5975, -4065, 423, -3363, -8401, -8324, -8517, -9690, -5923, -4224, -11029, -15476, -12639, -11525, -10132, -7483, -11705, -18434, -16770, -10019, -9777, -10348, -10966, -16223, -16548, -9090, -5664, -8562, -9234, -8928, -10696, -7392, -1239, -1501, -4531, -3265, -3395, -3057, 2855, 7065, 2092, -764, 1635, 3564, 6085, 11153, 8641, 1709, 2777, 7932, 9182, 10231, 10161, 4292, 1718, 6781, 10093, 7346, 7089, 5213, 359, 1652, 7308, 6406, 2497, 1650, -1171, -3019, 1874, 5507, 1300, -3320, -3232, -3832, -2173, 3454, 1836, -5348, -6130, -2740, -1896, 520, 2106, -2989, -6755, -2124, 1359]
846A359m44J107j464m625P31N949J371j848k48k819k731N035N421k898l373p68
862b45j874J566O158J54o447j762J156L76K859K780n042n209K444K427K37K081
878A659j181o164o22N150J365p57N16l719l583L996N729j322k703k96k793J095
894c630O368J915m796j749L50n76L931M891l660m958J344J730J024L382M20o139
910a53k053M290J687L83J239l372n478K926N037m41j683j133m240o45N922K282
926D568m059j953j233j933L280M782k606m946j88N41M24M219J369o198k506K752
942c687J276J473L012l595n247J424N022M28J00j25m591j956N826L482k261j140
958e59j325k991K575O075j086m304k75l88l49M858K241m935l097J761O50J853
$$ y = [1359, 915, 2022, 558, -4067, -3336, 2613, 3984, 2136, 1888, -931, -3662, 1373, 6794, 3896, 523, -245, -2119, -553, 5605, 5759, -688, -2450, -1294, -918, 1941, 4721, -321, -5530, -3086, -659, -422, 1659, 478, -5686, -6308, -1158, 207, -550, -34, -3753, -7336, -3340, 2389, 1067, -1636, -1932, -4725, -3630, 2738, 4653, -143, -1892, -1542, -2118, 1813, 6704, 3044, -1914, -570, 1160, 2184, 5566, 5986, -153, -2206, 2084, 3771, 4154, 5393, 2021, -3457, -531, 4506, 4065, 2382, 1249, -2991, -3636, 2286, 4568, 509, -1444, -2677, -4610, -1330, 3452, 846, -4100, -4288, -3747, -3323, 896, 2265, -3933, -6439, -3687, -2411, -938, 2074, -1521, -6768, -5344, -322, 106, 206, 81, -4510, -6466, -640, 2842, 581, -559, -1884, -4875, -2300, 3775, 2689, -1615, -1890, -2278, -2627, 2231, 4472, -463, -3560, -1799, -1149, 704]
974G04L491k115o180K84M203M59J596P75n310l064M467L571j030r8j898l863J597
991b411N745M48l128j152j488o57M592L661l953k805M72m09J742M931j464n455
1007a331p56K729O06K461J808n038l717K989L308L05P81j582n121Q04N193J483
1023D922k123n30k431k344M334M278k542k974n59j288J414M982K01m893j616J182
1039A3K87K600K955m276m362J634K437M63J936j031n449p21M873J353r39M20l696
1056a503l367L513M407q87k610p39k408j8N552J058m224j801K58m92K783L478
1072C000l020m905J133J427N74L309q6n210j975L456J795M01R96k790m125K678
1088c342L995m79q83o18l311m37N202K115l222j462p65j511K886M373j908m417
$$ y = [704, 4195, 2080, -4100, -3816, 387, 846, 2442, 3217, -2093, -5157, -690, 2881, 1851, 1753, -145, -4008, -2411, 3334, 3782, 654, -498, -1986, -2643, 1949, 5610, 1657, -1148, -676, -1085, 657, 5588, 4124, -1331, -2087, 642, 1248, 3709, 5517, 479, -3238, -249, 3059, 3364, 4145, 2563, -2558, -1754, 3439, 4922, 2799, 2269, -162, -2506, 1828, 6106, 3564, 590, 31, -1257, 157, 5139, 5340, 447, -1169, 13, 300, 2900, 5855, 1579, -2783, -1149, 1288, 1751, 3687, 2656, -2793, -3514, 1359, 2712, 1773, 2193, -1503, -4870, -1357, 3050, 2163, -447, -1186, -3594, -3612, 1940, 2998, -1226, -3027, -2769, -3261, -478, 3000, -20, -4925, -3792, -2365, -1791, 1518, 1432, -3778, -5753, -2297, -502, -101, 895, -1895, -6020, -3342, 653, 174, -709, -1327, -4638, -5075, 127, 2242, -980, -2442, -3207, -4718, -1832, 2541, 633, -3784]
1104c784L09K84O34L629J124n037k112K212J412J217K073k912m615J476L693M04
1120GJ77J84l832j885M577K701j913j078j351k371K461M837j010l510m95m07K16
1137b692L992K004l899k521J618M17J624K946j461m805L54L560O13J102O00m152
1153g00j777M044K804o75k00r75l716J759N401J62k661m11j068r24L946L005l182
1170D832k603N48l11J437L780j141m720k17J746N78J997J186m036l383K690K525
1186D908n28O13j380m125O77M076J99j769j52j994k229L569L209k326k435j13
1202B00j669R87M640l7m237j342J332l29K248K496l721l539J906K023r9J370l30
1219A899m679m87L688Q03j056K69k483k622K789L051j519j532pk743L2M446Q21
$$ y = [-3784, -3475, -3191, -2557, 1072, 2196, -2841, -4953, -2741, -1329, -112, 1961, -951, -5566, -4090, -397, 7, 184, 368, -3464, -5349, -772, 1929, 16, -1062, -2413, -4784, -2323, 2514, 1504, -2006, -2501, -2908, -2692, 1300, 3304, -595, -3116, -1498, -1081, 543, 3489, 2028, -2777, -2423, 1137, 1750, 2852, 3452, -700, -2477, 1567, 4371, 3696, 3496, 2521, -1195, 564, 5965, 6127, 3466, 3055, 1987, 1063, 5009, 8014, 4832, 2229, 2777, 2466, 3903, 7683, 6542, 1822, 1605, 3351, 3929, 5926, 7112, 3076, -307, 2383, 4908, 4380, 4993, 3613, -512, 165, 4241, 4440, 2671, 2519, 525, -1704, 1865, 5074, 2748, 313, 200, -1469, -482, 4158, 4121, -116, -1458, -126, -455, 1793, 4289, 568, -2971, -1065, 958, 859, 2229, 1899, -2780, -3267, 421, 1224, 168, 437, -2046, -4668, -1879, 1172, -347, -1879, -1886, -4629, -4597, -151, 670]
1236F70l707j481k0q87K647L031l322l347R74J443K94K125j88m002p76L227Q27
1253b492L1J193j729l175J928L746j60q18K21k876n94M824J596k149q35k68j489
1270c046K376M030j908l586M93R42k9K685P65m056j592K229M97K38J837j977l883
1287c985O84K877k89R0N08l639j356L335K166j692p07j029k020J938L884r42l027
1304c204M26m8L17L268J380l289r17J558l8J235K969p98l507Q51K717JJ522J033
1322E476l390k013L570K424p76j92p81k549J076M252l60k353M2r36p94K710J944
1339G350k506k362Q18j021Q02K976l16m016o7J151j23J266J721l417l172K395
1355A479J980l36Q13r68l411O38L725J92j465M6j331j581K488K564k279j057K97
$$ y = [670, -3037, -4518, -4538, -5425, -2778, 253, -3069, -6416, -5442, -3999, -3705, -1580, -1768, -5770, -6546, -3319, -2492, -2461, -1268, -2997, -6172, -4244, -498, -658, -1476, -1255, -4131, -4725, 99, 1695, -454, -1289, -1557, -3046, -670, 3360, 1452, -2134, -1641, -699, -728, 1957, 2722, -1334, -2926, -697, -200, 38, 1875, -102, -3985, -3301, -424, -713, -623, -115, -3754, -5110, -1775, 391, -1301, -2008, -3037, -5057, -3119, 765, -177, -3204, -2778, -2826, -2509, 759, 2139, -1150, -2067, -509, -547, 688, 3657, 2859, -648, 203, 2920, 2921, 4443, 5476, 2086, 73, 3643, 6067, 5291, 5099, 4318, 1769, 2845, 7097, 6737, 4384, 4426, 3490, 2696, 5406, 7350, 4844, 2482, 3300, 2279, 3081, 6057, 5741, 1725, 1658, 2809, 2686, 3952, 5673, 2256, -916, 1479, 3459, 3123, 3936, 2968, -443, 195, 3920, 4112, 2647, 2693, 1362, -219, 2269, 4833, 2554, 1497, 1794]
1372A794j627K69L575o8l327r41O51l84J828J733k769l592J338J121k58J173o85
1389a69l792k44K832j62j026L83j788k523K213J877j423o62J48k369j91L457R15
1406b524k699m05J79j083K160K994k266k576J299J445m9K526j6l006o60L273K13
1423a195k1J865j332k658J615L098q93M56K82k177q53L345J274j872n46k81j555
1440a448J785L013j838k239L41J73J8J928R72l455p51J627k19J45J975j390l172
1457b535J282K118l41O35O75k819j285K918J467r47J08o71k011J612L258m05k304
1474G55M84n47o06K478J878l009j130J505l83M32K187q92k849K11J415p20J287
1491B496J143l033j854K342J433j063N82r29k724O64L273n13j522J56j130j110
$$ y = [1794, 167, 436, 4011, 3943, 616, -325, 326, -58, 1770, 3503, 734, -2858, -1520, -399, -657, 516, -169, -3961, -4205, -1373, -1535, -2561, -2178, -3966, -6489, -4276, -2399, -3822, -4484, -4336, -6705, -6896, -3439, -2524, -5223, -5628, -5449, -6532, -4372, -1378, -3644, -6220, -4921, -3476, -3525, -999, -1015, -4021, -4681, -1408, -1195, -1216, 649, -683, -3341, -1726, 1372, 479, 935, 1217, -960, -1813, 1532, 2806, 934, 388, 107, -1448, 337, 3350, 1512, -727, -386, -213, -195, 1733, 2705, -750, -1501, 126, -93, 52, 2027, 637, -2535, -1253, 865, 524, 1159, 1834, -985, -2270, 648, 2115, 1168, 1276, 605, -1406, 206, 3464, 3059, 755, 1239, 692, 86, 2564, 4442, 1433, 303, 1808, 1425, 1857, 4044, 3152, 303, 514, 1929, 1209, 2496, 3639, 606, -1248, 1094, 2527, 1464, 2046, 1117, -1607, -943, 2330, 1817, 295, 451, -679, -1789]
1507a789K629J890k615j156J018q34J39K969l02k675K06P21m42J473J809k410
1523F31k364K158R48l38J055m60k814L03K911l0r33L75j259j711K541J710j560
1540A163q14J70j423n6K824K68k465m34K37p89J312K032j938k723J268J016q36
1557a188J710o0l409k4K628J92n42Q00j459j960J705K061j154j04O32k058m19
1574b649K842Q04j888k71M54j676J848K300j575k074P54N82l88K231K36k663r31
1591b064K078n2q7J153r05k310J116J810n97J82M93j850j406K749R50r78m11J01
1609b8j835J203K524o79k215M29q7k35K092R05k467p11J593p02K86K123q40k514
1627a158M79J634m72L28R61k242j287K483R44r89M79l11k328P88K659j66j579
$$ y = [-1789, 840, 2730, 115, -1041, -23, -857, -718, 2251, 1949, -726, -520, 201, -241, 1232, 3041, 631, -1733, 425, 1373, 1035, 2090, 1630, -1184, -881, 2030, 2000, 1067, 1442, 183, -1528, 1013, 2723, 1163, 349, 519, -904, -960, 1864, 2132, -333, -767, -530, -1319, -7, 2025, 87, -2636, -1368, -352, -1188, 522, 462, -2947, -2971, -343, -151, -693, 107, -1352, -3312, -1607, 454, -700, -804, -172, -2230, -2649, 193, 997, -891, -1162, -708, -2384, -536, 1764, 189, -1885, -1131, -549, -937, 1294, 1530, -1133, -2064, 14, -38, -125, 1028, 123, -2187, -1071, 739, 142, 324, 817, -1033, -2439, 310, 1260, 282, -129, -28, -1863, -660, 1864, 1185, -1030, -601, -688, -923, 1169, 2074, -393, -1104, 489, -213, 73, 2196, 1356, -1158, -679, 955, 483, 811, 1772, -470, -1757, 726, 1670, 681, 1160, 849, -1479, -691, 1968, 1802, 223]
1644B23K42q45n75K628Q27k174r51J255q95M04K160o62k863L91J437o48J096J266
1662B316k599j578J844R15l85N74r7k788Q60K638n64j182M61j074j251K349J557
1679A996j784j131J460j437l53K714k19k247M8M65m04J041J440k036j455J155
1695g47R53o02J465n5k844R0J957L21n37Q22j440j520J562K169j059o25J10j058
1713a038k64K456N48k369J81L42j039J691J699j804j670J003L03j95J465M49k676
1730i18l82J798Q7j94J215j353k115J680J615r79o0L02j627n92K581Q48j525p8
1748C03l26j004Q45K295j122j713O80R7p29K192M32k184r15J303k9L97J356j180
1766F98k056R46J530n62K96K77j909q71K223Q41j171J74l79j503Q40K343q15j150
$$ y = [223, 465, -380, -955, 1673, 2500, 326, -625, 630, -265, 139, 2299, 1637, -1226, -835, 602, -46, 1050, 2316, -283, -1861, -17, 898, 513, 1087, 990, -1798, -938, 1700, 1136, -46, 415, -659, -1910, 439, 1996, 212, -919, 541, -896, -1249, 1465, 1246, -1001, -953, -488, -892, 149, 1589, -447, -1902, -747, 206, -396, 1069, 1014, -1830, -1740, 217, 538, 1, 823, -617, -2137, -575, 1594, 535, -90, 20, -1038, -1302, 1154, 1702, -667, -486, -144, -1183, 508, 2207, 403, -1267, -264, 39, -156, 1309, 1758, -918, -1300, 498, 585, 391, 1606, 253, -1862, -182, 1433, 454, 394, 696, -931, -1523, 1058, 1906, 381, 303, -23, -1027, -182, 2113, 991, -722, -42, 55, -674, 1518, 1950, -234, -1149, 154, 125, 522, 1878, 698, -1358, -412, 1118, 556, 852, 1129, -780, -1651, 572, 1413, 242, 416, 37, -1466, -626, 1717, 902, -248]
1784b48J34o19n75K385P92k027j155J335l86K01J630q14k176O00J117l01M39Q55
1802A187j653j589J713J146p91O04k71k001N54K276o01q53N86p19j390K208J324
1819A730k036n76P19q30L87K136k10k198R3Q84m90Q11J317j734j590J314P95k85
1837B37P58k32k120m7K058mo65N71j109j025J494J604j132m88N24j122n8K253
1855A497j07k127L1N30o51J145J529j608j472P01P69n10J492l05j881m80J817
1872C70J69N8M11j318j409J482J456q13j94L68j660k70K334N58j674j8Qj142J515
1891B31J707j259j866O70M12k14J698K55k343n26J458L15l38J267j238j951R83
1908g39J690l20n28M52j164p95K212N99j405l2P9j069P41K397j092j352M19n33
$$ y = [-248, -114, -733, -1308, 1077, 1869, -158, -1313, 22, -364, -163, 1467, 653, -1523, -923, 194, -107, 332, 1187, -466, -2055, -342, 804, 13, 617, 346, -1655, -1101, 1175, 574, -279, 307, -412, -1802, 406, 1730, -306, -882, -163, -993, -606, 1530, 1320, -878, -785, 99, -391, 420, 1737, 3, -1587, -273, 522, 237, 995, 763, -1357, -1404, 654, 650, -15, 556, -553, -1578, -84, 1520, 388, -100, 424, -698, -756, 1497, 1390, -737, -706, -176, -827, 318, 1847, 239, -1233, -532, 237, -273, 1219, 914, -967, -1447, 370, 539, 597, 1008, -310, -1719, -237, 1219, 406, 212, 580, -1080, -1350, 984, 1542, -132, -150, -142, -1284, 231, 1938, 679, -1187, -517, -105, -319, 1379, 1634, -709, -1235, 223, 538, 200, 1467, 229, -1722, -739, 951, 631, 103, 555, -609, -1404, 808, 1407, 2, -30, 49, -1020, -279, 2118, 1026, -326, 93, -440]
1926d40l05J979Q12k095j128J241lK75J498j428k045R55J253l19M84J50j556r00
1944a572J729J137j049K72n01j463L01K420p43o83j4n78l90J646J138j864o77
1961h91M18j7L59J558r05j798L86R48m48J044M46j703j119J764O21l71M32l75
1979C49j807L58K400k81r78J25j201m41K197P57j263q93K72m71J18K337o66k034
1997a122J66O01o8N77J241j584j319Q04Q21k27J074n27j515q8J806j81j60L47
2015F46j009j035J629J281r84p49M26q70M39J913j83j628l25O47p82J002J552
2032A970j463j182O40M36l48J484n4k252j23J349J59k79O67j244j220R85J605
2049A130j020j13p3j050MJ806J37j220j31j34k23N53J612j188j017M93Q6k71J325
$$ y = [-440, -745, 1234, 2046, -49, -1177, 64, 61, 336, 1834, 406, -1639, -684, 569, 250, 734, 884, -672, -1572, 157, 1294, 245, 517, 16, -1447, -1146, 1274, 531, -152, -166, -744, -1134, 512, 1650, -214, -891, -473, -490, -131, 1427, 522, -1276, -890, 58, -390, 654, 1100, -603, -1722, 42, 663, 292, 724, 349, -1458, -1100, 1300, 1019, 41, 166, -1035, -1476, 721, 1478, 215, -678, -406, -877, -759, 1578, 912, -1122, -956, -355, -423, 154, 1395, -189, -1508, -704, 117, -110, 964, 437, -1078, -1166, 640, 459, 299, 646, -363, -1398, 231, 1512, 528, -221, 205, -665, -226, 1687, 1504, -124, -449, 198, -584, 418, 1970, 507, -675, -35, 401, 53, 1537, 1483, -769, -892, 457, 616, 337, 1004, -240, -1460, -475, 1130, 110, -3, -76, -1126, -1122, 684, 821, -399, -530, -664, -887, -334, 1278, 90, -927, -434, -348, -619, 706]
2068G06M85j953q37J305J58K57J149j256j448Q21J657p28K09j71p35m35J472N31
2086A187j115K56j85j226O30J626l41j084km58j03J786N40k113o26P70K5M93J138
2105A198r02j645J68J821l43k05L10j134n59J494P55p91K30j9j454M02J492L29
2123A147r59o9n48n15J655J076j437q33O06l02N33J581r96j884O66Q53l78M11
2141F07M08j450q36J301L20m68N23j11j495j10J914j02m68j43r19q28J447J514
2159A104j315q86K30m06P98J406o17j643K19O19k64P49Q12j278p10J191k33j45
2177c69J106K22k126J52J361J29K57K91j156j402J835J236p82r36L09r09M00J703
2195A321l26j771P13J96n01L49J266j032q87P47o56J81J096M24j924m77J172M44
$$ y = [706, 1191, -762, -1599, -294, -136, 121, 1270, 14, -1434, -613, 1044, 316, 525, 354, -381, -816, 656, 1187, 72, 328, 143, -1083, -453, 1173, 832, -252, -254, -712, -815, 971, 1511, -602, -1228, -458, -433, 60, 1198, 296, -1349, -1181, 640, 297, 92, 402, -732, -1291, 203, 958, 167, 397, 378, -1076, -674, 818, 1147, 188, 119, -429, -944, 711, 1787, 350, -483, 123, -179, 354, 1935, 939, -945, -279, 574, 196, 607, 1015, -435, -1271, 30, 350, -118, 405, 294, -1201, -1311, 603, 501, 33, -110, -1029, -1857, -410, 1104, -211, -1097, -867, -1273, -475, 931, 314, -1329, -1110, -491, -755, -6, 806, -472, -1182, 9, -224, -369, 737, 959, -1167, -1015, 346, 475, 732, 1023, -133, -1535, 300, 1536, 754, -182, 127, -782, -382, 1321, 995, -776, -63, 133, -368, -19, 1247, 215, -672, 75, -581, -400, 696, 1120, -804, -1281, -109, 335]
2213C35P2L76j526r96J297J580o61o21q5n16N2J794j80j266K97K56j094O71J266
2232A051m14q41M09m34j59J242Q19j816p03P94K14N50P34j327j225O78J341l35
2250E78n41K22r74J27J183J17j101M84R2j043J99J481n41m90L40n83p25J402J233
2269A460j524m68j38K97P67Q66r96k214J172J214L6k79M21j242m49J522J85j003
2287c73P67J30j109l19J525n2l33M38r38j222K088J255j360j227J86K67M42J614
2305A779j019j853M95J325m41K61K03r77l77J097k7n45O70J21j359K9J214q8J81
2324F89L51j158r25J396J314r37r66Q5n33O89J822j065j988O71Q58l49N19J37
2342F10q36o80J040J55p81Q07O72j452o99J072j35M30O35j238j669J553J478n84
$$ y = [335, 407, 783, -743, -1739, -442, 1138, 477, -144, -229, -745, -693, 1101, 921, -345, -48, 208, -886, -215, 1051, 637, -204, 205, -229, -388, 854, 1673, -143, -846, -52, 162, 712, 1446, 119, -1106, -428, 913, 578, 37, 259, -715, -588, 595, 712, -389, 95, 187, -856, -657, 824, 283, -207, 133, -450, -1175, 227, 1460, -64, -532, -670, -373, 394, 1260, 264, -1950, -778, 436, 472, 193, 614, -628, -1077, 445, 630, -373, 394, 524, -585, -904, 621, 569, 236, 674, -264, -1486, 602, 1857, 497, -730, -544, -277, 165, 1779, 760, -1093, -598, 727, 286, 547, 750, -227, -604, 493, 466, -79, 591, 712, -647, -618, 596, 508, 689, 1040, -118, -1043, 353, 1667, 730, -236, -151, -684, 5, 1827, 762, -1226, -555, 303, -46, 473, 610, -226, -906, 134, 289, -492, 315, 987, -465, -1164, -92, -227, 203, 838, -400, -2069, -516, 962, 378]
2360C78q42j74q23Q31J765o10j525N0Q13m75L76J41l92l95Q90p42o40J114N82
2379C22j197o17P14J92L90J023j380j660J107J538k52m22n51r09P58J650l13j664
2397a271P02J88J19K26J52m44J39K65k35q87J390P30j007r63L70R5J046R64r17
2416F62k208J017J593J3k26m88j193N37J572L6j561L99M16o91N26K20L1l68N76
2435H63q15q96J205J306r40o55l64j87J331J061j004k163N82J533O7m28j69j090
2453g63K72J831m16q77L08M27r26K09N38k15J2Q40r86j356J517J178o08p31j98
2472E6l61P23J698p67k066K46J058K54K55l83j097j59J466l5j078O41M61p04R3
2491C01J36n62L95J026r98j382O18J529m04o59o67o69O66K078r00j765k6Q57O2
$$ y = [378, -464, -638, -1461, -630, 1135, 525, -1000, -950, -137, -612, -236, -95, -487, -882, 8, -734, -1374, -260, 322, -875, -1492, -778, -586, -196, 827, -553, -2213, -1106, 432, 180, -242, -793, -1702, -944, 706, 393, -1271, -569, -381, -262, -36, 116, -328, -189, 76, -159, -1046, 344, 1074, 67, -896, -526, -431, 615, 1579, 662, -1546, -529, 1064, 1077, 851, 363, -830, -293, 1279, 1315, -246, 153, 569, -122, 404, 624, 655, 287, 863, 48, -848, 357, 1663, 723, 68, -296, -483, 848, 1909, 905, -1258, -676, 857, 924, 496, 327, -763, -491, 1340, 924, 47, 355, 782, -144, 65, 603, 388, 400, 1240, 254, -1102, 415, 1593, 985, 254, 56, -305, 418, 2116, 1349, -717, -471, 587, 841, 1096, 713, -384, -543, 923, 888, -190, 451, 912, 208, 301, 437, -125, 270, 1296, 298, -1084, -466, 1063, 659, 0, -667, -1336, -670, 1408, 508, -1257, -1283, -426, -364]
2510c64K26K39j227n06J273k48p97N38M23m56l95K58m55M17J521r05j789N23J581
2529a43P6k01q61j095O23K060k38j296l13M99J39O99L20j077nP54p6p14N39O61
2549C51o57k97K98n67Q31J023o65j957M52J496M5J06o31r35L59J614J16j499r7
2568f14M49N6K14K87j109L46J133k25j082Q37P94n47l90k7m11N82J293o41j785
2587h40L79J271M20N6k96j707M09J974J20j517J41M22n83P24J58q60j46J381j197
2606C09m83K16J148l99m84J4r96M92J672n16k206J18J039N42J34m34j263k05J906
2625F04P6j368J19M35l75O90K47q65mJ458o53j159O85R73K9j34k58j026Q05J804
2645B083J16j981k39P68K77P19P2j581m17J832J55j139m7J3j42L92j00p03J4Q04
$$ y = [-364, -138, 101, -1126, -1632, -359, -607, -1404, -866, -443, -899, -1294, -1036, -1491, -1074, 447, -458, -2247, -1724, -143, -67, -268, -1129, -2224, -1601, 459, 221, -1075, -1388, -889, -750, -51, 269, -808, -813, -59, -135, -849, -310, 351, -306, -603, -305, -872, -41, 982, 317, -1640, -1188, 308, 353, 459, -172, -1107, -748, 866, 982, -517, -614, -165, -109, 105, 392, -717, -371, 762, 537, -545, 292, 1086, 539, 149, 122, -289, 293, 1586, 945, -840, -461, 810, 1230, 1286, 990, -717, -308, 1666, 1786, 269, 410, 832, 249, 973, 1131, 271, 125, 1506, 309, -174, 42, 1190, 791, 307, 321, -675, -183, 1489, 973, -1233, -1115, -76, 466, 600, 166, -1097, -1302, 604, 680, -688, -569, -134, -509, 181, 428, -437, -441, 1017, 364, -795, -110, 863, 892, 758, 500, -526, 279, 2083, 2199, 218, -21, 747, 1024, 1743, 1815, 234, -183, 1649, 1804, 665, 618, 631, 489, 881, 781, 78, 92, 896]
2665H96j41j603N1J177r2L9o78j237K42J648o3j614m55K51R36L92j02j591j11
2684b055J294L24q76L2N86m70j7M78p04L51J373o35r24K3R88lL58j41j388p5K196
2705G15N04j667n49J19K54P70K61j058o88J486K06j225N55j5k10J01J97p33k47
2724a224J920l38j641p7R17M63J66J46j624m1J805M26r61k78J51r4J054M44j009
2743B05n34J331L64p25m2M32K42j71M72j319N29J767l69j339n12J102K51N46l69
2762A861j331r76J836P36j233l10k91L3L89M29j451j30O08M51j228K20O43o24
2780c68L42o4j274L13J396J2j544j78K95N70N85L71k040j84J665L73n70J88j98
2799c10n31Q28P83j071j67J043j89p20RN49K16K76m8j554oJ838L75j290o55r6
$$ y = [896, 755, -848, -797, 380, 288, 327, -351, -1588, -1346, 302, 239, -1375, -1830, -1579, -643, -251, -353, -1944, -2055, -761, -437, -1313, -1281, -695, -1165, -1182, -704, -1408, -1057, 316, -319, -1243, -1220, -232, -235, 123, -18, -1406, -1481, 715, 1219, -448, -997, -878, -624, 146, 407, -651, -1339, 147, 353, -872, -317, -332, -542, -441, -244, -977, -1224, 696, 358, -1283, -1360, -443, 20, 186, 332, -1292, -1333, 472, 898, -63, -341, -190, -284, 770, 1214, 205, -329, 1002, 1366, 641, 599, 1031, 1273, 1102, 1574, 255, 784, 2551, 2182, 843, 331, 1433, 1684, 2230, 1861, 530, -446, 1390, 2126, 893, 583, 292, 325, 714, 1143, -308, -438, 170, 621, -607, -387, 256, -368, -26, -90, -1364, -1051, 345, 357, -1187, -1365, -1070, -500, 85, 456, -1584, -1768, -103, 270, -300, -112, -310, -841, -13, 770, -301, -468, 575, 386, -334, -325, 224, 440, 716, 668, -886, -892, 946, 1321, 31, -624, -720]
2819g20M14P95M82j790n65J157O71n79M6l09o98P96N28j005m01R54J28j009M18
2838f87M48j90O71k67j407j42K018N73j409r5qp8J188O13j312p17R68O53l85j79
2858B56M22q15N09P89j034k87J478k32j100L7M71n5M48K50j605k77J175O79r91
2877A18j45o65J49R19P82j607q26Q24Q82q49M98p3n30J78O95r30l30J120K58j006
2897e38L1K92K3O26J52j393o12J526M70k27o89k20m04J377P40j155p86Q22J91
2916B26k58K62P6n23L88L54r83l4J117L97j288N4l23L05R41M11j472q63J263P53
2936H03k12l20n94l18J025O41p38p17Q31j89k48L92q8l62L91K41r94L6J038L82
2956A000q81J02n99K17J158J65j246p16J048N17l20l74K54j170R21P68r19m45
$$ y = [-720, -306, 489, 971, -819, -1384, -227, 444, -135, -89, -398, -1096, -300, 228, -777, -1178, -224, -96, -1105, -687, -239, -429, 242, -25, -1432, -1574, 444, 1017, -392, -487, -495, -573, 615, 1228, -84, -801, 167, 820, 435, 256, 678, -137, 372, 1161, 127, -160, 1318, 1086, -14, 23, 494, 439, 887, 1137, -468, -745, 430, 1109, 118, -27, -692, -543, 376, 1158, -449, -1275, -451, 431, -418, 80, 7, -523, -345, 350, -580, -910, 210, 468, -538, -507, -215, -192, 434, 586, -807, -1419, 107, 577, 350, -339, -559, -963, 414, 1154, -1, -787, 35, 226, -32, 230, 306, -217, 171, 525, -458, -492, 625, 1022, -266, -212, -535, -230, 711, 1122, -350, -1213, 50, 803, 591, 271, -323, -641, 384, 1025, 287, -430, 401, 212, -36, 356, 268, -94, 297, 538, -456, -420, 618, 1000, 119, 221, -378, -161, 997, 1162, -84, -800, 248, 765, 445, 71, 325, -845, 76, 844, -75, -520]
2974e20P74K73p64J26J93l10M56L94j089l39J065N97p47j82m78l09J331O53j756
2993f32m84Q24J80k14K01k85r14O65J042r73m06N16K66m77K49J32l34L06K24j138
3013a252o0R65M19o24L4n96N3R81P22p69j243J204k36M37J84k74o63N98R03p87
3033dm05Q72j78l44L19K05n76P92M61j145m04J044O57n97lk21o24R34J033j456
3053C60k04J33L48QJ67j3j022L12Q51o73n30Q09o3n24J11L44o67P21N12j269m47
3074g36Q82N74n68j8l39p47R05R95p91o65O44m20N7J059m93n66R0P61p16q8P22
3095E42j90m09mM7o23J097N98j134o97Q54O48m51J79n66p70P29J205p18o58K29
3115i2K0l3P82j60q82K66L25k20n26P54j9n21L01j19k97P24M44o90j064Q46L88
$$ y = [-520, 254, 527, -237, -111, 82, -228, 228, 622, -467, -806, 259, 856, 109, -73, -551, -860, 471, 1124, -632, -1116, -292, -112, -326, -125, -410, -1324, -659, 383, -590, -996, -480, -214, -691, -442, -310, -644, -338, -114, -1252, -1312, -347, 72, -552, -518, -1114, -1061, -80, 642, -127, -1370, -166, -402, 35, 219, -55, -718, -120, 783, -4, -409, 463, 285, -59, 260, 465, -111, 681, 1142, -3, -407, 637, 1294, 697, 694, 473, -151, 783, 1816, 360, 156, 289, 637, 645, 812, 799, -223, 89, 940, 267, -263, 546, 483, -41, 70, 414, -253, 468, 980, -289, -736, 146, 720, 152, 134, -205, -952, -47, 948, 157, -508, 136, -284, -227, 832, 339, -227, -137, 624, -92, -180, 542, 352, -57, -61, -14, -637, 460, 1058, -76, -773, 81, 729, 278, 457, -109, -879, -150, 1055, 337, -321, -92, -72, -105, 677, 517, -365, -99, 226, 6, -520, 234, 215, -306, -5, -124, -421, 303, 747, 57, -1007, -161, 227]
3136B27o3N57p86n12K69R60l89o68O82k44l46O03n8n89M05J67n74l61J151l29
3156A02l09L26l00j90N7P10p40p74Q37K80k18O35n62p93L23P92k43m85J71J03
3176b78m52K55O24q00K86J15o69l4R92j43k8j31k67m82N06J093k98j094M71J92
3196a42j3O47k31o97j77J082l59m50R08n72l12O01J86m46L07L62o33l46O04L59
3216F78l66M43o52k62N29P39k24r21%K46l68P71J33j141K28O24m66K29M20n73
3236F7m36R3L07k62L57J91o18m74R95k71j02K55m51n92M32Q46k4r65O04j6m58
3257e22O53M79p43q0L10J8l21P97J06o11M36k8l47N60N83p10o09Q95K44l13K89
3278A086l60p02L87R45o18j09k0n35l0P13Q1n69K5J21m17l59P34J46j028O50l8
$$ y = [227, 164, 721, -65, -577, -308, 652, 263, -405, 277, 33, -313, 290, 232, -357, 48, 215, -359, -720, 431, 102, -207, 119, -181, -371, -314, 396, -344, -1118, -281, -1, -219, 416, -146, -939, -616, 176, -67, -552, -381, -278, -730, -475, 149, -651, -365, -250, -919, -953, 39, -104, -132, -263, -530, -1012, -506, 587, 289, -805, -334, -142, -155, 492, 261, -436, -613, 469, 110, -340, 568, -4, -316, 285, 471, 25, 332, 694, 61, -285, 319, 678, 312, 755, 103, -159, 370, 1109, 885, -36, -36, 210, -158, 613, 746, -395, -167, 457, -9, 220, 640, 67, -369, -276, 31, -231, 126, 317, -301, -775, 220, -51, -153, 102, -349, -941, -509, 337, 313, -652, -48, -64, -522, 131, 610, -133, -213, 97, 115, -206, 591, 697, 86, 522, 494, 147, 707, 1290, 580, -29, 866, 1110, 797, 1086, 726, 24, 411, 1356, 738, 629, 609, 74, 44, 757, 838, 269, 294, 415, -2, -361, 373, 519, -509, 141, 103]
3299A03p52L46P60q46j65J71m4J66L28k12p56J52M59o3j75K88m40k94O94N01q51
3320f30K19K65j86k58Q93l20k52K49l3n73L89O18n42l35l9L43m37M56J72j090
3340a091N8P91m57J45K68o95k68N08K58q4l07J55p12J43Q18n3k89J92K14m95M82
3361d19Q31p89q5K25L65n06P81L64p60j66P88K21k83M94k15k30L12K78o35M51
3381A022J54m49r9N21Q0l37M00l56p36K74Q57n43m05k81J46m10Q08j23q04p6O69
3402C12m55j61O84n68o09K93M93o72M62J82o85k52P72Q3l32L38j61m18O34O15
3422E55n06j65N47l59mL50J80l56n18O53k74k55R01l94l30J65J25m69J64P92r53
3443a51k68M93K98m72L68k5q59J89L06m58J75QJm62M92J55k34k60J94j47J38O30
$$ y = [103, -649, -303, 457, -389, -554, -383, -427, -261, 67, -145, -901, -749, -290, -353, -528, -240, -680, -974, -280, 221, -630, -411, -146, -332, -590, 303, -17, -269, -20, -53, -626, -237, 381, -161, -496, -535, -192, -629, -173, -1, -1091, -1033, -242, -699, -554, -286, -981, -1249, -741, -483, -567, -874, -719, -1431, -1288, -470, -523, -812, -620, -406, -901, -419, 412, -377, -462, -237, 128, -378, 403, 767, 7, -159, 629, 850, 567, 1061, 846, 616, 928, 1206, 571, 1022, 1176, 727, 628, 1149, 1229, 892, 1292, 936, 200, 474, 1331, 788, 383, 102, 248, -162, 646, 523, -281, -357, 312, -143, -304, 380, -188, -797, -504, -11, -683, -221, -39, -724, -976, -204, -121, -453, -115, -276, -694, -60, 555, 49, -116, 431, 72, 68, 418, 598, 242, -276, 377, 103, -152, 749, 355, 25, 190, 315, -154, 10, 802, -151, -419, 74, 372, -100, 268, 243, -616, -427, -121, -579, -404, -396, -395, -857, -365, -210, -444, -704, -510, -657, -519, 111]
3465A11j16m93j51M11l12O82L07l82j30M79j44j16M33j99m52o6P95k86L8L81o19
3486A71l79O80O58p38J92ll72l76P78m15n6J29n3j95K3M57k87l85L51q3n80M55
3508b8K78j044L19L23N1j46N01n29m26K97K65j74K26J02p06L77L04O7m69M92j59
3529g9k99K2R74n65l51M65l8n19N62M63r42N5k4J30M0L33j7o53J73N07o33M52
3551E6ll80n4M32J12o85K82L61n79K97L34r4n64K17N2l38P89P6p98J26L47J60
3573A46j12J97Qn84O69j1l1j32M23n74l33O79K53j99n3p7m50L65M88k90j35K76
3595E23on13O86k30j97mJ46l21K61L13k12o84N20K42m66L44K56n89m58N11j92
3616g0r7L74L0p31M38K46l93j26N31o78k35O26J65o35L1K00l33J03P32n12k54
$$ y = [111, -5, -498, -649, -238, -550, 132, 439, 57, -73, 406, 262, 146, 579, 380, -72, -138, 657, 371, 409, 790, 171, -208, 472, 1130, 392, 584, 581, 209, -167, 611, 196, 140, 269, 216, 21, 44, 501, 214, -171, 180, 97, -483, -28, 250, -794, -475, -152, -101, -247, 254, -275, -701, -404, -139, -313, -87, 15, -691, -314, -10, 57, -412, 80, -79, -378, -356, 618, 53, -298, 167, 129, -390, 172, 635, -307, -252, -276, -146, -106, 227, 210, -443, -270, 237, -396, 56, 53, -327, -381, 51, 163, -522, -240, 121, -458, -161, 173, 79, -485, -268, -216, -554, 235, 311, -487, -361, -14, 146, 34, 231, 239, -345, 324, 313, 282, 150, 573, -1, -334, 345, 598, 399, 346, 269, -181, 184, 672, 382, 247, 523, 517, 4, 690, 460, 263, 259, 405, 84, 345, 658, 446, -238, 282, 524, 58, 402, 658, 69, -389, 122, -70, -167, 207, 237, -494, -56, 190, -203, -329, 202, -476, -711, -85, 80, -555, -524, -324, -657, -554, 178, -334, -588]
3637e88L33j92l33K41O11o63k08K10J98l11N70Q6l30P3K31RN8K5Q3r36J138p7
3659B28M6O8K07k99l20R54m14k9J49K19n01R5P91q43l47O07l62J52K57M77r28
3680B07k32R03k98k57M29n09k19L59J90m23M24k45m72j30L69L10j07k34n2n60
3700e47M38N01n86j86J52J21j12K48Q1o27L92J58k73nP45l44n04J03L89j28j21
3721a05L03p46n7O35j94l80L88j65j34Q2M53m02m32N73k46n70M44K48l41j20J84
3742e82rL58J65n88K18o0M15l62J93K42n79J50k0L87l05K30L97k41n1N08k56l41
3764a31O44k12j70N20j86k10K39L5L6l97O84k91k89J61J30n7N0l7k67m72O99P5
3786E54l50K47k08j61K7J70l43J54K52k90l35M28j58O7k24J75m47L3N72j49k52
$$ y = [-588, -255, -447, -780, -539, 72, -591, -799, -589, -391, -702, -132, -46, -376, -303, -72, -63, -5, 20, 103, -833, 305, 228, 274, 342, 549, 250, -70, 884, 470, 441, 590, 809, 308, 403, 1194, 351, 4, 611, 249, 401, 658, 1135, 207, -25, 878, 580, 323, 752, 243, 24, 383, 573, 150, 574, 329, -143, -273, 96, 406, 299, 65, 13, -547, -109, 392, -194, -380, -228, -107, -219, 29, 110, -517, -125, 33, -240, -245, 500, 156, -348, -245, 144, 16, -105, 198, -548, -605, 30, -164, -544, -156, -321, -455, -373, 80, -322, -754, -181, -427, -997, -553, -305, -646, -766, -582, -591, -233, -68, -656, -438, -498, -83, -445, -252, -10, -589, -439, -459, -72, -377, -147, 250, 9, -42, 466, 210, -131, 513, 301, 131, 651, 465, 255, 494, 529, 565, 168, 852, 561, 272, 433, 563, 506, 556, 519, 252, -220, 479, 554, 204, 451, 243, 82, 109, 279, -64, 90, 342, 52, -283, 145, -13, 54, -170, 5, -442, -409, 163, 14, -238]
3807b38n2L50m77L69M06n75j51M63j97L6K55j56k53N7N31k02k95L64Mj42P9J58
3829C34m9j08L53o51O9Q08l45o20N01k2m66K71M13m40l50N99qn23N69J12q60L45
3851f8R7q5M4K74k87j67J49L33p20L71J13l14j54J85K89j92K14j51n23P6O07l3
3873E8l93M78j75j84K02J58n19n4N66l17p3M30l32j81K81J4k62L94L99p82k05
3894d97N91K95m23M0k14r4K70K35j39J56k98L39k83K93m6l86L56q5k6j51K23j09
3916D7n11M73q9L4J09M15n97k81M17J17j20O4nm43L02O79m79j02K33m25N5O88
3938E81r5n82L49Q6n98M38L87k33k43K05K71o87M32K98o52j40L37L8k28J24K63
3959C51r11L04L98l78j88M99k12j55K19R3l52o6K75l79K67O7k1l24L29j61k5L71
$$ y = [-238, -290, 60, -417, -48, 358, -217, -368, 95, -102, -66, 189, 33, -220, -163, 368, 166, -129, 235, 239, 97, 176, 334, 285, 177, 530, -121, -52, 756, 411, -209, 292, 270, -196, 75, 488, 48, -302, 297, 289, -234, 335, 447, -413, -68, 29, -56, -12, 262, -25, -192, -43, 290, -430, -59, 54, -260, -414, -229, 60, -132, 82, -69, -592, -516, 91, 58, -335, 143, -32, -216, -14, 144, -375, -429, 137, -180, -253, 177, -155, -336, -55, -41, -303, 91, 490, -292, -497, 94, 389, -34, 6, -208, -302, -32, 203, 64, 220, -78, 261, -22, 271, 225, -161, 195, 110, 84, -67, 156, 47, -464, 9, -80, -46, 63, 478, -119, -400, 17, 134, 14, 78, 73, -370, -68, 611, 132, 30, 263, -162, -107, 581, 486, -96, 253, 339, -259, 179, 566, 333, 90, 295, 566, -121, 311, 609, -43, -183, 154, 192, -36, 88, 351, -560, -256, 142, -236, -424, 75, -137, -292, -73, 20, -332, -398, -123, -502, -235, -168, -189, -513, -184, -345, -370, 1]
3981AJ17l18j03K36K4m72O25J13l33k88M35K31m3K72n31n8P04J07m71R8J45k8
4003D63m42O89j86k24J49l8l14K23M12l49l30J22k49J5M42K14m27k75K53j44k09
4024b05O39p32n8J31J43l61M98K8p16P2N55j13n98P90k67l55J93N71k18j98L0
4045a71j43k1M40L25m91j33M40l88j17N55k04k93J96M23l50n7K93m32r3J94kL63
4067C34j06j76m39O2M76k47k8K18n66K2N23k4l95k34O62m03k84L51n8n5L31P9
4089D3k96K94j3k63j1L30J91n00Q35l03j44K71J66o8m33Q59q38J45M22j4j61j33
4111C79N4k43K41j00L2j44MJ19m27N58k85j68j36%J89j59K03L6m38J60K77l19
4133a67K13j70j5l34L09K93l36J50R8l11OO14l53n3M3J61j60K44J64n17k58N02
$$ y = [1, 118, -200, -303, -67, -43, -515, 110, 223, -110, -398, 37, 268, 225, 497, -34, -92, 612, 719, 248, 346, 491, 463, 21, 710, 524, 300, 449, 411, 97, 320, 732, 383, 53, 175, -74, -59, 383, 597, 170, -105, 148, 4, -205, 434, -298, -356, -225, -82, -443, 55, 83, -633, -561, -6, -119, -717, 73, -194, -549, -356, 215, -3, -201, -171, -314, -335, 105, 430, -61, -194, 246, -142, -259, 296, 92, -201, -5, 418, 68, 11, 304, -128, -221, -27, -29, 334, 228, 52, -387, -325, 151, -96, -124, 94, -472, -450, 73, 49, -346, -580, 82, -321, -605, -254, -312, -367, -36, 43, -253, 41, 28, -235, -246, 84, 275, -225, 610, 307, 163, 434, 600, 532, 99, 958, 120, 265, 687, 673, 512, 379, 433, 190, 431, 331, 363, 219, 223, 342, -85, 473, 188, 20, -116, -116, 73, -86, 117, 153, -285, -125, 152, -167, 46, -124, -139, -473, -164, 129, -207, -57, 41, -270, -264, 350, -3, -56, -13, 148, -12, 232, 396, -121, -379, 123]
4155A23j13j04P2K32l95q2M11n8j45K28k38k61K96P0k58j38M72j86k15M42j09
4176D4l00L45o5l83M15j56R5k91J10l33J28N07j3m94j1M60j83J10L26l39m49J86
4198b91L94j86J43j57j22K87L60j38l24L7J84l01K26M56k04m99M76J05j21M33
4218G58l35k00O3Q3l32J77N15k90m62P2L31l57o3K90Ol80M13j50l5Q6K03m41o8
4241a16O48l50l00L66l91j96L98P6k58J35j80q7J43M72l90n32J62K38J0p6Q17
4262E89j103M0L55j20k70M91r2n18N37j34L9j79J30k82M5M80J23m17q9K84m00
4283d91L37K79k79J47J1K0k28J06L51n2m54K89J82K94j46Q6k13l11M47J22qK2
4305E11l11l15L97o9j42j22L70J43m15L24k08j85M36j51p25N28M31k92n25L44
$$ y = [123, 10, -94, -22, 210, -185, -267, 144, 86, -59, 169, -69, -330, -34, 36, -222, -360, 112, -74, -289, 153, 44, -256, 89, 24, -359, 56, -100, -5, -296, -186, -519, -391, 116, 103, -391, -402, 58, -125, -15, 311, -28, -477, -291, 103, -83, 60, -97, -219, 68, 428, 290, -34, 3, 187, -114, 112, 568, 364, -135, 341, 446, 325, 758, 423, 223, 286, 369, 37, 214, 729, 439, -23, 49, 380, 23, -40, 250, 256, -124, 289, 139, 104, 190, 393, -48, -116, 532, 182, -118, 248, -143, -339, 59, 135, -123, 12, -168, -255, -112, 360, -30, -562, -400, -162, -152, -228, 589, -514, -474, -119, -239, -509, -18, -110, -628, -91, -225, -186, -365, -235, -517, -472, 8, 131, -286, -375, -91, -491, -154, 125, -154, -7, 4, 24, -204, -98, 253, 201, -253, 36, 218, 512, 366, 452, 239, -72, 375, 497, 489, 511, 200, -115, 282, 213, 71, -51, 319, 462, 47, 371, 163, -22, 414, 263, -462, 66, 497, 205, -320, 24]
4325B4mJ7L11l61k4n4J43nj70M24j64m32M41NO9j5K47n95J6M7M43o33L36Q0l95
4350b49J77J38n36J63K00j35q0j4K59l37k27K73M4LK5j04k58M65L1l30J83m4J96
4373a57m26P24k54kR3K18q60N64M35k34k92K58O9l10M65r9R1k26K79k75l0N81
4395F12m85K77R2M6l6J1J44l56J2jJ50j88K00k13j33M8K51k54M0J4n9m79M42n5
4419H0m42k0L09l25J73M59k22m04J23P1k69N19M4n08K60l24K55q0K51N8l37K12
4441a17L09q6l67M75n12J54J49L7l9o5K99m97k7M05j1j23mj98L19q8J71q6k88
4464a90K56k5k17j0M21m70j8L15j1k62M56j97m47L33j38l87M90L14n41L7M62j33
4486C8q2J20J14l79L58J81m70J69R9M9k47N65J4o59jM30k90O4L85n15j24L55J40
$$ y = [24, 20, 37, 348, -13, -37, -91, 52, 47, -123, 301, 137, -295, 146, 151, 220, 205, 452, -143, -127, -80, 363, -270, 66, 146, -249, -72, 66, -470, -307, -107, -242, -322, -336, -77, -414, -641, -368, -324, -321, -296, -400, -658, -193, -162, -492, -309, -353, -157, -583, 141, -113, -115, -22, 196, -664, -100, 335, 101, -191, 67, 136, -174, 291, 192, 283, 57, 336, 61, 31, 612, 127, 404, 496, 542, 506, 517, 661, 305, 317, 316, 466, 278, 478, 265, 132, 180, 431, 177, 217, 231, 172, -307, 135, 80, -362, -382, -73, -398, -225, 234, 12, -392, -269, -198, -467, 52, 96, -412, -152, -476, -221, -301, -50, 8, -329, -117, 192, 106, -261, 214, -298, -144, 5, 42, 3, -62, 237, -260, -287, 118, 107, -16, -20, -218, 101, 13, 184, 98, -190, 66, 41, -176, -186, 235, -235, -253, 62, 51, -211, 245, 48, -399, -66, -204, -591, -101, 213, -328, -291, 171, 38, -44, 76, 190, -189, 169, 350, -120, 49, 148, 197, -50, 515, 529, -130, -131, 299, 9, 73, 458, -57, -181, 174, 314]
4509C14k52J40K2l32j06N29k38j08N9l19M5J97K20l36q9K02K08j95J29N7l13o5
4531b31l0l8J94K49j98m59L19L38l53N4L41m38K58K37l04N8m9l2N6j4O1k05J3
4554a73M52l79l9M01J40m48J37R1k31J81J63q8o74M78N27o86K71J28k31m13O08
4575B15k3o17L51J72k28J18J56k54l0J38r2k75L46L61o80J73R5n17L37L24J9k15
4597a26pn4q9J67L36m27j77L10J3j52o3N80o52N41l06K05k63P2j04j4L42j31k9
4620b8k2L2O4N1J31j46J07k87M30l65J77J70m45M1L50l47j69K87J54k61j75N60
4642C09m10J12j08L80l28J02r5J08K5Q1k02J21n0J20m34K43m2j6N6J50j82k10
4664b70L20r2l9N23j49k94r3L66k04j31J92k16K08N6nl28J30n4J69j37N74m15
$$ y = [314, 62, 202, 224, -108, -214, 315, 77, -31, 28, -291, -246, -49, 171, -165, -254, -52, 156, -39, 90, 147, -166, -231, -261, -299, -105, 144, -54, -513, -194, 144, -209, -155, 186, -252, 6, 243, -61, -3, -52, -84, -28, -42, 19, -186, -173, 279, -100, -139, 262, 402, -46, 91, 182, -49, 132, 295, 207, -467, 11, 538, -148, 123, 251, 20, -393, 215, 192, -425, -74, 98, -130, -12, 144, -110, -140, -2, -94, -369, -23, 338, -342, -169, -74, -591, -254, 70, 89, -126, -133, -187, -276, -109, 227, -200, -377, -67, -54, -206, -269, 311, -341, 200, -106, 99, -164, -92, -196, -210, 132, 1, -28, -50, -18, 46, 97, 228, 82, 189, -98, 332, -33, 144, 314, -131, -90, 260, -87, -256, 31, 185, -76, -251, 309, -101, 11, -97, 283, -45, 57, -38, 70, 95, 176, -26, 95, 45, 165, -269, -26, -68, -84, -28, 122, -60, -270, 50, -42, -81, 442, 293, -1, -94, 272, 68, -63, 129, -87, 121, 177, 172, -156, -26, -80, 89, -48, 526, 111]
4686A11m11M60k13j44o5N20m05R8K48k20m34O34M3n90j3J19O1J76j5K21n26KL31
4709a2m15L18J17l05j28M81j20m3L67l14l49L64L70l09j68L90k98j83N22j96k20
4730a31j32M76o7l46N31l22j3n6K26r8J3q7j07J51K17k18O1m1j4k82K36K73m85
4753b15J90O1k32k84N57p4j20R2mM9o19O63J76l47j10K38k48M08j49p7M1M53k50
4776A99n51O15J09p58K78P10m82j74L00r8j57J85N0k63n5j02j61m6M31J4l96M46
4798I4J18n65M19K37p02L30J32l61K71J04r4j04Q9J96o3l19K81m2k84M84k52j17
4820a48L0K17j14j50J97J93m28L32Jk87m1N74j02j85P4p7K44J5J20n51K03J2O0
4843A89k22M20j68l54J35J95j5l9J94o25K06J75N2k07M49l91L0O2Q7J31l36K93
$$ y = [111, -300, 160, -53, -197, -262, 258, -147, -49, 199, -21, -455, 179, 222, -368, -381, -262, -201, -25, -40, 181, -345, -343, -12, -427, -109, 8, -297, -425, 56, -64, -107, 260, -54, -403, -39, 331, 22, -146, 244, -54, -237, 285, 89, -131, -263, 213, 146, -200, 331, 9, -4, -60, 166, 68, 81, -6, -113, 38, 255, 37, 98, 57, 43, -239, -3, 270, -215, -25, 36, -196, -480, 77, 3, -117, -25, -29, 20, -599, 64, 240, -107, -217, 21, -227, 181, 32, -45, -4, 449, 199, -352, 263, 372, -386, -108, 602, 120, -54, 246, 148, -9, 176, 226, -37, -92, -194, -355, -401, 30, 44, -352, 94, 212, -353, 66, 303, -399, -69, 63, -298, -27, 77, -17, -121, -32, 164, 101, -218, 63, 21, -263, 221, -31, -148, -118, 99, -15, -165, 32, 225, -203, 129, 130, -157, -198, 376, 274, 89, 163, 86, 330, 345, 465, -86, 117, 129, 189, -33, 387, 219, -135, 0, 195, 180, 141, 335, -290, -84, 91, 143, -64, 385, -6, 24, 86, 173, 304, -32, 261]
4865B61j24j62K87k22j86J47j6J65m27O48l87l79N96j97l01K5N23l75p9J31K47
4886A75n49N39l54k79J62L58l39K78q5k39p0L06j41K25J2J57m21J45J32j2m10
4907d10K11J37N4K02K46o25K1qR2n0J57r2j56K07n7K70k39K02ql40J31N0p2L44
4931B67j55j94R9O4j7j8K97np11K86K61J2j68K26J4k65K16r7l10J52J60q3P7j51
4955d3P5J71k33K74l79J06J58j95L8L65k95j29N31j74k86O7J46k70m02O50j57
4976A8k98N24k59k58m2K87k67L33k84j21N1K36m2l64M79k3k17j7R8k68L54J81
4998A01m90M21l89M70j73k38L08k23K10J44l24J86j5K33j83P4l4RJ74p4L3j88
5020C2k1J06Q5k11J9J57K01j38m4o0J32Q0nk28K78j91K6pO1l01LN3K0l19M23k31
$$ y = [261, 137, -25, 262, 40, -146, 1, -15, 150, -277, 371, -16, -395, 201, 4, -297, -272, 251, -124, -203, -72, 175, -374, 165, -189, -468, -306, 52, -287, -9, -94, -333, -403, -97, -238, -13, -1, 156, -265, -120, 12, 0, -410, -199, -62, -8, 194, 440, -185, -164, -172, -80, -130, 27, -65, -221, -14, -71, 199, -40, 162, 154, -186, -55, -5, -77, 267, 112, -82, 17, 81, 64, 46, 343, 338, -373, -87, 174, 186, 18, 244, 258, -7, 209, 112, -198, -46, 114, 31, 108, -43, 32, 203, -30, 244, -135, -29, 129, -66, -28, 337, 42, -87, 444, 270, -16, 51, 197, -73, -475, 175, 18, -280, 244, -15, -273, -315, -28, -295, 38, -246, -367, -316, -80, -122, -486, -7, -30, -247, -264, -166, -434, -80, 101, -389, 32, -357, 113, -60, -298, 10, -213, -3, 141, -183, 3, -12, 221, 38, 112, 78, 87, 261, 187, 220, 32, 11, 117, 202, -9, 10, 167, 368, 230, 186, 126, 258, 338, 333, 105, 383, 192, 218, 211, 272, -29, -26, 27, 47, -272, 151, -80]
5046h0j57L95k45k87L27K3r8j48L20J36k77q9MJ58j17K23J33l51j03K98l8P4L8
5069A39j70J44J01k93M9O0k23K64N7q3j96J86J2k26M47k57n7m25N69j79K1k85
5091c45L95k69J18Q4l6LK59K3k83lJ42k7k72K11K93n57L66M1j26M9k01L56k13
5114HJ01M6l03O23k62k91K36K68l38J28j31K78j68l46K49l88J96M82j78o4k29
5135h3J39k9L3r7n6r9K44j27J38k12j11K48p6M67p08K26J22Q6k04J14j00m9K86
5158A52l48j23j43O91m45rL14k56J52j69M24j04m9K64l21qJ35l12Q6N25l99n60
5180e03K36M17j03J21k93J16k17L51J21o11L98K30j71m41J44L60m90L82j61R0
5200b4k05M88k79j5J58l09K17r9N03p79L36J73j06l96P01n62P2K41J78o83M26
$$ y = [-80, -237, 158, -87, -374, -47, -24, -122, -270, 50, 186, -91, -180, -176, -18, -135, 88, 221, -130, -233, 65, 27, 101, 139, -31, 113, 214, -79, -30, 30, -193, 71, 128, 45, -151, 35, 47, -179, 268, 11, -46, -471, 98, -81, -60, -345, 50, -219, -101, -17, -53, -50, 209, 232, -51, -54, 88, 61, -211, 0, 293, -264, 102, 143, 17, 66, -135, 221, 8, 109, 155, -148, 475, 213, -78, 158, 426, 88, 216, 85, 363, 195, -151, 98, -290, -94, 388, 210, 146, -83, 56, 27, 60, -37, -93, -192, 52, -75, 63, -149, -260, -12, -88, 379, -329, -103, 19, 105, -99, 15, -85, -134, 152, -196, -319, -462, 229, -216, -225, 89, -167, -15, -184, 240, 136, 87, 351, 30, 22, 157, -155, -69, 456, 57, -503, -267, 150, 47, 168, -125, -9, -226, 125, 246, -365, 33, 263, 92, -349, -205, 155, -335, 47, -114, -24, -229, 259, -20, -35, 123, -186, 31, -68, 435, -344, -8, 165, 59, -337, 364, -198, -126, 115, 293, -390, 36]
5221C6j9n2k64K14R4j8K30k46j75K49p0j16K20j42o6N0j2O1j6J04J90Ln04L22
5245G3J10J50l76L5J7O0j38J94k12K98j28N0k26J73q3m31L29K66j00r6j43L16
5267A38j41J60k72J73K40k98j05M3r9L69Pk18j12O2K33k08m7K98j54j94K26r6
5289Ek72K97j86oK94j70P3j88L44L5m91L03k8n5J46M8n75K96K84kj05M7l45L97
5313A46j82J3K53j29p6Q5q2j80mM2n8L98j85j26k32L88k96L99m4l88J09J69j97
5336a77K6n7L40l64J25L74m47O2N7K27k60J87O9j50K8J50j05O6j99J29n14Q22
5358C89o70j18L58K10j86J02K6j26o4L08l31k56k66P81o5j01O4k01J34j25K36
5379I9j8j77K72k91M07k04J56j29Q2n7K45n01J38k7l2K41l56j06M81L7o41K12
$$ y = [36, 17, -35, -299, -85, 9, -9, 221, -25, -200, 49, -21, -137, 83, -59, -125, -75, -87, -26, -42, 62, 252, 255, -249, 73, 183, 333, -43, -8, 9, 69, -69, 125, -87, 211, 83, 133, -93, 80, -3, -434, -105, 161, 61, -35, -178, 138, -3, 157, -115, 58, 298, 0, -105, -62, -161, 208, 215, -3, -115, -53, 180, -28, -75, 223, 69, -125, 101, 5, -267, 30, -156, -162, 132, -38, 35, -153, 191, 226, -265, 38, 10, -45, 101, 149, -426, -130, 154, 152, 47, 94, -251, 146, -36, -23, 230, 101, 25, 110, 28, -152, -156, -114, -172, 226, 41, -85, -317, 71, -225, 174, 130, -258, -149, 20, -177, -151, -208, 132, -232, -107, 267, -180, -118, -61, 166, -94, 93, 162, 12, 40, 190, 85, 151, -48, 81, -433, 389, -281, -399, -41, 169, -17, 85, 111, -15, -79, 229, -102, -358, -624, 157, 92, -9, 55, -146, -12, -137, 99, 81, -96, 176, -115, 292, 88, 244, 115, 197, 140, 385, -116, 22, -5, -37, 204, -152, -258, 223, 260, -381, -169]
5401a69M35m9j49jM7j38L11j90l48J01n0J7K45M79o54J79m0J2m27M40Q2n85L35
5424a17j3J79j73N54o2o68L89om28K51L29l17O3K99j17l86L15k66K55j81J5k78
5446c63n8N48j0J05j34K38n78N18o5j07j01M3j24M9k34J14J02M32m10n3l27L94
5468b1J91K7l07R5j36J29J54k39o6M98l96l8J38o2j13K02J34m11L68P3J55n27
5490a52K67L1m33L58m1j24l5J66K59l31n8J79n9J11k93R7k68L3N18l49K63j6j1
5513A12L4k47L32n58K05L82k33l02K30p4J36r1K15LJ81k27r6J92l9k69j9P5J33
5536G5j21p9N26k88j89K54R2j41n8p2k18M69j57n0Q5n2k50J48K97o38J58M14m4
5559A61j9j66j00j22Q5M56l25L5K11n1m45P4K47K19n48K87Qp9m5K03j91M7K06
$$ y = [-169, 266, 217, 68, 67, 114, -24, 287, 97, -251, -150, -200, -183, 62, 541, -113, 66, 26, 38, -389, 51, 133, -452, -117, -130, 49, -124, 430, 368, -300, 89, 83, -345, -94, 235, -82, -19, 280, 163, -223, 92, -174, 81, -100, -85, -363, -421, 127, 117, 222, 88, 326, -252, 266, 201, 94, -7, 36, -88, -39, -273, -159, -57, 375, -35, -88, -415, -21, 170, 197, -110, -15, -151, -22, 132, -107, -173, 325, -71, -109, 29, -33, -146, 56, 190, -221, 147, 220, 375, -152, 115, 146, -287, 71, 30, -94, -129, 37, 296, -35, -93, 86, 27, 138, -155, -58, -326, -293, 225, -124, 139, 123, 112, 146, -101, 231, -327, -122, 260, 27, -275, -45, -119, 17, -74, 141, 144, 325, 98, 2, 194, 155, -114, -133, -58, 75, -46, -125, 401, 113, -76, 178, 270, 129, 71, -1, -219, 250, 93, 43, 128, 76, -174, -26, 271, -367, -209, 205, 161, 142, -24, -124, -246, -161, 295, -30, 5, 216, 165, -280, -206, 41, 260, -288, -1, 7, -72, -117, 86, -105, -58, 148]
5582A48k90%j39K37J0r1M82n77K33M4J99k53j16J75K22k83J39l09J66J78j91K67
5604B51m13O1k5N67k94l34K01N7Q9j55%O0j45K6N0m6o3N29n24M19l14j10j98M85
5628A74p8j18M0K44L2k77KJ0k25L6K19j19K51k4k09q6K04j83j16N20k66j30K93
5651A94k82K20j02J29j56l34O71J38o68J80L90n33p1K72m4J28k1r4J30q7K20j84
5673I6O6l99K93m0o2N6L4L13o11K18K20k66j30K97l00J89j89Q0LJ6o4J95J7l73
5697c41K00K6n3J7K31l21p0K95k8L3L5R9j00j86K73n7L2j53P8k91K05J93k63K71
5721A25l51K41L9j25K2j58L56j12j61J87n6Pj55O9k2j44N4M12k32K80j45j08j90
5744a67J07n6K7K46l33P6m6k5Q4P1N9N6j47n1J64J7R2k83L23J76l88O4j19P9n0
$$ y = [148, -142, -142, -281, -44, -34, -125, 357, -220, 13, 57, 256, 3, -113, 62, 284, 1, 140, -169, -3, 175, -16, 251, -162, -101, -126, 441, 147, -187, 14, 71, 160, 5, 5, 65, -80, -54, -4, -50, -113, 416, -108, 311, -3, -113, -311, 174, 96, -22, 18, 262, 294, 17, 19, 29, -196, -160, 59, -60, 191, 167, -42, -128, 76, -107, -223, 297, 31, -99, 194, -88, 132, 30, 159, 3, -331, 340, 478, -190, -10, 380, -153, -224, 48, 4, 132, 111, 17, 147, 60, 280, 96, 162, -237, 56, 16, -46, 10, 44, 357, -254, -36, 184, -82, -212, 85, -215, -26, -215, -135, -132, -116, -180, 15, 32, -341, -141, -115, -168, -151, 80, -241, -311, -16, -44, -11, 24, 123, 23, -163, 110, 53, 85, -68, 10, -281, -76, 117, -146, 125, -226, 15, 54, -71, -49, -207, 149, 37, -124, 63, 7, 14, -141, -72, -94, -238, -184, 228, -4, 276, 131, 23, -167, -60, -116, -89, 157, -176, -100, -146, -171, -87, -16, 43, 99, -48, -99, 65, 82, 174, -109, 214, 390, 2, 66, -53, 26, -24]
5769b4J00j45MnM7P4L14l20K02j49l27J08P1p9K05K74j45l63K32J72j40k6k52
5792a72kK95j62P8L3k36J55j87M57l64J20n0J14M4k02L04J5j66o1q1J25L5M8l2
5816A08l11L23l1k44K97k03j35K78K68j43m07L60N8k40j16K64k67k42M41j41J82
5837I9k73M52j51n39L11m2m4M73l02J2J53l58L31J6J58l01j91J44J4o2K24rk49
5860a34J6J43N3O3j42j35k4K84j79P9L8j42P7l94M13l47J31J65M3j50J92p2K21
5883A99l71P2L01k56J09r4M4J05l87L13k03rj6O6k8K71k63J13J72l47K54k64K05
5906a4J63m5k89j06J81R9k38K16O6R3l60L57J76n70N18J00n05K03MM0m64L00J7
5929e8K56r6J10k46q9K71j75J22k00j80J34J69K5l59M70j49j85L03l7m06J20J49
$$ y = [-24, 76, -69, -65, -70, -23, 51, 365, 45, 247, 98, -229, -121, -50, -129, 76, 350, 205, -158, 74, 246, 106, 80, -172, -174, 121, -41, 37, 70, -166, -11, -198, 259, -105, 15, -35, 79, 123, -79, 225, 240, 74, 13, -68, 57, 92, 140, 108, -203, 120, 89, -155, 142, -61, -196, 82, 350, 207, -200, 160, 218, -22, -138, 126, -141, -383, 58, -83, 99, -174, 278, 127, -412, -101, -143, -187, 286, -16, -4, 149, -209, 122, 138, 296, -5, -196, -52, -38, -100, 124, 115, -134, -118, 25, 78, 141, -1, -136, -160, 124, -55, 24, 62, -80, -3, -397, 16, -331, -200, -35, 8, -142, 50, -22, 199, -172, -100, 201, -55, 54, -40, 4, 109, -278, 35, -168, -177, -193, -127, -155, 116, -147, -34, 138, -209, 45, -219, -14, 149, 104, -185, -291, -110, -11, -249, -33, 33, 126, -234, 123, 299, -271, 247, 347, -158, 45, 49, 89, -375, -75, -58, 198, 102, 212, -34, -123, 148, -27, 95, -105, -285, -151, 18, 43, -316, 154, 5, -180, 123, 86, -320, -200, -51]
5951e1L02n6k15K24l7j46k22L81j14j3N9j91o7K94k75r6L38j29j77J52J51n5N9
5974A16O7m27r4L07oj64O7L86k97J73J19k88J72ml73J6J4q1K78j30j55l5J14K96
5998G1O3j51R0J50j77j09L4q0j1m7L33k07Q9l08J59J77J06Jm49L51p9k66K31m
6022c3O1j62J47r5Q3K3N2j99n3R0M5m2K85L9m37K76J11j97R9q5j77J97j28J10
6046A0k4r6J96j04n8K98j81J28M43m69j61K05j79J28l01M47j24k14J1O5J02j98
6068g6L34j85K68j29j75M8J89k90j76L36k60J84o0J11n38M55K46l49l7K53k2Q0
6090B07l06K00k4k56k09L86k40N00r3n11L83J6j04K02kl20k43L52J71j40L40k88
6112B1L7J40k60N6k5L05j08j97m18K80N8N01k53k07J75j10k21J86l57M68N6l6
$$ y = [-51, 251, 195, -20, 204, 167, 21, -201, 180, 66, 53, 112, -79, -146, 148, -127, -223, 115, -14, -191, -39, 112, 57, 116, 183, -244, -338, -31, -37, -201, -134, 252, -45, 128, 247, -41, 131, 127, -246, -230, -216, -297, -19, -149, -304, -339, -225, 71, 134, -17, 73, 223, 46, -63, -29, -109, -120, -167, 166, -41, 48, -260, -101, 76, 182, 183, -266, 85, 6, -260, -29, -33, 28, -134, 13, -82, 1, 24, 76, -123, -176, -86, -41, -83, 202, 241, -196, 80, 191, -6, 93, 8, -169, 28, -100, 10, -14, -110, 86, -18, -76, 222, 41, 169, 612, 143, -18, 187, 8, 136, -165, 282, 158, -56, -45, 20, 122, -76, 258, 73, 341, 212, 37, 85, 274, -16, -192, 144, -116, 68, 8, 119, -419, 36, 282, -67, -104, 149, 127, 207, -99, 101, 77, -179, -388, -2, -242, 258, 165, -346, 37, 53, -51, 151, 149, -171, -414, -62, 109, -31, 309, 21, 58, 198, -62, -6, -31, 274, 166, -31, -449, -169, -111, 390, 137, -70, 105, -5, -226, -40, -397, 71, 127, 91]
6134I1p1j01j23L7M0p2J65L08j44j11j6k53L05k08P6K20k48M11J35p56N05j5j16
6157E9j79K84l94L36k92J27N6k9L14o42L84r2m8p1L7L43L6j77p2rnK5k14j08M07
6182G6m0RJ16M2l59R0K31k01l35K48k1l0J95N6P9K52m60J72l45K80Jl13J67P8
6206a2Q0p3p3J1J11J79o59K40K66n27K27N33l02M2r3J3k51M16L5j86M9mj84J02
6230f0J46J59j02j86J71n2m6J88k22J90j9k4K9k32N43m83j25L21k04J24mO5n0
6253A27j33J03l58K18L10j03l10M11k63K10j16O2n4l22J70R8K0l03K69k45J5j28
6275c22N27l08J34l3j74qk2L04l53M76l26l10K15R4j89O3L31j46p8L67l69j04
6297b31K15K0Ol4K54l03j76L05j63jk24J72o4R8K4J98k42K00o4m11J31K60k5j09
$$ y = [91, 20, -81, -204, -167, -127, -199, -34, 274, 130, 19, 3, -250, 55, -153, -77, 143, -105, 306, 441, -315, 190, 175, 59, -120, 164, -230, 106, -186, -59, -3, -32, 282, -360, 24, -68, -116, -187, -150, 193, 229, 52, -20, -29, -34, -9, -223, -331, 76, 36, 45, 161, 203, -156, -66, 165, -36, -371, -123, -144, -174, 21, 77, 156, 408, -52, 120, -225, 55, 56, -257, -90, -12, 68, -5, -78, -67, 44, 223, -436, -196, 70, -457, -230, 303, 1, 43, -50, -37, -288, 128, 163, -23, 26, 22, -162, -60, 86, 245, 143, -43, 128, 76, 30, 218, -4, 186, 167, 143, 172, -60, 483, 0, -125, 196, -8, 116, 112, 177, 127, -6, 97, -261, -43, 267, 164, -146, 265, 2, 212, 96, 158, 104, -218, -48, 50, 70, -233, 36, -209, -194, -322, 205, -103, 31, -2, -176, -184, -206, 98, -255, 221, -105, -415, -200, -106, -295, -232, 99, -47, -125, 242, -127, -231, -16, 4, 10, -24, 230, -73, -249, 56, -107, -108, -332, -160, -224, -126, -102, 96, -146, 54, -10, -421, -290, -30, -55, -164]
6321a64J96j28P5P5m1J42j35M43o10N5J12k60K00L74j01q0J29k45P6M6R4J15o7
6344C01j95m4j50J09J31l1J37o8k21P1j97L18j53L5j12j71J83O8O5J05l76M8J72
6367B5N2q0Lm4j88j85K38N19m17K09l04K86l97J72J47j06m6K41j5l30K81Ro0J6
6391B6k48K89l37L52oLK97m87R1Q7J56j78l1R5k90j37L46J29P8k21k04L16k96
6414a70J2K12L5Q0ll48L42j82O4L7j46R7l18O43k32l53L35K0m9Q1l75L05k28L7
6438a04Q8j75L72J40l87K29l6j08L34j48o7j77N43l03r4k75K04k43L58M6j50P0
6460A17j43J11K0n1J65k96J25m9j69M4L02k06j91L1L7k2m4K70J4m42M56kk14%
6484a37P2J24k38K79k47j18K67J27n11L93n2J96m54K45M49n67K91j98J96j58P1
$$ y = [-164, 32, -96, -21, 54, 13, 155, 20, 463, -147, -92, 20, -240, -40, 334, 233, 153, 282, 37, 113, 159, 253, 368, 301, 106, 62, -88, 21, 152, 121, 258, 190, -31, 40, -157, 161, 8, 43, -69, -240, -57, 11, 76, 181, -195, -147, 25, 77, -3, 0, -44, -232, -417, -179, 340, -77, 132, -172, 114, -283, -111, 36, -70, -116, 125, 110, -220, 61, 70, 10, 26, -222, 67, -270, 82, 76, 79, 376, -111, -20, 67, 223, 45, 14, 109, -181, -318, 28, 157, 235, 14, -190, 126, -170, -158, 54, 89, 169, 166, -182, 160, -22, 42, 79, -67, 30, -288, 355, 123, -230, 105, 125, 76, 157, -218, 87, -141, -104, -16, -191, 181, 321, -66, 163, 127, 19, 353, 205, 138, -39, 504, 201, 107, -168, 36, -207, 151, 197, 47, 117, -26, 85, 105, 54, 219, -77, 48, -1, -170, -126, 176, -30, -221, -190, -153, -175, -219, 51, 65, -377, 79, 77, -137, -137, -65, 59, -179, 100, -147, -265, 2, 129, -382, 11, -41, 155, -299, -54, 395, -172, 119, -79, 117, -41, 30]
6505C0oM0k10L06n9j36KO9k01J82m6j1q1K15j90L07l09O2J61j07o1J63k28J97
6529H9j2k17K16K29l03mj2l7K26j86j07K45M4J95l12j15j26J11K22k86J50q1J60
6552H9q6q0J19j21j91o9M34j96K20k04O9J4L02k82j04q8K55p5j85L41j97r9L58
6575B24l31M5J78qj41pJ21m07K76Q9r5J10N5P0J3j85K0j55J74j12K8m4K9J36j92
6600a09J31k37L18o0j18J98l65M85k32j39J43N3k63K43j55O3j89L7N24o88M40
6621H0j52N3q1R8J06j12J01l1k56K11J16k5o6L80m11l76J20J29K35l04K46N7k08
6644i0J59j25l3K16n08L94pJ39k46q7J48J09k66J89j66r6K16R6j74J55K02j9k88
6667h2K2j51L03l8K55l09l6NJ92k54K50j13K38nn80M17o1K34k1m72K54O7r0j57
$$ y = [30, 24, 64, -146, 160, 101, -35, -33, 36, -165, 17, -29, -40, -121, 94, -96, 211, -98, -36, 125, 18, -43, 120, -108, 89, 77, -140, 76, 305, 2, -2, -14, -51, 175, -11, -118, 127, 171, 366, 54, -61, -187, -76, 146, -140, 10, -71, 89, 3, -77, 42, -79, -270, -339, 95, -101, 119, -85, -16, -2, 300, 18, -86, -174, 81, 6, -179, 162, -35, -134, 224, -107, -62, 116, 108, -33, -40, 81, -326, -50, 39, -56, 54, 109, 179, 192, 7, 27, -128, 46, -66, -38, -82, -53, 83, -109, 22, -215, 103, 43, -75, 123, -242, 243, 11, -128, 15, 68, -195, 48, -107, -44, -233, -196, 328, -360, 80, -72, -19, -100, -2, 104, -8, 93, 62, -194, 17, 133, 108, 42, 422, 11, -365, -245, -116, 119, -185, 61, 118, -90, 69, -56, -89, 127, -381, 13, 6, 145, -101, -188, -40, 69, -197, -8, -174, -270, -54, 42, -132, 23, 225, 206, -82, -60, -211, 92, 54, 309, 0, -36, -31, 161, -93, 157, 44, 282, 277, -303, 114, 53, 287, 266, -206, 48, 115, 25, -132]
6691a32q9p2N44ook58n3j94L98J31j95Q7j70Q0l28L24J57k88j22j6M74k06N9j36
6715a7j05k2K0L1K02L6j49J0M8J32k78j16k0K84j43K21N2Mm83K35N8Q7r7M8r2
6740e4j51L68r1j31k11J23j42L47K60m50oj07J25J16J06P1k64lL3n4J47Nj5m8
6764b6j3J7j10j96M25j17J43k07Q7M9N2k73P0L00q7O4k72K91j35p0k71k32M16
6787i5N2N5k10L10q9L8j29K87j26m6N2L3l38L14l9P3j53K35k02J82k70l0J55k1
6811C8OKO9l7K5k96L04l46J64M3j64M8J88J68j91k65M07j62j37k31L88j60j34
6834b73L39Lk84J46J1M48k57J05P0m15J04M40l97K04j90k41O6o2K98j44L67m07
6856f9K80J8k57l9L9nk8j8K21q6K72k48kJ13K3j26L8l22L04J4k02J38R5k16l4
$$ y = [-132, -221, -293, 251, 245, 239, -19, -72, -266, 132, 263, 68, 155, -15, 65, -263, 61, 218, -70, -192, -208, 266, 60, 119, -17, -122, -144, -124, -93, 109, 145, -4, 6, 54, 186, -92, -208, -228, 56, -87, 134, 186, 190, -293, -58, 0, 87, -10, 38, -54, -205, 163, 72, -59, -270, -147, -289, 58, 318, -132, -138, -245, -120, -4, 102, 173, -91, -94, -61, -115, 32, 37, 22, -26, -39, -22, -132, -328, 97, -20, 123, -84, 3, 52, 104, -169, -99, 201, 114, 178, -94, 197, 62, -8, -279, -511, -95, -43, 12, -198, 112, 23, 61, -68, 219, 93, 47, 99, 132, -206, 108, 69, 142, -11, 224, 22, 204, -66, -96, 59, 38, 44, 46, 115, 78, 103, -193, 111, -235, -71, -28, -192, -144, 44, 212, 21, -244, 163, 1, -136, -367, 21, -139, -273, 66, 69, -215, -69, -58, 390, 133, 238, 308, -107, -3, 437, 40, 244, 54, -187, -121, -183, 115, -29, 338, -69, 211, 229, -28, -67, -28, -33, -61, -79, 142, 56, 328, 80, 78, 191, 214, 88, 126, -196, 108, 122, -80, 58, 153, -63, -97]
6881i7j11M62o9k34p7l07N77l9J10q7J17j41K55n2m11K48k82j01J91p3k4N8%J49
6905F2k99J5j01M72n05K26J71LJ15k04j26J45k57q3Q5L21J5n44K25K39L34n72
6927b63mM78j24m8j95P3lq0J02j71j66K94J91M8K9j97K0j93K68Rk83M55m29J21
6951f8n6l9q1L24n7J19l8K05j38r0P0j02j0J01P4j53K68l06L6k78N76k76j51K29
6975A59l6j33j06L79j19l02p4N12k49jM14k95k29O6k52L10K05j01j55m6k12K12
6997e3n2k1K00j28j47l5K60m74O39j42J79j89Oo4j49J09j82j9L48Jq3J39j3k18
7021h8R0J31l20J10N6J12J0K6k38K61r1o8j8N9J2K04l74J59L4r2J21l12J60k8
7045h4J87p9j68K3J31k52J55P1Q6nj95L91k55K09J41m24J61j48M35l87J24k06
$$ y = [-97, -208, 254, 185, -49, -126, -433, 144, 105, 215, 128, 245, 104, 359, 307, -104, 144, -138, -239, -48, -121, -145, -87, -87, 62, -237, -222, -323, 149, -356, -130, 41, 44, 159, -45, -171, -26, -283, -366, -281, 40, 55, -489, -264, -25, 309, -263, -267, 211, 87, 39, -156, -83, -86, -166, -64, -235, -401, -107, 84, 132, 161, -36, -16, -209, 59, 68, -215, 240, -189, -68, -124, -163, -244, 80, 23, 142, 104, 309, 171, 81, 151, 49, 39, 140, 214, 61, 329, 23, 59, -219, 357, 81, -70, 159, 123, -10, -116, 263, 144, -158, -232, 280, 31, 30, 444, 149, -80, -14, -266, 44, 249, 148, -7, -53, -265, -53, -105, -126, 74, -54, -201, -236, 24, -450, 189, 47, 226, 37, 43, -21, -170, -61, -243, -262, 86, 87, 4, 143, 130, -88, 2, 133, -187, -77, -21, 91, 101, 127, -111, 150, 59, -9, -27, 32, 44, 248, -126, 33, 67, -25, 96, -216, -56, -84, 103, 24, -144, -121, 10, -242, -87, -16, 70, 65, -130, 261, 6, 215, 356, -68, 93, -55, 380, -7, 117, -89]
7067h9K2j51R8J42o7K67j94k41N00l19K08n12L45J5pJ7k23jK54k66O5K46m35L3
7091b93R8n3L58k11J64j62q6j64L4M6J17N0L2M9L5l8L11l58K64j86R4r6J51J82
7115C38j38m05k0L21J16j78K31j65J90o0k07j30K14j49k22K06J66o3K6N6j94K94
7137B27J21k47j82K13k03K36o7j29J01Q0l1k15J80m06M07J27q6K1j48J68m4L9
7159A62O2k90L7N0N8N9n9j46J00R4j14P7nm09K43M52m04K5j00J61k93L05J71k44
7183hJ05J07j33p3J1J03p6l06J97j3r5L19l09p7L77j38L77q44M31k9n1p3K99j55
7207e4n7j13rK31Jql3o7J02k26K83j45k25J40L03m02L41O0k21j74L20p7P1k9o2
7232e0p4j5O16n77nP7L4l0k78K27L7m6J24O9k93N9J48k82L76L59n94K94N2l24
$$ y = [-89, -67, -218, -120, 22, -45, 222, 28, -213, 287, -32, 176, -336, 9, 24, 17, 34, -189, -190, 64, -202, -137, 109, -326, -293, -195, -248, 110, -101, 63, -99, -185, -349, -315, -269, -152, -102, -70, -21, 14, -24, 287, -71, 193, 7, 101, 5, 156, 338, 200, -205, -225, 96, 212, 34, 265, 100, 290, 230, 23, -107, 107, -42, -264, -58, 108, 45, 71, 127, -67, 227, 348, 101, -81, 132, -71, 165, 98, -31, 70, 150, 119, -96, 84, -322, 85, 212, 126, 147, -1, 167, 123, 162, 224, -66, -29, 21, 79, 138, 79, -67, 33, 127, 13, 90, 85, -324, -81, 371, -33, -8, -108, 53, -240, 65, 236, -8, 97, 204, 71, -2, 9, 112, 36, -270, -73, -86, -181, 138, -171, -248, 129, -9, 368, -476, -45, -74, -125, -198, 101, -54, -111, -224, -233, -2, -1, -9, -42, -109, -7, -233, 50, -95, -320, -180, 123, -279, 62, 122, -99, -273, 47, -30, 41, 12, -50, -124, -139, 477, -100, -105, -28, 6, -24, -302, -75, -38, -84, 40, 109, -184, -125, 23, -259, 117, 476, -118, 176, 228, -96]
7256i6l0K59j26L7J3j39j6j42K18O0M7k10K8j52M15p6q0J62k42K2J53P7K62n23
7280g9M4j29o8K96K09j73R4l59M52k38J24j93K1j84M75k27j25r8M69m9j68l70
7302b76L13J80j83J84j95J15L5R%p4k05J28Ok3J21pj81Q8J33k99j51Q1N20j88
7326A31M6l01M2l42M85j1R9l40P6K71k50L6o6J32r5K83N9k74j4L6N5n8l3j69J43
7351e9P0J07j27PK7j30MJ10N8oK75n71j4L62k24m2J43p7o6J90K2j69rK47r7k31
7377b00j92M48j88NJ93R8m00K32l2l0J05o3J41k32J40k24K23J40jk83m9M42k01
7400G2r8J10j49J37k2J3q4L51l17k5K8J8n2J3q4M4j6K62nn70K81L02Ol19M15l96
7426h5j5J91K88l75N8J62k36j78K28O4p9l82K54J70%q0j10mK5K43m5Q3l46K91
$$ y = [-96, -126, 133, 7, 44, 57, -82, -98, -240, -22, 38, 85, -125, -97, -249, 166, 90, 10, 172, -70, -48, 105, 182, 444, -79, -35, -164, -232, 64, 273, 100, 194, -165, 287, 49, 173, -20, 1, -183, 292, 65, -60, -158, 311, 262, 94, -276, 37, 217, 34, 218, 23, 138, 173, 182, 182, 108, -97, 31, 37, 14, 135, 128, -53, 35, 168, -131, -282, -201, 319, 131, 177, -124, -82, -424, 61, 50, 149, -191, -115, 156, -94, -58, -124, 8, -87, 196, 255, -19, -33, 3, 58, 0, -33, -202, -59, 11, 118, -9, -2, 25, -105, -101, 9, 67, 61, 336, -235, -249, 113, -111, -153, -10, -87, -153, 37, 59, -110, -119, 128, 31, -200, -392, 56, -132, -127, 66, 164, -236, -4, -36, -66, 39, -24, 117, -115, 25, -199, 24, 164, 163, -120, -169, 273, 72, -26, 84, -65, 72, 50, 63, -21, 330, 13, -12, 16, 34, -18, -5, -89, -45, -61, 201, 196, -374, -93, 209, 215, -104, 311, -85, -100, 91, 379, 4, 62, 224, -12, -190, 38, 102, 23, -359, -105, 65, 65, -15, -125, -129, -104, 139, 94, 177, -169, 122]
7450A22j56O0l7q6r4L71L0p6l47Q7J90O1l57K36J02j98L24j83j20J03K90m98M49
7473B73j45m4l03J83o0J13j58r7M19k12j43K37jN0r2p3j02R2NJ5K14L2j3j49j54
7498a13J69PP1K5l8L3q7k31K33j87K21l95K38L5Q1k70K92j46K5O1KR5j69J45m25
7523c28L6K06M0K33k26N1J41k87N4j41M17p2k32P2Q4j23J07pk32n2K1PK74p0j47
7548a74Q5J60m62L65j5K59l12j29n6L03k39J84q1K28k37Q8j31J60N9ol00L98j48
7571aJ88j24k60K68l30K13J09j31N3J15n6J6K48k16j90L12k03R8qR9M1l20K46
7594A67J6m5m6j79Q4L7R5k12L53k05p7J72J3l83j27M46k03L47l10k7K15P1j10
7617I2k83J94J35r9Nj43o3M7K98j99P2l2O1L4k27j55L2N06k28p4J59l79l7K63
$$ y = [122, -34, 26, -11, -97, -191, 180, 210, 134, -213, -126, 64, 125, -232, 4, 106, -92, 232, 49, -71, 32, 322, -176, 273, 128, 84, -219, -36, -96, 17, -141, -238, 181, -31, -174, 63, 62, 112, 20, -53, -155, -63, -58, -43, 171, 203, 190, 41, -113, 56, 63, 134, 159, 121, 154, 67, -164, 69, -118, 103, -292, -54, -19, 62, -208, 84, -62, -37, 24, 26, 121, -48, 97, -328, -292, -86, -46, 187, -39, 12, 153, -134, -80, -221, 196, 124, -108, -36, 48, -75, 32, 25, -207, -259, -238, -231, 43, -27, -174, -89, 71, -391, -26, -41, 218, -94, -223, -279, 24, -215, -31, -112, 116, -121, -33, -164, -4, 55, 49, -251, 147, -1, 187, 63, -197, 71, -259, -46, 63, -68, -15, 100, 44, 60, 308, 92, -98, 214, 11, 109, 101, 200, 241, -79, 167, 183, 138, 92, -87, -3, 34, 129, -83, 270, 65, -12, 160, 173, -210, -337, 109, -94, 253, -57, -84, 131, 202, 92, -191, 3, 138, 39, 44, -99, -162, -115, 183, -16, 56, 24, 85, 119, -108, -263, -231, 275, 47, -27, 132, -247, -284, -21]
7641b1M27k40k76N07l19k26j1k27L71k31m5K68L4k73L42j15J53k63r4M32m21M14
7663A86k98Q5J38k13K3k29P8j33O84l56j36L61n02L63j91L44m52L20N4j36M12
7684D02o08M26j32j84j40J07K24J01l41n4J99L46l24P4RK49n36L00n6O2K73l01
7706I6l39J85q2j38Q1JJ78l7Ml8R1j43K2J32j39K58m44Q4R1K5j74K2j03L10J83
7731A26j42r3o3J01p5p0mN55j87j20j69K31j12K51k36Jk74K31J02J93n72M11j11
7754b6J61k24J30LL5j51J8K48l02N03l76M6m4k21K44k03J50L3j23K69j81k12K89
7777F6j07k67J05J51K94k58J29l0j57P9j6M5o7kl1J90k67O61l43j7k27J45r6R4
7801G4K05j53k87L35J1k80L11m98K59J11j47n1J80l50K57K19k93J9j21L11l35
$$ y = [-21, 406, 166, -110, 397, 78, -148, -159, -386, -15, -246, -291, -23, 11, -262, 80, -35, 118, -145, -239, 193, -228, 186, -112, -27, 111, -102, -79, -308, -230, -363, 321, -35, -171, 190, -312, 51, -140, 204, -248, 72, 126, -10, 402, -206, 220, 88, -96, -236, -129, 95, 196, -145, -199, 0, 346, 22, 96, 105, 354, -182, 118, 62, 124, 397, 96, -243, -58, -140, -278, -197, -196, -18, -55, -51, -89, 2, -141, -119, 13, -126, 132, -312, -228, -137, -112, -286, -264, -367, -57, 126, -16, -109, -172, -71, -146, -216, -220, 335, 148, 28, -141, 90, -22, 229, -7, -6, -280, -49, 53, 246, -326, 85, -26, 135, -89, 41, 44, 79, -72, -54, 194, -108, 395, 19, 65, 21, -200, 44, -159, -9, 24, -99, 170, -11, -223, 66, -41, -308, -203, -52, 242, -16, 113, 83, -74, 5, -11, 34, -33, -35, -66, 124, -143, 518, 175, 158, -69, 76, -20, 74, 279, 126, -161, 174, 185, -95, 216, -282, -23, 88, -59, -110, 70, -280, -23, 196, -97, -78, -199, 112, -223]
7822b23R7j3j70P06l93l17M32l06K52J64m20R3J99n5k68L29r2K09k20j12j83O22
7844C31l76j94J83J42j11J73k88L29j98j63K84o4k28L74l74L55j93J13L5j63P8
7865D5j19J8o6J43j56K04k97L69l17K22j41O4L00n24L89q7n5q6L11k25M3J28k61
7888i8k75N06J8m0o5k00J05J55p1j26N2J12R8k04l6L7J30k45J65O7J84l36n2K53
7912A34j34j18l2L4K20j29L3j15NK35J16l07j61K0J55N9o7k35M09n30L53K09O6
7935B20K67q90N37j47Q9j67J93l82J06J79K1L0K42k91k71M99m4m50K88n8J33k45
7957a41K40k42Q2LO4L7M5J79j17l13K8N55l69J67l68K66j61M4J68j28j58J25K54
7980B60k81Ro0L5Q2K10j03k57P9J13j52Q1o4J74LQ5n09L85L0L9j36k61K17l5j29
$$ y = [-223, -126, -139, -309, 397, 4, -313, 119, -187, 65, 229, -191, -98, 101, 46, -222, 107, 15, 224, 4, -108, -291, 331, -45, -239, -56, 86, -25, 148, -140, 189, -9, -172, 112, 48, -180, 194, -180, 175, -18, 95, 130, -33, 45, -74, -56, -122, 21, -135, 69, -228, 141, -176, 46, -95, -31, 269, -255, 134, 47, -8, -94, 217, -8, 35, 163, -98, -373, 133, 151, 111, 46, -154, -49, 106, 35, -91, -39, 73, 171, -33, -69, -32, 98, -147, 18, 85, 269, -67, -119, 134, 0, -118, -150, -116, 104, -25, 8, -107, -102, 133, 249, -58, -219, -199, -44, 15, -52, -287, 122, -408, -55, 154, 220, 487, -403, 134, -13, 76, -91, 102, -280, -174, 5, 26, 56, 298, 7, -264, 235, 191, -259, 29, -29, 104, -141, 99, -143, -61, -58, 6, 43, 88, 267, 150, -163, -135, 420, 51, 218, -150, 116, -45, -1, 167, 39, -119, 6, 260, -21, -12, -72, -37, 45, 255, 152, -105, -26, 87, -65, 16, -48, 126, 129, 214, -295, 90, 120, 159, 23, -238, -21, -56, -185]
8005a85K26J25Q8l41j51K37j34L50m29J80P1j27k50M23oj88K08k06K36k10M05
8026C22j63m5l6m9k0o0J19N5k5q0j4L38k26q5M6j19Nj03j68K85P1k3J75l52O7
8051h5J02J6K07j23K8p3j78K56j77n5M1O8J88O8k26K5j27p9M1L4M8J3j92L78k57
8076e9N2K7L0o1O6mK34k77R8O7K7l96J22M4J01P1j80l05L76J91j29M2r7j13j39
8101b12R2P0p3K15j36J48j77J5Q3O9n0j88l6n0J19J40j07J52j44p7J77m7m8J34
8125F9l26K89Q6o6l8M0j9l21K33J46K0l26P0K11l12K0K41j01J0J8KMk8J8lJ06
8151D3j39J30J83r0k55k4PQ1J90j03p5j29K67J09k6j40J45p4n9J34N6k98J99j33
8175aq6J70J78m73J25J9n0R7J20j61J45j39J67k45L70j86
$$ y = [-185, 41, 166, 254, -87, -238, -1, -135, 215, -214, -34, 37, -90, -340, 83, 77, -111, 97, -109, 127, -83, 322, 159, 114, 78, 29, 9, -51, 68, 123, 98, 18, 4, 342, 116, 31, 77, -42, -37, -140, -308, -23, 48, 25, 200, -152, -85, 17, 33, 240, 117, 145, 72, -106, 150, -27, -82, -41, 27, 215, 283, 57, 82, -45, -124, -83, -49, -1, 12, -180, 198, -59, -7, 20, 50, -11, 55, 51, 285, 8, 106, 173, 200, -196, -74, -30, 71, 142, -38, -343, 33, 224, 95, 137, 40, -73, -212, -120, -50, -123, 92, -44, 104, -73, -58, 25, 94, 44, -144, -180, -230, -111, 29, -78, 74, -70, -147, 30, -17, -65, 69, -257, 32, 118, 52, 14, 54, 35, -286, -53, 93, 113, -213, -143, 68, -244, -224, 17, -84, -74, -56, -54, -50, -78, -60, -63, 43, -96, 34, 217, 127, -128, -152, -145, -64, 126, 23, -52, -181, 86, 195, 169, 29, 174, 100, 41, 175, 231, -67, 132, -1, -87, 83, 261, -212, -87, -68, -118, -21, 99, -62, 83, -56, 111, -134, 236, 50]
8191E0
$$ Imaginary data points
##PAGE= N=2
##DATA TABLE= (X++(I..I)), XYDATA
0@%%%%%%%%Qj6J6j6J6k3L1l3M1n0N8p1Q4r6J10j28J49j71J96k23K52k85L22l63
32a92M06m53N07n67O31p02P81q65R59j062J175j302J441j597J774j974K202k468
50a306K779l149L599m162M889n867P266r445J3358k2605Q5630Q5746p1375j1919
64G3439O187L5085J2306p380l8822l713K3465J0170k1412o603k23j349m343p806
78F9001j4774J0824J7836j9673m0399k632K5943J7040q804l2043l3263J3890M2958
91D5904M788l8747k5151N264K0517J8175p486l0956o339K3791O593j3870o19Q213
105A0077L38k583p416q536J6189K5947j2131l5012n357K5889K3246K566k7277
118E940l4092R903M2813J1153k9412k3091l73J3995J7576k733k5559p224J7988
$$ y = [0, 0, 0, 0, 0, 0, 0, 0, 0, 8, -8, 8, -8, 8, -15, 16, -17, 24, -26, 32, -39, 45, -51, 59, -69, 80, -91, 105, -118, 134, -151, 171, -192, 214, -239, 268, -299, 332, -370, 411, -454, 505, -557, 618, -684, 757, -840, 934, -1040, 1162, -1306, 1473, -1676, 1923, -2239, 2650, -3217, 4049, -5396, 7962, -14643, 70987, 156733, 85358, 73439, 79626, 114711, 127017, 119637, 80815, 77102, 100567, 110737, 89325, 82722, 82499, 81150, 76807, 69001, 54227, 65051, 82887, 63214, 22815, 20183, 46126, 63166, 54362, 22319, -10944, 2946, 45904, 50692, 11945, -13206, -7942, 12575, 30750, 23264, -7692, -14031, 9760, 16353, 2483, 1864, 10077, 10415, 7832, 416, -8120, 8069, 34016, 21885, -13127, -18484, 7405, 30651, 33217, 5940, -28152, -18249, 24564, 35717, 6305, -16786, -17159, -3164, 14412, 11679, -13880, -21104, -3116]
131c116L463j3453r20P875J479l295j0909j1277J7062K9330p871l4753r649K1304
145a4730K5571J1637j8334l2066L659L9206J7329j8162j7264q40J2559K0197M018
158C2780j8259l533J6807K943j0810L552J2145M573k161j2063j4690J4175L0822
171E6281j665l1874j5737J1682K2083J3931j5171l4815n063K9846J5751j4659
183C0590j6925p550L101J4271L150j6299m847J2439j045j4101l08J1267O878k43
197B0378j3899j7394J0648L2079M751k6180j7490O580K1327K0108o213k9785p878
210b968K6114J7667o910j0314o088K118J2908N989j1308k067J3772j088j5346
223B2479j336J1713R181L280j3445k2041M638L0227Q196k1973j9410j272J4615
$$ y = [-3116, 347, -13106, -14026, -6151, -4672, -7967, -18876, -30153, -13091, 16239, 8368, -26385, -36034, -14730, 10841, 22478, 4144, -27922, -24263, 14943, 32272, 14110, -3154, -3994, 8565, 28762, 32780, 14521, 10988, 27795, 30738, 19928, 23480, 35625, 40198, 38037, 25974, 11284, 25459, 56281, 54616, 22742, 7005, 18687, 40770, 54701, 39530, 4715, -348, 29498, 45249, 30590, 13665, 6115, 9216, 23487, 26637, 10338, 5491, 17930, 16885, 2784, 2476, 13743, 20621, 20378, 6479, -10915, -267, 31812, 36563, 10383, -7107, -527, 20800, 40908, 34695, 4910, -2968, 23146, 40813, 33903, 23589, 17501, 19619, 32527, 38516, 27208, 25141, 38913, 37825, 22479, 21143, 32856, 42037, 45317, 31872, 9831, 14469, 44696, 52892, 30919, 11509, 10237, 24852]
236B4852K0067j640k8906j3270J7808J4240m299p637o749k514P661L263j0395
249A2481p80J3712j277j6405m348R207J0641O859j0940k3788M32K7897J3760j6548
263B0903j8757n042J0245K1133L825k2860j4015J2730J1993k174l891m470l485
276F135O478J756j0659QJ5204K61j7000p460N926J1185J0151q180k5081n131K4481
291H074J5245j0424j6441q861M572J9690P877j8114j3318R276Q894j925o23j691
305B231k308M623J464j0100R74J6375L406j4942q448L391J1594J4108l640k3614
319d886q046K0727J6343m732j2234j0051Q14J7000J0214j3103j1351O831O075
332A3601k191M96j10j473M967n10j1780K49J7194M960j3335j0469L61R058J5776
$$ y = [24852, 44919, 43279, 14373, 1103, 18911, 33151, 28852, 21215, 14466, 11952, 19613, 22876, 12481, 11701, 25413, 24136, 7731, 3383, 12590, 23231, 30090, 19150, -4638, -4206, 23691, 37451, 20903, 2146, -2896, 7349, 28482, 32307, 9447, -4568, 8162, 20155, 17981, 14090, 9620, 6135, 12613, 14369, 3710, 3718, 18922, 19183, 2183, -5277, 649, 11834, 21985, 13805, -11276, -16407, 8074, 23319, 12895, -3546, -12407, -7835, 11855, 19732, 1618, -11700, -2424, 6470, 4545, 3922, 2231, -77, 4546, 6010, -4090, -3116, 13259, 16665, 1723, -6725, -3334, 8260, 22368, 18728, -4886, -12932, 7795, 24138, 19406, 7172, -2879, -2065, 14935, 25149, 12046, 695, 7526, 13601, 11410, 11906, 11796, 10323, 15290, 14780, 3000, 3249, 20443, 25403, 12068, 1599, 1960, 11018, 26794]
347B6794K39k2040j1681J5529J5643r60r279j0322k518J3575J0342j0054r060
360F208N536L159l349J107J095m32M931j217j2670j866J7015P523j0349j1182
374E509l733O492J6547L726j8748j3107J0625J2954J463m636r651n730J0076J0328
388B2115p438p205N021K037m836k83J886P42O237j440j4115l551J5511Q880p513
403A6048j0079o408K913J5817P641j6090j3622O640J0324K888j266p776o937O490
417F583Q269n750m500N625P49n777r76Q36J747P499l15j4693n933J3577J0283
432A7224m275q778q565k71J4438R545j1808j3094L362P186L062J404n458p188
446c216M641O163n158l066O436J571o444k378M11K166Q089J866j4398p575J1345
$$ y = [26794, 27033, 4993, -6688, 8841, 24484, 23524, 14245, 3923, 1405, 14980, 25322, 15268, 6208, 11744, 14903, 11554, 12661, 13756, 13324, 18255, 17038, 4368, 2502, 19517, 27040, 16691, 5509, 1776, 8268, 24815, 28541, 9793, -3314, 7311, 20265, 21728, 17092, 7441, 1711, 11787, 22115, 14677, 7472, 12493, 14530, 9694, 9411, 11297, 12039, 18276, 16836, 2721, -830, 14681, 23561, 16048, 5969, -439, 2474, 18291, 25932, 9842, -3780, 2860, 13184, 16072, 14806, 7030, 93, 6583, 14852, 9102, 4602, 10227, 10976, 5199, 4223, 5059, 6806, 14305, 13990, -703, -6636, 6941, 17224, 12949, 4171, -4394, -4665, 9773, 19318, 7510, -5584, -2222, 4964, 8026, 9430, 3972, -3216, 1425, 7588, 2430, -636, 5800, 7371, 927, -1451, -1040, 1126, 9215, 11081, -3317, -10892, 453]
461D53J0260r45n731r233l375J2301J0732q110j0489J530M432J941L786k823o227
476a498K951M516m730k471P817K169o028l206j184K022J0072L414j2967r191Q484
491A70R162J605k685q488o093R246J1463m887q560R34K062O34M521n57m622L119
507G024L415n607j642Q536L512m497l106k130J171J0888O038j0761r733N854Q325
522A7287L883q3o802p568O444J0141k288n832P66j90n87L758Ml952K140K054p343
539A1832k956Q094L725m522m309n048j894R049O761r026j0566J960M659K787J931
554A2477o111r324L502Q404j700m252J293j561l000L118J636j997K708K264p524
569f7l696Q029N185j462k289n042k959R268Q864o088q863Q70L394L448M497l161
$$ y = [453, 10713, 9768, 4037, -5196, -8571, 3730, 14462, 6352, -4137, -2607, 1825, 3766, 7552, 4729, -1498, 1453, 5969, 1239, -1232, 6585, 8754, 2726, -480, -1664, 358, 10430, 13844, 877, -8314, 170, 9332, 10937, 8252, -236, -6329, 2917, 14380, 9493, 933, 1867, 3929, 4563, 9084, 8527, 3905, 7024, 10439, 4832, 3190, 11726, 15238, 10741, 7635, 5505, 6676, 17564, 23602, 12841, 3108, 8962, 17287, 21170, 21087, 14285, 6717, 13161, 23302, 21014, 15182, 15948, 15758, 15171, 18929, 18933, 14981, 17121, 19175, 11832, 8876, 16970, 20695, 16173, 11864, 6816, 4922, 13971, 20732, 11706, 1140, 3100, 7759, 10546, 12477, 6366, -2958, 544, 8948, 7248, 2996, 4289, 2728, -272, 2846, 4482, 2485, 5193, 7457, -67, -3763, 4266, 9451, 7989, 5700, 658, -2301, 6967, 15831, 9743, 880, 1750, 5144, 8592, 13089, 9928]
585I928q412J237O528j052k386K473k085l959J571N76j621L168J695q788n163
600f290O162M526r22k059o161n574O537Q554l638p675j086P81K261N192j094p320
616g806J7M951p73o41M876j350m325J001J112m33N527L637p194n615N132M951
632C067R17L76n039o185M708R085k213n488j592k182P00O192M65o484j628K441
648b860l119n69M541k79m885r81k80j299N156M362p199o111L393M442K336K995
664c57l793p219L695R316J088k067M07j779M64P188M009l107P11K811k076J778
680A1069P515J818k697N70p53m94O713O142m483o232K138K824K498L473l434q062
696A8605M00O574L02j596q12n029l834M164K504l646n44n71n426k248N371Q83
$$ y = [9928, 1516, 2753, 9281, 8229, 5843, 8316, 6231, 2272, 3843, 4419, 2798, 5966, 7661, -1127, -6290, -128, 4398, 3476, 1417, -4744, -10318, -3781, 4773, 1135, -6540, -7626, -6845, -4584, 608, -486, -7806, -7789, -2838, -3611, -4252, 624, -726, -5051, -4050, -2938, -3371, 2156, 5793, -1401, -7016, -1884, 3067, 3984, 4360, -679, -6864, -2156, 6929, 4716, -772, -2364, -4546, -3846, 2346, 2811, -3673, -5301, -2860, -5979, -6548, -2007, -2286, -7171, -8152, -8432, -9731, -4575, -213, -7412, -13523, -10130, -5688, -3352, -357, -4150, -11369, -7674, 1642, 2730, 663, 1070, -709, -245, 6943, 10952, 7845, 8556, 11367, 9291, 11069, 18584, 20402, 17705, 18275, 17522, 17028, 23741, 29883, 25400, 19168, 21306, 24130, 26628, 30101, 26667, 18605, 19005, 25579, 25881, 24285, 23473, 18444, 14610, 18774, 21278, 17632, 17088, 16517, 11091, 8843, 14214, 15097]
712A5097l905j392l108l772M891O056m908o626P1L93K242N261j477q598p39M935
728D421Q97M14K128l910m585L117L416j527J020K22n844j752N526K022k267p19
744B579l741m949M202O497l409n670j584j430N43N639n95p770k603K212N5R11
760i113L017l850n751J909K628j78K575R39n945k467N517L421j56J229k630m630
776a3485M320Q039L8k983j40j672P42P691L186m957j507J864j97K518N303j987
792F773n042R01K061J97L109J935n814m572L998K331N13J078l696o917J679O033
808D567J55k900j202l957j707N433K887l691k771L1k191J957N447o49n169j53
824c913Q58n9M505L853m783m158L100K296K343L567j494o641J203O316J578L82
$$ y = [15097, 11192, 9800, 6692, 2920, 7811, 13867, 8959, 2333, 2404, 2797, 5039, 10300, 8823, 225, -514, 4421, 5318, 5732, 7860, 3950, -635, 2482, 5898, 4371, 5391, 5613, -231, -1983, 3543, 5565, 3298, 2579, -1162, -6111, -1909, 4588, 1179, -4491, -6075, -7505, -6962, -1323, -1918, -9688, -12291, -10079, -10024, -9113, -6096, -9946, -15697, -13788, -11160, -11338, -8763, -7824, -13769, -16236, -10719, -7298, -7454, -6225, -8855, -13485, -9165, -1126, -1088, -4071, -4211, -5883, -5141, 2550, 5736, 779, -728, 1136, 939, 3457, 8760, 6773, 1731, 2632, 4693, 4890, 7999, 9934, 4120, -452, 3546, 5877, 6390, 7468, 3772, -3145, -1466, 4567, 4722, 1822, 620, -3337, -5044, 389, 3276, -415, -3186, -3155, -5346, -3389, 2058, 1409, -3760, -3913, -3055, -3114, 1391, 5244, 461, -3697, -597, 1699, 4042, 7609, 6115, -526, 677, 6993, 8571, 8953]
840H953P30m137k677N966M325k070j424m40l007J018O625L12m598j104o37j099
856F736M409L557m465n382J157R41J124L757j006p187j440M269R72R02R00m420
872D824m615L822M335j128j49j190m846O27O182J476l210q63j907k193M192N488
888A0845k981m491M2j28R70M980J98o510k604K907Q03J829K059m598n473K221
904F9L693p55N82r55n610j966N545J664k064j071k726l715L448N352k142l775
920d426q88j851M25N567J562n545k431J527J38K682L642k151n949Q31L439P84
936b644K133P16n134k361M786L161n90N13k542l852K932N853j73k489n39k446
952b676n13N979K636l978k207M7p67K883M560j771n278l95K262N22L206J491n512
$$ y = [8953, 9683, 5546, 2869, 8835, 13160, 11090, 9666, 9226, 6219, 7237, 13862, 14174, 9576, 8472, 7835, 6736, 11145, 14702, 10237, 4855, 6012, 6953, 8077, 11834, 10828, 3641, 2201, 6470, 7442, 8344, 9244, 4824, 209, 4031, 8366, 7238, 7089, 5899, 1053, 1680, 7862, 9338, 6128, 5265, 3358, 1165, 5357, 10845, 7864, 3373, 3415, 3287, 4257, 9237, 9435, 2925, 321, 3228, 4031, 5860, 7919, 3321, -2152, 69, 3762, 3007, 3589, 2634, -2976, -4942, 603, 2267, 203, -868, -3594, -7309, -3861, 1491, -651, -4426, -5314, -7165, -6740, -1173, 389, -5156, -7587, -6060, -5922, -3240, 402, -1749, -7698, -6867, -3428, -2644, -511, 205, -4929, -7290, -2504, 657, 67, 580, -1962, -5814, -2882, 2971, 2798, 309, -230, -2676, -3189, 2790, 5426, 1448, -759, -712, -1479, 1404, 5964, 4193, -1085, -1480, 782, 1304, 4510, 6001, 489]
969D89l100L789K250J83J649k037n524J321N664P79j419m24l663j614N294L341
985F978k747j787o76j882K191N511j045m870p00Q68Q2L535K490n071l697K177
1001A357J935O60K909j865n718l06M596J097j20K02l935l145M165L973j741j350
1017B714j448l205J094N858L06m129j289n75p73L670L523l997l829P35O49J383
1033F87L732r50o125n51K870J334R80J047l696l986K967L568m32k51r94m050L25
1050c525N615J111k903q98j458k237M349M444k598l740j07J35O56M665O95n722
1066a518j453K729Q57J558K601l670m718K630L848K30O91m64m523j108N238J964
1082D892j578j96k253k360K708M978j602k905k5j473L00M764J402m576k103J038
$$ y = [489, -2611, 1178, 3428, 3611, 5260, 3223, -2301, -980, 4684, 5463, 4044, 3620, -43, -1657, 3637, 6978, 4231, 2444, 1768, -114, 2077, 7588, 6543, 1673, 973, 1841, 1923, 5458, 7948, 2877, -820, 1357, 3292, 3952, 6861, 4996, -722, -1028, 3568, 4665, 4545, 4747, 812, -2333, 1832, 5805, 4064, 2714, 1266, -1939, -845, 5013, 5319, 1190, -99, -674, -1447, 2223, 5746, 1749, -2080, -1345, -696, 687, 4419, 3469, -2656, -3207, -337, 997, 1977, 3024, -672, -4658, -1691, 1877, 1445, 1194, 200, -3850, -3525, 2090, 3201, 298, -600, -2058, -4295, 54, 4498, 1900, -1840, -1947, -1812, -1156, 3509, 4204, -1518, -2971, -242, 615, 2173, 4774, 1104, -3614, -984, 2864, 3094, 3785, 3321, -1202, -2310, 2928, 4892, 3314, 3118, 865, -1495, 1213, 6191, 4589, 1684, 1659, 186, 486, 5250, 6652, 2076, -27, 1011]
1098A011M73K013L498l105m747J031K454M18J834J46m941j572M023J752o80K94
1114C902k128l847K126M805m34k190l78k636n13M823K236l737k044m4m99J981
1130A423L897j582n259M76J781M49K466J373m731l001L376J566K95J574k260m302
1146b459J001M600Q9j087j92k877j526M241K883k580k032o79j526J695M593j010
1162C134m330m54M62l56K952J718l931k945J792J426p5K302j142n139L7L874L67
1179c08J49nl248k746M231L049j740j008j006k369J413M795j74l343j04n10l51
1196c275L182K704l144k763P73P37J022L482l84m762n47K806R55Q56J353l207
1212b12l322L238K861o87J17r90k929o2M589J120k697m14q18j851L061L628j996
$$ y = [1011, 1484, 3497, 6995, 3890, -857, 174, 2628, 3046, 4880, 5026, 85, -1487, 2536, 4288, 3608, 3902, 1774, -2073, 53, 4858, 4424, 2234, 1856, -780, -1293, 3530, 5766, 2029, -15, -59, -558, 1423, 5320, 3738, -1521, -1045, 736, 1185, 3651, 5024, 293, -2708, 668, 2234, 2529, 4103, 1843, -2459, -1458, 3142, 3231, 2144, 1952, -925, -2451, 1790, 4673, 2093, 61, -618, -2144, -449, 4144, 3134, -1196, -1650, -1188, -1544, 1408, 3126, -805, -3750, -1958, -532, -607, 1695, 553, -4586, -4549, -675, -308, -159, -164, -3412, -6158, -1927, 1122, -618, -1626, -2632, -5001, -3588, 1207, 1033, -2310, -2414, -2924, -3275, -93, 2611, -533, -3296, -2523, -1786, -764, 2718, 2334, -2428, -2975, -169, 786, 1642, 2995, -212, -3534, -296, 2565, 1878, 1995, 1005, -1924, -1986, 2603, 3723, 1026, 612, -206, -2057, 1004, 4632, 2636]
1229B636l364N42l14N47M107K16m524j068K240Q55J184K032l029l279K285L069
1245D135m61O04l2l676m40M286J196j492K27j387k463K230M112j597k088l41j622
1262A191K61L855J165m053j907O81Q5J428K464k813m035P82K030l16R20j00l961
1279b323j856L537J209r05L31j519l374J384L672n12j348j50j719j047M072J794
1295A246k603j437N47l51J564L860j757l524Q06J762r2K536R95l129j845K475
1311A053J522k1J180r21l542O64L911k66o44J70l059j393L519K719k528j375l09
1328F80j718J006L835j286l588N2O63o53K263J580l386k430J813P39j1K308o82
1345A185l834LK764L53M84P14k610k333L237K711j423m32m18k389R86M496m07
$$ y = [2636, -728, -186, -500, 47, 4154, 4370, -154, -1222, 1018, 1873, 3057, 5089, 2060, -1219, 1066, 4135, 3674, 4278, 4246, 570, 130, 4416, 5612, 4120, 4347, 2960, 497, 2727, 6839, 5242, 3154, 2813, 1191, 1452, 5307, 6472, 2419, 512, 1193, 1278, 2706, 5170, 2357, -1678, -896, 1134, 818, 1738, 1638, -2323, -4179, -642, 567, -338, -7, -1526, -4900, -3516, 156, -356, -1704, -1854, -3573, -4620, -548, 1246, -1357, -2794, -2247, -2598, -1034, 2826, 1069, -2455, -1649, 113, 21, 2557, 3552, 423, -1422, 1053, 2575, 2554, 3734, 2813, -729, -65, 3846, 3580, 2936, 3106, 47, -1346, 2173, 4892, 2364, 989, 680, -1038, -32, 3803, 2517, -1071, -1019, -356, -1009, 1254, 2834, -552, -2982, -1169, -430, -441, 1867, 1185, -2649, -2646, 118, 471, 955, 1669, -941, -3274, -37, 2674, 1251, 819, 401, -1988, -1002, 3494, 3087]
1362C087l148K08O8j118K321K482k623k420R39o6j19K704m03m039l80J882q3Q41
1380A33J065k758l024K159K594q98j39l25k725pL998J61k059J61m07j611K725
1397i57K555j592j637O89j94P3L503R19l288q15J697J16J443K164j916l467J977
1414A270K294q4O51m22k819l07L369N35j397J30q72k187J528K954j390j871M96
1431A878j692j018K912J139k908j209N92q62J105K383k118l210Q18J556k33Q93
1447B6N88k945j174K790N33l95P82r07k530J380K758l44p64K70j811r77L550J767
1465B597k194j113L62r58J263K939r74l367P89Q81l38J538J208k962j526J981
1481A26L41n94J509n82l129M92K798j28n50P17k139j619K752J643j372n01K4j575
$$ y = [3087, -61, 147, 215, -903, 1418, 3900, 1277, -1143, -204, -270, -389, 2315, 1912, -2127, -2507, -625, -708, 133, 1198, -1560, -4584, -2425, 169, -729, -868, -1193, -3918, -3925, 73, 234, -1825, -1664, -2071, -3682, -957, 1598, 6, -1631, -942, -1136, -1063, 2440, 3359, 71, -744, 953, 1069, 2512, 4676, 2760, -707, 1270, 3564, 3480, 4131, 3709, 890, 583, 3952, 4487, 3090, 3220, 2348, 161, 1689, 4643, 3253, 1382, 1878, 186, -832, 2080, 3219, 311, -898, -306, -1168, -63, 2320, 202, -3008, -2190, -634, -867, 26, 614, -2331, -3505, -715, -182, -577, 205, -702, -3232, -1852, 906, 562, -202, 68, -1743, -2720, 830, 2597, 403, -710, -348, -1306, -43, 2896, 1922, -1445, -656, 225, -113, 1425, 2633, -329, -1855, 126, 467, -127, 1382, 800, -2329, -1837, 961, 833, 283, 1000, -1139, -2758, -6, 1637, 265, -236, -212, -1787]
1499a787M00L496k18k684K21N37p92K157J911k422j399J083O56j58J623R4l222
1516e04L52K412m84R6J436k233k220K445J767q37m40j20k354M78K551O6k127J41
1534D25k93j087J741J718k326j243Q78m07m68K360K69l226j85J299q0M97J485
1551A357j772k500J624K088p52K11j28k179k26L004N78j494Q6l93j729K023K380
1568B178j717j201M99l54l94K399O35k504p01J203o39Q82K103j848k743J415J737
1585I50p82J056J78k390j156L034N30j337N23o83j962J211K384j044p91P31j381
1602i29p26K727R93k336m40M93o74P05K576j068k671O02J108l20J200R10k894
1619g44p30K042P63o51N40l82k385Q25K429n78m52M32j455j102K113J418j530
$$ y = [-1787, -1387, 2109, 1891, -793, -572, -35, -827, 1330, 3241, 819, -580, 503, 1159, 1001, 2624, 2718, -504, -152, 2260, 1776, 1872, 3308, 1075, -1145, 1300, 3067, 2230, 1790, 1670, -684, -206, 2345, 2411, 284, 425, 132, -955, 786, 2504, 178, -1065, -187, -594, -1062, 1298, 1567, -1659, -1844, -545, -625, -128, 1357, -415, -2915, -1291, 797, 45, 256, 128, -2051, -2277, 727, 1305, -189, -103, -496, -2225, -202, 2178, 461, -740, -241, -595, -989, 1410, 2045, -459, -1160, 43, -596, 286, 2389, 541, -2202, -787, 950, 168, 1224, 1402, -988, -2144, 890, 1420, 83, 606, -77, -2039, -828, 1556, 512, -279, 452, -929, -1655, 1072, 2065, -271, -711, -218, -892, -187, 2389, 1321, -1350, -748, 360, 40, 1240, 2150, -744, -1474, 568, 1331, 680, 1220, 838, -1547, -722, 1707, 1129, 677, 1109, -346, -1448, 665, 2083, 553]
1636E53p35N86j594R44K509r48k392N27N79j036K046R09k224j262J703O9j68J324
1654A390n08k628K03K494o23j12P48j433j952K705J381j451NJ21j845P9K826J4
1672A414k576N80P7q92J839J139j885j147J067l74Q0J881k38k514K23J370j66
1689a22K35J549j729k206J958J072n98L73K02k137l39L103J5j350J97n09j326
1706a612K184J597j312j684J101m34m84K469P1k640k8J301l98L80K173j960k526
1723a802J598J464o75N10O01k481n87K405M74j109M88n69j746J467K099j190j049
1740a02L72p69l24K392P64k124o63P31q11Q90J630q89k519J157R81o65J026M83
1758A560k372q51K246M27o45N31n61j876Q79J923m55q05O61j209r15K304R02j875
$$ y = [553, -182, 404, -1190, -246, 2263, 1315, -1077, -550, 29, -1007, 1039, 1948, -276, -1538, 165, 234, 66, 1390, 882, -1746, -1543, 951, 328, 216, 964, -469, -2421, 284, 1665, 214, 219, 340, -1505, -1426, 1400, 1414, -1162, -582, -505, -1397, 442, 1581, -304, -1451, -384, -758, -678, 1203, 965, -1549, -1326, 44, -122, 113, 1662, -67, -2273, -315, 757, 159, 532, 734, -1403, -1742, 1361, 1376, 26, 223, -286, -1612, 572, 2169, 857, -827, 274, -160, -644, 1825, 1896, -744, -772, 529, 131, 511, 2684, 724, -1802, -204, 1260, 585, 1095, 1696, -785, -1372, 1033, 1507, 398, 886, 317, -1429, 38, 2137, 947, -102, 270, -499, -823, 1569, 2333, 209, -454, 277, -534, 356, 1986, 1097, -1422, -265, 716, 51, 1077, 1560, -812, -1663, 583, 1010, 365, 896, 335, -1541, -662, 1261, 806, 1, 662, -547, -1462, 842, 1744, -131]
1776a31m72O42j053N15K009n80k118K75R06q12J679Q17k488j043K012l1p2Q95
1794I50n71k665J030K218m07p30P38j263j254K306J226j394o17K3r49K25K390
1811A256l01j846J24L31m26J469J015j897j362J236rK27J511o46k653O58J622
1828C09k04J52P23j389j792K151J292j223K87k65j555K83K687j77j534k6L7p06
1846i50J390J386j717j383R43rk13J749mk530J96J572l00l0J408j507j695J537
1864a57R86n41J60J63j903J29K112K76j090L39n09j334J213J996r96j313K07j61
1882d23m10K221K29j844q51J132k59N11J438j077k051Q49J124l66N79L00k117
1899a015q2K154O0n05J11o09j531J212J843o71j143O15j081l1J909O32j844o24
$$ y = [-131, -603, 39, -1014, -499, 1510, 930, -1188, -913, -7, -819, 860, 1677, -811, -1854, 158, 127, 55, 950, 379, -2286, -1256, 962, 555, -175, 563, -700, -1954, 352, 1578, 184, -433, -410, -1359, -1134, 1256, 955, -891, -767, -436, -862, 607, 1622, -275, -1637, -401, -410, -183, 1328, 682, -1971, -1313, 309, 105, 257, 980, -409, -2201, -50, 1242, 19, 306, 41, -1514, -1231, 1456, 1279, -255, -281, -244, -950, 440, 1826, 109, -1274, -331, -340, -553, 1196, 1192, -1338, -1142, 430, 130, 100, 1508, 1, -1694, -157, 829, 288, 448, 611, -1292, -1163, 949, 1225, 135, 474, -35, -1369, -156, 1840, 844, -469, -262, -423, -833, 1388, 1617, -227, -1078, 54, -205, 306, 1744, 667, -1384, -535, 589, 223, 802, 1102, -1015, -1097, 1057, 1117, 612, 723, 114, -1417, -205, 1638, 967, -176, 439, -642, -673, 1236, 1868, 24, -600]
1917f00M96p76J069J445p88j823J27P45n0R59O85k328p64J790L69j63L72m37j850
1936a522N27K052m24r39M34j203j33J655R46j398n17J51r61R07J867o49j771L62
1954f16P0k50J307J228k322p57J204L90j11J233p61j857N33J450m26M9L17j365
1972f84p44J345J149r62j52j0j212L94K080q7j389J39k70n88J453J067j547r50
1990i68O55K23n3J617o03j822L28J191m05J25Q76j314j236J685R84m03k11N6j751
2009a026N03J928Q9j228q9j98r02J334J368r88j369M02l10K08J732j00k405K01
2027h50P65j08L90J016j296j517P41J349p08O40m51j485j9J571P20j098P2q43
2045a111r80J665J504j059r85N18n64J97J507K18k034L9J020p24P14J147p57j695
$$ y = [-600, -104, -880, 189, 1634, 846, -977, -850, -105, -155, 804, 1489, -839, -1603, 187, 556, 393, 765, 328, -1522, -995, 1057, 633, -306, 128, -1075, -1208, 447, 1393, -5, -522, -371, -1332, -425, 1442, 793, -978, -616, -546, -796, 511, 1739, -583, -1340, -136, 254, 143, 1376, 615, -1242, -709, 741, 315, 364, 681, -684, -1428, -83, 1066, 104, -48, -58, -1270, -876, 1204, 1117, -272, -133, -403, -991, 462, 1529, -18, -968, -313, -90, -143, 1474, 871, -951, -623, 568, 163, 288, 1164, -150, -1386, 299, 1283, 880, 669, 725, -1026, -523, 1405, 1494, 266, 177, -21, -923, 411, 1779, 791, -578, -176, -486, -278, 1454, 1354, -1051, -850, -85, -193, 197, 1213, -83, -1600, -859, 490, -218, 422, -29, -1514, -1533, 38, 758, -340, -268, -1111, -2091, -426, 1078, 19, -966, -448, -1012, -815, 692, 910, -1124, -1085, -65, -789, -75, 1072, 315, -1380]
2063a380O85Q32k59R54K88k100m81K006L54n03L91j121j058J344J681r71r39J82
2081i5n00j12J452O77j613n80Q48p26L09J790q69j507K58L70j0R88N63j671q08
2100a236J597K58K04J51p90j348J069J272k34q62L92o55m07J476R47j485O9J39
2118E57r31M97J601m43j672J52J31k95J520O57j973p52P96O38M1L28n70j963P13
2137i68J473n23N2J95r79n37J426M11o93j79O51j675J10K011N2j154j05m37j84
2156a053J609J041j550j492J006L77J67Q78k31j914M13J203k59L32J96m98j333
2173a108J255O72n35J83J3j289k41J860L52j037R2q27p76J866J135r72j789N72
2191e74L25J5J240o52j431L42R04n16l5J192o96j299P35Q49p83J075m02j534k70
$$ y = [-1380, -695, 137, -122, 832, 1120, -980, -1461, 545, 899, 396, 787, -334, -1392, -48, 1633, 662, -277, -95, -595, -707, 745, 1422, -191, -771, 77, -649, -340, 1450, 581, -926, -668, -298, -308, 680, 1243, -428, -1236, 361, 619, 823, 974, 184, -1164, -95, 1177, 943, 81, 473, -182, -589, 887, 1834, 349, 418, 557, -374, 123, 1724, 1281, -391, -239, -108, -403, 1117, 1774, -199, -951, -155, 483, 524, 852, 282, -1681, -968, 505, -18, 34, 229, -750, -1287, 139, 550, -143, -322, 329, -1346, -1236, 775, 827, -327, -432, -869, -1053, 556, 1597, 47, -1445, -439, -62, 105, 983, 752, -1162, -749, 454, 195, 527, 723, 225, -1108, 147, 819, 284, 467, 480, -809, -1050, 810, 1162, 125, 217, -610, -1386, 480, 1615, 643, -1146, -574, -249, -234, 1006, 354, -1077, -735, 169, -347, -382, 810, 114, -1185, -450, 399, -384, 691, 289, -1245, -1515]
2210a515J681L89l16O6n88j438J408K141j489r30M01j47n1J443R5j992N07L99
2228F4k81L26J099o06j350M36M03m21J060J7j603o21J258P42l89O58j157j301
2246a666J134J734q55n88k63J1k57J418j74j257K45O59k42k77J241l12j187O29
2264gj36l66J358O00j644r33Q75O78J75O49j206j631J307J454k12p53k81m09k00
2283f82J445N29j532L26N00j063L26J219n14n51K82m53q16J364J503j708j051
2300h76O21M44O19M67r82j542N45J665k88p12J43l45m71J316L32j161rM63p23
2319d94k71J062L22o59K01o30q00J716J268j686j054r2N15O13J053p79j992N58
2337a149J785m27l39K60l99r26J289j41n60O36L39j273n38J600M35m95J43p30
$$ y = [-1515, 166, 555, 239, 305, -283, -1721, -313, 1828, 339, -591, -190, -337, -388, 1055, 1150, -842, -335, 64, -217, 109, 1208, 602, -748, -312, 91, -330, 730, 747, -856, -1477, -219, 523, 134, 792, -365, -1666, -532, 1202, 347, -241, -504, -493, -750, 668, 494, -763, -518, 141, -101, -378, 863, 551, -636, -7, -143, -509, 849, 1449, -195, -1128, -253, 425, 600, 1249, 43, -1588, -281, 1173, 961, 208, -73, -482, -682, 763, 1292, -240, 86, 586, -477, -151, 1068, 554, 3, 285, -168, -984, 380, 1883, 175, -876, -255, 189, 808, 1275, 293, -1249, -704, 961, 673, -39, 104, -241, -712, 604, 936, -225, -234, 229, -494, -765, 297, 619, -40, 161, -469, -1269, 447, 1715, 29, -1025, -1117, -602, 11, 1064, 285, -1707, -1149, 636, 209, -130, 130, -269, -1195, 94, -47, -607, 29, 368, -905, -1443, 157, 592, 97, 240, -490]
2355d90j341J766J415r43j478M30k99Q43J150l83k010L51J106J07r6J16o92m46
2373h94J099J48r58J042K34j128r17J522k8J36O34j391j077J297K115j063j000
2390b29j92l53Q72J269k8k074J75J197k11l65Q30o45m42O91k19n27Q23R32j400
2409A04q46Q30L47M13M57j068j740Q60K150o03p99k28m41n0J685r6j879L97Q76
2428C69o98L5O98l69j71L23l79o82O10J444j294q32J93M68O09P79j114j259O14
2447f56J737j41r08k68n66L41J688m93j455J03Q86j69l08R15q7o79P58o28p60
2466f90P24J173p15r19m6J98R09J088j023j990L83K084k03o02l26p68J0J505J43
2485I35j522R1R06m05n57L33K23o1O00p58j179J075J110n04j195jp6Q02J318p31
$$ y = [-490, -1831, -65, 1350, 407, -1071, -641, -940, -97, 1053, 670, -1340, -989, 117, 224, 128, 244, -448, -894, 205, 353, -605, 437, 671, -457, -1374, 148, 120, 256, 890, -501, -1578, -281, 1834, 771, -229, -421, -774, 98, 1367, 1339, -735, -560, 637, 426, 61, 891, 246, -196, 495, 276, -251, 572, 1504, 104, -742, 88, 435, 848, 1305, 237, -1503, -643, 1507, 904, 105, -123, -564, -614, 1071, 975, -904, -507, 369, -329, -294, 404, 35, -136, 187, -192, -874, -264, 1180, -114, -946, -753, -285, 324, 1103, -11, -1270, -656, 1081, 940, 32, -236, -802, -461, 1227, 734, -721, -618, 268, 99, -209, 706, 619, -60, 698, 70, -690, 34, 1207, 492, -427, -473, -275, 634, 1722, 699, -1291, -908, 1176, 973, 371, 45, -723, -713, 792, 935, -587, -496, 410, 5, -552, -219, 4, -57, 543, -215, -1394, -319, 791, 287, -908, -909, -985, -183, 1135, 404]
2505D04k069M67J264n2O5l16p04j82J426J4j055J02R11o41l88K72L54J12O46p05
2525g5j154N30J995m85r22k80l36N16J749n32j606j90J202L86n68N33j074l72
2543f83J545l48j193N58Q38p29l58K49j62O07N26p27j554N09J691K20j116l88
2561e15j156R27J792k94j845K15Q61K27l35L51p35n8J109Qj403N59J004m57q74
2580f19M79r9M72R94q75j609L71J831j92j76p60p57K96J522M88k058n24J365m92
2599c43L81K54o05m0M99k02p98O99R07o03p58J29k39O21J546q43j860J75J608
2618E28N10m34m67o41k30J988K67j182n06J029j55J32M83m14k63J190k33j041
$$ y = [404, -1665, -1198, 66, 14, 79, -237, -941, -1123, 303, 317, -738, -636, 275, -366, -754, -482, -128, -16, 630, -75, -1229, -699, 1296, 811, -111, -391, -727, -211, 1538, 1006, -600, -790, 412, 798, 230, 763, -311, -683, 862, 514, -679, -121, 717, -12, -370, -121, -283, 324, 850, 123, -1431, -922, 769, 989, -127, -515, -1671, -744, 1048, 754, -1091, -876, -15, 212, -123, 228, -507, -565, 544, 552, -851, -292, 712, 255, -619, -140, -239, 233, 1227, 352, -1257, -886, 945, 753, 577, -183, -940, -644, 878, 1366, -692, -1216, 149, -343, 38, 292, -313, -353, 146, -56, -854, -155, 752, 149, -609, -480, -719, -98, 1448, 605, -1255, -1080, 528, 1038, 604, 137, -504, -734, 1254, 1521, 339, -167, 862, 707, 839, 1322, 908, 645, 1835, 1602, 561]
$$ [...]
8191C45
##END NTUPLES=NMR FID
##END=
