##TITLE=1H_CG-1131-1
 CDCl3, 8 sc, 
 4.3.2020
##JCAMPDX= 6.0         $$ Bruker NMR JCAMP-DX V2.0
##DATA TYPE= NMR FID
##DATA CLASS= NTUPLES
##ORIGIN= UXNMR, Bruker Analytische Messtechnik GmbH
##OWNER= root
$$ XWIN-NMR		Version 3.5
$$ Wed Mar  4 14:16:05 2020 Russian Standard Time (UT+4h)  she@DPX200
##.OBSERVE FREQUENCY= 200.1315
##.OBSERVE NUCLEUS= ^1H
##.DELAY= (6, 6)
##.ACQUISITION MODE= SIMULTANEOUS
##.ACQUISITION SCHEME= undefined
##.AVERAGES= 8
##.DIGITISER RES= 18
##SPECTROMETER/DATA SYSTEM= spect
##.PULSE SEQUENCE= zg30
##.SOLVENT NAME= DMSO
##.SHIFT REFERENCE= (INTERNAL, DMSO, 0, 15.7039)
##AUDIT TRAIL= $$ (NUMBER, WHEN, WHO, WHERE, WHAT)
$$ ##TITLE= Audit trail, XWIN-NMR		Version 3.5
$$ ##JCAMPDX= 5.01
$$ ##ORIGIN= Bruker BioSpin GmbH
$$ ##OWNER= she
$$ F:/spectra/data/she/nmr/H-F/1/audita.txt
$$ ##AUDIT TRAIL=  $$ (NUMBER, WHEN, WHO, WHERE, WHAT)
(   1,<2020-03-04 14:15:01.92 +0400>,<she>,<DPX200>,
      <created by zg, POWCHK disabled, PULCHK disabled
       configuration hash MD5:
       00 E9 B6 7A A2 85 ED C7 34 08 36 98 17 FE 4E 26
       data hash MD5: 16K
       6A 89 BF 3B 6F D3 DD 8E B2 5F 1B 9A 13 49 47 F6>)
$$ ##END=
$$ 
$$ hash MD5
$$ F3 9B 95 69 71 29 3B 56 53 3C 50 97 6C 16 C7 F8
##$RELAX= 
##$RELAX= 
##$RELAX= 
##$RELAX= 
##$RELAX= 
##$RELAX= 
$$ Bruker specific parameters
$$ --------------------------
##$DU= <F:/spectra>
##$EXPNO= 1
##$NAME= <H-F>
##$PROCNO= 1
##$TYPE= <nmr>
##$USER= <she>
##$AMP= (0..31)
100 100 100 100 100 100 100 100 100 100 100 100 100 100 100 100 100 100 
100 100 100 100 100 100 100 100 100 100 100 100 100 100 
##$AQSEQ= 0
##$AQ_mod= 1
##$AUNM= <au_zg>
##$AUTOPOS= <>
##$BF1= 200.13
##$BF2= 200.13
##$BF3= 200.13
##$BF4= 200.13
##$BF5= 200.13
##$BF6= 200.13
##$BF7= 200.13
##$BF8= 200.13
##$BYTORDA= 1
##$CFDGTYP= 0
##$CFRGTYP= 5
##$CHEMSTR= <none>
##$CNST= (0..31)
1 1 145 1 1 1 1 1 1 1 1 1 1 1 1 1 1 1 1 1 1 1 1 1 1 1 1 1 1 1 1 1 
##$CPDPRG= <>
##$CPDPRG1= <>
##$CPDPRG2= <>
##$CPDPRG3= <>
##$CPDPRG4= <mlev>
##$CPDPRG5= <mlev>
##$CPDPRG6= <mlev>
##$CPDPRG7= <mlev>
##$CPDPRG8= <mlev>
##$CPDPRGB= <>
##$CPDPRGT= <>
##$D= (0..31)
0 1.2 0 0 0 0 0 0 0 0.06 0 0.03 0 0 0 0 0.0002 0 0 0 0 0 0 0 0 0 0 0 0 
0 0 0 
##$DATE= 1583316901
##$DBL= (0..7)
120 120 120 120 120 120 120 120 
##$DBP= (0..7)
150 150 150 150 150 150 150 150 
##$DBP07= 0
##$DBPNAM0= <>
##$DBPNAM1= <>
##$DBPNAM2= <>
##$DBPNAM3= <>
##$DBPNAM4= <>
##$DBPNAM5= <>
##$DBPNAM6= <>
##$DBPNAM7= <>
##$DBPOAL= (0..7)
0.5 0.5 0.5 0.5 0.5 0.5 0.5 0.5 
##$DBPOFFS= (0..7)
0 0 0 0 0 0 0 0 
##$DE= 6
##$DECBNUC= <off>
##$DECIM= 24
##$DECNUC= <off>
##$DECSTAT= 4
##$DIGMOD= 1
##$DIGTYP= 9
##$DL= (0..7)
0 120 120 120 120 120 120 120 
##$DP= (0..7)
150 150 150 150 150 150 150 150 
##$DP07= 0
##$DPNAME0= <>
##$DPNAME1= <>
##$DPNAME2= <>
##$DPNAME3= <>
##$DPNAME4= <>
##$DPNAME5= <>
##$DPNAME6= <>
##$DPNAME7= <>
##$DPOAL= (0..7)
0.5 0.5 0.5 0.5 0.5 0.5 0.5 0.5 
##$DPOFFS= (0..7)
0 0 0 0 0 0 0 0 
##$DQDMODE= 0
##$DR= 18
##$DS= 0
##$DSLIST= <SSSSSSSSSSSSSSS>
$$ [...]
##$SUBNAM2= <"">
##$SUBNAM3= <"">
##$SUBNAM4= <"">
##$SUBNAM5= <"">
##$SUBNAM6= <"">
##$SUBNAM7= <"">
##$SUBNAM8= <"">
##$SUBNAM9= <"">
##$SW= 24.9337058887773
##$SWIBOX= (0..15)
0 0 2 0 0 0 0 0 0 0 0 0 0 0 0 0 
##$SW_h= 4990.01996007984
##$TD= 16384
##$TD0= 1
##$TE= 0
##$TE2= 300
##$TE3= 300
##$TEG= 300
##$TL= (0..7)
0 120 120 120 120 120 120 120 
##$TP= (0..7)
150 150 150 150 150 150 150 150 
##$TP07= 0
##$TPNAME0= <>
##$TPNAME1= <>
##$TPNAME2= <>
##$TPNAME3= <>
##$TPNAME4= <>
##$TPNAME5= <>
##$TPNAME6= <>
##$TPNAME7= <>
##$TPOAL= (0..7)
0.5 0.5 0.5 0.5 0.5 0.5 0.5 0.5 
##$TPOFFS= (0..7)
0 0 0 0 0 0 0 0 
##$TUNHIN= 0
##$TUNHOUT= 0
##$TUNXOUT= 0
##$USERA1= <user>
##$USERA2= <user>
##$USERA3= <user>
##$USERA4= <user>
##$USERA5= <user>
##$V9= 5
##$VALIST= <valist>
##$VCLIST= <CCCCCCCCCCCCCCC>
##$VD= 0
##$VDLIST= <DDDDDDDDDDDDDDD>
##$VPLIST= <PPPPPPPPPPPPPPP>
##$VTLIST= <TTTTTTTTTTTTTTT>
##$WBST= 1024
##$WBSW= 4
##$XGAIN= (0..3)
0 0 0 0 
##$XL= 0
##$YL= 0
##$YMAX_a= 113652
##$YMIN_a= -43461
##$ZGOPTNS= <>
##$ZL1= 120
##$ZL2= 120
##$ZL3= 120
##$ZL4= 120
##$ABSF1= 10
##$ABSF2= 0
##$ABSG= 5
##$ABSL= 3
##$ALPHA= 0
##$AQORDER= 0
##$ASSFAC= 0
##$ASSFACI= 0
##$ASSFACX= 0
##$ASSWID= 0
##$AUNMP= <proc_1d>
##$AZFE= 0.1
##$AZFW= 0.1
##$BCFW= 1
##$BC_mod= 2
##$BYTORDP= 1
##$COROFFS= 0
##$CY= 11.3945322036743
##$DATMOD= 1
##$DC= 2
##$DFILT= <>
##$DTYPP= 0
##$F1P= 16.9975609425685
##$F2P= -3.02152046262296
##$FCOR= 0.5
##$FTSIZE= 0
##$FT_mod= 4
##$GAMMA= 1
##$GB= 0.15
##$INTBC= 1
##$INTSCL= 1
##$ISEN= 128
##$LB= 0.24
##$LEV0= 0
##$LPBIN= 0
##$MAXI= 10000
##$MC2= 0
##$MEAN= 0
##$ME_mod= 0
##$MI= 1.114404
##$NCOEF= 0
##$NC_proc= 0
##$NLEV= 6
##$NOISF1= 3.799351
##$NOISF2= 2.8
##$NSP= 1
##$NTH_PI= 0
##$NZP= 0
##$OFFSET= 15.70392
##$PC= 1
##$PHC0= -9788.276
##$PHC1= 17.20082
##$PH_mod= 1
##$PKNL= yes
##$PPARMOD= 0
##$PSCAL= 0
##$PSIGN= 0
##$REVERSE= no
##$SF= 200.130013532006
##$SI= 16384
##$SIGF1= 3
##$SIGF2= 2
##$SINO= 400
##$SIOLD= 16384
##$SREGLST= <1H.CDCl3>
##$SSB= 0
##$STSI= 0
##$STSR= 0
##$SW_p= 3612.71676300578
##$SYMM= 0
##$S_DEV= 0
##$TDeff= 0
##$TDoff= 0
##$TI= <>
##$TILT= no
##$TM1= 0
##$TM2= 0
##$TOPLEV= 0
##$USERP1= <user>
##$USERP2= <user>
##$USERP3= <user>
##$USERP4= <user>
##$USERP5= <user>
##$WDW= 1
##$XDIM= 8192
##$YMAX_p= 0
##$YMIN_p= 0
$$ End of Bruker specific parameters
$$ ---------------------------------
##NTUPLES= NMR FID
##VAR_NAME=  TIME,          FID/REAL,        FID/IMAG
##SYMBOL=    X,             R,               I
##VAR_TYPE=  INDEPENDENT,   DEPENDENT,       DEPENDENT
##VAR_FORM=  AFFN,          ASDF,            ASDF
##VAR_DIM=   8192,          8192,            8192
##UNITS=     SECONDS,       ARBITRARY UNITS, ARBITRARY UNITS
##FACTOR=    0.0002004,     1,               1
##FIRST=     0,             0,               0
##LAST=      1.6414764,     0,               0
##MIN=       0,             -43461,          0
##MAX=       1.6414764,     113652,          0
$$ Real data points
##PAGE= N=1
##DATA TABLE= (X++(R..R)), XYDATA
0 0 0 0 0 0 0 0 0 0 0 0 -2 8 -8 8 -8 8 -16 16 -16 24 -24 29 -33 40 -45 52 -59 67 -77 86 -99 110 -122 136
34 136 -153 170 -191 211 -236 260 -288 320 -353 392 -434 481 -535 595 -664 745 -839 952 -1089
53 -1089 1262 -1485 1790 -2228 2920 -4187 7331 -36618 -26212 -2148 -24343 1265 -3157 -31837
67 -31837 -30471 -9492 -30019 -34670 -18624 -28734 -43461 -18520 -11021 -23043 -1920 22433 3251
80 3251 271 20975 3369 -25647 -11108 -7278 -29720 -17635 8926 -2397 -2927 21896 14725
93 14725 -4172 13280 17480 -7717 -4193 9618 -14068 -26565 -3846 -4107 -16286 5558 18294
106 18294 51 3235 15414 -4331 -14487 1491 -9861 -29418 -12240 -4241 -24986 -14800
118 -14800 10337 -4315 -14898 7656 5069 -19031 -10479 -1017 -21754 -23787 -7101 -17415 -23788
131 -23788 -3145 -2869 -15127 2309 11127 -10375 -9104 6547 -12203 -26277 -5409 -3664 -21394
144 -21394 -6240 9612 -6792 -7206 11101 1941 -8676 8041 8278 -11092 -3366 5018 -14624
157 -14624 -15116 6618 1738 -6459 13465 16183 -3553 1305 10083 -7247 -9467 7946 -374 -11823
171 -11823 3441 4332 -14130 -3837 12367 -1882 -4494 14350 5011 -14584 -3387 -186 -17776
184 -17776 -12108 3606 -6494 -9322 5635 -306 -12771 -199 2292 -13906 -6338 5948 -10622
197 -10622 -16461 303 -5765 -20010 -3598 6797 -7503 -3672 10396 -2460 -12151 1657 -1376
210 -1376 -12988 -693 6460 -8148 -4487 9666 -1584 -6682 11159 9528 -4881 5783 12338
223 12338 -3911 -3234 10768 1510 -4893 11186 11155 -1644 9249 17609 2049 2425 16729 6228
237 6228 -3378 11390 11645 -2841 4767 14592 2397 1891 16065 8880 514 12063 10860 -3397
251 -3397 4681 12353 -2174 -2687 11903 4017 -6157 8207 11134 -3254 1812 11601 -1504 -5504
265 -5504 7270 1772 -7822 3204 5318 -7683 -1897 7625 -3368 -5427 7814 1996 -9010 1762
279 1762 4537 -9528 -5190 5751 -4478 -7863 5279 1822 -8529 1913 5947 -7079 -3826
292 -3826 6748 -3476 -8277 4660 1321 -9567 81 6271 -6022 -2962 8540 -498 -6193 5150
306 5150 2372 -8271 727 6043 -6130 -2868 7954 -1321 -6937 6404 5068 -6434 1671 8315
320 8315 -4327 -4555 6908 -416 -6505 4415 4427 -5504 1669 7602 -3247 -2751 8409 862 -6353
335 -6353 5416 5049 -6631 380 8025 -2925 -4005 7845 2665 -4965 5320 5923 -4671 378
349 378 7409 -2358 -3349 7689 2084 -5199 4954 6752 -4789 403 8847 -279 -3046 7183 2859
364 2859 -5330 3797 6035 -4133 253 8354 -828 -3104 7318 3542 -5288 3690 6910 -4254
378 -4254 -1316 7619 -474 -4316 5878 3362 -5185 2609 6308 -3477 -828 7357 -1205 -5049 5272
393 5272 2506 -6220 2024 6772 -4472 -2392 6684 -565 -5315 4788 3452 -5675 993 4842 -4539
408 -4539 -3146 5862 -1207 -5503 4814 3140 -5848 568 5944 -3943 -3564 5576 -405 -5686 3360
423 3360 3449 -5115 514 5611 -3008 -2962 6263 757 -4957 4044 4049 -5148 39 5968 -2251 -2768 6245
440 6245 1599 -4621 3580 4887 -3708 830 6621 -1489 -2254 6212 1783 -4290 4453 5607 -3164
455 -3164 912 7777 119 -2198 6747 3577 -3118 4034 6458 -1680 1749 7508 570 -1562 7374
470 7374 3970 -1956 5250 7583 -1581 1197 8133 1005 -1695 7442 5638 -1474 4935 7488 -986
485 -986 1006 8150 2055 -670 7725 5424 -2058 4128 7052 -1183 810 8449 2764 -1106 7065
500 7065 5627 -2054 3100 6489 -916 501 7787 2339 -1657 5821 4678 -2802 2161 6851 -818
515 -818 -593 7078 1758 -3595 3777 3467 -3252 1329 5595 -1373 -1641 4858 -113 -4620 2600 2812
531 2812 -4399 -199 4296 -3441 -4311 2975 -1032 -6226 1032 1902 -6058 -2542 2221 -4504 -5597 1307
547 1307 -2079 -7089 -618 164 -7284 -3854 1226 -5231 -6973 138 -2727 -8066 -2138 -327 -7271
562 -7271 -4733 693 -5370 -7149 -145 -2896 -8263 -1905 126 -6833 -4657 1381 -4951 -7107 -76
577 -76 -993 -6639 -1227 1628 -5275 -3962 1426 -3437 -5045 2380 969 -4647 -160 2505 -5032 -2888
593 -2888 3166 -1246 -3539 3577 2332 -4555 -299 2726 -3556 -2043 4422 398 -2957 3045 1668
608 1668 -5008 -883 2884 -2977 -1632 4549 -30 -4049 1196 573 -5805 -1041 3040 -2324 -2307 3107
624 3107 -1517 -6164 -428 -158 -5715 -1332 3050 -3185 -4531 688 -2962 -7024 -960 576 -4831
639 -4831 -2256 1733 -4450 -5297 416 -2768 -6091 144 1097 -5139 -2074 1771 -4219 -5250 1349 -585
655 -585 -5015 691 1934 -4496 -2569 1958 -2745 -3522 2575 542 -4099 967 2369 -3682 -1547 3083
671 3083 -1431 -3208 2499 810 -3973 385 2890 -3096 -1233 3289 -1418 -3566 2221 966 -4113
686 -4113 388 2455 -3433 -2596 2457 -1832 -4163 1569 1057 -4458 -1018 1030 -4061 -3320 1490 -1692
702 -1692 -3912 1174 389 -4884 -1503 968 -4525 -3230 2715 -455 -3766 1129 667 -4710 -1432 2523
718 2523 -1956 -1650 3871 789 -2877 1837 1977 -2469 1007 4942 571 398 5292 1767 -1634 3453
734 3453 4693 6 3310 7289 2043 971 5522 3274 134 5313 6793 2187 4007 7602 2654
749 2654 1005 6015 4593 1276 6017 7115 1501 2854 6192 1635 731 6315 4178 483 4502
764 4502 5283 -314 956 4683 955 -505 4388 3126 -1632 1592 3125 -1720 -733 3538 -42 -2093
780 -2093 2437 1139 -3388 165 1880 -2802 -1672 3150 -1101 -3124 1480 272 -4231 -539 2143
795 2143 -2826 -2472 2511 -973 -3479 980 601 -3463 -601 2273 -2372 -1737 2530 -550 -3181 1455
811 1455 1161 -3186 297 2592 -1783 -1450 2856 251 -2420 2063 1877 -2741 -20 3038 -1212 -1492
827 -1492 3027 573 -2698 1649 2013 -2557 -471 2912 -970 -1605 2367 0 -2626 1264 1855 -2748
843 -2748 -465 2898 -1660 -2340 2139 78 -3273 888 2015 -2445 -880 2426 -1158 -2545 1765
858 1765 702 -2603 1017 2297 -2058 -887 2701 -749 -1504 2657 1310 -1901 1640 2722 -1381
873 -1381 58 3444 459 -991 3294 1988 -1240 1834 3730 -442 646 4336 1322 -553 3627
888 3627 3212 -818 2111 4078 469 915 4265 1540 -444 3467 2867 -781 2026 4205 -112 586
904 586 4359 1291 -1289 3194 2476 -1373 1285 3901 -307 -767 3350 657 -1997 2003 1968 -1591
920 -1591 453 2532 -1224 -1193 2109 185 -2460 1414 1530 -2552 -294 2145 -1678 -2189 1454 -16
936 -16 -2770 797 1401 -2695 -942 1667 -1899 -2434 1815 -46 -3088 270 892 -2855 -1245 1503
952 1503 -1455 -1911 1445 -12 -2653 57 1230 -2866 -1161 1758 -1202 -2246 1781 461 -2861
967 -2861 229 1767 -2034 -1172 2352 -457 -2198 1279 664 -2635 312 1903 -1646 -703 2304 -616
983 -616 -1872 1599 817 -2335 396 2114 -1244 -854 2401 -160 -1950 1769 1516 -1973 530 2297
999 2297 -1310 -1002 2394 189 -1638 1499 1698 -1643 161 2497 -980 -763 2121 331 -1844 1626
1015 1626 1622 -1403 544 1976 -1195 -994 2420 744 -1905 1273 1500 -1774 30 2373 -695 -1270
1031 -1270 2180 482 -1869 983 1160 -1837 -167 2035 -969 -1563 1487 140 -2464 463 1475
1046 1475 -2268 -788 1571 -1298 -1946 1453 79 -2643 303 1034 -2480 -990 1536 -1222 -2127 1087
1062 1087 82 -2671 -322 766 -2498 -1403 1193 -871 -2327 468 -124 -3066 -643 819 -2198
1077 -2198 -1551 1182 -1306 -2622 458 279 -2879 -873 1169 -1787 -1584 982 -785 -2707 286 -174
1093 -174 -2439 -402 1393 -1895 -1490 1189 -1175 -2516 721 570 -2353 -229 1170 -1747 -2002 1256
1109 1256 -544 -2412 575 1107 -2112 -415 1571 -1903 -1857 1328 -242 -2171 689 908 -2101 -532
1125 -532 1239 -1453 -1506 1787 227 -1907 763 1193 -1895 -601 1492 -993 -1505 1670 87 -2090
1141 -2090 512 1107 -1770 -549 1870 -737 -1649 1386 60 -2123 -75 1029 -1648 -591 1580
1156 1580 -805 -1570 1060 186 -2317 -12 1453 -1420 -864 1697 -688 -1797 1077 591 -2188 375
1172 375 1563 -1350 -997 1421 -598 -1889 1026 770 -1548 381 1518 -1561 -795 1878 -308 -1495
1188 -1495 1121 675 -1490 -53 1337 -1351 -1024 1629 -234 -1667 818 1112 -1687 188 1615 -1248
1204 -1248 -1213 1319 -46 -1766 569 927 -1851 -658 1557 -1165 -1431 1363 -248 -1763 666 792
1220 792 -1873 -206 1086 -792 -1260 1176 125 -1713 592 858 -1652 -615 1490 -664 -1330 1587
1236 1587 615 -1403 998 1231 -1163 -121 1978 -46 -567 1961 1132 -1211 1016 1701 -641 393
1252 393 2188 478 -669 2006 1133 -759 1211 1954 -195 304 2481 509 -434 1561 1282 -800
1268 -800 1086 2374 -46 284 2297 435 -930 1239 1091 -699 859 1862 -1099 -686 1055 -134
1284 -134 -1276 1032 1112 -1354 -206 1165 -1222 -1197 761 -466 -1581 521 664 -1974 -408 714
1300 714 -1607 -1548 992 -589 -2112 217 299 -1860 -795 868 -1126 -1467 768 -132 -1583 407 616
1317 616 -1468 -620 1172 -817 -1065 1262 121 -1401 601 892 -1207 -367 1717 -27 -1103 1472
1333 1472 355 -1502 476 1318 -1096 55 1657 -139 -670 1520 728 -982 401 1319 -733 -426
1349 -426 1681 -296 -1176 1248 599 -1480 395 1382 -1037 -426 1546 -342 -1114 1085 894 -1330 161
1366 161 1242 -690 -820 1412 64 -998 948 557 -1180 409 1642 -646 -597 1670 -127 -1048
1382 -1048 1132 1020 -992 698 1863 -128 -318 2025 485 -546 1778 1577 -389 857 2096 28
1398 28 31 2007 1088 -113 1826 1908 -200 624 2205 60 54 2120 969 -392 1783 1419 -261 550
1416 550 1890 304 -245 1306 723 -520 543 1392 -628 83 1590 -19 -408 1423 537 -1403 475
1433 475 1049 -1335 -711 1196 -470 -1242 604 -158 -1496 -242 616 -1746 -1202 861 -897 -1613 62
1450 62 -237 -1950 -334 498 -1508 -1245 593 -941 -2036 196 -260 -1735 -345 663 -1156 -1111 546
1467 546 -691 -1695 -68 -151 -1569 -403 609 -1357 -1160 686 -759 -1699 456 313 -1646 -446
1483 -446 746 -1118 -1128 982 -600 -1177 306 272 -1118 -191 738 -966 -1199 967 -105 -1460 438
1500 438 48 -1427 -491 1118 -775 -1592 1087 -50 -1763 117 686 -1249 -511 986 -918 -1072 1034
1517 1034 -23 -1260 229 478 -876 -173 793 -590 -825 814 198 -1057 688 908 -810 -163 1123
1534 1123 -303 -651 1011 385 -1020 368 798 -674 -473 1228 101 -792 944 566 -738 203 1101
1551 1101 -385 -226 1338 69 -1007 1007 785 -836 557 1158 -626 -419 1401 -27 -661 597
1567 597 569 -1137 122 1193 -518 -768 804 69 -1148 751 315 -1368 -133 637 -963 -934 618
1584 618 -117 -1088 81 731 -1295 -368 870 -640 -862 670 55 -1464 314 519 -1143 -318 781
1601 781 -689 -1009 557 45 -963 209 604 -934 -534 844 -777 -933 937 43 -1223 3 614
1618 614 -873 -439 992 -175 -1007 658 379 -1150 416 623 -531 -498 1023 -414 -881 686 465
1635 465 -751 259 1000 -716 -232 1125 98 -556 673 536 -615 389 633 -653 -30 1060 -371
1652 -371 -706 318 990 -738 530 1028 -675 -341 995 -185 -807 794 649 -911 386 1193 -356
1669 -356 -506 945 225 -598 398 619 -1091 -399 993 -158 -205 843 396 -811 482 558 -913 -213
1687 -213 866 -282 -511 822 227 -1021 65 676 -716 -175 779 -586 -841 709 234 -827 378
1704 378 652 -673 -366 915 -386 -842 507 318 -952 -15 760 -798 -419 624 -661 -789 464
1721 464 140 -955 310 426 -569 -197 603 -399 -876 298 131 -920 354 855 -700 -583 629
1738 629 -378 -861 442 111 -913 -268 578 -545 -630 484 -116 -837 343 402 -773 426 594 -439
1756 -439 -380 887 -115 -834 685 771 -692 0 520 -416 -293 833 297 -945 512 605 -342 53 717
1775 717 -187 -474 1006 457 -486 369 525 -727 119 1002 -241 -23 1017 127 -832 758 569 -188
1793 -188 295 801 -261 -366 803 384 -520 183 632 -395 -68 800 -385 -305 673 390 -791 382
1811 382 637 -488 63 616 55 -557 922 372 -484 545 737 -689 -296 479 -218 -697 471 380 -527
1830 -527 34 645 -467 -372 860 -56 -777 432 254 -656 16 540 -597 -710 680 -251 -530 540
1848 540 362 -628 32 443 -461 -206 702 -23 -477 401 246 -737 -365 737 -496 -386 350 65 -682
1867 -682 135 198 -758 -335 637 -282 -782 542 332 -791 379 442 -658 -78 475 -155 -711 223 119
1886 119 -796 184 451 -560 82 625 -256 -549 634 227 -651 124 503 -352 -96 554 227 -202 1050
1905 1050 197 -489 193 623 -680 93 566 -73 -91 530 593 -116 287 524 -401 203 820 70 -235 465
1925 465 338 -542 466 1030 -318 59 840 157 -512 481 248 -352 -174 510 -412 -317 785 -76 -485
1944 -485 643 141 -586 34 517 -422 -87 535 -22 -507 619 359 -525 -313 306 -283 -400 413 -217
1963 -217 -902 618 673 -244 -240 422 -229 -586 458 211 -933 94 262 -501 -247 333 -395 -855 511
1982 511 18 -714 -288 633 -547 -214 157 -305 -765 466 -63 -723 356 462 -478 -259 685 -154 -684
2001 -684 372 -120 -432 -90 391 -804 -390 579 -341 -761 288 207 -613 -67 302 -490 -224 329 -188
2020 -188 -549 463 162 -561 273 544 -411 -278 622 -141 -418 453 330 -588 155 535 -270 -460 646
2039 646 257 -78 565 41 -438 143 932 -171 -252 439 327 -554 263 270 -625 230 663 -456 -166 476
2059 476 -75 -729 282 463 -153 75 505 -45 -347 402 -113 -590 394 507 -367 16 366 -257 -332 423
2079 423 -231 -655 215 306 -225 22 431 -262 -296 435 3 -364 161 562 -315 -519 309 -211 -598 338 279
2100 279 -519 -122 272 -405 -371 360 -600 -247 -220 -111 -552 -16 606 -409 -439 161 -494 -403 275 -52 -516
2121 -516 -38 152 -607 -295 475 -51 -502 235 101 -513 -137 301 -438 -192 267 -119 -312 363 292 -424
2141 -424 215 354 -271 -120 548 323 -310 267 -93 -461 -172 437 -168 -423 465 -98 -585 262 483 -543
2161 -543 36 455 21 -134 838 463 -468 375 501 -559 -190 831 -379 -460 329 122 -345 218 482
2180 482 -49 334 679 -116 -538 476 214 -337 127 320 -329 156 446 157 -270 497 -59 -513 -207 -3
2200 -3 29 -103 462 -133 -484 655 442 -234 3 506 -199 -481 287 -243 -181 349 417 -437 415 -40 -141
2221 -141 -353 216 -233 -588 270 299 -676 30 133 -280 -290 338 134 -708 320 487 -669 13 395 -448
2241 -448 -319 291 18 -696 23 81 -439 -227 379 111 -255 140 -249 -167 -4 179 -630 -62 289 -442 -229
2262 -229 200 -146 -687 335 69 -411 -184 566 -136 -412 384 -234 -551 164 534 -530 -347 400 24
2281 24 -106 141 -106 -344 -88 381 -349 -270 441 -367 -424 624 -30 -466 402 215 -163 111 354 -68 -257
2302 -257 652 321 -451 -89 571 -570 70 791 -199 -485 398 211 -363 264 341 -39 -259 662 36 -662
2322 -662 407 285 120 -48 282 -417 -215 629 203 -407 260 517 -579 30 665 49 -117 349 235
2341 235 -458 492 240 -376 171 565 -232 -127 401 -104 -733 279 758 -675 2 521 -209 -248 425 -91
2361 -91 -478 94 376 -550 -93 396 -577 -359 145 24 -343 316 331 -456 -193 235 -324 -61 177 104 -676
2382 -676 107 413 -550 -152 418 -15 -407 307 192 -674 -101 436 15 -186 224 -25 -294 191 152 -567
2402 -567 61 443 -389 -34 349 -30 -546 200 -7 -465 -312 54 -378 -337 322 38 -174 -114 291 -290 -38
2423 -38 499 -273 -312 503 39 -420 349 230 -231 128 494 -421 -86 494 -199 -201 466 248 -140 -210 614 54
2445 54 -222 518 -109 -238 19 -143 -40 121 317 81 -81 424 -46 -402 1 609 -262 -203 515 -298 -182
2466 -182 576 429 -32 13 244 57 -26 550 -323 -340 338 267 -276 -143 238 -212 8 233 -3 -112 145
2487 145 313 -639 94 233 138 -453 483 95 -440 200 113 -306 -71 219 -151 -272 134 -47 -616 176 79
2508 79 -264 16 692 -187 -74 442 -284 -654 187 144 -234 -35 236 -132 -291 631 100 -364 40 80 -248
2529 -248 -22 251 -208 -501 356 0 -223 128 202 -266 181 132 -143 -184 357 21 -358 113 277 -387 -19
2550 -19 315 -69 -363 634 181 -191 173 246 -102 -40 204 -117 -115 214 239 -607 397 501 -313 -102 480 -7
2572 -7 -418 31 197 -414 291 275 -460 -250 430 -112 -477 95 232 -371 -206 153 -207 -125 290 54 -248
2593 -248 224 449 -407 167 508 -188 -19 346 -165 -189 455 -40 -450 257 353 -11 -441 387 161 -231 -32
2614 -32 410 -368 47 324 -43 -102 602 46 -268 68 -17 -369 155 242 -304 -340 277 125 -259 179 108 -412
2636 -412 -66 562 -177 -511 509 -194 -219 361 271 -343 -75 391 -85 -367 62 -159 -393 252 54 -390
2656 -390 -257 286 -270 -508 126 -81 -316 -176 146 -388 -388 216 -177 -476 84 290 -542 -163 249 -417 -190
2677 -190 301 -161 -356 151 35 -179 360 516 -258 -417 331 -49 -266 664 443 -197 78 453 0 -153
2697 -153 312 -50 -407 129 -22 -98 76 193 243 -47 361 121 -249 132 179 -420 -32 317 -62 123 -29
2718 -29 299 -108 348 336 -223 -144 348 -501 14 563 10 -349 -37 -72 -278 87 52 -148 -279 192 -62 -382
2740 -382 -308 -5 -72 -170 162 -307 -352 99 -89 -259 427 168 99 20 210 -121 -375 288 -168 43 -148 52
2762 52 -251 220 201 -267 -33 66 -83 -102 110 -151 -223 184 268 -133 -255 13 -14 -294 45 305 -108 -61 564
2785 564 181 -367 313 88 -403 88 73 68 -259 37 -191 -533 165 -74 -162 -116 272 -56 -547 394 44 -431
2807 -431 39 394 -295 50 292 -285 26 218 -72 -394 245 206 -293 102 174 -33 50 312 102 -230 370
2828 370 176 -447 -139 88 -122 -136 255 437 21 117 430 176 -2 446 -151 -320 202 189 -27 6 323
2849 323 -181 -92 310 -145 -494 414 214 -207 167 261 -400 -315 325 -152 -59 368 276 -68 187 326 -380 -295
2871 -295 497 120 -174 269 105 -293 -125 196 -142 -251 331 -238 -347 137 -285 -405 -253 184 -93 -351
2891 -351 180 -366 -524 190 -76 -506 44 156 -338 -310 5 -21 -342 -135 -269 -407 57 321 -170 -426 216
2912 216 98 -336 111 -27 -419 -94 209 -96 -322 352 -262 19 253 259 -70 62 599 -121 -78 387 1
2933 1 -332 109 348 -141 -130 179 34 -313 198 157 -48 -115 246 -244 210 380 -89 -321 211 345 -46 309
2955 309 268 -102 -69 174 181 -591 336 159 41 -89 318 18 -222 224 -48 66 414 350 -298 -153 208 -63
2977 -63 -163 136 -207 -96 -51 384 -133 -222 26 -31 -1 187 74 -164 128 511 -70 56 464 77 -75 339
2999 339 -40 -396 481 60 -76 250 303 -37 -71 316 -159 90 368 167 -267 -117 324 -342 -185 372 -28
3020 -28 -112 25 185 -218 155 217 -42 -173 391 105 -225 303 132 -215 -130 376 -109 -151 113 141 -575 197
3042 197 443 -58 108 308 -95 -84 186 -180 -54 -9 352 -285 39 87 -177 -294 209 392 -410 -53 220
3063 220 -201 -184 295 -73 -423 341 281 -172 71 177 49 27 -55 -117 -109 130 219 -245 -145 251 -153 -173 46
3086 46 229 -136 218 241 -65 144 250 -10 -457 48 -141 -240 55 496 -180 10 -38 -291 43 213 265 -21
3108 -21 230 -82 -123 159 241 -149 -31 155 -39 -182 -190 271 39 -40 190 76 -97 301 212 -133 197 57
3130 57 -288 -417 236 37 -240 212 124 -291 77 233 -358 16 153 -114 -285 259 -53 -121 126 -56 -407
3151 -407 -463 221 -363 -209 -67 -7 -87 -24 368 -187 -180 -80 16 -422 120 248 -151 -248 165 -172 17 282 57
3174 57 -266 180 164 -456 -292 28 17 36 266 -4 -83 388 56 -397 28 187 86 -47 147 -117 -546 29
3196 29 179 -188 10 176 -49 -12 700 134 -152 85 315 138 -30 185 -127 -207 104 204 -10 68 127 236
3218 236 52 401 -125 -121 -46 163 -16 137 97 -222 189 208 144 -312 66 301 -127 347 257 97 -118 -33 -35
3241 -35 -245 68 212 -161 297 -109 -343 -132 14 -101 -479 208 106 -205 9 243 43 -78 442 -30
3261 -30 -223 -3 -84 -238 -343 134 -79 44 86 -134 -523 165 317 -364 -74 249 165 -32 454 -260 -129
3282 -129 202 32 -351 -181 316 -360 -139 266 80 -303 325 24 -7 -313 223 -191 -166 75 -76 -201 232
3303 232 11 -184 -322 147 -139 -10 393 51 89 -1 151 -340 -43 136 -3 -316 -86 114 -476 120 -20
3324 -20 -470 75 -87 -300 18 14 -92 160 41 190 -475 -64 140 -232 -72 -199 149 -61 -92 313 -46
3345 -46 167 38 -92 -183 79 329 -382 364 36 29 42 142 -108 -185 143 104 14 185 357 -108 114 414 475
3368 475 -95 150 255 -95 -15 420 -196 -149 151 -117 -577 235 185 -15 160 24 -135 -398 -91 -218 -340
3389 -340 272 70 -366 -135 75 -189 -161 -54 7 -127 -122 134 -57 -170 116 -211 -94 -121 -68 -38 134 87 -165
3412 -165 110 314 191 -393 175 171 -187 -174 39 -88 157 -64 -93 -113 293 153 -269 -260 7 -96 -4 160 -178
3435 -178 49 509 137 64 115 221 26 -182 65 -18 -182 115 113 -214 106 380 210 117 238 -114 -133 154
3457 154 416 -85 40 13 -117 -465 208 7 -257 220 415 -41 133 258 -181 71 109 -220 5 179 370
3478 370 -24 88 76 -162 220 109 282 -161 111 201 -203 -116 291 3 -248 -219 -336 -71 42 291 45
3499 45 -83 293 -27 -135 67 130 -189 74 285 -117 166 132 -116 -44 291 -94 -434 -167 24 115 76 176
3521 176 250 -88 176 2 2 -122 494 19 -131 145 -261 -26 -1 145 -114 19 284 208 42 122 -70 -229
3543 -229 -75 338 -169 63 -99 -264 -13 -234 -255 -120 -68 80 -349 224 296 103 -178 -115 8 37 -192 58
3565 58 -141 237 95 -204 -12 107 195 36 359 137 -215 -292 166 215 -195 -26 -148 -238 228 230 70 -8 401
3588 401 -10 36 264 -29 -338 169 331 -92 33 178 -40 112 179 181 2 31 -23 -118 -406 168 -250 -296 40
3611 40 218 -16 -5 590 -181 45 -20 158 -1 63 175 -16 41 94 268 12 -141 94 239 -165 265 118
3633 118 269 234 -196 335 -67 -71 -20 192 -152 -186 260 -303 -108 -291 29 137 -316 277 222 21 -91 255
3655 255 -170 -197 127 109 -213 140 313 103 -160 -164 -255 -96 109 20 -85 395 0 -376 -156 215 -32 -129
3677 -129 270 21 -67 174 206 28 -267 254 -279 -20 -7 -39 67 149 163 -182 94 39 -128 99 148 -57 -223
3700 -223 51 -68 -353 138 335 -48 -154 -70 97 -194 -360 155 -313 145 50 -3 -322 228 163 -283 -120
3721 -120 204 -97 -72 118 -22 -392 72 209 -488 90 7 246 -92 253 34 -437 53 235 -78 -260 220
3742 220 2 -246 112 195 -256 -36 141 -126 270 326 -119 7 43 -149 -187 206 -41 -134 179 255 87 250
3764 250 118 8 -252 251 202 189 -8 -4 114 124 -6 -80 -255 -81 137 -195 205 310 2 -42 -68 -165 -139
3787 -139 -39 148 -11 -8 89 -214 21 -182 -170 -145 -372 216 159 139 106 -283 -20 54 -114 -337 -101 95 -343
3810 -343 130 129 -447 -194 191 155 -264 59 166 28 -316 -73 -46 -184 144 179 -125 80 116 38 -294 144
3832 144 -37 -285 362 -76 -237 388 -44 -107 61 -19 140 -338 277 2 -261 226 545 -13 -48 292 -106
3853 -106 302 -62 90 -36 -187 104 -25 7 296 -139 -172 -100 -5 -120 257 151 -118 40 161 255 -37 322
3875 322 -85 100 -19 -98 7 -34 297 124 -116 467 124 125 42 336 87 140 20 60 -194 -36 432 97
3897 97 414 335 -241 301 -73 146 126 125 24 -158 -112 -56 228 -63 25 -238 -151 98 39 -41 -18 141 -96 -606
3921 -606 9 73 32 -70 410 -39 -120 129 -106 -81 7 45 -22 147 261 228 -177 409 -220 -330 -41 473 -263
3944 -263 77 266 41 -209 -18 74 77 -324 -251 -140 50 96 57 -75 9 -9 -200 157 104 -265 -17 56 207
3967 207 -29 60 144 59 -346 268 -454 112 -176 130 65 434 -49 -139 -152 -63 -82 -256 265 -112 52 39 189
3990 189 -54 53 246 72 -138 134 -279 -136 44 -219 -152 202 102 209 -105 187 -103 147 65 159 -175
4011 -175 321 329 -237 -43 -3 144 -210 8 110 -83 -136 90 -87 -333 223 213 -144 135 48 -171 74 -227
4033 -227 0 -410 107 161 -1 19 196 248 168 -290 -116 -66 225 -348 -100 -14 136 197 28 268 298 -139 -296
4056 -296 -9 27 200 5 -362 -49 48 -280 51 255 38 26 -109 82 178 -90 0 -283 -222 307 -18 -222
4078 -222 -308 -32 -251 -70 51 -251 -166 65 134 -72 -146 267 -169 -38 273 -53 -2 76 -4 -219 46 157
4100 157 32 88 406 35 -63 67 261 -28 -12 321 -375 141 239 272 166 291 149 -74 51 152 -1 -186
4122 -186 189 52 -92 45 203 -410 34 38 15 19 -49 187 252 228 -224 -69 19 -125 -24 205 410 -247 -201
4145 -201 -93 1 70 -286 -125 91 -276 204 83 -231 141 380 -125 -92 201 -232 132 -74 150 185 17
4166 17 180 -264 80 -43 -3 -24 64 -131 -140 -8 -117 -264 329 219 -23 -213 -15 -42 -157 86 167 -258 270
4189 270 523 -62 -23 92 241 255 -79 173 -157 22 227 31 -69 291 -84 50 -126 115 -210 -65 138
4210 138 172 -21 30 -97 -227 -356 -125 -211 -10 183 -145 -90 -104 -98 -250 -112 -282 -293 -80 152 72 -37 -5
4233 -5 88 59 25 16 295 -306 -140 -130 -138 218 -69 -200 13 312 51 39 201 43 -103 97 280 -260 -48 167
4257 167 -5 -45 268 167 91 -5 194 -77 -6 277 -18 44 279 9 13 18 380 23 -243 111 86 33 -1 -145
4281 -145 -92 117 -45 -143 120 41 201 66 82 -17 -183 -71 188 -96 304 49 -24 -385 113 117 -65 -148 -131
4304 -131 189 70 116 265 -2 -7 286 119 -28 234 -92 168 -229 -172 58 -26 29 -459 -219 -65 196 -137
4326 -137 36 114 -187 -91 -21 -273 170 446 60 -53 336 58 163 66 70 -126 -274 216 -231 -225 40 169 -92
4349 -92 229 323 15 -16 246 -65 154 224 120 -181 151 63 -22 299 76 84 -139 247 -191 60 189 -34 90
4372 90 286 -12 27 -12 22 -81 -15 42 101 -27 118 306 -273 103 -175 261 -274 -251 95 -315 -36 153 -63
4395 -63 -2 251 70 -92 28 96 46 237 -14 115 -167 -177 34 -58 -260 83 -81 66 367 -9 16 225
4417 225 196 201 -100 217 -288 -168 -157 -152 -132 -10 -323 57 -178 41 142 -166 113 210 -213 -206 -65 -273 -83
4440 -83 126 -190 2 37 143 72 -90 151 -79 -20 -105 -77 7 -129 -114 -287 53 14 140 12 254 94 -336
4463 -336 -286 41 -133 312 -99 98 162 -215 -121 -228 174 204 -379 -123 72 -36 141 42 185 -238 -5 87
4485 87 -74 104 47 43 14 163 283 -131 -74 -208 191 -95 213 -41 -167 283 36 -12 -47 86 222 152 -117
4508 -117 -12 -120 140 -92 -95 -146 -168 -41 -198 -84 92 -127 106 -223 -8 14 368 11 57 -27 284 -183
4530 -183 -67 21 -404 -106 -60 -119 113 -12 113 111 131 128 -41 86 -196 -263 -133 77 -140 -162 392 15 134
4553 134 351 376 53 181 -139 -141 86 -207 257 68 125 395 -190 79 -174 -235 154 44 -17 34 160 -114
4575 -114 -9 92 26 -118 131 145 60 -128 101 299 -96 -37 268 -162 -123 16 114 -183 71 115 -81 -134 158
4598 158 35 -333 -170 -159 40 81 282 -172 -69 170 3 -422 62 31 -193 -170 104 -85 -154 51 93 -189
4620 -189 264 198 -158 2 -91 -178 10 -44 -5 -151 180 86 223 23 -186 42 -67 159 -72 82 379 -68
4642 -68 -104 -20 -2 287 41 83 9 -154 -92 175 -71 53 81 -71 16 376 132 -78 195 -16 111 56 217
4665 217 -151 -122 -14 66 46 -53 39 96 -54 348 -45 62 7 -55 -137 -153 117 39 -11 344 -286 79 101 -1
4689 -1 -66 -5 268 269 23 287 -85 -12 161 -3 -106 45 55 -39 16 35 9 -214 53 107 -51 112 311 -48
4713 -48 43 -171 -136 56 225 63 -250 80 99 -159 -72 -127 -154 -117 59 76 -105 -127 -56 -292 153 344 -123 -219
4737 -219 180 124 5 70 215 20 287 1 93 -193 -24 -133 13 146 471 -199 -14 72 319 42 -73
4758 -73 -6 34 210 261 -59 -183 154 -116 140 119 130 -68 22 164 56 181 221 109 -63 -42 -120 -402 15
4781 15 15 27 -46 79 88 -53 -230 -193 -3 54 124 -259 -434 288 -185 -130 179 206 -65 -1 1 79 -95 53 37 425
4807 425 -160 109 -301 -363 147 -14 -9 74 1 -138 -58 18 -415 -17 16 -144 -68 198 -27 -83 50 179 -106
4830 -106 154 -106 119 -258 70 197 -93 -245 230 165 156 436 -233 -223 146 -76 -35 256 117 93 102 168 88
4853 88 -42 211 206 -440 345 -183 -63 -126 -96 -18 -202 196 -45 -16 -244 59 142 -141 136 154 -381 345 -40
4876 -40 26 -21 59 -112 81 93 -79 92 47 148 173 -48 30 201 125 69 21 -480 65 134 -73 131 162 68 -115
4901 -115 -76 132 -304 254 -74 -5 -41 265 26 205 5 -92 -87 93 13 134 206 17 87 -290 -123 -19 158
4924 158 -181 -120 -20 55 -150 199 -32 31 38 -84 75 -43 58 129 57 -222 -367 -29 -109 104 130 357 -22
4947 -22 -103 91 -99 -198 206 255 88 153 165 -50 -420 179 59 15 22 126 -74 -63 305 -22 50 70 110 212
4971 212 10 -5 95 -102 -41 -25 -3 53 -1 -58 143 50 -159 -60 -304 233 118 -371 -42 385 281 -115 -314
4994 -314 54 3 -236 21 104 -66 -101 -71 388 187 -129 108 62 -161 33 -70 41 148 187 6 266 58
5016 58 -198 -146 -216 -8 17 -228 -115 86 -48 14 170 241 82 48 -26 376 -104 37 169 231 84 -160 -95
5039 -95 -271 -177 -130 -75 -100 109 31 -69 -124 -80 -131 -94 -116 25 113 -32 413 -314 98 55 95 73 -124 256 -4
5064 -4 11 169 -237 7 34 38 78 55 193 1 -149 -266 225 -238 -106 336 -191 37 168 175 7 -44 28 -54
5088 -54 -19 59 235 188 -29 -49 -133 -56 26 -142 256 -59 -51 -72 38 -446 -237 -433 -243 -21 -270 34 231 -100
5112 -100 -24 181 -173 291 130 -2 148 -221 173 178 82 -248 15 246 -189 74 -6 190 -169 -105 -76 -121 45
5135 45 -166 -46 64 -59 -143 -463 32 397 -103 -225 443 207 -22 -208 104 -87 52 -53 297 71 256
5156 256 -46 -146 -75 -73 -16 -238 -26 260 -55 -151 287 152 -79 227 -37 -17 63 -126 52 17 194 -26 -67
5179 -67 -93 196 -94 34 134 61 56 33 -61 284 33 -114 65 151 6 -145 171 321 48 -70 160 -178 88
5202 88 12 -10 121 -371 1 -328 53 10 236 -372 -58 -217 12 66 99 50 -208 67 -21 -95 78 78 -2 292
5226 292 149 -74 47 -5 -21 -101 -166 -356 196 -114 -15 -239 -252 -185 -65 129 46 386 -185 -51 -119 -134 -465
5249 -465 -231 -155 -13 18 304 104 9 215 80 23 91 222 -263 74 -22 12 -77 29 40 78 197 -6 -161
5272 -161 23 -322 -42 90 112 27 -60 177 45 -9 -175 82 -98 -316 -107 212 -239 223 373 32 77 -187
5294 -187 97 98 240 3 189 -23 91 -51 -13 58 -57 -49 14 -242 98 315 237 26 -21 399 134 -112 -360
5317 -360 183 -103 -81 38 303 -16 50 160 176 0 -113 -300 193 246 71 48 -15 -79 116 219 -294 -100
5339 -100 -104 -57 -185 -82 31 -5 -65 -281 -106 49 -113 -210 81 222 -426 -5 -70 -297 104 308 -23 62 -56
5362 -56 -241 279 -127 -21 228 145 -26 -133 47 107 -155 250 112 -89 71 -139 -351 -60 -88 112 104 185
5384 185 312 22 -204 174 76 -47 -92 134 287 -16 282 -143 -14 131 114 81 -29 -103 -136 -82 -170 -234 -65
5407 -65 1 -9 -197 49 -118 -72 -246 249 -121 38 199 60 -72 -106 127 -109 178 57 77 262 -17 170
5429 170 130 108 39 194 298 -7 -175 -246 269 134 -97 -389 -3 108 69 152 -154 -40 15 -147 -48 182 86
5452 86 -155 141 37 -37 -30 143 -220 -19 -103 -39 84 -107 -13 76 -9 25 -364 69 214 -132 -62 -141 111 -200
5476 -200 -80 -71 309 -268 59 115 28 -22 -68 115 -227 147 -152 174 -172 33 -54 -58 27 -12 240 -45 142 -90
5500 -90 -72 -176 -49 -89 267 -123 11 -59 161 52 -91 -310 -46 -50 -52 -173 465 154 -164 40 57 66 1 7 -3
5525 -3 -303 -103 183 189 -261 -125 -67 -48 -299 9 195 -95 119 346 -43 -12 -167 67 -12 206 33 -114 130
5548 130 53 -146 -195 36 -77 -31 -217 -68 -148 483 136 198 153 -42 12 -327 -5 -211 -29 -47 -200 150 32
5571 32 46 -121 -73 92 66 51 447 -11 -26 120 -100 -269 133 462 -263 2 81 166 27 -110 -77 -146 62
5594 62 -136 34 -57 -102 -191 82 -84 125 -225 -229 151 184 -60 -45 0 -140 -141 171 -24 140 -74 132 389 -71
5618 -71 215 -134 -221 79 196 80 87 -33 -184 32 -214 124 37 -142 -34 103 -254 280 -103 63 -89 -80
5640 -80 -105 -319 218 0 55 123 56 -134 219 26 68 -61 9 -9 -296 241 -60 142 -27 3 236 -140 46
5663 46 -209 67 152 -30 -138 -69 31 -312 13 -159 -123 109 -113 22 286 -158 -397 218 385 -31 -117 204
5685 204 -14 -229 -66 219 11 334 32 -12 -12 -119 -34 -185 61 -19 115 173 110 158 77 29 -81 -57 -144 -323
5709 -323 -275 64 35 -168 39 214 -286 -264 134 113 387 -347 140 -74 186 -261 -314 1 -20 -82 71 165 -1
5732 -1 264 -54 62 34 33 350 105 34 -152 -260 -159 -71 188 -35 -75 -71 -282 83 12 40 71 49 304 -2 -64
5757 -64 -165 0 9 220 4 -63 -206 16 30 -155 34 256 57 -175 58 163 -98 -249 233 211 0 -68
5779 -68 -148 -31 -11 -231 -233 130 72 -301 69 -231 -65 -232 -29 35 -142 -18 106 -46 -153 -95 -51 -46 170 -114
5803 -114 -287 157 -24 -186 270 -31 158 113 66 -14 68 -361 227 -144 396 123 -16 -109 -5 -177 -20 -6
5825 -6 -139 124 202 -155 39 182 101 -71 -58 105 57 -74 -32 -147 -6 -116 -193 -78 -86 50 167 187 281 182
5849 182 -269 297 314 128 -4 299 228 -32 -193 -82 -175 -161 284 -13 -131 -157 140 -84 112 15 102 12 -176
5872 -176 77 -41 -66 182 -209 82 -14 -24 -79 -121 15 63 164 -29 22 131 -174 -82 -42 -1 -366 224 10
5895 10 -30 -156 20 -141 -208 -22 61 -99 60 107 132 -30 -247 -136 -78 239 -39 45 148 -82 -35 119 -32
5918 -32 275 -10 -144 42 34 50 -177 62 114 -98 245 76 230 46 -384 30 -155 177 -79 227 172 97
5940 97 -89 12 -111 146 52 0 -29 -48 165 262 24 -19 118 -126 -63 -98 79 -163 149 -64 -163 90 274
5963 274 -414 225 -107 100 -134 -182 96 -2 -62 23 -123 28 115 -148 -155 24 -33 328 -217 330 -145 -167 313
5986 313 234 -50 153 -54 -213 -54 118 53 120 -134 4 -226 -70 3 262 -167 131 -196 -89 -142 -108 108
6008 108 60 22 103 154 -1 -21 -162 105 80 -99 -281 -290 -14 -11 156 12 77 -14 -142 213 -335 -73 -98 94
6032 94 139 76 -217 -105 206 -83 115 153 82 -122 -223 -10 27 -136 -321 68 97 78 135 75 62 -125 183 96
6056 96 114 -100 184 -129 54 145 -66 -20 -233 -263 117 22 -20 -8 -182 -169 -40 -4 -117 280 -109 192 198 141
6080 141 53 47 178 56 -49 122 -102 130 -108 244 265 -74 -117 -110 -80 96 15 53 -92 -194 19 -100 15
6103 15 -16 -101 -164 -220 144 -278 -213 -41 342 -388 20 87 -23 -211 231 -1 125 -15 -150 170 17 -173
6125 -173 76 113 -259 -15 -56 -430 34 184 -303 -117 -57 -215 -148 -6 116 -135 196 193 -148 249 -205 -48
6147 -48 139 169 128 -99 130 87 -239 -191 175 267 133 10 -10 13 -9 -18 -321 -107 227 31 227 55 -105 98
6171 98 177 244 -13 -72 1 -135 -181 415 26 71 233 -97 72 153 -204 -144 232 -138 39 58 39 -7 -78 -182
6195 -182 -82 282 16 323 132 -21 -35 -88 237 20 118 104 80 54 48 -101 191 43 156 -18 30 23 -18 -58
6219 -58 432 -11 -77 -99 -1 257 50 173 -120 238 -118 -63 -286 -146 -45 131 -212 -36 -232 -109 -358 -166
6241 -166 36 3 27 -161 -197 -44 218 -82 69 18 98 -128 -39 -152 -354 244 109 175 14 82 208 335 105
6264 105 145 57 229 121 -14 -72 -159 -24 -171 114 -30 -162 -286 253 126 -36 -156 -21 39 124 0 -231
6286 -231 55 113 6 -10 -158 151 14 20 22 7 -69 -302 -61 156 -19 -364 -357 -191 -300 -137 300 -48 -143 181
6310 181 -98 -41 62 39 -112 31 -128 4 -116 311 23 -199 -47 -261 256 -78 -208 31 -195 162 120
6331 120 -211 177 221 -8 52 193 -142 -49 22 -371 73 -165 247 -107 -178 -199 -286 117 133 -186 296 -124 -69
6354 -69 97 116 -43 -105 -34 -6 -167 119 -249 15 -190 -351 24 133 167 -96 103 -97 -145 -121 182 70 -63
6377 -63 80 333 15 -15 81 40 75 -132 -47 -30 131 177 40 78 224 -31 170 142 -159 -245 325 44 313 11
6401 11 -322 -18 -268 -42 -109 -34 -166 35 114 144 -12 -199 168 60 -37 -304 127 84 111 44 276 52 -138
6424 -138 153 69 -129 -102 -135 -94 -217 308 0 212 -33 -117 -34 72 -123 152 249 -51 83 -134 214 -93
6446 -93 -28 -55 -66 101 -21 234 168 162 35 -50 13 108 222 63 -269 21 -215 -194 -89 298 133 -50 -37 -69
6470 -69 82 -194 85 -161 48 38 -30 61 34 12 87 318 122 -112 84 196 -65 297 74 -19 21 -167 -209
6493 -209 205 27 -124 206 29 -52 -56 114 -324 -255 -536 -33 118 232 206 -186 -214 190 -151 90 151 -88
6515 -88 -67 -39 -132 293 1 -182 191 -272 178 -18 11 -177 70 -432 -128 250 10 382 155 82 110 173 -93
6538 -93 -153 -212 -216 -51 217 130 30 82 -304 112 37 370 177 83 -14 4 133 -95 181 144 109 -107 -87 -132 241
6563 241 -53 -1 -251 143 35 -239 -207 -226 72 8 -57 177 -185 238 31 169 179 -233 246 -114 100 -20
6585 -20 97 -88 173 95 136 65 146 136 -226 201 136 50 -128 -182 92 93 35 106 -11 10 -364 -84 74 -61 251
6610 251 -134 85 -113 20 257 353 258 131 208 -82 -169 -123 -41 34 147 186 136 16 -10 -209 -108 -282 139
6633 139 6 -63 131 -35 277 112 -24 61 74 280 58 273 39 -71 -83 94 178 -5 267 -116 178 -27
6655 -27 48 69 136 1 70 149 179 -223 -243 75 97 -237 93 91 149 -67 177 -204 9 138 -216 -38 -217 -213 -72
6680 -72 33 -130 -7 225 -61 -77 -62 59 -72 -202 -312 -66 -94 -23 -266 104 -31 -282 236 6 319 119
6702 119 -265 -34 -29 -118 -76 9 62 -189 -152 -3 91 -81 188 117 -107 -53 8 -31 110 216 90 15 50 435 -92
6727 -92 25 185 165 113 86 110 -308 243 -226 -164 -141 -301 46 -146 114 25 81 122 -148 -338 319 -35 73
6750 73 -7 243 -110 17 -332 309 -212 -66 -87 46 -133 229 63 156 -282 107 119 -40 25 118 176 73 49
6773 49 20 226 -148 -209 -85 306 262 -80 -53 192 -347 82 -189 95 -141 40 326 192 119 -251 -143 -61
6795 -61 222 93 120 392 -58 -145 318 417 -192 -72 -165 -125 24 35 -8 79 64 -2 121 245 -43 185 75 19
6819 19 -78 91 -230 190 169 -51 276 -107 -67 -55 187 217 542 -71 -349 249 -328 -53 128 -120 -133 24
6841 24 156 52 -291 -70 143 -167 191 239 123 13 141 123 -15 -135 -179 153 9 -132 -20 -88 98 -191
6863 -191 -190 -25 259 241 -14 -268 -160 227 -44 288 213 -7 -186 175 75 50 -12 -3 365 -254 -95 -204 -16
6886 -16 -126 8 -77 -113 121 -73 -129 -65 -108 288 -84 -137 181 67 -7 -87 382 -40 -115 27 -84 -283 -21
6909 -21 376 252 178 51 -79 -10 -107 106 84 -323 207 -47 322 -185 59 144 -211 65 -107 68 22 206
6931 206 240 -128 70 -7 -33 -204 166 -131 -128 -91 160 -244 -234 -108 10 -174 -145 -360 167 252 -186 133 -107
6954 -107 -194 122 113 246 215 -15 7 -94 422 -147 -59 248 8 -40 -301 164 94 -163 -86 -266 69 311 -124
6977 -124 20 -377 166 -117 -333 -41 -67 118 -181 116 68 200 111 55 -128 164 -97 -146 161 -346 163 -43
6999 -43 -38 -444 -453 -89 291 -122 186 -104 254 1 -32 30 -199 195 -36 134 89 160 -204 151 -99 -75 88
7022 88 202 -77 25 -104 108 55 -54 115 -10 -76 -162 -143 321 -52 -340 184 40 -56 -337 -95 -65 64
7044 64 -18 4 -58 6 -304 -167 59 107 -51 -98 -27 48 125 84 61 38 47 40 3 61 33 177 -236 166 -164 60 -155
7071 -155 -310 -33 -150 60 134 6 44 -135 128 236 14 82 -53 -8 266 33 -25 209 -181 132 -281 -359
7093 -359 -8 -171 -74 7 112 161 -245 105 70 -207 -63 -37 -21 95 -435 -38 141 4 174 198 -4 106
7115 106 161 -23 7 109 258 303 -131 87 -126 -113 106 5 180 170 -53 -106 -37 -50 103 49 -219 48 -237
7138 -237 -56 -15 -191 -56 281 -8 -240 116 -48 -168 -25 -87 -166 122 -116 -83 -41 48 188 57 36 -78
7160 -78 138 -91 183 -117 -336 -104 -86 11 34 -102 87 -154 490 -71 75 197 151 -28 -209 234 -110 27
7182 27 107 115 131 57 -89 -17 -296 23 -43 -200 50 -100 -141 16 -72 -144 96 -83 24 8 86 -57 132 -394
7206 -394 160 -273 52 -198 -306 313 -46 53 133 69 -95 -16 -54 162 299 53 -69 -50 11 -35 -116 -14 184
7229 184 171 -73 -202 -197 54 -306 -205 95 33 72 -47 -11 49 -26 -254 29 143 19 38 227 -297 261 -9
7252 -9 160 8 -4 46 -146 -45 -160 153 52 80 -137 -191 -110 -132 -61 -150 -316 -427 118 -63 108 -30 89
7275 89 50 -51 -13 204 -69 92 296 255 -24 19 -8 -20 102 -93 179 171 -75 -74 -30 -188 172 55 157 -119
7299 -119 -180 20 62 -94 50 -17 52 -87 177 -13 -5 -101 170 298 -6 -63 -195 -51 206 -36 94 197 -55
7322 -55 -17 131 192 35 -25 30 156 -208 161 114 -176 59 99 13 223 -87 -22 4 -30 165 -121 -187 -160 -2
7346 -2 -137 137 97 -114 178 -38 -159 -108 26 119 -26 -162 -288 321 231 13 -8 -180 63 -178 36 21 11
7369 11 -219 -110 197 -138 -197 -81 -91 295 16 340 -122 23 -81 -77 -222 71 -388 -120 -34 184 -303 31
7391 31 -16 -159 50 -156 47 8 57 -229 133 66 148 27 -28 -144 323 -37 -116 -32 -92 211 -214 121 -79
7414 -79 -309 -145 -245 45 -108 125 -50 -53 31 76 -27 115 0 33 51 55 26 -14 180 -183 -80 22 -147 -89
7438 -89 -124 4 9 -71 251 -301 245 -59 336 42 -48 -51 65 -64 109 -118 -62 14 90 371 14 224 93 453
7462 453 -18 107 -10 -129 -125 198 -45 -145 166 -41 -68 -86 207 23 -134 90 -176 -81 107 -199 -3 144
7484 144 -101 -271 -98 -229 -7 -190 -106 231 -24 46 -27 -216 -121 -60 327 -43 110 -233 -69 119 -22 -149
7506 -149 131 191 169 160 24 71 128 -180 -178 63 169 -49 230 29 -276 -155 103 -54 243 61 8 -76 -47 196
7530 196 -287 96 -319 324 57 -22 -227 277 288 -44 21 298 116 43 211 -223 47 -93 106 262 -30
7551 -30 78 20 146 49 199 177 -16 -20 -168 -65 275 147 108 108 -215 237 -247 -102 -28 163 60 -73 -43 245
7575 245 96 -74 -32 237 -28 33 64 33 57 90 142 130 118 47 163 227 19 19 -56 -40 -34 -54 104 -138 -25 27
7601 27 120 -27 0 -9 -170 -236 173 -46 -2 -112 6 34 -107 -67 87 59 156 -21 83 19 56 45 15 -106 50
7626 50 -62 -120 126 147 -106 54 -112 -4 -138 -11 -95 159 213 -154 -36 125 -172 -48 41 57 -30 -105 218
7649 218 50 242 54 -316 -83 146 -182 -66 -25 -139 -62 153 -121 -69 -137 146 -269 -113 -70 139 201 -67
7671 -67 139 -74 -114 -103 -131 295 95 317 25 -165 58 120 -137 72 167 -138 59 56 -177 50 197 -26 -386
7694 -386 58 196 -41 -21 87 -47 169 -300 213 59 126 -110 -15 -84 140 -238 16 240 -210 201 106 -252
7716 -252 184 49 -151 261 135 55 -75 -74 29 -205 -215 210 141 -39 202 50 169 43 140 -342 -93 143
7738 143 -268 -75 -178 8 -168 45 -78 -112 -5 -120 36 115 -142 147 -104 169 80 11 89 174 5 -113
7760 -113 -83 -151 174 75 215 -150 -28 77 121 140 175 47 -123 -249 94 -196 55 63 113 -127 6 -120 -109
7783 -109 415 40 -203 -89 92 42 -80 100 60 13 12 -260 -53 239 103 -188 147 -221 -206 121 -96 43
7805 43 209 194 -356 -28 -42 -176 180 203 35 291 57 20 251 -24 223 33 109 -125 44 151 324 37
7827 37 -187 67 -146 -171 -56 212 -144 -206 141 149 -219 -155 -189 -29 -24 183 -74 -7 23 72 -219 228 -221 -214 -33
7852 -33 124 67 136 108 78 -43 -18 -77 -8 -128 -35 118 -40 235 172 -264 168 90 -13 -56 65 -234 -26 -77
7876 -77 -193 -154 -40 244 -46 24 -19 243 -285 146 49 -129 52 39 154 -196 -403 -49 91 54 -126 -41 -123
7899 -123 -350 -155 -224 -24 33 159 166 76 -103 -134 -102 196 29 183 -158 107 -93 -12 141 -342 -72 -134 219
7922 219 26 15 -222 204 352 -162 196 132 382 -34 -26 167 -4 -166 -150 -276 82 49 -111 -236 256 -65
7944 -65 266 16 -59 -1 163 30 -113 24 -170 495 -24 165 -162 32 116 -17 -221 160 -168 98 -172
7965 -172 272 -142 14 127 -271 -92 -397 -137 223 -5 180 217 -266 167 105 -198 -128 -30 389 15 91 -77
7987 -77 45 173 141 270 178 70 -26 -126 20 -185 75 52 -65 -294 -176 -63 19 5 -192 155 26 405
8009 405 231 -99 -10 263 1 -144 73 129 162 18 -162 302 -110 85 129 9 109 79 -47 -221 -17 -5
8031 -5 -59 -161 -174 -158 -77 110 -22 147 233 -176 -44 232 -48 -280 -108 18 -267 25 4 -171 -72 193 281
8054 281 30 71 -71 -321 -90 133 6 13 -63 -41 66 52 -16 -22 127 79 -217 288 -103 -60 -140 -168 -61 -53 -52 -97
8080 -97 148 93 -426 197 -7 -134 116 86 198 -51 12 50 119 18 -71 -60 187 -82 -99 95 -114 171 -97
8103 -97 60 -43 -34 -208 -129 90 -193 170 -176 -376 -178 -6 -92 1 -52 186 -253 -15 -106 -203 74 -46 88
8126 88 -128 -168 25 12 -88 -161 -90 26 -31 -13 122 32 -197 -57 -38 72 144 -134 -56 228 120 -141 -152 -3
8150 -3 -179 -147 109 -186 -69 -191 -84 -100 8 30 -359 -30 25 -8 -7 -69 -204 -116 -74 11 176 421 -6 -153
8174 -153 -129 -226 -138 203 -102 -27 21 88 -80 222 37 65 -74 101 -25 -225 219
8191B19
$$ Imaginary data points
##PAGE= N=2
##DATA TABLE= (X++(I..I)), XYDATA
0 0 0 0 0 0 0 0 0 0 0 -8 8 -8 8 -8 16 -16 16 -24 24 -32 33 -40 48 -56 64 -72 81 -93 105 -121 135 -151 170
33 170 -189 213 -237 261 -293 324 -358 397 -439 486 -539 597 -661 735 -819 914 -1028 1160
51 1160 -1320 1517 -1763 2090 -2536 3195 -4259 6278 -11522 55254 113652 54580 64774 57632
65 57632 30444 24720 52868 36751 26035 42982 43737 26515 49271 61601 43476 48486 67084
78 67084 39565 20093 34330 21795 -9261 7243 24206 7677 14043 42073 29841 14541
90 14541 30342 23599 -3601 5573 14441 -11010 -14042 5541 -9162 -22098 4183 13110 -3397
103 -3397 8980 21178 -2114 -10459 2157 -12678 -26593 -8889 -8751 -26135 -9205 7354 -10757
116 -10757 -7994 16395 3268 -16697 766 2535 -23981 -19061 -1999 -17410 -22133 -1201 -3901
129 -3901 -14169 3288 7533 -9771 -2402 6758 -15870 -22388 -4696 -15593 -30872 -9019 354
142 354 -18543 -10361 7200 -9597 -19238 -2220 -8154 -25604 -12414 -8073 -28491 -25074 -10455
155 -10455 -23964 -27338 -3988 -5247 -20352 -8123 -4200 -26924 -27509 -13503 -25401 -30197 -11210
168 -11210 -13985 -28545 -15118 -8210 -24988 -18543 -22 -12723 -22379 -6026 -10740 -31272 -20397
181 -20397 -7826 -20648 -17491 2221 -4426 -13309 -196 -1479 -15750 -5633 2398 -12117 -9060
194 -9060 6323 -5707 -15234 3112 4836 -9311 3447 17064 1886 -1752 12194 2402 -10499
207 -10499 3803 7735 -4752 4155 14573 872 -499 14735 7494 -2577 12190 13713 -3962
220 -3962 1761 12576 -1895 -5352 10743 5945 -4083 9487 13166 -2538 3134 13530 -1312
233 -1312 -6216 9245 3082 -9637 3638 8813 -6318 -2421 10720 489 -4876 8568 5203
246 5203 -7647 1697 5307 -8673 -4226 7558 -3650 -8064 7397 3618 -8581 2893 9892
259 9892 -5894 -5123 7545 -2406 -9578 3763 3544 -8229 463 7015 -5410 -3225 8411 -606
273 -606 -6888 6054 3396 -9490 -1054 5942 -6891 -5824 7662 427 -7116 5278 5262 -7146
287 -7146 -313 7175 -5675 -5563 6492 -1266 -8591 3336 4550 -8083 -1380 8244 -3230 -5153
301 -5153 7398 994 -8524 2047 3474 -8010 -1328 7066 -3643 -4975 6977 719 -7728 3668
315 3668 6150 -6858 -1881 7699 -3461 -6950 5664 2047 -7150 2894 6538 -4758 -1090 7789
329 7789 -2126 -5318 6252 1724 -7453 2765 6069 -5870 -2238 8269 -1301 -5132 6474 4013
343 4013 -5782 1998 6053 -5239 -3010 6285 -1571 -5556 5731 3194 -6481 1633 6198 -5021
357 -5021 -3303 6682 -1050 -6446 4066 2374 -7216 -140 5473 -4234 -3413 5961 -1155 -6717 3738
372 3738 2521 -8047 -1060 5061 -5331 -5289 5007 -1046 -7347 2187 2619 -7291 -1400 4963 -4985
387 -4985 -5310 3789 -2428 -8274 1401 2300 -7886 -1913 5484 -5191 -6172 3829 -651 -8115 755
402 755 2848 -7049 -3249 3768 -4748 -5898 4071 -352 -6660 1828 3178 -6721 -2749 4719 -3828
417 -3828 -6310 3702 632 -6895 1014 4075 -5398 -2622 5051 -2095 -5002 4384 1067 -6736 1259
432 1259 4177 -5280 -2237 5902 -1336 -4807 4521 2298 -5839 384 4637 -3832 -2143 5291 -971
447 -971 -4691 3769 2294 -5332 1438 5475 -3697 -2273 5979 -731 -5403 3108 2752 -5038 521 5286
463 5286 -3340 -2598 5149 -597 -4909 3735 2906 -4927 946 5375 -3626 -3377 4920 340 -4856 3950
479 3950 4305 -4234 233 5315 -2641 -3024 5540 1609 -3583 3974 4626 -4092 658 6379 -1203 -1323
495 -1323 6898 3173 -2757 4273 5589 -2486 964 7188 381 -512 7409 3588 -2305 4600 5950
510 5950 -1950 1683 8278 1405 -303 6825 3868 -2529 3896 6505 -813 1935 7552 1576 -1316
525 -1316 5823 3192 -2676 3974 6454 -1391 994 7240 688 -2078 5595 4316 -2181 3801 6656
540 6656 -767 246 6690 1838 -1005 5960 4643 -1094 4096 7650 337 1531 8387 3171 -136
555 -136 7206 6646 128 5368 9226 2024 3106 9328 5178 1460 8511 8174 1638 6653 10617 3360
571 3360 3465 10339 5889 1768 9034 9310 2612 6281 10424 3451 2661 9057 5589 1901 7936 8750
587 8750 1458 3894 7975 1002 832 7906 4410 -475 5218 5230 -2483 207 4721 -583 -1596 4762
603 4762 1638 -3964 573 1144 -5757 -2888 2341 -3083 -4460 1423 -2276 -8118 -3016 -1498 -7204
618 -7204 -4375 850 -4440 -7201 -1470 -4649 -9897 -4053 -1066 -7041 -5133 91 -6058 -9358 -2648
633 -2648 -3990 -8747 -2990 48 -6409 -5362 -700 -5885 -7923 -1615 -2331 -6602 -1956 191 -5919
648 -5919 -5315 -313 -4519 -7210 -199 -570 -6410 -2130 708 -5819 -5933 229 -3216 -5997 -532 -536 -6552
665 -6552 -3476 -165 -6132 -5565 260 -3434 -6803 -1372 -1716 -7243 -3908 -339 -5819 -6183 -398 -3599
681 -3599 -7342 -1851 -1497 -6974 -3802 -242 -5551 -6304 -171 -2391 -6316 -838 -280 -5288 -3619 602
697 602 -3608 -4322 1510 -499 -3795 945 1341 -3615 -1448 3665 -1177 -1357 4711 2747 -1780 2825
713 2825 4151 -1533 1319 6253 2554 939 6127 4448 -355 3860 6120 1383 3349 8082 3668
728 3668 1092 6075 4374 -91 4413 6966 2080 2831 7029 2140 -683 4501 3686 -655 3355 5953
744 5953 54 98 4260 62 -2388 2654 2660 -2347 1232 3387 -2767 -2759 1701 -1512 -3809 1254 841
761 841 -4301 -1372 524 -4579 -4219 648 -2107 -5115 231 -313 -5486 -3090 -193 -4330 -4621 600
777 600 -1584 -5069 -648 -616 -5327 -2450 750 -3264 -3493 1191 -1336 -4625 -182 755 -4186 -1722
793 -1722 1838 -2378 -3037 1789 -393 -4096 218 1249 -3406 -1308 2154 -1817 -3014 1655 177
808 177 -3548 229 1100 -3248 -1591 2018 -2043 -3046 1429 -152 -3876 -347 1154 -3599 -2163 1987
824 1987 -1632 -3854 1245 -581 -4906 -740 1221 -3492 -2460 1463 -1762 -3841 331 -591 -4320
839 -4320 -870 1210 -2765 -1935 1700 -1706 -3348 937 680 -3374 -280 2479 -2274 -1771 2639 -534
855 -534 -2486 1742 1939 -1920 692 3012 -886 -517 3277 635 -1723 2918 2906 -1442 1165 3860
871 3860 -483 -329 3989 1852 -1147 2987 2840 -1143 1027 3858 -91 -355 3885 1594 -1351 2388
887 2388 3322 -1339 798 3610 -191 -975 2834 1111 -1671 1244 2327 -2203 -230 2774 -465 -1557
903 -1557 2430 729 -2653 999 1963 -2116 -589 2650 -913 -2181 1722 333 -2723 376 1928
918 1928 -2081 -1055 2267 -613 -2166 2088 983 -2335 933 1966 -1742 -1015 2399 -577 -1921
933 -1921 2079 1607 -1755 938 2623 -900 -1154 2645 246 -1308 2340 1829 -1402 940 2548 -1013
949 -1013 -583 3270 520 -1031 2192 1758 -1251 943 2997 -626 -554 3045 1217 -1371 2410 2002
965 2002 -1694 565 3135 -18 -698 3057 1332 -1514 1763 2281 -1289 764 3142 95 -457 2921
981 2921 918 -1822 1603 2322 -1405 279 3115 -521 -1307 2296 631 -2007 1372 2437 -1444 -196
997 -196 2775 -597 -1467 2026 714 -1933 1326 1970 -1377 -539 2062 -865 -1653 1756 1145 -2085 710
1014 710 1935 -2111 -803 2070 -651 -1956 2036 598 -2111 824 1828 -1976 -1050 2065 -403
1029 -403 -1951 1357 811 -2111 194 1598 -1503 -1204 1909 -355 -2035 1264 806 -2269 198 1668
1045 1668 -1517 -1076 1940 -108 -1853 1246 1017 -2290 95 1944 -1056 -905 2181 35 -1765 1334
1061 1334 1363 -1856 -127 2021 -949 -996 1980 204 -1672 1284 1611 -1660 269 2658 -304 -504
1077 -504 2162 849 -1694 1406 1897 -1171 120 2253 -4 -1130 2398 975 -1628 1101 1727 -825
1093 -825 121 2713 -216 -1230 1845 1043 -1154 1296 2104 -1231 141 2222 -223 -1161 2169 1148
1109 1148 -1479 709 1916 -1146 -495 1938 -448 -1653 1705 812 -1696 869 1420 -1440 -897 1751
1125 1751 -404 -1523 1017 797 -2298 -180 1170 -1824 -1148 1683 -544 -1782 748 246 -2428 -698
1141 -698 808 -1795 -1322 1276 -354 -2713 570 233 -2586 -458 897 -1688 -1492 1245 -716 -2356
1157 -2356 391 357 -2311 -496 1418 -1553 -2051 994 -815 -2159 -27 744 -1855 -596 998 -1221
1173 -1221 -1934 514 -721 -2527 60 580 -2216 -1070 853 -1701 -2148 649 -295 -2452 286 731
1189 731 -2184 -1044 786 -1253 -1874 1095 -261 -2169 -153 763 -1888 -769 1377 -914 -1613 987
1205 987 375 -2004 139 1094 -1768 -474 1855 -412 -1383 1316 688 -1745 258 1559 -1197 -549
1221 -549 1921 76 -1173 1446 1312 -1141 577 1824 -674 -352 2229 621 -767 1646 1267 -989
1237 -989 587 1921 -600 -195 2349 451 -941 1464 1492 -1108 620 1870 -121 -498 1937 367
1253 367 -1322 1126 978 -1460 -8 1653 -685 -821 1175 -232 -1980 564 657 -1434 -367 867
1269 867 -1152 -1668 564 -540 -2601 154 468 -2024 -953 878 -1612 -1882 436 -490 -2043 73
1285 73 707 -2063 -1361 297 -1469 -2105 317 -243 -2148 -502 418 -2018 -1479 975 -951 -1858 740
1302 740 -310 -2429 -440 735 -1814 -1418 1183 -978 -1845 594 -126 -1907 -134 836 -1550 -788
1318 -788 1416 -467 -1359 875 167 -1752 -1 1326 -916 -695 1147 -165 -1551 527 574 -1458
1334 -1458 -28 1264 -1142 -1037 1408 208 -1439 733 900 -1491 -311 961 -645 -1069 1442 -493
1350 -493 -1395 480 796 -1274 -227 1448 -676 -1083 1197 304 -994 856 1224 -1148 83 1763
1366 1763 -361 -516 1621 699 -1049 785 1569 -388 244 1753 -14 -538 1752 947 -742 1154
1382 1154 1773 -249 140 1665 242 -333 2047 1240 -515 1182 2007 -281 389 1949 191 -616 2088
1399 2088 879 -404 953 1626 -845 -280 1780 17 -802 1597 1073 -1103 280 1493 -847 -696
1415 -696 1427 -234 -1236 955 520 -1555 132 1093 -957 -726 1104 -177 -986 597 576 -1582 -198
1432 -198 1010 -885 -599 996 -348 -1247 642 565 -1546 10 1144 -350 -709 1175 29 -1267
1448 -1267 802 1002 -1062 -127 1184 -238 -680 1327 562 -1012 774 1191 -563 14 1489 -317
1464 -317 -757 1429 645 -694 699 1500 -701 -26 1587 -191 -597 1611 891 -790 679 1225 -726
1481 -726 -100 1473 187 -495 1270 742 -592 661 1217 -806 -383 1582 9 -996 1251 464 -998
1498 -998 585 1304 -822 -461 1013 119 -807 841 892 -959 525 1273 -611 -429 1181 147 -817
1515 -817 653 795 -1043 330 1090 -478 -630 1019 -104 -955 510 675 -1059 25 1122 -687
1531 -687 -688 744 -328 -863 640 650 -777 -105 853 -675 -848 990 131 -979 628 859 -1185 -362
1549 -362 603 -585 -745 837 -34 -1527 26 654 -1282 -687 853 -835 -1296 889 -186 -1291 550
1566 550 731 -1251 -636 846 -773 -1149 769 44 -1659 304 558 -1116 -513 733 -396 -1177 886
1583 886 284 -1291 159 885 -661 -389 967 -396 -1107 828 214 -1123 92 837 -789 -339 959
1600 959 -447 -774 288 475 -1260 378 946 -660 -487 1093 -193 -702 964 770 -732 -23 1212
1617 1212 -563 -519 1148 -41 -891 578 733 -723 274 984 -309 -136 1130 264 -740 532 976
1634 976 -762 419 1203 -512 -385 970 139 -743 520 691 -771 -116 877 -624 -802 656 318
1651 318 -575 510 828 -380 -397 915 -662 -714 942 21 -870 41 765 -836 -289 873 -280 -756
1669 -756 741 138 -932 -2 374 -866 -339 1085 -298 -823 445 241 -1067 363 567 -984 -344
1686 -344 643 -286 -1040 578 -83 -1263 -92 591 -768 -323 758 -389 -996 120 281 -946 -176
1703 -176 741 -587 -728 401 -128 -911 464 225 -766 -203 658 -529 -730 488 -237 -996 537 435
1721 435 -994 83 768 -821 -731 964 245 -581 676 561 -766 -78 636 -243 -416 1021 133 -962
1739 -962 361 467 -832 -311 1042 -550 -423 941 487 -847 479 859 -618 -147 1051 -27 -682
1756 -682 523 509 -375 509 778 -321 -202 680 -80 -400 867 94 -661 463 378 -608 -478 816 -142
1775 -142 -682 787 250 -594 176 869 -645 -54 515 76 -763 418 85 -972 -8 753 -508 -656
1793 -656 856 -102 -844 469 256 -821 109 428 -578 -588 703 -435 -706 442 367 -915 -193 532
1811 532 -635 -759 387 -59 -930 315 328 -592 -165 474 -778 -665 659 -163 -1148 376 329 -993
1829 -993 -182 706 -617 -610 186 17 -736 -148 387 -577 -305 701 -433 -401 637 164 -568 279 320 -997
1849 -997 -161 803 -265 -335 609 179 -687 256 598 -554 -450 560 -265 -632 915 408 -858 191
1867 191 707 -483 -276 627 17 -416 433 33 -561 159 737 -259 -223 928 111 -561 437 168 -231 495
1887 495 461 -52 -329 801 214 -350 645 621 -499 219 688 -436 -120 664 122 -559 710 398 -393
1906 -393 -54 829 -546 -105 782 10 -554 387 757 -505 168 740 -244 -445 524 141 -293 128 348
1925 348 -650 -94 587 -80 -649 470 -101 -786 272 441 -573 25 627 -335 -570 541 125 -744 49
1944 49 398 -686 -342 714 -302 -514 586 235 -872 -74 322 -525 -601 640 -165 -440 293 -69 -683
1963 -683 -181 306 -643 -267 197 -264 -742 465 -9 -591 37 333 -779 -38 321 -302 -594 215 413
1982 413 -482 -56 416 -315 -23 511 -189 -681 599 221 -476 120 785 -424 -398 289 -49 -375 374 499
2002 499 -328 -9 802 -315 -468 742 119 -470 515 682 -556 95 566 -101 -139 472 354 -478 383
2021 383 452 -292 103 645 -51 -338 574 336 -760 214 623 -482 1 475 -55 -350 460 52 -653 73
2041 73 443 -508 -211 625 -29 -584 417 176 -571 219 569 -434 -391 618 -98 -648 205 432 -453 248
2061 248 389 -463 -356 263 -119 -447 383 202 -611 191 290 -285 -204 413 -23 -651 251 372 -375 -211 238
2082 238 -450 -346 485 -92 -523 391 402 -647 -78 288 -306 -481 557 -278 -530 140 344 -549 -112 330
2102 330 -533 -267 353 11 -513 192 385 -492 -116 583 -79 -227 441 -72 -236 453 624 -261 -406 368
2122 368 -215 -313 281 186 -603 -5 697 -346 18 530 -237 -229 298 254 -576 41 263 -378 -153 533 -53
2143 -53 -472 260 191 -636 -105 163 -318 -122 817 91 -43 482 304 -230 390 439 -450 -145 487 160 -242
2164 -242 412 399 -339 147 456 -330 -458 518 305 -789 649 49 -595 23 483 -273 -217 490 -199 -595
2184 -595 125 74 -581 -311 661 -324 -280 416 65 -438 327 208 -783 -350 238 -436 -510 439 19 -620 -168
2205 -168 264 -476 72 526 -135 -683 137 -171 -561 -16 115 -504 -79 314 -403 -527 177 222 -395 -21
2225 -21 432 -336 -189 421 49 -431 365 79 -736 321 651 -359 98 500 -130 -443 503 225 -370 122
2245 122 208 -378 -218 440 -9 -511 404 442 -522 -71 382 -387 -221 500 84 -263 434 292 -553 16 570
2266 570 -552 291 589 38 -191 365 508 -327 -92 400 160 2 538 182 -390 244 234 -293 286 405
2286 405 165 -136 638 17 -441 168 109 -338 94 522 -122 202 811 141 -454 375 264 -419 152 144 -161
2307 -161 -372 202 -104 -291 52 495 -210 -244 652 -298 -349 276 -48 -291 39 298 -290 28 239 -201 -451
2328 -451 358 23 -655 -94 386 -502 -361 435 -306 -319 417 -14 -488 120 27 -354 -243 569 -212 -391 111
2349 111 146 -566 -19 334 -736 9 214 80 -663 1 155 -564 98 368 -240 -232 277 -195 -549 265 0
2370 0 -338 -182 369 -315 -473 88 -33 -564 233 199 -206 -98 253 -83 -285 358 296 -485 224 132 -425 -21
2392 -21 253 -354 -146 504 -144 -259 192 362 -206 -179 644 -255 -230 356 90 -192 442 653 -361 -23 515
2413 515 78 -551 432 204 -290 -20 386 -165 -41 203 -198 -160 412 89 -353 218 130 -91 55 295 0
2434 0 -493 240 -19 -129 74 475 -233 -246 457 52 -565 346 142 -359 133 224 -225 -274 363 -90 -536 265
2456 265 269 -193 -27 285 -590 -99 159 -173 -398 138 27 -584 -140 117 -477 -425 206 -199 -468 186 81
2477 81 -608 -139 34 -631 -266 298 -31 -317 68 -183 -292 -448 247 -131 -550 518 -177 -565 -195 278
2497 278 -322 -76 152 -205 -329 436 281 -307 182 699 -555 -491 313 50 -288 511 104 -242 147 638
2517 638 -109 -161 567 -67 -153 338 95 9 293 181 117 180 496 168 -257 403 88 -44 462 248 -30 -151
2539 -151 573 56 -218 405 516 -212 569 536 -218 24 639 251 -148 386 72 -169 122 343 127 57 417
2560 417 -70 -221 503 68 -250 184 454 -164 -36 554 14 -372 241 378 -342 99 348 -319 -315 201 351
2581 351 -383 -105 129 -341 177 437 -73 -140 261 -37 -98 14 384 -182 232 539 -12 -268 372 200 -254
2602 -254 201 -93 -607 17 313 124 -291 365 -29 -438 -253 88 -397 -511 324 -186 -193 319 -20 -283 -329
2623 -329 199 -120 -185 242 -180 -742 30 464 -193 -188 99 -465 -279 103 52 -241 -23 -59 -399 62 182 -225
2645 -225 -310 255 -209 -554 181 277 -601 -57 38 -440 -226 311 64 -499 97 153 -106 96 109 49 -89 383
2667 383 -182 -362 -56 337 -337 127 171 -368 -273 531 205 -40 211 396 -302 109 461 -60 -56 139 -28
2688 -28 -211 494 258 -250 79 281 157 -96 158 -24 -463 430 529 -125 -37 305 -68 -299 537 213 -236
2709 -236 113 176 -224 -127 337 -139 -416 319 -52 -318 144 210 -250 -56 366 -313 -286 533 -109 59 248
2730 248 212 -369 121 198 -430 -357 211 72 -224 367 258 -148 -115 266 -107 -447 375 329 -487 316 310 -3
2752 -3 -120 309 -13 -217 422 493 -248 -100 247 -28 -92 288 237 -310 140 301 -327 -100 452 17 -190 550
2774 550 380 -40 265 143 -251 -312 73 -123 7 323 -32 -361 110 79 -185 -9 163 -341 -128 242 106
2795 106 -301 -79 184 -72 -102 378 -217 -398 273 49 -534 16 70 -118 -118 349 286 -180 272 -89 -256 120
2817 120 142 -374 247 438 75 -86 406 226 -312 7 192 -168 42 380 20 -458 327 206 -599 -505 446
2838 446 -352 -255 308 -357 -413 365 69 -347 -220 138 -274 -276 526 212 -286 134 40 -376 20 444 -315 -61
2860 -61 319 -6 -486 -30 216 -139 -173 239 -438 -232 78 -146 -339 199 249 -260 -301 257 -315 -153 -79 -146
2882 -146 -382 -166 -2 -157 63 369 -134 -519 387 -34 -357 55 26 -373 -140 475 -31 -408 186 4
2902 4 -12 198 32 -160 -101 309 -60 -160 256 133 -201 241 361 -554 -196 296 226 -48 100 230 -145 228
2924 228 236 -48 52 295 -113 -370 179 225 29 29 326 -71 -316 197 34 -176 666 172 -167 30 225 -293
2946 -293 7 127 281 -290 259 -70 -158 258 204 -148 -402 -44 -210 -578 252 224 -181 -28 -16 -35 -265 170
2968 170 7 -157 -190 178 -474 -110 79 -497 -215 347 31 -258 -81 131 -433 -66 300 81 -488 185
2988 185 -247 -478 50 361 -49 -191 111 -174 -192 192 287 -450 233 258 -178 -136 381 52 -328 239 -53
3009 -53 -283 200 275 -171 -348 427 -198 133 -15 -60 -279 -147 66 -194 44 438 163 -124 351 95 -235
3030 -235 -233 346 92 -164 215 -118 -382 35 320 -88 226 337 -90 -181 364 201 -7 73 -36 -82 214 181
3052 181 -91 -164 371 123 -158 325 48 -160 42 246 153 143 222 -8 -364 170 1 -313 -159 215 145 -3
3074 -3 296 28 -386 114 246 -241 324 254 -144 -90 169 146 -294 455 21 -139 -28 652 -291 189 198 205 -11
3097 -11 263 226 -278 -162 329 204 -200 327 47 -230 236 41 -219 42 165 -14 -178 152 262 -87 -83
3118 -83 353 -294 165 45 -29 -462 -226 63 -376 -47 102 -265 -303 -101 -201 -552 192 23 -174 -224 182
3139 182 -303 -461 135 -170 -410 251 50 -231 -51 182 -196 24 -57 -168 -482 13 -81 -235 96 212 -38
3160 -38 -270 196 134 -196 191 152 -79 -285 196 -165 -124 -13 -35 -72 230 118 -276 113 464 45 157 301
3182 301 67 -83 359 208 -367 -109 -45 -71 -248 389 67 71 -10 -35 422 246 198 227 195 282 300 -23 292 353
3206 353 337 -466 315 104 -60 143 254 -155 233 229 -409 7 247 -41 -351 412 477 -239 89 154 -80 -65
3228 -65 200 179 -189 -120 267 51 -153 259 -132 -235 226 40 -104 195 256 -146 -189 23 -169 -273 117 -129
3250 -129 -590 -51 -74 -64 29 512 -141 -177 283 118 -22 -105 131 -225 -138 419 50 -153 106 366 -522 304
3272 304 147 -336 -253 282 -71 -147 27 189 -19 -151 -27 -231 -92 254 -108 -342 309 145 -363 264 169
3293 169 -416 -84 283 316 -169 -1 -44 -483 -285 -76 -62 -324 21 -57 -91 112 -176 -379 -124 -194 -214 -57
3315 -57 195 -91 -262 -205 -47 -68 -56 183 -239 -262 159 -137 -393 203 117 -108 -128 170 -37 -140 151 -161
3337 -161 -21 136 119 -254 2 261 -84 -173 99 19 -430 -121 395 -89 75 259 105 -216 -26 -38 -176
3358 -176 205 -180 27 157 253 -66 -170 -43 -182 -696 45 132 210 -2 412 -57 -118 62 -1 -420 -314 219
3380 219 -327 -125 244 -75 -225 51 214 -244 130 66 -418 -162 51 -24 -276 -56 143 -3 -137 56 119
3401 119 -212 367 -172 -35 -30 2 -58 -33 451 89 -117 210 -93 -87 473 110 238 -76 433 28 127 197 -297
3424 -297 -159 262 194 -98 169 44 -235 -124 131 72 -211 53 159 367 124 508 68 -159 103 339 -115
3445 -115 -93 19 78 185 -65 -214 -385 120 204 86 -279 199 -221 -214 107 -65 -10 349 -80 27 -115 192
3467 192 -229 -165 264 24 -93 335 -31 -175 16 31 -107 -130 292 -78 -196 471 -63 -305 41 42 -196 147
3489 147 -122 -77 -400 187 -47 -243 -98 173 43 -230 76 -142 -174 55 192 -159 102 -221 -194 -44 168
3510 168 -29 -161 214 114 -375 -152 110 -193 -211 -59 93 -248 53 236 -435 65 32 -112 28 83 -43
3531 -43 -261 16 -22 -188 84 215 -264 -243 -65 -245 87 53 142 -79 151 372 -52 -298 106 126 269 99
3553 99 -181 -110 -247 110 92 -519 201 51 -283 -124 -172 -196 -109 -114 95 -454 -112 57 35 135 86 -183 -227 249
3577 249 61 42 227 -16 -149 104 -16 -17 44 66 40 -35 448 -4 62 138 260 195 -38 452 -129 -140 343 -10
3601 -10 -8 243 193 236 -343 234 12 -220 389 -165 -194 371 348 72 -214 253 283 -180 -60 -84 -320 -143 146
3624 146 -170 -63 202 -264 -650 82 258 -142 6 116 -319 -387 44 -160 -294 118 89 160 111 400 -9
3645 -9 53 61 7 274 343 67 -410 11 28 -250 -146 217 331 -26 -144 115 -92 -101 259 -196 -45 265 241 -228
3669 -228 -74 226 23 32 90 -125 -140 89 260 -229 119 -162 -243 217 298 -47 35 -157 -167 169 302 59 8
3692 8 -120 144 251 116 4 153 -29 -15 118 -178 -92 -19 129 -388 243 36 179 359 233 -26 57 190
3714 190 -181 -121 -24 -5 -125 15 150 29 23 45 -86 -124 18 171 -41 186 -26 -98 47 531 -131 -234 208
3737 208 158 -180 157 -25 -266 5 29 -53 95 193 234 82 50 76 194 61 341 19 77 -216 377 23 56
3760 56 300 -88 -5 -39 -287 -364 168 -45 5 293 56 -34 -501 272 98 -206 5 101 -314 -52 256 -2
3782 -2 -64 147 177 -259 57 -104 37 -104 -76 104 -294 46 11 -185 150 123 -141 -242 57 34 -77 -200 -74
3805 -74 133 -79 32 -26 -12 7 -201 -139 91 -159 -353 -99 -25 -69 -51 271 274 -335 78 253 -259 11 -15 95
3829 95 151 93 68 -334 115 309 197 -84 156 58 -326 98 -37 -157 266 -84 -242 -375 281 151 -83 38
3851 38 64 89 72 173 -299 -190 139 166 -263 290 157 -116 -121 18 -78 342 -124 -409 -37 154 160 46 45 509
3875 509 -107 10 396 -123 -203 260 -17 -248 6 -63 -241 -84 -185 191 -152 -66 -411 -320 -6 -41 -61 -222
3897 -222 109 -224 87 -152 -27 27 227 387 -51 26 168 -156 -57 -109 98 19 -70 7 -31 3 10 137 -232 -22
3921 -22 79 -12 17 396 -281 32 59 35 30 -19 166 -136 135 276 128 -44 -106 226 -10 85 437 -114 20
3944 20 122 -69 -211 -127 171 -14 -124 438 -153 -182 135 114 21 6 72 -101 -31 93 222 277 -11 -19 -18 118
3968 118 21 -63 -286 -80 83 -89 189 -230 -154 135 -6 -12 197 -1 -162 -35 77 -146 54 -43 380 -235
3990 -235 74 289 -110 -178 136 -50 -71 150 66 -64 33 352 -118 62 -26 93 -21 174 377 -95 -103 332
4012 332 -146 67 311 -136 -24 221 -24 -125 240 363 -148 -195 501 24 -6 -27 -60 -45 205 96 189 32
4034 32 306 -19 -139 -183 -128 -250 -262 -19 -166 -160 401 81 -448 184 394 76 49 -172 -243 85 289 -59 -376
4057 -376 -50 356 91 -153 89 -147 -131 225 -141 -17 -7 -171 117 104 359 -6 -562 58 -111 -117 -261 189
4079 189 -190 264 225 178 146 -160 371 24 -295 146 126 -27 45 97 -220 172 49 -241 197 26 51 -84
4101 -84 -120 185 4 -56 78 11 -45 329 -48 -249 43 -12 -141 -90 -205 -167 -36 276 205 124 69 -43 -114 52
4125 52 277 -280 46 213 197 33 92 -26 133 -27 285 31 -38 -36 -24 -256 87 70 73 124 116 131 -298 -167 -86
4150 -86 -6 60 34 -203 295 177 11 72 165 123 -163 291 50 -198 138 -72 165 -115 147 -54 -14 -68 -64 -142
4174 -142 -208 -190 -30 66 -10 -337 -221 -180 68 -169 -277 25 -136 -72 -22 19 -94 -107 104 -182 263 -27 -187
4197 -187 -147 198 -63 -179 121 26 -265 -226 -141 -238 -69 46 -7 43 114 156 -88 -256 -39 -10 -133 270 32
4220 32 -128 -26 -115 -233 -89 87 396 -61 174 120 -59 1 128 -117 42 106 149 95 188 67 -237 473 -75
4243 -75 -45 120 197 -42 94 307 2 132 -95 202 -212 106 358 221 116 287 270 -39 137 147 -173 -225
4265 -225 151 112 -28 45 115 -229 -440 106 -94 5 294 -16 6 171 202 -491 -5 167 -44 -13 29 -179 -226
4288 -226 -148 131 -17 2 220 -296 239 111 22 -272 -209 142 85 43 93 -17 26 16 -202 -50 -142 160 -110
4311 -110 33 106 -104 -264 -49 -6 -116 -17 -94 -13 30 45 -327 -427 77 -50 -219 54 116 -307 -26 183 6
4334 6 44 95 -14 160 -162 141 -136 -156 183 50 -261 -10 61 -317 -192 -181 162 105 415 -287 -294 -243 -104 -27
4358 -27 71 100 42 -102 158 113 -238 -96 213 -299 370 367 -134 58 306 -276 -434 89 -131 -47 -157 171 0
4381 0 -281 154 -119 -285 131 -100 94 56 -121 53 -92 -22 43 -37 48 110 -309 101 67 -106 4 340 172
4404 172 73 486 -34 -24 -315 218 -210 53 35 -61 -1 100 -36 220 73 87 170 -110 -141 111 -161 23 174
4427 174 -275 -210 215 -262 -43 73 -67 29 -166 202 -46 191 61 80 -125 276 82 130 -106 52 349
4448 349 -196 -17 171 -29 105 -157 -139 -244 -45 -223 -425 -8 -206 85 209 242 -273 34 202 36 8
4469 8 -361 -123 -196 123 -10 -138 81 -31 -230 -191 73 -23 147 18 200 50 64 59 -73 -465 77 -149 -164
4492 -164 -196 -7 -260 -146 203 -138 22 148 207 -74 -6 357 -99 141 -139 144 221 -22 -157 -77 -199 106
4514 106 -32 -41 -87 107 -57 287 -253 -8 -120 371 -123 -57 77 -88 176 49 219 -36 -22 189 -211 65
4536 65 50 -208 113 -177 30 -347 -37 -60 9 -128 111 -171 -131 66 22 -65 -22 -52 -422 -151 -16 205 -52
4559 -52 16 14 239 -77 -19 115 -19 97 -35 -226 126 -106 -36 191 264 -108 -249 151 -185 -156 122 100 -32
4582 -32 -17 -55 -182 -3 -45 -14 -329 -41 -46 -89 -167 -51 -76 -108 -90 -140 130 71 -148 -188 -8 239 -106 -224 24
4607 24 -146 -144 185 -146 45 -134 135 -45 -143 29 273 104 118 -23 -26 22 16 16 -126 208 -119 -125 157 -237 -153
4632 -153 185 -131 -88 80 120 -225 -87 -172 316 -16 -210 222 -266 -131 130 -47 12 -199 -208 -72 129 17
4654 17 129 -21 68 220 58 413 57 -94 -33 -133 99 59 186 -75 -163 -67 75 35 -100 122 -105 -170 -22
4677 -22 230 -82 -82 161 -218 -72 84 -67 253 118 188 -33 -167 120 -46 -241 -155 224 -67 -71 28 -86 165
4700 165 56 -56 76 -105 -220 -43 -279 112 -49 -49 114 -163 -105 167 401 -279 16 93 252 -42 149
4721 149 200 -152 140 133 -42 262 -13 -99 24 199 -59 181 31 150 -208 228 -6 -50 100 -189 27 -145
4743 -145 13 42 -173 -78 199 104 111 73 239 252 -187 41 -64 -142 55 101 -114 220 129 -249 -57 117 -8
4766 -8 137 143 176 -302 59 -19 68 135 153 101 27 149 29 -30 91 257 25 -70 -78 -99 55 -166 -110 52 -167 -50
4792 -50 181 64 153 212 131 230 -65 -135 62 27 -269 -290 -172 16 103 58 -211 13 244 92 -2 -152 29 65
4816 65 225 20 61 285 114 216 -2 -106 -24 15 128 -11 -114 12 81 125 -10 79 159 67 17 29 152 -134
4840 -134 129 128 130 73 98 -129 -232 48 -168 -109 165 87 105 85 161 122 45 -50 -18 -394 163 -175 -72 279 86
4865 86 5 -148 0 85 -40 93 -342 -157 -143 149 -156 166 -90 189 68 139 344 -56 234 34 130 115
4887 115 195 73 153 -110 66 -51 -14 107 275 167 65 118 -192 -209 210 -159 -276 -75 100 -40 -62 -127
4909 -127 -118 -51 254 81 -121 -53 -134 97 -68 255 -272 33 -88 -69 40 -62 -197 -92 -24 97 -299 73
4931 73 24 -43 134 77 13 -38 42 65 137 46 133 -193 -172 -417 -110 19 92 -189 -199 -91 -91 62 138 191 -161 37
4957 37 -219 29 -104 -132 -115 -416 -86 265 -37 -279 124 -35 -81 -162 64 16 -168 117 29 -351 -23 248
4979 248 -267 325 99 11 40 -23 296 -130 82 135 87 122 104 126 -52 -28 135 12 291 96 16 -109 -136 67
5003 67 -99 -100 -33 147 -146 59 73 4 203 -43 103 17 -200 -69 32 42 164 20 -154 236 -198 170 186
5026 186 -230 -152 -64 208 105 -26 22 -137 290 25 172 8 151 -35 -26 -375 23 -176 211 304 54 237
5048 237 12 9 -357 196 -264 -116 82 5 -238 90 47 229 245 -155 182 235 -50 8 -206 -162 -38 -34 235
5071 235 68 -96 -296 -142 -9 103 -44 -32 203 79 85 157 -75 -109 91 -15 263 102 -31 4 130 206
5093 206 -432 -63 -13 -37 51 -31 -51 -282 -481 190 -221 -234 -201 -322 -28 -103 118 104 -167 -245 -411 -243 354
5116 354 -132 192 -97 10 -167 82 79 223 177 -134 -4 99 289 80 -485 54 308 -115 175 -47 63
5137 63 -129 -17 -52 -161 149 -31 3 -16 201 -20 -157 133 357 180 -94 -119 3 -87 -46 -74 -170 -69 -122
5160 -122 -43 144 32 100 11 39 -98 -58 215 -52 -177 -47 79 88 -302 194 51 -226 186 -170 -109 33 -31
5183 -31 -346 166 -11 240 57 103 249 -171 -3 -88 20 -319 -274 226 154 166 -30 -283 141 47 -98 198
5205 198 -117 -42 154 142 5 -155 -155 -95 -197 -348 70 -8 -100 -22 -92 20 -68 125 128 27 115 83 -163 131 -142
5230 -142 -50 73 272 106 267 -93 -34 -145 99 80 112 220 -61 -13 125 118 57 98 -74 87 48 244 41
5253 41 251 -61 34 122 -149 -136 -44 3 51 -122 -114 -64 -17 -77 -120 289 343 31 224 180 -150 -6 145 131 -102
5278 -102 -41 479 -228 199 364 15 -54 -137 40 -360 198 -61 -92 -57 212 -57 -207 -127 70 -98 87 122
5300 122 -142 272 -173 13 -25 138 151 -73 -135 -25 -98 42 5 -7 -407 -16 -44 -290 292 222 -138 237 149
5323 149 165 -151 -36 -124 -113 102 -46 -158 -203 -108 0 -321 -34 -192 183 -91 -169 -246 12 45 232 -140 -76
5346 -76 160 -179 -231 155 5 223 -24 -100 -49 87 -171 -215 275 181 113 -31 33 -90 -42 -149 53 -253 367
5369 367 -83 -54 -118 -175 152 -347 -47 -100 -26 122 -40 -108 -131 5 -313 -53 92 -51 329 306 -145 -167 137
5392 137 17 85 -62 -104 29 123 2 -193 -101 11 -81 6 -97 -341 -61 77 66 138 -96 -65 10 35 50 201
5416 201 35 -229 229 183 3 -134 -84 -101 -192 36 263 113 -7 15 331 -274 71 139 -133 68 152 -83
5438 -83 -151 -17 -310 -103 -222 249 156 -38 168 -76 -44 184 -218 73 -121 59 160 -271 -69 -103 67 204
5460 204 267 19 5 -29 98 49 167 2 181 -178 -166 -59 28 -140 -58 122 0 26 235 -70 179 37 -186
5483 -186 70 70 67 117 -194 -85 -122 52 214 25 -74 26 17 194 -23 -97 204 48 13 -213 156 -5 -131 -219
5507 -219 -191 221 204 5 -87 -187 118 -7 -95 205 -39 17 284 179 95 -150 137 79 -163 -61 18 -102 55
5530 55 -220 -104 64 161 -237 -174 142 -70 -171 -240 -228 -204 107 14 198 -221 113 76 6 -187 225 14 96
5553 96 256 -53 -64 -436 303 53 157 50 -151 -34 -38 -109 256 -168 253 235 280 -96 -176 218 97 58 -53
5576 -53 34 99 -109 35 33 -144 296 -174 -115 -231 -147 -49 23 -9 -67 -93 35 -117 202 -13 54 125 -152 211 75
5601 75 374 -148 156 26 185 23 -74 46 -327 47 -35 339 82 41 -267 231 281 -50 -260 138 -67 -48
5623 -48 -67 184 8 -68 -178 -84 141 135 -224 -77 93 -231 -228 97 -2 92 38 -34 -221 -71 269 270 17 122 337
5648 337 69 -128 52 -217 -27 70 -82 -60 -42 34 -82 -77 -97 -41 -325 159 149 -6 -198 125 39 -59 38 -170
5672 -170 83 -173 55 19 -44 14 -139 14 72 -39 -55 386 -54 164 133 -75 12 98 -248 32 -88 -15 -186
5695 -186 -290 -176 -153 8 -141 168 -89 63 -118 158 -66 -195 -25 -69 -99 -179 -78 -159 -89 -90 131 306 -16
5718 -16 165 125 -142 30 57 -15 -285 -104 91 -280 148 226 32 -259 59 -201 229 -283 175 226 91 134
5740 134 97 -153 -42 2 224 -102 32 -45 -33 -122 -81 66 -23 168 208 183 34 129 20 101 3 -35 88 36 -112
5765 -112 89 -93 -118 -107 -228 144 -252 -15 -41 74 -143 105 214 -8 -256 91 -171 -20 -120 -247 58
5786 58 113 53 8 29 69 150 40 -50 146 203 97 118 -206 309 47 -57 19 201 221 -144 13 -169 -405 -186
5810 -186 -279 -14 -151 -285 -96 -5 -223 -104 -82 -101 -97 95 199 38 -109 -213 67 -130 -132 -293 151 -161 143
5833 143 259 176 14 -258 -85 90 239 -39 256 173 -151 -257 -149 -72 -35 -156 -278 9 81 70 -44 -85
5855 -85 -142 54 65 23 -20 17 30 -26 16 -35 -203 78 14 355 -209 191 -244 -75 153 36 -13 102 375 14
5879 14 -52 -51 -133 -88 67 -242 37 132 163 -221 -155 -135 235 -179 107 20 101 -58 -55 186 -216 -51 132 -116 231
5904 231 91 308 -98 18 -83 119 250 -63 175 -81 -59 -134 176 -185 36 -6 103 -335 -152 12 -69
5925 -69 -350 -48 164 -110 21 93 312 49 179 230 141 -236 89 109 -63 -172 -57 -8 -38 309 -157 76
5947 76 16 244 -2 190 -141 81 46 1 52 -5 176 141 -126 -348 256 16 -94 76 -51 -80 266 111 167
5970 167 104 54 83 -30 -231 29 124 284 -65 -98 -122 125 -111 59 87 26 107 -137 92 141 -80 118 56 -208
5994 -208 -18 -67 -19 -49 -23 -389 33 53 219 53 87 -185 43 -8 -175 -197 64 8 -154 -122 -14 -219 -44
6017 -44 16 40 -89 22 178 -72 -5 -285 6 -52 -126 -20 38 -63 -37 -258 225 287 -84 84 201 -54 128
6040 128 189 -64 -323 174 -14 -2 23 197 -412 -136 -199 236 36 -118 -39 -62 10 22 90 -13 -116 53 7
6063 7 -138 49 132 -93 14 72 87 -185 22 304 -54 -283 69 63 -194 391 -184 32 30 -216 35 -36 -54 -80
6087 -80 153 -7 80 199 -97 -28 68 42 282 170 -333 -43 287 194 254 156 191 305 205 265 -264 -18 48 -52
6111 -52 170 -283 -265 -21 72 55 -313 -221 -65 11 364 38 25 248 -72 -19 -281 -299 61 -50 1 96 10 -98
6135 -98 -191 6 -294 -103 -41 11 -123 46 -12 53 197 -139 287 71 123 -39 40 -305 26 26 -32 -201 -124 45
6159 45 35 7 -105 5 -15 10 -158 281 -36 86 -16 -41 345 -69 172 259 5 -91 -101 -184 -142 -219 4 202
6183 202 -280 189 135 -281 276 34 -188 -424 -289 6 -203 102 -289 152 120 -52 2 -105 229 150 -452
6204 -452 5 -96 -15 15 -91 -101 55 66 235 83 352 10 -116 -43 140 125 105 -166 126 120 84 7 -3 35
6228 35 189 -58 -57 -203 -123 -190 -225 71 -253 119 279 -54 76 206 -185 82 49 -12 -67 76 -131 119 187
6251 187 -81 4 -84 -29 147 -99 -161 -38 -59 -115 213 218 -245 118 2 84 174 -19 -194 81 1 293 -80 -104
6275 -104 45 50 -180 -199 152 -65 -278 -151 30 85 145 60 -153 399 -242 337 -102 -92 137 45 31 -381 52
6298 52 -121 103 110 -72 -168 -252 119 86 -67 31 73 -287 111 -8 196 95 -217 -212 -148 -133 -148 145 -7 -84 89
6323 89 287 -330 -127 -3 -22 -267 48 289 -7 -177 140 245 -155 -161 -296 83 -260 -70 -60 210 69 64
6345 64 371 36 84 -202 -76 27 164 -62 -74 381 -397 186 -361 61 126 -64 235 -51 -135 143 275 -361
6367 -361 45 110 -87 -139 20 -54 223 39 385 233 -5 -103 -43 144 28 71 226 -97 -185 60 -307 -57
6389 -57 -346 108 107 46 0 -85 -53 231 155 155 392 94 98 0 105 126 37 -16 178 2 -193 -117 47 -134 -198 -209
6415 -209 6 -209 218 -93 -151 354 -148 -101 -209 -164 -2 -103 -74 -20 140 -80 -129 34 240 90 -34 116
6437 116 38 85 66 107 -22 -49 -208 -41 149 255 8 39 176 88 52 -150 -66 -65 -165 112 -359 200 -314 41
6461 41 -47 73 15 124 -246 -174 -89 61 -196 -193 225 125 12 -95 -51 7 -254 -95 -112 -319 119 80 304 -95
6485 -95 94 -237 -52 146 -152 -243 -9 79 235 142 378 45 -175 187 -7 -243 -348 -286 -228 252 -116 -251
6507 -251 -92 -25 34 27 155 63 -219 86 172 -114 207 -16 108 84 217 -127 -190 83 -287 58 -1 -30 -162
6530 -162 54 -164 -1 -6 -72 -7 -243 88 -82 -108 67 69 44 -49 -70 101 -72 -56 165 261 -56 -35 50 -119 243
6555 243 -131 126 146 68 -221 68 -22 209 -235 -74 164 132 166 20 -209 28 -42 -77 -92 -68 48 -97 30
6578 30 -95 5 -19 -268 -86 52 -39 -54 -157 281 -14 97 158 -175 -16 1 71 -153 -6 -156 -149 -275 -185
6601 -185 394 -106 -45 106 219 -5 89 142 25 240 -117 -6 65 -170 24 91 61 -160 -78 1 -232 -158 -142
6624 -142 -242 -12 580 -34 209 -98 -143 119 -338 -250 309 139 -8 -83 -204 271 -314 6 175 -56 -231
6645 -231 79 1 110 -91 -107 -32 -198 12 -206 -188 -245 119 -134 13 -124 115 -44 -66 -8 -15 -196 -56 89
6668 89 -74 192 2 48 15 169 222 -255 -10 -55 -20 -45 125 -127 141 200 -14 70 -11 -208 -93 37 -58 128
6692 128 75 -464 29 -86 64 117 188 154 64 72 0 176 283 222 64 -114 -131 -161 -30 67 -191 -310 -123 -89
6716 -89 225 -239 -446 -103 124 -40 -52 210 -80 -295 265 -10 -44 -84 -40 -219 248 142 -261 -187 149 -109
6738 -109 109 76 118 328 -166 -159 -225 231 -219 -120 28 170 -52 242 119 257 162 -174 246 -144 25 -589
6760 -589 6 -58 191 -55 256 -116 7 131 165 -106 -105 -7 -214 76 10 187 -61 -266 -22 -62 143 -204
6782 -204 -321 -402 -23 -217 -152 302 -1 30 -52 60 -45 -96 119 -81 -99 -221 -148 79 -51 12 -152 111 224
6805 224 73 49 -122 54 40 -202 -336 -218 -106 -15 144 78 28 104 -158 -196 -323 -22 -99 -108 -211 59 51 116
6829 116 56 -42 257 -236 20 -92 -5 -189 -24 -247 195 12 -302 43 -96 58 100 133 106 54 152 120 -27
6852 -27 89 -116 177 180 -154 -235 72 -160 -67 -184 184 10 -103 -31 126 161 90 -223 -176 -311 119 -158 83
6875 83 -295 53 256 -41 -4 -178 104 313 -281 -93 -98 -9 -118 103 8 -124 51 -35 -113 -60 162 -38 -52
6898 -52 -144 -73 192 52 -36 -6 -73 -218 95 82 -129 -186 -159 36 141 -189 -60 198 -203 187 -199 -36 129
6921 129 -49 228 76 342 -136 81 -55 -85 194 180 46 -68 -33 163 -99 -69 -191 -142 -77 -178 175 -172
6943 -172 -374 -68 -183 -36 36 -211 -195 -156 81 70 251 126 3 11 -135 65 149 -92 39 61 199 17 -85
6966 -85 -249 6 -43 -226 143 54 -250 98 -56 306 -194 -142 79 -115 -156 -231 240 44 -295 36 198 233
6988 233 64 -67 132 -338 -210 -90 161 5 83 95 -321 202 -22 -332 -336 -19 170 59 65 -92 -129 -7
7010 -7 232 68 99 -12 193 -129 -247 -246 -344 94 -1 157 147 -58 -52 30 44 172 -36 176 -192 171 66 120
7034 120 -239 -92 298 97 -77 256 299 216 -28 48 150 50 126 103 134 -138 -98 142 59 176 -15 12 194
7057 194 155 -194 -93 -11 -47 127 -96 18 2 -37 116 38 -146 -14 -104 -3 15 61 -7 85 69 -24 118 -393
7081 -393 -152 73 -190 290 -55 -11 -307 1 -71 330 -39 -104 -142 30 -30 122 -122 206 140 -167 223 -60
7103 -60 236 4 241 122 -20 27 -217 148 165 -38 -29 28 78 -14 129 -159 -233 14 55 -53 157 -235 157
7126 157 -409 48 28 -134 185 -170 490 -24 -199 -12 16 -6 133 405 -290 -151 -130 69 85 171 -72 60
7148 60 94 -21 -69 -78 63 -119 111 -147 49 72 -69 188 190 19 86 -127 85 88 150 -193 -348 19 166 -8
7172 -8 65 -50 -117 -262 -174 15 -23 -22 -200 32 168 10 -186 -99 242 32 -105 320 110 -54 261 -100 -154
7195 -154 -52 11 120 -48 -161 12 71 62 170 64 -25 -450 -359 -118 -40 -96 -90 157 457 -208 179 27 118 -217
7219 -217 -43 -129 -134 -193 115 166 23 -60 5 160 -346 -91 139 122 58 -51 -24 127 -156 122 -407 -102 -103 -194
7243 -194 -64 21 -104 111 -30 118 0 188 83 -113 44 -5 41 -109 -9 -322 13 -111 82 -35 -36 -395
7265 -395 -87 -101 226 225 -29 -106 -17 149 75 67 -14 -252 189 20 -201 100 -351 -317 93 127 -88 55 -291 105
7289 105 16 131 -193 34 172 -262 -161 -67 -165 -49 329 -157 -34 -85 -111 -294 -164 297 173 -103 92 -119
7311 -119 -47 -45 1 107 -121 -51 143 -64 94 -250 97 110 278 62 270 -106 -97 152 -144 14 60 269 -380
7334 -380 104 -145 1 26 -1 50 157 -138 -189 -86 -158 216 19 -138 -45 287 -182 43 -86 138 42 -165
7356 -165 -102 85 101 -223 129 -140 -158 37 327 36 140 -323 29 -79 29 293 -36 365 258 -107 136
7377 136 140 56 -402 195 -109 -398 -140 251 -59 -126 -14 169 -154 -245 -23 -116 16 -204 -177 -61 -86 74 -64
7400 -64 -243 160 -119 172 -363 35 -4 -138 202 39 46 -106 303 30 109 104 -16 -32 -288 87 -33 -75 102
7423 102 -176 -85 -190 -290 26 175 185 291 -140 286 -43 155 49 125 67 -50 -238 -31 -95 49 -221 -209
7445 -209 -221 43 156 120 141 225 98 -128 41 -92 208 -11 -112 341 -157 -119 -48 126 104 -222 140 153 -29
7468 -29 -158 -139 303 331 -151 -197 -72 -89 47 -276 -186 76 60 -3 -35 105 -209 25 207 -138 -63 83 -137
7491 -137 41 46 181 124 27 40 -292 -97 87 -250 199 119 59 -221 -127 -191 -29 376 104 -338 324 215 -2
7514 -2 121 144 225 43 -39 -97 -108 -18 199 48 -135 143 -24 73 109 288 278 116 109 -122 -77 -25 236 -130 83
7539 83 203 -431 -289 -43 -91 -123 172 116 51 -47 107 92 73 13 5 98 -210 239 -309 -44 -220 7 -98 175
7563 175 -80 -187 43 -99 154 -274 12 -48 0 -48 -67 -18 116 110 256 -257 -250 -229 192 56 314 21 -223
7586 -223 314 38 205 112 194 -265 -240 -49 199 -183 167 283 195 102 -52 369 -29 213 -110 69 -32 0
7608 0 136 -111 -97 276 116 83 86 -108 57 331 -37 -133 -278 -286 120 -386 -281 48 -321 -42 -172 20 122
7631 122 -107 44 35 226 -131 -56 -176 143 85 250 -246 -11 59 -28 -85 -52 -26 171 -133 113 -2 158 -131
7654 -131 -101 162 81 -63 -157 49 197 -145 -67 -104 4 46 -42 -106 33 174 153 -87 -172 206 -98 187 158 102
7678 102 -200 85 -146 208 22 5 6 -154 64 138 83 57 26 -221 -42 -14 9 230 -387 215 191 79 -38
7701 -38 -183 159 125 4 -53 103 -256 -276 61 -92 65 -50 203 -103 -229 88 119 -225 53 90 -61 -43
7723 -43 -87 -56 231 -81 29 -286 91 164 -156 117 7 288 120 67 -44 14 307 -97 64 -49 -65 214
7745 214 -103 275 75 -143 291 163 -111 -130 98 259 -105 52 190 341 49 -55 -214 -212 -146 443 184
7766 184 157 203 101 -70 -13 -10 -260 -61 202 355 -115 71 -191 -189 -25 -86 12 186 -80 -251 114 124 121 208
7790 208 116 47 -41 112 185 116 -23 52 -155 -165 -32 213 -177 301 426 -52 111 -32 64 37 17 -30 -184 -80
7814 -80 -107 -61 104 -34 168 110 -42 261 13 -11 -131 -24 59 35 -4 -255 -22 73 46 -96 64 118 -170 -60
7838 -60 -127 -37 154 -146 -226 125 96 -143 -311 -187 215 237 -70 -104 -244 -22 -255 -8 252 -76 10 -134 71
7861 71 262 -288 -84 17 -43 -362 191 -113 -182 -90 -53 227 302 80 101 221 82 78 49 36 174 4 68 29
7885 29 144 143 216 -101 15 456 123 61 -41 67 126 66 -159 134 -32 -187 2 182 195 -103 12 53 28
7908 28 189 84 132 -119 -325 -117 -13 242 -99 -144 30 -7 406 187 114 -303 67 18 81 57 -178 138 155
7931 155 131 -68 -180 44 380 106 -80 100 -5 109 181 307 229 -20 -350 67 208 108 -36 388 153
7952 153 95 -21 97 -114 -169 405 -78 -80 38 -29 -158 -40 218 59 -173 149 -210 -105 311 64 -266 -147
7974 -147 -78 -256 -141 -152 -76 -233 126 -45 180 118 260 -25 -13 -100 193 483 -27 -26 -101 155 22 -16 -2 119
7998 119 252 2 166 -17 -70 134 -58 109 -34 155 -184 -215 20 361 -336 22 91 -62 -66 80 -96 32
8020 32 473 -113 -116 -2 -47 -6 97 -130 238 6 -6 109 -47 -193 82 -178 65 -57 86 -45 155 136
8042 136 -83 -208 127 91 -195 -163 -34 -170 18 -36 -49 -36 111 122 -139 -126 -22 32 173 -127 -79 -123 -253
8065 -253 278 -150 -24 -21 -254 -126 -100 -71 255 -207 -298 -87 -54 -158 63 278 257 -209 56 -207 150 -268
8087 -268 -142 243 -89 -22 220 -230 -303 153 -180 9 -56 118 -119 232 -76 143 -50 195 -101 -111 -28 128
8109 128 12 -243 39 -110 284 186 214 127 -268 308 15 -255 102 36 93 247 229 -32 -57 169 -17 -291
8131 -291 -203 188 -265 -14 28 -126 44 134 -119 -45 143 -52 -164 -36 -287 -60 177 -213 271 -16 -86 38
8153 38 -148 21 186 72 50 125 -22 -90 33 105 211 372 -208 94 -220 -30 65 -89 6 -6 282 207 0
8176 0 -89 214 -131 -316 188 -32 75 94 76 -203 83 6 -56 -111 76
8191G6
##END NTUPLES=NMR FID
##END=
