##TITLE=1H_CG-1127
 DMSO, 8 sc, 
 7.2.2020
##JCAMPDX= 6.0         $$ Bruker NMR JCAMP-DX V2.0
##DATA TYPE= NMR FID
##DATA CLASS= NTUPLES
##ORIGIN= UXNMR, Bruker Analytische Messtechnik GmbH
##OWNER= root
$$ XWIN-NMR		Version 3.5
$$ Fri Feb  7 14:17:16 2020 Russian Standard Time (UT+4h)  she@DPX200
##.OBSERVE FREQUENCY= 200.1315
##.OBSERVE NUCLEUS= ^1H
##.DELAY= (6, 6)
##.ACQUISITION MODE= SIMULTANEOUS
##.ACQUISITION SCHEME= undefined
##.AVERAGES= 8
##.DIGITISER RES= 18
##SPECTROMETER/DATA SYSTEM= spect
##.PULSE SEQUENCE= zg30
##.SOLVENT NAME= D2O
##.SHIFT REFERENCE= (INTERNAL, D2O, 0, 15.7039)
##AUDIT TRAIL= $$ (NUMBER, WHEN, WHO, WHERE, WHAT)
$$ ##TITLE= Audit trail, XWIN-NMR		Version 3.5
$$ ##JCAMPDX= 5.01
$$ ##ORIGIN= Bruker BioSpin GmbH
$$ ##OWNER= she
$$ F:/spectra/data/she/nmr/H-F/1/audita.txt
$$ ##AUDIT TRAIL=  $$ (NUMBER, WHEN, WHO, WHERE, WHAT)
(   1,<2020-02-07 14:16:04.10 +0400>,<she>,<DPX200>,
      <created by zg, POWCHK disabled, PULCHK disabled
       configuration hash MD5:
       00 E9 B6 7A A2 85 ED C7 34 08 36 98 17 FE 4E 26
       data hash MD5: 16K
       F0 3F 13 48 84 77 66 0C 43 82 28 BF 38 A2 F8 BC>)
$$ ##END=
$$ 
$$ hash MD5
$$ 9E 59 D7 40 82 0D 65 29 CD 27 57 8C 37 79 7E 5E
##$RELAX= 
##$RELAX= 
##$RELAX= 
##$RELAX= 
##$RELAX= 
##$RELAX= 
$$ Bruker specific parameters
$$ --------------------------
##$DU= <F:/spectra>
##$EXPNO= 1
##$NAME= <H-F>
##$PROCNO= 1
##$TYPE= <nmr>
##$USER= <she>
##$AMP= (0..31)
100 100 100 100 100 100 100 100 100 100 100 100 100 100 100 100 100 100 
100 100 100 100 100 100 100 100 100 100 100 100 100 100 
##$AQSEQ= 0
##$AQ_mod= 1
##$AUNM= <au_zg>
##$AUTOPOS= <>
##$BF1= 200.13
##$BF2= 200.13
##$BF3= 200.13
##$BF4= 200.13
##$BF5= 200.13
##$BF6= 200.13
##$BF7= 200.13
##$BF8= 200.13
##$BYTORDA= 1
##$CFDGTYP= 0
##$CFRGTYP= 5
##$CHEMSTR= <none>
##$CNST= (0..31)
1 1 145 1 1 1 1 1 1 1 1 1 1 1 1 1 1 1 1 1 1 1 1 1 1 1 1 1 1 1 1 1 
##$CPDPRG= <>
##$CPDPRG1= <>
##$CPDPRG2= <>
##$CPDPRG3= <>
##$CPDPRG4= <mlev>
##$CPDPRG5= <mlev>
##$CPDPRG6= <mlev>
##$CPDPRG7= <mlev>
##$CPDPRG8= <mlev>
##$CPDPRGB= <>
##$CPDPRGT= <>
##$D= (0..31)
0 1.2 0 0 0 0 0 0 0 0.06 0 0.03 0 0 0 0 0.0002 0 0 0 0 0 0 0 0 0 0 0 0 
0 0 0 
##$DATE= 1581070563
##$DBL= (0..7)
120 120 120 120 120 120 120 120 
##$DBP= (0..7)
150 150 150 150 150 150 150 150 
##$DBP07= 0
##$DBPNAM0= <>
##$DBPNAM1= <>
##$DBPNAM2= <>
##$DBPNAM3= <>
##$DBPNAM4= <>
##$DBPNAM5= <>
##$DBPNAM6= <>
##$DBPNAM7= <>
##$DBPOAL= (0..7)
0.5 0.5 0.5 0.5 0.5 0.5 0.5 0.5 
##$DBPOFFS= (0..7)
0 0 0 0 0 0 0 0 
##$DE= 6
##$DECBNUC= <off>
##$DECIM= 24
##$DECNUC= <off>
##$DECSTAT= 4
##$DIGMOD= 1
##$DIGTYP= 9
##$DL= (0..7)
0 120 120 120 120 120 120 120 
##$DP= (0..7)
150 150 150 150 150 150 150 150 
##$DP07= 0
##$DPNAME0= <>
##$DPNAME1= <>
##$DPNAME2= <>
##$DPNAME3= <>
##$DPNAME4= <>
##$DPNAME5= <>
##$DPNAME6= <>
##$DPNAME7= <>
##$DPOAL= (0..7)
0.5 0.5 0.5 0.5 0.5 0.5 0.5 0.5 
##$DPOFFS= (0..7)
0 0 0 0 0 0 0 0 
##$DQDMODE= 0
##$DR= 18
##$DS= 0
##$DSLIST= <SSSSSSSSSSSSSSS>
##$DSPFIRM= 0
$$ [...]
##$SUBNAM2= <"">
##$SUBNAM3= <"">
##$SUBNAM4= <"">
##$SUBNAM5= <"">
##$SUBNAM6= <"">
##$SUBNAM7= <"">
##$SUBNAM8= <"">
##$SUBNAM9= <"">
##$SW= 24.9337058887773
##$SWIBOX= (0..15)
0 0 2 0 0 0 0 0 0 0 0 0 0 0 0 0 
##$SW_h= 4990.01996007984
##$TD= 16384
##$TD0= 1
##$TE= 0
##$TE2= 300
##$TE3= 300
##$TEG= 300
##$TL= (0..7)
0 120 120 120 120 120 120 120 
##$TP= (0..7)
150 150 150 150 150 150 150 150 
##$TP07= 0
##$TPNAME0= <>
##$TPNAME1= <>
##$TPNAME2= <>
##$TPNAME3= <>
##$TPNAME4= <>
##$TPNAME5= <>
##$TPNAME6= <>
##$TPNAME7= <>
##$TPOAL= (0..7)
0.5 0.5 0.5 0.5 0.5 0.5 0.5 0.5 
##$TPOFFS= (0..7)
0 0 0 0 0 0 0 0 
##$TUNHIN= 0
##$TUNHOUT= 0
##$TUNXOUT= 0
##$USERA1= <user>
##$USERA2= <user>
##$USERA3= <user>
##$USERA4= <user>
##$USERA5= <user>
##$V9= 5
##$VALIST= <valist>
##$VCLIST= <CCCCCCCCCCCCCCC>
##$VD= 0
##$VDLIST= <DDDDDDDDDDDDDDD>
##$VPLIST= <PPPPPPPPPPPPPPP>
##$VTLIST= <TTTTTTTTTTTTTTT>
##$WBST= 1024
##$WBSW= 4
##$XGAIN= (0..3)
0 0 0 0 
##$XL= 0
##$YL= 0
##$YMAX_a= 253944
##$YMIN_a= -190917
##$ZGOPTNS= <>
##$ZL1= 120
##$ZL2= 120
##$ZL3= 120
##$ZL4= 120
##$ABSF1= 10
##$ABSF2= 0
##$ABSG= 5
##$ABSL= 3
##$ALPHA= 0
##$AQORDER= 0
##$ASSFAC= 0
##$ASSFACI= 0
##$ASSFACX= 0
##$ASSWID= 0
##$AUNMP= <proc_1d>
##$AZFE= 0.1
##$AZFW= 0.1
##$BCFW= 1
##$BC_mod= 2
##$BYTORDP= 1
##$COROFFS= 0
##$CY= 11.3945322036743
##$DATMOD= 1
##$DC= 2
##$DFILT= <>
##$DTYPP= 0
##$F1P= 16.9975609425685
##$F2P= -3.02152046262296
##$FCOR= 0.5
##$FTSIZE= 0
##$FT_mod= 4
##$GAMMA= 1
##$GB= 0.15
##$INTBC= 1
##$INTSCL= 1
##$ISEN= 128
##$LB= 0.24
##$LEV0= 0
##$LPBIN= 0
##$MAXI= 10000
##$MC2= 0
##$MEAN= 0
##$ME_mod= 0
##$MI= 1.114404
##$NCOEF= 0
##$NC_proc= 0
##$NLEV= 6
##$NOISF1= 3.799351
##$NOISF2= 2.8
##$NSP= 1
##$NTH_PI= 0
##$NZP= 0
##$OFFSET= 15.70392
##$PC= 1
##$PHC0= -9788.06
##$PHC1= 14.20082
##$PH_mod= 1
##$PKNL= yes
##$PPARMOD= 0
##$PSCAL= 0
##$PSIGN= 0
##$REVERSE= no
##$SF= 200.130013532006
##$SI= 16384
##$SIGF1= 3
##$SIGF2= 2
##$SINO= 400
##$SIOLD= 16384
##$SREGLST= <1H.CDCl3>
##$SSB= 0
##$STSI= 0
##$STSR= 0
##$SW_p= 3612.71676300578
##$SYMM= 0
##$S_DEV= 0
##$TDeff= 0
##$TDoff= 0
##$TI= <>
##$TILT= no
##$TM1= 0
##$TM2= 0
##$TOPLEV= 0
##$USERP1= <user>
##$USERP2= <user>
##$USERP3= <user>
##$USERP4= <user>
##$USERP5= <user>
##$WDW= 1
##$XDIM= 8192
##$YMAX_p= 0
##$YMIN_p= 0
$$ End of Bruker specific parameters
$$ ---------------------------------
##NTUPLES= NMR FID
##VAR_NAME=  TIME,          FID/REAL,        FID/IMAG
##SYMBOL=    X,             R,               I
##VAR_TYPE=  INDEPENDENT,   DEPENDENT,       DEPENDENT
##VAR_FORM=  AFFN,          ASDF,            ASDF
##VAR_DIM=   8192,          8192,            8192
##UNITS=     SECONDS,       ARBITRARY UNITS, ARBITRARY UNITS
##FACTOR=    0.0002004,     1,               1
##FIRST=     0,             0,               0
##LAST=      1.6414764,     0,               0
##MIN=       0,             -190917,         0
##MAX=       1.6414764,     253944,          0
$$ Real data points
##PAGE= N=1
##DATA TABLE= (X++(R..R)), XYDATA
$$ plain form
0 0 0 0 0 0 0 0 0 0 -7 8 -8 8 -8 16 -16 16 -24 24 -32 40 -45 52 -61 69 -79 93 -104 118 -137 152 -171 195
32 195 -218 243 -272 304 -337 375 -416 462 -513 565 -628 693 -768 852 -948 1053 -1175 1319
50 1319 -1486 1687 -1932 2236 -2634 3171 -3943 5161 -7373 12705 -56208 5033 128877 42683
64 42683 -101909 -190917 -121167 11421 98801 52065 -65156 -150149 -119397 -15760 75143
75 75143 75028 -7055 -108254 -130819 -45450 82892 125575 36104 -101631 -145405 -51711 89573
87 89573 135936 43082 -98253 -143021 -48789 85565 125411 43299 -69704 -109338 -51943 45203
99 45203 99260 65282 -30050 -104576 -91343 1690 91790 95029 228 -108579 -122690 -16874
111 -16874 109243 123506 7233 -120422 -128867 -14449 103741 110319 5491 -105599 -116453
$$ packed form
0@%%%%%%%%pJ5j6J6j6K4l2L2m0M8n6P2q5R7j13J30j48J72j97K22k55K89l23L66
32A95m13M61n15N76o41P12p91Q78r75J078j193J321j461J620j800K001k228K494
50A319k805L173l619M168m870N805p114R104j2534K0078o8913O1241J23844q6194
64D2683j44592q9008O9750J32588Q7380m6736j17221q4993L0752J03637R0903
75G5143j15q2083j01199k2565Q5369J28342M2683q9471j37735m3774R3694J41284
87H9573M6363r2854j41335m4768R4232J34354L9846q2112j13003l9634N7395R7146
99D5203N4057l3978r5332p4526J3233R3033R0100L239r4801j08807j4111J05816
111a6874J26117J4263j16273j27655q445J14418J18190O578j04828j11090j0854
$$ plain form
122 -116453 -23185 81238 101715 28892 -63930 -97712 -46087 48702 107669 72416 -32934
133 -32934 -110685 -78510 38862 128657 100463 -19501 -111824 -78668 51244 147684 114076
144 114076 -9617 -93450 -57627 53190 129451 107274 17243 -56069 -49409 28399 108119 121823
156 121823 60580 -21927 -53678 -1927 93577 144093 92254 -19167 -80067 -24889 91809
167 91809 150385 91914 -23219 -80837 -25980 82486 137153 87032 -12941 -66921 -33127 47495
179 47495 101279 84805 12380 -58371 -64888 3182 86301 104804 34287 -62969 -93222 -22920
191 -22920 82786 115634 35228 -81197 -114904 -33351 75167 100382 22779 -76970 -104004
202 -104004 -39746 50349 82819 31681 -52173 -93262 -59925 16197 69917 53084 -24592 -95791
$$ packed form
122a16453R3268J04423K0477p2823r2822l3782N1625R4789N8967l5253j05350
133c2934p7751L2175J17372Q9795k8194j19964r2323L3156J29912R6440l3608
144A14076j23693q3833L5823J10817P6261k2177r0031p3312O660P7808P9720J3704
156A21823o1243q2507l1751N1751R5504N0516n1839j11421o0900N5178J16698
167I1809N8576n8471j15133n7618N4857J08466N4667n0121r9973n3980L3794Q0622
179D7495N3784j6474p2425p0751o517O8070Q3119J8503p0517r7256l0253P0302
191b2920J05706L2848q0406j16425l3707Q1553J08518K5215p7603r9749k7034
202a04004O4258R0095L2470n1138q3854m1089L3337P6122N3720j6833p7676p1199
$$ plain form
214 -95791 -88600 -1995 82968 79390 -10813 -97177 -92159 1492 90759 86528 -4705 -89579 -83664
227 -83664 2190 79033 76862 8595 -58123 -66291 -12724 56094 82408 43588 -28268 -68334
239 -68334 -38233 38879 93519 70016 -15927 -81681 -57438 37822 108279 81309 -13669 -79042
251 -79042 -51708 37257 100165 78061 -3094 -64850 -51879 18367 77990 75938 18156 -45085
263 -45085 -60227 -11410 61829 92094 44126 -41860 -81321 -33523 56855 99660 48604 -48414
275 -48414 -94184 -41580 54525 96255 43373 -46045 -82618 -37924 39113 76356 45227 -23985
287 -23985 -68988 -51719 11282 63742 58895 280 -61562 -68731 -9063 65194 80474 16129
299 16129 -64781 -79869 -13210 67367 80909 16345 -61293 -76254 -16954 56087 72757 22394
$$ packed form
214i5791P191Q6605Q4963l578r0203q6364N018R3651Q9267m231r1233q4874N915
227h3664Q5854P6843k171o8267o6718q168N3567O8818K6314l8820p1856m0066
239f8334L0101P7112N4640k3503q5943o5754K4243R5260P0457k6970r4978o5373
251g9042K7334Q8965O2908k2104q1155o1756J2971P0246N9623k052n7782o3241
263d5085j5142M8817P3239L0265m7968q5986l9461M7798R0378M2805n1056r7018
275d8414m5770N2604R6105M1730n2882q9418l6573M4694P7037L7243l1129o9212
287b3985m5003J7269O3001N2460m847n8615o1842p169N9668P4257J5280o4345
299A6129q0910j5088O6659Q0577J3542o4564p7638j4961N9300P3041J6670n0363
$$ plain form
311 22394 -42709 -63444 -26616 32428 64351 41582 -18238 -64446 -51640 12054 68462 61331
323 61331 -6363 -70766 -66744 5339 75726 72320 -3225 -74464 -69545 3471 69490 64565 -1857
336 -1857 -64227 -66310 -10768 49352 59545 12703 -47509 -68714 -32263 30135 62739 32427
348 32427 -38605 -82913 -54051 22747 71288 40457 -39676 -88975 -57740 21454 70096 40376
360 40376 -34726 -80101 -54048 13035 56122 38414 -18721 -62532 -57331 -7977 42139 49216
372 49216 5365 -50987 -67370 -25243 38785 63388 21381 -48982 -77136 -33338 40151 68708
384 68708 24953 -45358 -72735 -32182 34220 62959 30486 -29182 -60639 -37280 18116 55253
396 55253 43266 -7881 -53050 -51033 505 55783 61077 7378 -54820 -63284 -7134 59687 69317
$$ packed form
311B2394o5103k0735L6828N9044L1923k2769n9820m6208J2806O3694N6408p131
323F1331o7694o4403M022P2083P0387l406p5545p1239M919P3016O6019m925o6422
336a857o2370k083N5542O0120J0193m6842o0212k1205L6451O2398L2604l0312
348C2427p1032m4308K8862P6798M8541l0831q0133m9299L1235P9194M8642k9720
360D0376p5102m5375K6053O7083M3087j7708n7135m3811N201M9354N0116P077
372D9216m3851n6352j6383M2127O4028K4603m2007p0363k8154M3798P3489K8557
384F8708m3755p0311k7377M0553O6402K8739l2473n9668l1457K3359N5396L7137
396E5253j1987n1147m5169K017N1538N5278N294n3699o2198q464N6150O6821R630
$$ plain form
409 69317 11184 -57038 -66863 -9566 55877 64290 11234 -49581 -61460 -17178 39286 56978
421 56978 21612 -33898 -59516 -32899 21992 56231 36000 -21518 -64490 -48941 12848 61083
433 61083 46686 -17342 -67982 -53850 9720 59496 47253 -13100 -61361 -51958 2403 47897
445 47897 43890 -2296 -47132 -51922 -13724 33143 47679 15492 -35539 -58839 -30402 25696
457 25696 56397 29885 -30534 -65402 -38331 24478 61597 35576 -26545 -62835 -39157 20662
469 20662 57067 38305 -14985 -52640 -40728 8505 49311 45879 1688 -44061 -49082 -6730
481 -6730 44345 56209 14557 -42575 -59040 -16464 44690 63111 19941 -42270 -60851 -18788
493 -18788 41227 59722 20714 -35562 -55430 -22899 29139 52857 27791 -21095 -49216 -31935
$$ packed form
409F9317n8133o8222r825N7297O5443Q413n3056o0815j1879M4282N6464J7692
421E6978l5366n5510k5618K6617N4891L4239k0231n7518m2972J5549O1789M8235
433F1083j4397o4028n0640J4132O3570M9776j2243o0353m8261R403N4361M5494
445D7897m007m6186m4836m790L8198M6867J4536l2187n1031k3300K8437N6098
457B5696L0701k6512o0419l4868K7071O2809L7119k6021o2121l6290K3678N9819
469B0662L6405j8762n3290l7655J1912M9233M0806l432m4191m5749n021M2352
481f730N1075J1864m1652n7132j6465M2576O1154J8421m3170o2211j8581M2063
493a8788O0015J8495l9008n6276j9868L2531N2038K3718k5066m8886k8121J7281
$$ plain form
505 -31935 15218 50295 40018 -7241 -48400 -43661 4869 50551 48398 -739 -49355 -49488 -394
518 -394 48792 50399 3815 -44366 -47989 -5956 39903 47063 11214 -33090 -46827 -18373 26607
531 26607 47393 24962 -21685 -48853 -30310 19082 53046 37958 -13536 -52385 -38565 15525
543 15525 55409 42716 -10455 -50790 -40108 10496 51391 44805 -2341 -43279 -40659 2016
555 2016 43296 45530 8277 -35513 -45831 -12700 34502 51158 18532 -31847 -51913 -21286
567 -21286 31981 54941 25484 -28485 -53653 -25323 27440 51975 25752 -23474 -48857 -27698
579 -27698 17395 45887 31572 -11035 -41697 -33378 6282 40305 37825 284 -38768 -42874 -6626
592 -6626 37095 44478 7392 -38202 -47262 -10881 35210 46252 13463 -32259 -46946 -17114 27496
$$ packed form
505c1935M7153L5077j0277m7259m1159M739M8530M5682k153m9137m8616j33M9094
518c94M9186J607m6584m8181l623M2033M5859P160l5849m4304j3737K8454M4980
531B6607K0786k2431m6647k7168J8543M9392L3964j5088n1494l8849J3820N4090
543A5525L9884j2693n3171m0335J0682N0604M0895o586m7146m0938K620M2675
555B016M1280K234l7253m3790j0318L3131M7202J6656l2626n0379k0066L0627
567b1286N3267K2960k9457n3969k5168K8330N2763K4535k6223m9226k5383K1159
579b7698M5093K8492j4315m2607l0662Q319L9660L4023k480l7541l9052m106L6248
592f626M3721P383l7086m5594r060L6381M6091J1042l2789m5722j4687K9832M4610
$$ plain form
605 27496 44169 17978 -24449 -44014 -24100 17414 43727 29763 -11929 -42507 -31814 11144
617 11144 45406 38136 -4750 -43071 -39759 4060 45466 43479 -736 -41812 -40154 1744 42169
630 42169 43584 5784 -35018 -40638 -6797 34432 43206 12605 -28514 -41951 -15573 26187 45590
643 45590 23742 -20266 -43216 -22315 22681 47568 28326 -15948 -43167 -27838 15124 44249
655 44249 31291 -10598 -39831 -28907 9822 39388 33816 -451 -33061 -34146 -2522 32513
667 32513 36860 6398 -30561 -39715 -11718 27243 41568 16113 -25304 -42368 -17052 25463
679 25463 43513 19733 -21834 -42373 -23347 17187 40909 24983 -14644 -39763 -26418 11932
691 11932 39330 31413 -5019 -36628 -33685 2537 37386 35965 -1036 -37749 -38614 -3860 34216
$$ packed form
605B7496J6673k6191m2427j9565J9914M1514K6313j3964m1692l0578J0693M2958
617A1144L4262p270m2886l8321L312M3819M1406j987m4215m1076J658M1898M0425
630D2169J415l7800m0802n620L3841M1229Q774l0601m1119j3437K6378M1760J9403
643D5590k1848m4008k2950K0901M4996K4887j9242m4274k7219J5329M2962K9125
655D4249j2958m1889k9233J0924L8729K9566n572l4267l2610j085L1624L5035
667C2513M347l0462l6959r154K7997L8961J4325k5455m1417j7064K5316M2515
679B5463J8050k3780m1567k0539J9026M0534K3722j5926l9627k5119J3345L8350
691A1932K7398p917l6432l1609K943L6222L4849j421l7001l6713q65L4754L8076
$$ plain form
704 34216 38994 5569 -33446 -39998 -7177 31622 38668 8805 -28509 -39476 -14665 22331 36932
717 36932 15153 -21959 -38753 -19196 17695 37475 22880 -13305 -37515 -26761 9958 36413
729 36413 26410 -10677 -38311 -30635 3912 32758 29615 -2835 -33650 -32694 -1564 29564 31115
742 31115 2565 -28775 -35517 -11435 21858 32944 10946 -24132 -38004 -16456 19832 36421
754 36421 18709 -17174 -37897 -22598 14584 37707 22444 -15149 -38080 -25383 10390 35810
766 35810 27352 -6343 -33918 -28393 5584 34232 30719 -1441 -31577 -32558 -3368 29111 33640
779 33640 5147 -29149 -34701 -5826 28375 35993 10960 -22445 -33934 -11650 23240 35963
791 35963 14262 -20277 -34028 -15063 16887 33877 20495 -10817 -31125 -20284 12027 33579
$$ packed form
704C4216M778l3425l9015o552L2821L8799P046k9863l7314j0967K4811L6996J4601
717C6932k1779l7112j6794J9557L6891J9780j4595l6185k4210J0754L6719K6455
729C6413j0003l7087k7634P676L4547K8846l143l2450l0815R56L1130L1128J551
742C1115k8550l1340o742K4082L3293J1086k1998l5078j3872K1548L6288J6589
754C6421j7712l5883k0723J5299L7182K3123j5263l7593k2931J2697L5773K5420
766C5810q458l3695k7575N525L3977K8648l513l2160l0136r81K9190L2479M529
779C3640k8493l4296n552K8875L4201P618k5033l3405j1489K2284L4890J2723
791C5963k1701l4539j3751J8965L1950J6990j3382l1312k0308J0841L2311K1552
$$ plain form
803 33579 24364 -6740 -30254 -25750 2787 28845 27675 -1216 -29673 -29165 -1038 27813 29782
816 29782 5008 -24134 -30901 -8449 22284 31287 8803 -22949 -33239 -13865 17117 31720
828 31720 16766 -15271 -32883 -18567 14573 33784 20717 -12472 -33141 -23797 7081 31062
840 31062 23856 -7837 -33162 -26582 4964 30809 26539 -1750 -28043 -28475 -1821 26288 28812
853 28812 1872 -27348 -30535 -6332 22428 29293 9096 -20635 -30533 -10209 20752 31937 12515
866 12515 -17879 -30276 -14945 13867 29516 16867 -12081 -30148 -18467 10662 29313 20549
878 20549 -5647 -26141 -22166 2985 25921 23904 -2465 -27063 -26580 -2546 22717 26158 4787
891 4787 -21718 -28207 -6948 21243 29201 8756 -19581 -29202 -12487 15220 28469 13728 -15297
$$ packed form
803C3579r215l1104k3514M504K8537K6058j170k8891k8457N08K8127K8851J969
816B9782k4774k9142o767K2452L0733R003k2484l1752j0290J9374L0982J4603
828C1720j4954l2037j7612J4316L3140J9211j3067l3189k0669R344L0878K3981
840C1062p206l1693k5325O580L1546K5845m270k8289k6293m32K6654K8109K524
853B8812k6940k9220l187K4203K8760O865k0197k9731r898K0324L0961J1185j9422
866A2515l0394j2397J5331K8812J5649j2649k8948j8067J1681K9129J8651q764
878B0549k6196k0494L975K5151K2936k017k6369k4598M83K4034K5263L441k1371
891D787k6505o489K1259K8191P958k0445k8337r621J6715K7707J3249j4741k9025
$$ plain form
904 -15297 -30368 -16466 13773 30167 18238 -9977 -28265 -20103 7573 28608 21290 -7686
916 -7686 -29663 -23643 3802 26471 23679 -1308 -25476 -24969 -37 25661 26402 2242 -23224
929 -23224 -25833 -4726 20032 26379 7307 -18997 -26987 -8029 18941 28056 12118 -13419 -25027
942 -25027 -12077 13081 27517 15789 -10789 -25968 -15950 8862 25125 18884 -4398 -23534
954 -23534 -19448 4108 25425 22994 -853 -22107 -21823 -1283 20339 23661 4603 -19875 -24746
967 -24746 -5371 19666 26301 9117 -15459 -24766 -9795 15594 27253 12937 -14257 -27260
979 -27260 -14292 12031 26165 15922 -8791 -25990 -17528 8168 26478 18897 -6553 -25507
991 -25507 -20118 3014 23013 20277 -2489 -23816 -22837 150 22144 22207 1589 -19977 -22720 -4283
$$ packed form
904a5297j5071J3902L0239J6394j1929k8215j8288Q162K7676K1035p318k8976
916g686k1977O020K7445K2669k792k4987k4168N07K4932K5698P41k4160k5466
929b3224k609K1107K4758O347j9072k6304p990J8958K6970R115j5938k5537j1608
942b5027J2950K5158J4436j1728k6578j5179J0018K4812J6263o241k3282j9136
954b3534M086K3556K1317k431k3847k1254K84K0540K1622L322j9058k4478m871
967b4746J9375K5037O635j7184k4576r307J4971K5389J1659j4316k7194j3003
979b7260J2968K6323J4134j0243k4713j7199Q462K5696J8310p581k5450j8954
991b5507N389K3132J9999k736k2766k1327R79K2987K1994O3k0618k1566k743J8437
$$ plain form
1005 -4283 18303 23477 5863 -18293 -24615 -7961 15274 22873 9660 -12747 -23066 -11682 11879
1018 11879 24108 13186 -10040 -23151 -15029 6545 21388 15995 -5487 -22324 -18635 2879
1030 2879 21344 19091 -977 -19347 -19692 -1890 18871 21570 3407 -18646 -23011 -5684 16531
1043 16531 22592 7096 -14410 -22942 -9380 14151 24907 11294 -12546 -23909 -12242 10350
1055 10350 22851 13771 -9338 -23832 -15984 7670 23597 16479 -6065 -22043 -17246 3696 21261
1068 21261 18533 -2482 -21560 -20102 679 19400 19503 1497 -17654 -19839 -3319 17469 21535
1081 21535 5522 -15438 -20792 -6259 13524 20408 8532 -11382 -20996 -10066 10581 21291
1093 21291 11835 -7918 -19634 -12897 6196 19543 15059 -4456 -19944 -16066 2525 18795 16909
$$ packed form
1005d283K2586N174j7614k4156o322J6654K3235P599j3213k2407j0319J1384K3561
1018A1879J2229j0922k3226j3111Q122K1574J4843n393k1482j6837L689K1514
1030B879J8465k253k0068j8370l45J7802K0761K699j8163k2053m365J7327K2215
1043A6531O061j5496k1506q532J3562K3531J0756j3613k3840j1363J1667K2592
1055A0350J2501r080k3109j4494P848K3654J5927p118k2544j5978M797K0942J7565
1068B1261k728k1015j9078J458K0781J8721J03j8006j9151k185J6520K0788M066
1081B1535j6013k0960n354J4533J9783O884j1876j9914r614J0930K0647J0710
1093B1291r456j9753j1716O737J9093J3347m484j9515j5488L878J8591J6270j886
$$ plain form
1106 16909 -517 -17471 -17678 -971 17545 20116 3236 -16078 -19507 -4101 15249 20158 6509
1119 6509 -13461 -21001 -7843 13357 22150 9320 -11258 -20548 -10445 9855 21244 12256 -8630
1132 -8630 -21329 -13677 7060 20852 14189 -5559 -19773 -15339 3733 19359 16092 -2678 -18538
1145 -18538 -16799 818 17033 16790 1049 -15861 -17829 -2522 14824 18529 4177 -13557 -18346
1158 -18346 -5621 11871 18369 7515 -11042 -19133 -9161 8920 18268 9720 -7895 -18144 -11894
1171 -11894 5377 18002 12897 -4522 -18097 -14309 2370 16609 15025 -837 -16488 -16971 -1113
1184 -1113 15698 17182 2226 -14799 -17992 -3837 13699 18174 5152 -13290 -19072 -6600 12001
1197 12001 18823 7422 -10693 -19039 -9174 9017 18576 10311 -8483 -19001 -11311 6441 18379
$$ packed form
1106A6909j7426j6954k07J6707J8516K571j6880j9314l429J5406J9350M909j3649
1119F509j9970p540J3158K1200Q793j2830k0578r290J0103K0300J1389q988k0886
1132h630j2699P652K0737J3792o663j9748j4214M434J9072J5626l267j8770j5860
1145a8538J739J7617J6215k43j5741j6910j968J5307J7346L705j4352j7734m789
1158a8346J2725J7492O498j0854j8557q091R972J8081R348q548j7615j0249O250
1171a1894J7271J2625n105j7419j3575L788J6679J4239j584j5862j5651m83J5858
1184a113J6811J484j4956j7025l193J4155J7536M475j3022j8442n782J2472J8601
1197A2001O822j1401j8115q346R865J8191R559q265j8794j0518P690J7752J1938
$$ plain form
1210 18379 12272 -5497 -18121 -13674 3824 17837 13982 -3168 -16626 -14177 1393 15662 15380
1223 15380 546 -14420 -15429 -1702 13930 16132 3229 -11736 -15865 -4907 10630 16310 6411
1236 6411 -9484 -16280 -7759 8400 16540 9214 -6477 -16304 -9967 5626 16079 11602 -4208
1249 -4208 -15757 -12294 3001 15497 13730 -576 -14379 -13974 -163 14557 15686 2029 -13181
1262 -13181 -15644 -3518 12551 16555 4594 -11652 -16803 -5303 11476 17425 6880 -9921 -16904
1275 -16904 -7612 9382 16876 8470 -8124 -16795 -9726 6288 16033 10407 -4753 -15605 -11294
1288 -11294 4148 15534 12471 -2584 -14684 -12734 1249 13657 13280 -118 -13231 -13894 -1323
1301 -1323 12440 14121 2918 -10643 -14110 -4000 9549 14255 5089 -9013 -14882 -7356 6677
$$ packed form
1210A8379o107j7769j2624M447J7498J4013l855j7150j3458K449J5570J4269k82
1223A5380j4834j4966j009J3727J5632K202j2903j4965m129J0958J5537N680r899
1236F411j5895o796Q521J6159Q140p326j5691r827O337J5593J0453m477j5810
1249d208j1549L463J5295J2496j767j4306j3803M05J3811J4720J129j3657j5210
1262a3181k463J2126J6069M004j1961j6246n151J1500J6779N949j0545j6801o983
1275a6904R292J6994P494q406j6594q671P069J6014R745n626j5160j0852M311
1288a1294J5442J1386l063j5055j2100J950J3983J2408l77j3398j3113o63J2571
1301a323J3763J681j1203j3561l467J0110J3549M706r166j4102n869P526J4033
$$ plain form
1314 6677 14198 7828 -6222 -14480 -9387 4909 14721 10382 -4087 -14756 -11579 2579 13179
1327 13179 11538 -1650 -13746 -12848 142 12821 13651 1240 -12115 -13891 -2483 11555 13984
1340 13984 3277 -11356 -15285 -5459 9706 15067 5462 -9213 -14918 -6258 8420 15282 7275
1353 7275 -7546 -15355 -8197 6086 14315 8489 -5679 -13632 -9234 3909 13727 10650 -2376 -12690
1367 -12690 -10944 1568 11983 11313 -221 -11537 -12264 -1303 10954 12848 2403 -9939 -12080
1380 -12080 -2884 9415 12870 4794 -7772 -13178 -5744 7134 12744 6852 -5765 -12521 -7725 4799
1394 4799 13458 9808 -2618 -12143 -9472 2968 12666 10624 -1101 -12172 -11481 101 12145 12211
1408 12211 557 -11225 -11686 -833 10722 12914 2869 -9615 -12927 -3934 9085 12826 4374
$$ packed form
1314F677P521o370j4050q258N093J4296R812m339j4469j0669L177J4158J0600
1327A3179j641j3188j2096Q98J2990J2679Q30j2411j3355j776J1408J4038K429
1340A3984j0707j4633l929R826J5165N361r605j4675n705Q660J4678O862q007
1353G275j4821p809P158J4283Q229n826j4168p953M398J3143R818l077j3026j0314
1367a2690J746J2512J0415o70j1534j1316p27J0961J2257J894j0445j2342k141
1380a2080R196J2299L455q076j2566n406P434J2878N610n892j2617o756M796J2524
1394D799Q659l650j2426r525K671J2440R698k042j1725j1071O91J1582J2044O6
1408A2211j1654j1782m61J0853J1555K192j0045j2484l312Q993J3019L741q452
$$ plain form
1421 4374 -8437 -12970 -5717 7348 13801 6888 -6639 -13271 -6815 5952 12557 7241 -5332 -12922
1435 -12922 -9120 3536 12176 8933 -2689 -11467 -8910 1855 10670 9933 -27 -10229 -11023 -1218
1449 -1218 9288 10396 1178 -8724 -11290 -3559 8130 11873 4911 -7092 -11720 -4628 6758 11131
1463 11131 5439 -5755 -11674 -7263 4031 11752 7712 -3590 -11032 -7751 3031 11391 9650 -1041
1477 -1041 -10748 -10712 216 10989 10318 -239 -10617 -10920 -1053 10022 11865 2500 -8982 -11315
1491 -11315 -2197 8923 11238 3015 -8155 -12249 -5027 6636 11383 5158 -6454 -11693 -5392 5411
1505 5411 11536 6783 -4311 -11517 -7834 3124 10635 7302 -3477 -10730 -7964 1284 9609 8858
1519 8858 -184 -9194 -9076 -242 8540 8839 855 -7837 -10253 -3269 6533 10385 3640 -6720 -10219
$$ packed form
1421D374j2811m533P253J3065O453o913j3527o632O456J2767O605n316j2573p590
1435a2922L802J2656Q640l243j1622q778K557J0765Q815p37r960j0202p94R805
1449a218J0506J108r218r902k566P731J1689L743o962j2003m628P092J1386M373
1463A1131n692j1194n919M411J1294P721m040j1302p442L281J0782Q360j741j0691
1477a041r707L6J0928J0773o71j0557j0378l03R867J1075J843r365j1482k333
1491a1315R118J1120K315q223j1170m094P222J1663M747o225j1612n239O301J0803
1505E411O125m753j1094p206L683J0958P511l333j0779p253K766R248Q325p51
1519H858r042r010J18Q834Q782K99p984q692k416O984R802L852o745j0360l499
$$ plain form
1534 -10219 -4033 6095 10685 5310 -4231 -10759 -6772 3920 10650 6346 -3825 -10375 -6970 2786
1548 2786 10614 9016 -1074 -9643 -8278 1653 10311 9098 -242 -9200 -9632 -933 8971 10660 1632
1563 1632 -8444 -9449 -783 8716 10817 3555 -6776 -10274 -3761 6594 10410 3495 -6336 -10240
1577 -10240 -4497 5342 9832 6218 -3718 -9285 -6210 4020 9683 6157 -2553 -9263 -7942 672
1591 672 8149 7814 -556 -8440 -8008 377 8146 8363 1051 -6891 -9238 -3011 6195 8336 2398 -6371
1607 -6371 -9465 -4005 4814 9307 5004 -4425 -9719 -5454 3790 9362 5419 -3894 -9853 -7215 1740
1622 1740 9120 7024 -2111 -9844 -7205 1960 9090 8072 -426 -8161 -8634 -1049 7951 8775 425
1637 425 -7824 -9013 -1115 7349 9344 2893 -5642 -8687 -2769 6857 9468 2976 -5804 -8984 -4344
$$ packed form
1534a0219O186J0128M590n375r541o528L987J0692O730m304j0171o550L405R756
1548B786P828j598j0090q569J365R931Q658j213r340q958m32Q699R904J689r028
1563A632j0076j005Q666R499K101p262j0331l498O513J0355L816o915r831l904
1577a0240N743R839M490l614r936n567L075J0230N663l526q710o710J321Q614
1591F72P477l35q370p884M32Q385P769K17p312p942k347O227R206K141n938q769
1607f371l094N460Q819M493m303r429n294M265R244N572l943r313n959K638Q955
1622A740P380k096r135p733K639R165P130j018q498p735m73P585R000Q24q350
1637D25q249j189P898Q464J995o451q535l045N918R626K611o492q780l180M640
$$ plain form
1652 -4344 4114 8871 4914 -4032 -8910 -4485 4075 8525 5656 -1985 -7865 -6417 990 7721 6578
1667 6578 -1318 -7993 -7312 -83 6908 7918 1515 -5904 -7875 -1608 6298 7982 1747 -5797 -8137
1682 -8137 -3651 4221 8351 4164 -4423 -8669 -4100 4217 8574 4868 -2775 -8536 -6098 2230 8408
1697 8408 6335 -2525 -8832 -6458 1491 8095 7215 -120 -7392 -7191 547 8145 7590 253 -6975 -7424
1713 -7424 -1118 6218 8202 2279 -6109 -8190 -1717 6553 8285 3040 -4584 -7611 -3494 3881 8196
1728 8196 3945 -4089 -7739 -4008 3383 7406 5275 -1451 -6768 -5216 1893 7471 6023 -931 -6765
1743 -6765 -6054 -353 5789 6831 1143 -5870 -7130 -1048 5974 7191 2261 -4699 -7388 -3208 4582
1758 4582 7635 3181 -4450 -8094 -3822 3313 7228 4493 -2778 -7736 -5051 2608 7846 4961 -2564
$$ packed form
1652d344Q458M757l957q946m878M425Q560M450k869p641n880J448P407O731j143
1667F578p896o675O81P229O991J010o403p419j971O267P906J684o235p544k340
1682h137M486P872M130m187q587m246M569Q317M357l706p643n761K438Q328O178
1697H408k073q860o307K374P949O604q80p335p272K01P738P598n55p337p228m49
1713g424O306P336J984n923q388k081O473Q270J732n245p624l027M117P375M315
1728H196m251q034l650L731P391M023k131o726n317J552P109N578j448o954n834
1743f765P11N701O142J042n688p013j260O082P022J217m930o960k689M180P790
1758D582L053m454p631l644M272P135L915k735p271m958K685P659N238k885p525
$$ plain form
1773 -2564 -8091 -5934 866 6878 5808 -1249 -7519 -6465 768 7213 6434 -131 -6675 -6907 -1028
1788 -1028 5866 6717 961 -6486 -7404 -1705 5041 6734 2023 -4122 -6927 -2964 3894 6992 3131
1803 3131 -3917 -6869 -3961 2127 6228 4404 -1692 -6525 -4775 1674 6567 5209 -456 -5774 -5504
1818 -5504 -374 5296 6095 723 -5836 -6134 -879 4929 6389 1881 -4185 -6702 -2582 4451 7095
1833 7095 2823 -4257 -7127 -3176 3291 6453 3988 -2566 -6928 -4439 3060 7444 4609 -1945 -6365
1848 -6365 -4925 1615 6899 5732 -938 -6930 -5910 969 6341 5624 52 -5495 -5724 -279 5760
1863 5760 6272 912 -5163 -5840 -1166 4422 6003 2059 -3711 -6200 -2359 4036 6376 3291 -2727
1878 -2727 -5597 -3000 2398 5898 4157 -1708 -5924 -4250 1447 5903 4701 -512 -4763 -4701 8
$$ packed form
1773b564n527K157O800O012j070p057o270J054P233O445p79o565o544k32N879
1788a028O894Q51n756p447r18N699O746J693m711o145k805L963O858L098l861
1803C131p048k952K908O088M101j824o096m833J750O449M893j358n665n318K70
1818e504N130N670P99n372o559k98N255N808J460m508o066k517M120P033K644
1833G095m272p080k870L951O467L162k465o554m362K489P499M384k835o554m420
1848f365J440O540N284j167o670n992J020O879N372p17n572n547k29N445O039
1863E760N12n360o075o77M674N588J581l944n770k489L841O395K340l085o018
1878b727k870K597N398L500j741n865m216J674N697M456j202n213m251O2M709
$$ plain form
1893 8 5574 5430 486 -4851 -5655 -1086 4527 5756 1463 -4297 -6208 -2259 4404 6310 2341 -3538
1909 -3538 -6237 -2981 2984 6118 3311 -2898 -6517 -3730 2337 6273 3878 -2000 -5881 -4334 1537
1924 1537 6324 4638 -1472 -5975 -4564 678 5247 4815 -414 -5315 -5640 -623 5080 5025 430 -4534
1940 -4534 -5236 -974 3758 5194 1410 -3864 -5947 -2104 3339 5054 2489 -2802 -5211 -2987 2048
1955 2048 5311 3462 -1975 -5358 -3846 725 4935 3720 -697 -4820 -4826 -153 4831 4794 1 -4484
1971 -4484 -5027 -518 4277 5306 1443 -4148 -5683 -1608 3733 5486 1839 -3448 -5730 -2837 2922
1986 2922 5735 2907 -2962 -5924 -3479 2602 5735 3729 -1963 -5767 -3787 1966 5793 3899 -1510
2001 -1510 -5131 -4063 1132 5051 4295 -585 -4374 -4606 2 4363 4510 644 -3812 -4627 -912 3786
$$ packed form
1893HN566j44m944n337q04M569N613J229m293n760j911L949O663J906l969n879
1909c538k699L256N965L134k807o209l619K787O067L936k395n878l881J547N871
1924A537M787j686o110m503J411N242M569m32n229m901l25N017N703n5m595m964
1940d534p02M262M732J436l784n274k083L843N443J715k565n291k409K224N035
1955B048L263j849n437l383J512M571M210j215m417m123oM673M984l7m793m485
1971d484n43M509M795J029l863n591j535M075N341J753l647n287k282K893N759
1986B922K813k828n869k962K445O081L133k006n692l804J980N753L827j894n409
2001a510l621J068N195L919p56m880l789k32M608M361J47l866m456q15L715M698
$$ plain form
2017 3786 4946 1649 -3549 -4643 -1374 3040 4860 2309 -2349 -4689 -2683 2161 4984 2881 -1667
2032 -1667 -4348 -3207 1514 4272 3795 -241 -4340 -4128 343 4555 4466 182 -3868 -4354 -828 3919
2048 3919 4828 1164 -3866 -4684 -1062 3749 5147 1766 -3283 -5275 -1938 2968 5017 2312 -2435
2063 -2435 -4668 -2716 2435 5193 3390 -1636 -4928 -3336 1479 5024 3761 -1409 -4832 -3620 809
2078 809 4691 3810 -584 -4332 -3962 291 4009 3983 232 -3593 -4301 -887 3292 4070 1163 -3183 -4270
2095 -4270 -1483 2689 4071 2087 -1904 -4094 -2555 2006 4206 2784 -1896 -4319 -3037 1047 3932
2110 3932 2783 -864 -3969 -3552 270 3803 3781 -74 -3765 -4022 -821 3184 4075 755 -3591 -5000
2126 -5000 -1382 3303 4856 1446 -3262 -4411 -1563 2652 4500 1757 -3013 -4467 -2258 2469 4178
$$ packed form
2017C786J160l297n198j094L269M414J820k551m658k340K006M844K823k103m548
2032a667k681J141M721K758m77m036m099K12M471M212q9m284m050m86L526M747
2048C919R09l664n030q18L622M811J398l381n049j992L337M906K049k705m747
2063b435k233J952N151K758j803n026l292J592M815L545j263n170l423J212M429
2078H09L882q81m394l748L70M253L718k6l751l825p08L414M179P78k907m346j087
2095d270K787M172J382j984l991k190J539M561K200j422m680k423J282M084K885
2110C932j149l647l105M17L822L533k2l855l691k57L201M005Q91l320m346j409
2126e000L618M685J553l410m708j149K848M215J848k743m770j454K209M727J709
$$ plain form
2141 4178 2199 -1914 -3999 -2324 1542 4404 2996 -1019 -4006 -3079 752 4049 3393 -718 -3566
2156 -3566 -3682 404 3746 3857 383 -3299 -3078 115 3176 3599 1102 -2446 -3473 -1068 2229 3619
2172 3619 1779 -1516 -3235 -1858 1813 4324 3105 -1106 -3782 -2733 1126 3830 2788 -817 -3705
2187 -3705 -3071 709 3780 3399 176 -3185 -2898 -89 3222 3695 593 -2726 -3700 -995 2549 3894
2203 3894 1574 -2678 -4059 -1531 2550 4514 2273 -2664 -4401 -1803 2437 3502 1653 -2246 -4052
2218 -4052 -2060 1645 3686 2278 -1248 -3210 -1788 912 2852 2641 -439 -3387 -3242 -217 2985
2233 2985 2943 208 -2928 -3149 -265 3050 3740 1035 -2536 -3145 -564 2211 2752 974 -1946 -2904 -1647
2250 -1647 1235 3356 2200 -664 -2770 -2133 774 3496 2680 -421 -3552 -3246 235 3214 3238 -294
$$ packed form
2141D178j979m113k085J675L866K862j408m015k987R27L831L297o56m111k848
2156c566j16M086L342J11l474l682K21L193L061M23k497l548j027K405L297J390
2172C619j840l295j719J377L671K511j219m211k676J049L859K704j042l605k888
2187c705O34L780L071l81l223l361K87K809L311M73l102l319r74K705L544J345
2203C894k320m252j381K528M081J964k241m937j737K598M240J065j849l899j806
2218d052J992L705K041j408l526j962J422K700J940k11l080k948J45L025L202
2233B985m2k735l136k21K884L315O90k705l571o09K581K775N41j778k920r58J257
2250a647K882K121j156k864k106O37K907K722q16l101l131L06L481K979K4l532
$$ plain form
2266 -294 -3191 -2949 226 3201 3418 234 -3277 -3051 -431 2434 2715 582 -2521 -3473 -1394 1835
2282 1835 3435 1545 -1986 -3661 -1800 1757 3564 1811 -2060 -4028 -2715 1474 3193 1555 -1844
2297 -1844 -3427 -1713 1359 2619 1935 -491 -2753 -2055 159 2110 1926 -2 -2085 -3057 -987 2126
2313 2126 3411 1033 -1959 -3148 -784 2084 3125 1190 -1881 -3258 -1815 1779 2738 1138 -1505
2328 -1505 -2574 -1269 1141 2839 2435 148 -2078 -2309 272 2631 2837 238 -2746 -3354 -447 3460
2344 3460 3775 585 -2680 -2651 442 3214 2984 390 -2302 -2554 -375 2003 2482 768 -1747 -2172 -701
2361 -701 1339 2718 1858 -934 -2944 -1887 1133 2926 1804 -1369 -3307 -2158 714 3225 2354 -893
2377 -893 -2484 -1687 723 2033 1355 -266 -1692 -2242 -423 1298 1777 437 -1152 -2328 -1380 1380
$$ packed form
2266b94k897K42L175K975K17l184l511K26K620K865K81k133l103r52K079L229
2282A835J600j890l531j675J861L557J807j753l871j968J313M189J719j638l399
2297a844j583J714L072J260o84k426k262O98K214J951j84j928k083r72K070L113
2313B126J285k378k992j189K364K868J041j935l071j377J443L594R59j600k643
2328a505j069J305K410J698m04k287k226k31K581K359K06k599k984o08K907L907
2344C460L15l190l265K9L093K772k30k594k692k52K179K378M79j714k515m25J471
2361g01K040J379q60k792k010J057L020J793j122l173j938J149K872K511q71l247
2377h93j591P97K410J310o78j621j426n50J819J721M79j340j589j176R48K760
$$ plain form
2393 1380 3053 1881 -1137 -3178 -1552 1803 3139 1208 -1918 -2931 -1748 1264 2635 1635 -991
2408 -991 -2220 -1269 845 1931 2215 33 -1905 -2436 -675 1921 2523 652 -2481 -2735 -558 2568
2424 2568 3296 1033 -2326 -3226 -261 2881 2416 235 -2428 -2128 -191 1299 2012 784 -1126 -1941
2440 -1941 -941 626 1719 1368 -357 -1974 -2512 -55 2048 2118 -742 -2773 -2112 288 2648 1912
2456 1912 -340 -1978 -2055 192 2163 1303 -304 -1470 -1519 -632 293 1706 1092 -700 -2148 -1500 517
2473 517 2391 1706 -834 -2973 -2445 911 2681 1644 -1280 -2850 -1543 1552 2702 1659 -908 -1816
2489 -1816 -1759 568 1714 1322 -127 -1544 -1624 -739 1414 2244 1254 -1431 -2430 -911 2349 2772 860
2506 860 -1720 -2586 -842 2036 2283 367 -1899 -1891 328 1379 1670 793 -140 -1138 -896 15 1291 1379
$$ packed form
2393A380J673j172l018k041J626L355J336j931l126j013J183L012J371j000k626
2408i91j229R51K114J086K84k182j938n31J761K596O02j871l133k54K177L126
2424B568P28k263l359r00K965L142m65k181k663L00J937J490P13j228j910q15
2440a941J000J567J093l51j725j617n38K457K103P0k860k031O61K400K360p36
2456A912k252j638p7K247J971q60j607j166m9Q87R25J413o14j792j448O48K017
2473E17J874o85k540k139N28L356J770j037k924j570J307L095J150j043k567r08
2489a816N7K327J146l92j449j417q0Q85K153Q30r90k685r99J519L260M23j912
2506H60k580q66J744K878K47j916k266QK219J051K91q77r33r98K42R11J276Q8
$$ plain form
2524 1379 128 -1378 -1531 -465 1480 2434 669 -1606 -2211 79 2411 2061 67 -1661 -1608 -265
2540 -265 1320 1710 -213 -1175 -1351 -403 546 1180 1320 380 -1453 -1900 -135 2083 2030 -303 -2521 -2149
2558 -2149 257 2758 1925 -636 -2286 -1764 1012 2350 1061 -807 -1501 -1191 271 1134 1009 204 -1345
2575 -1345 -1169 -444 543 1519 1131 -742 -1960 -1708 1208 2219 795 -1945 -2179 -813 1259 1899 770
2592 770 -1074 -1892 -186 1043 877 202 -289 -533 -270 -454 437 1377 820 -768 -1746 -710 1061 2186
2610 2186 983 -1229 -2654 -926 1635 2027 287 -2019 -1928 -226 1391 1236 370 -965 -1279 -630 611
2627 611 1116 645 -32 -1159 -1438 -391 1535 1871 229 -1860 -2006 179 2032 2037 -458 -2098 -1704 486
2645 486 2270 1181 -706 -1737 -768 391 717 717 5 -519 -1011 -350 548 844 878 -69 -1320 -1262 254
$$ packed form
2524A379j251j506j53J066J945R54j765k275o05K290K332l50j994j728N3J343
2540b65J585L90j923r62j76R48R49O34J40r40j833m47J765K218n3k333k218L72
2558b149K406K501q33k561j650N22K776J338j289j868o94L10J462Q63j25q05j549
2575a345J76P25R87R76l88j873j218K52K916J011j424k740k34J366K072O40j129
2592G70j844q18J706J229j66o75m91k44K63j84Q91R40n57j588r78J036J771J125
2610B186j203k212j425J728K561L92j740k306R1J702J617j55q66j335l14O49J241
2627F11N05m71o77j127k79J047J926L36j642k089j46K185J853Nk495j640L94K190
2645D86J784j089j887j031R69J159L26%p12n24m92O61Q98K96L4r47j251N8J516
$$ plain form
2664 254 1695 1214 -697 -1990 -1169 1178 1891 554 -630 -1237 -49 630 976 381 -168 -808 -566 -297
2682 -297 170 1037 676 -215 -1470 -1082 664 2023 992 -820 -1729 -1017 1038 2055 867 -1099 -1470
2699 -1470 -210 1028 1303 333 -779 -805 -411 486 1019 846 11 -535 -937 -383 876 1624 180 -1356
2717 -1356 -1878 -666 1887 1336 -200 -1562 -1440 127 1321 953 -636 -1685 -976 403 1036 253 -395
2734 -395 -397 -358 -348 59 1006 558 -155 -1054 -1059 -75 1369 1197 36 -1185 -1312 426 1524 1177 -748 -1485
2754 -1485 -515 560 739 762 -119 -658 -383 -171 115 588 884 -124 -1273 -1416 254 1497 1381 -642
2772 -642 -2210 -909 733 1766 769 -1264 -1807 -204 1214 1495 267 -1396 -1205 -94 103 500 200
2789 200 -84 -502 -709 -381 592 916 395 -673 -1127 -415 1070 1538 180 -1506 -1136 347 1426 948
$$ packed form
2664B54J441m81j911j293Q21K347P13j337j184o07J188O79L46n95n49o40K42K69
2682b97M67Q67l61q91j255L88J746J359j031j812r09P12K055J017j188j966l71
2699a470J260J238K75r70j112k6L94Q97N33j73q35n46m02N54J259P48j444j536
2717a356n22J212K553n51j536j362J22J567J194l68j589j049P09J379O33p83o48
2734c95kL9J0M07R47m48p13q99nR84J444j72j161j221j27J738J098l47j925p37
2754a485R70J075J79K3q81n39K75K12K86M73K96j008j149j43J670J243j16k023
2772f42j568J301J642J033r97k033n43J603J418K81j228j663J91J111J97L97l00
2789B00k84m18k07L28R73L24n21j068m54P12J485M68j358j686L70J483J079m78
$$ plain form
2807 948 -443 -1098 -847 400 776 441 -211 -313 -98 -338 -247 291 730 57 -274 -1304 -395 928 1246
2826 1246 86 -1178 -1165 -126 1129 1457 -237 -1128 -623 709 1260 404 -180 -457 -293 -308 172 512
2844 512 413 5 -809 -732 470 871 1099 -225 -1374 -971 972 1737 916 -900 -1527 -269 1028 1427
2862 1427 364 -746 -319 265 987 481 111 -202 -108 -75 -190 158 622 786 -440 -440 -659 871 1183 495
2882 495 -752 -706 314 1057 751 -262 -799 -452 149 945 69 -244 -51 -126 -143 -251 80 573 163 -576
2902 -576 -936 -731 442 1002 301 -796 -1218 -31 995 1162 154 -1168 -833 175 854 639 -413
2919 -413 -781 -389 135 371 196 276 98 -571 -348 83 1079 673 -422 -716 -595 -31 967 651 -557 -1218
2939 -1218 -455 601 1192 228 -271 -529 282 580 329 -111 -223 -187 -157 -262 -109 478 461 151 -605 -181
$$ packed form
2807I48j391o55K51J247L76l35o52j02K15k40R1N38M39o73l31j030R09J323L18
2826A246j160j264J3J039J255L28j694q91N05J332N51q56n84k77J64j5M80L40
2844E12r9m08q14P7J202M01K28j324j149M03J943P65q21j816o27J258J297L99
2862A427j063j110M27N84P22n06l70l13R4L3j15L48M64J64j226%k19J530L12o88
2882D95j247M6J020P43l06j013n37L47O01P96q76l13J93p5j7j08L31M93m10p39
2902e76l60K05J173N60p01j097m22J187J026J67j008j322L35J008O79k15j052
2919d13l68L92N24K36j75Q0j78o69K23M31R96m06j095k94J21N64R98l16j208o61
2939a218P63J056N91r64m99k58Q11K98k51m40j12L6L0j05J53N87j7l10p56M24
$$ plain form
2959 -181 104 1013 514 -337 -1219 -492 390 749 176 -524 -649 -42 470 347 -18 -122 -220 169 -240 23
2979 23 559 133 -338 -902 -668 336 753 378 -605 -1066 -330 842 1028 10 -943 -1050 23 920 392
2998 392 -225 -900 -297 310 436 -113 -190 -65 -380 263 165 360 203 -247 -625 -754 -98 678 453 -175 -641
3019 -641 -133 465 863 36 -507 -434 397 455 204 -240 -446 128 201 -32 598 481 593 230 -91 -219 -22
3040 -22 297 487 -34 -694 -384 466 772 208 -150 -362 -30 728 563 269 -327 -295 -64 146 -302 -163 -202
3061 -202 -359 -150 -162 241 797 452 -561 -685 132 574 580 -131 -1182 -803 305 731 176 -841 -633 -85
3081 -85 609 459 211 -257 -127 5 -287 -244 -3 -246 -450 -285 -474 -175 677 382 38 -177 19 292 579
3102 579 -112 -453 -354 -162 304 280 23 -48 88 400 3 -75 -83 295 247 -111 -167 -223 372 139 -333 -287 -436
$$ packed form
2959a81K85R09m99q51q82P27Q82L59n73p00j25O07N12j23l65j04r8L89m09K63
2979B3N36m26m71n64K34J004M17l75r83m61P36J172J86j018r53j07J073Q97n28
2998C92o17o75O03O07J26n49p7J25l15O43r8J95j57m50l78j29O56P76k25o28m66
3019f41N08N98L98q27n43P3Q31N8k51m44k06N74P3k33O30j17J12l63l21j28J97
3040b2L19J90n21o60L10Q50L06n64l58k12L32P58j65k94n96L2K31K10m48J39l9
3061b02j57K09j2M03N56l45j013j24Q17M42Op11j051L79J108M26n55j017K08N48
3081h5O94j50k48m68J30J32k92M3K41k43k04J65j89K99Q52k95l44k15J96K73K87
3102E79o91l41R9J92M66k4k57p1J36L12l97p8qL78m8l58n6n6N95k33m72M6j49
$$ plain form
3125 -436 307 939 508 -357 -563 -141 210 175 -455 -464 -465 -170 38 258 122 -59 -425 -5 81 -12 -4 54 -694
3148 -694 -537 96 344 253 -319 -702 -191 5 562 226 50 -744 -378 579 465 -60 15 -248 -194 64 8
3169 8 9 -228 -126 -277 74 10 450 169 -92 -21 -260 37 298 274 -419 -682 372 374 122 100 -99 40 293
3192 293 149 -107 -98 85 51 143 -436 96 387 252 -122 -251 78 496 295 249 -117 -440 -143 401 852 -43
3214 -43 -414 -443 201 401 366 337 -50 -347 125 290 342 66 -204 -287 -217 11 -14 480 -207 -622 -296 514 500
3237 500 272 -150 -400 -341 207 146 39 -596 0 -3 55 -52 -141 54 142 326 176 182 75 13 -503 -166 -115 -212
3261 -212 -4 267 -334 -408 -186 242 178 -50 -293 -136 0 -269 -18 -33 -382 -3 -66 185 199 361 226 -293
3283 -293 -463 94 460 484 199 -404 -174 30 444 388 -45 -504 -465 350 460 58 70 -516 -283 -51 177
$$ packed form
3125d36P43O32m31q65k06M22L51l5o30rjK95K08K20j36j81l66M20Q6r3QN8p48
3148f94J57O33K48r1n72l83N11J96N57l36j76p94L66R57j14n25P5k63N4K58n6
3169HJk37J02j51L51o4M40k81k61P1k39K97K61k4o93k63J054Kk52k2j99J39K53
3192B93j44k56RJ83l4R2n79N32K91j35l74j29L29M18k01m6l66l23K97N44M51q95
3214d3l71k9O44K00l5k9l87k97M72J65N2k76k70q3P0K28k5M94o87m15L26Q10j4
3237E00k28m22k50N9N48o1j07o35N96lN8j07q9J95Q8J84j50Oj07o2n16L37N1r7
3261b12K08K71o01p4K22M28o4k28k43J57J36k69K51j5l49L79o3K51J4J62j35n19
3283b93j70N57L66K4k85o03K30K04M14n6m33m59L9Q15J10m02J2n86K33K32K28
$$ plain form
3304 177 139 -213 -442 -275 106 307 288 254 -137 -505 -212 196 489 31 -309 -67 36 224 533 -177 -159
3325 -159 -492 -65 304 136 -123 -203 -220 44 78 -66 264 79 -519 -400 43 517 -93 220 -1 -194 -242
3346 -242 260 486 319 -445 -183 327 474 443 87 137 -202 22 508 799 350 -68 -564 16 410 265 385
3367 385 20 -322 -472 157 359 427 148 -395 -458 144 861 441 -209 -761 -540 87 334 313 -337 -152 -390
3388 -390 -123 467 609 -232 -326 -192 -2 300 -64 43 -518 -748 -308 209 441 -178 -219 -78 -200 36 186
3409 186 297 -236 -438 -323 119 59 -39 206 -320 -497 -503 222 349 -21 60 -331 -184 47 292 277 -360 -564
3431 -564 -258 457 521 -277 -461 -679 -83 123 632 353 -178 -670 -454 96 191 -39 66 -262 -727 321
3451 321 559 480 -73 -501 -278 393 331 115 -107 -381 -527 29 530 316 -67 -50 125 177 383 233 -92
$$ packed form
3304A77l8l52k29J67L81K01j9l4l91l68K93M08K93m58l40K42J03J88L09p10J8
3325a59l33M27L69j68k59q0j7K64L4j44L30j85n98J19M43M74o10L13k21j93m8
3346b42N02K26j67p64K62N10J47l1l56N0l39K24M86K91m49m18m96N80L94j45J20
3367C85l65l42j50O29K02O8k79n43o3O02P17m20o50n52K21O27K47k1o50J85k38
3388c90K67N90J42q41r4J34J90L02l64J07n61k30M40N17K32o19m1J41j22K36J50
3409A86J11n33k02J15M42o0r8K45n26j77oP25J27l70Q1l91J47K31K45j5o37k04
3431e64L06P15O4p98j84k18N96K06N09k79n31m92K16N50R5k30J05l28m65J048
3451C21K38p9n53m28K23O71o2k16k22k74j46N56N01k14l83J7J75N2K06j50l25
$$ plain form
3472 -92 -494 -489 -111 281 104 -1 -257 -482 -191 188 421 -148 -109 -468 216 -55 204 322 -18 41 -501 -382
3494 -382 282 419 63 -82 -236 103 349 217 370 -215 -468 188 303 401 152 -287 -571 -444 472 606
3514 606 335 -332 -828 21 102 542 163 -165 -149 -122 376 798 328 -533 -172 91 150 304 374 -251 -629 -206
3536 -206 374 330 371 -319 -232 50 -99 366 646 4 -357 -423 -41 325 261 23 -55 -35 -425 433 289 124
3558 124 -169 -382 -199 -193 407 388 -270 -362 -58 133 378 322 95 -210 -316 -153 290 495 211 -754 -559 -45
3580 -45 476 143 338 -574 -517 -274 644 264 81 -197 -425 -148 335 349 363 -601 -548 -370 527 411 -6 -378
3602 -378 -834 -522 -184 474 258 -425 -571 -266 -192 284 56 -123 -472 -409 -30 689 374 -64 -348 -433 -43
3623 -43 247 521 -283 -210 -523 96 -22 550 257 -295 -345 -331 112 361 301 138 -706 -343 253 705 499 -121
$$ packed form
3472i2m02NL78L92j77j05k56k25K91L79K33n69L9l59O84k71K59J18l40N9n42J19
3494c82O64J37l56j45j54L39K46j32J53n85k53O56J15R8k49m39k84J27R16J34
3514F06k71o67m96Q49Q1M40l79l28J6K7M98M22m70q61L61K63N9J54P0o25l78M23
3536b06N80m4M1o90Q7K82j49M65K80o42l61o6L82L66o4k38p8K0l90Q58j44j65
3558A24k93k13J83OO00j9o58r2L04J91K45n6k27l05j06J63M43K05k84r65J95N14
3580d5N21l33J95r12N7K43R18l80j83k78k28K77M83J4J4r64N3J78Q97j16m17l72
3602c78m56L12L38O58k16o83j46L05P4M76k28j79l49O3L79P19l15m38k84q5L90
3623d3K90K74q04P3l13O19j18N72k93n52n0J4M43K49o0j63q44L63N96M52k06o20
$$ plain form
3645 -121 -173 -445 246 417 477 77 -514 -513 -124 527 324 71 -310 -377 -78 433 976 377 -373 -729 236 232
3667 232 598 117 -413 -485 -328 -7 543 236 -146 -284 -404 568 274 104 -291 -753 -294 48 271 305 199
3688 199 -252 -393 80 348 424 -87 -281 -158 60 330 350 114 -440 -433 216 189 310 12 162 -333 -189 466
3710 466 678 160 -171 -438 -265 182 572 188 -82 -530 -279 304 368 657 103 -543 -436 141 345 378 19
3731 19 -597 -612 -368 146 483 293 -389 -198 -72 391 413 -20 -457 -695 -379 645 377 210 -574 -439 -344
3752 -344 -6 225 136 8 -311 -70 -127 236 141 -286 -528 -451 92 55 200 -325 71 -389 -251 3 313 401
3774 401 -213 -502 -161 -118 249 321 -501 -461 -311 223 198 124 -33 -341 -255 130 354 282 -334 -506 -340 14
3796 14 362 316 80 -672 -550 217 463 297 -202 -328 -448 -111 471 494 -38 -492 -559 114 275 511 325
$$ packed form
3645a21n2k72O91J71O0m00n91JL89O51k03k53l81o7K99N11N43n99p50l56R65m
3667B32L66m81n30p2J57L21N50l07l82j38j20R72k94j70l95m62M59L42K23L4j06
3688A99m51j41M73K68P6n11j94J23K18K70K0k36n54PO49k7J21k98J50m95J44O55
3710D66K12n18l31k67J73M47L90l84k70m48K51N83O4K89n54o46J07N77K04L3l59
3731A9o16j5K44N14L37j90o82J91J26M63K2m33m37k38L16J024k68j67p84J35R5
3752c44L38K31q9j28l19K41n7L63r5m27k42P7N43l7J45n25L96m60J38K54L10Q8
3774D01o14k89L41M3L67P2q22M0J50N34k5p4j57l08Q6L85K24p2o16j72J66L54
3796A4L48m6k36p52J22P67K46j66m99j26j20L37N82K3n32m54o7O73J61K36j86
$$ plain form
3817 325 -342 -543 36 390 414 307 40 -385 -27 225 558 150 -35 -257 -402 394 460 499 -101 -534 -345
3838 -345 270 194 363 -100 -246 -457 293 229 156 214 -314 -128 -8 320 458 45 -214 -406 -288 108 488
3859 488 103 -33 -357 -382 287 599 114 -16 -204 -271 195 519 697 -46 -510 -695 178 241 347 -306 -428
3880 -428 -560 205 457 605 -112 -304 -596 -88 324 661 327 -358 -328 25 209 450 152 -468 -233 -128
3900 -128 164 534 251 -251 -470 -140 191 471 390 125 -522 -579 -244 429 232 -310 -631 -316 -53 368 230
3921 230 197 -691 -469 49 191 569 50 -497 -384 -362 161 456 2 -232 -762 -5 402 528 617 -22 -684
3942 -684 -289 -2 655 395 -196 -655 -645 79 243 460 -150 -424 -503 -168 357 217 169 -310 -326 -218 412
3963 412 334 101 -684 -424 248 557 707 296 -131 -659 -83 214 547 105 -499 -137 -376 -14 448 361 -254
$$ packed form
3817C25o67k01N79L54K4j07k67m25L58K52L33m08j85k22j45P96O6L9o00m33J89
3838c45O15p6J69m63j46k11P50o4p3N8n28J86J20L28J38m13k59j92J18L96L80
3859D88l85j36l24k5O69L12m85j30j88o7M66L24J78p43m64j85Q73O3J06o53j22
3880d28j32P65K52J48p17j92k92N08M12L37l34o85L0L53J84K41k98o20K35J05
3900a28K92L70k83n02k19L30L31K80q1k65o47n7L35O73j97n42l21L15K63M21j38
3921B30l3q88K22N18J42L78n19n47J13K2N23K95m54k34n30P57M07J26Q9o39o62
3942f84L95K87O57k60n91m59J0P24J64K17o10k74p9L35N25j40m8m79j6J08O30
3963D12p8k33p85K60O72L09J50m11m27n28N76K97L33m42o04L62k39L62M62q7o15
$$ plain form
3984 -254 -654 -336 320 327 677 221 -300 -211 -334 234 681 -113 -408 -457 188 202 283 41 -104 -406 -115 402
4006 402 297 239 -438 -730 -115 340 406 409 -13 -170 -225 -16 659 290 -203 -368 -259 123 141 347 -254 -808
4028 -808 -440 258 534 77 52 -437 -506 87 529 35 -212 -403 -426 -273 301 218 250 -208 -483 -279 573 630
4050 630 120 -82 -459 -115 -195 180 490 -273 -362 -157 107 463 229 274 -286 -502 -258 446 396 209 -531
4071 -531 -631 16 368 576 40 -417 -743 -302 548 841 57 -295 -565 -191 135 402 194 -124 -373 -465
4091 -465 116 473 235 49 -510 -360 213 503 411 -13 -661 -559 233 444 350 158 -509 -351 -98 258 656
4112 656 29 -161 -351 -125 402 464 -37 -301 -468 62 209 694 122 22 -272 -330 9 280 246 -220 -680
4133 -680 -416 -169 349 254 -126 -132 -683 53 415 421 -70 -481 -331 194 177 369 -50 -196 -657 -62 471 258
$$ packed form
3984b54m00L18O56PL50m56n21Q9j23N68M47p94k95m9O45J4Q1k42j45l02K91N17
4006D02j05n8o77k92O15M55O6Lm22j57n5K09O75l69m93j65J09L82J8K06o01n54
4028h08L68O98K76m57k5m89o9N93M42m94k47j91k3J53N74q3L2m58k75K04Q52N7
4050F30n10k02l77L44q0L75L10p63q9K05K64L56k34M5n60k16K44P04n0j87p40
4071e31j00O47L52K08n36m57l26M41Q50K93p84l52k70L74L26K67k08l18k49r2
4091d65N81L57k38j86n59J50N73K90r2m24o48J02P92K11r4j92o67J58K53L56L98
4112F56o27j90j90K26N27O2n01k64j67N30J47M85n72j00k94n8L39K71l4m66m60
4133f80K64K47N18r5l80on51P36L62Om91m11J50N25j7J92m19j46m61N95N33k13
$$ plain form
4155 258 21 -346 -136 -5 281 406 172 -287 -613 -362 501 248 223 -270 -289 -395 -111 645 561 -89 -236
4176 -236 -532 217 477 162 -228 -486 -496 319 548 308 -149 -615 -219 -292 631 377 214 -295 -513 -13 151
4197 151 309 195 -70 -307 -457 -109 632 3 -464 -459 69 -168 370 412 -209 -482 -372 101 536 264 9
4218 9 -378 -378 127 378 425 86 -347 -674 -185 515 301 -49 -227 -489 -70 293 495 71 -181 -484 -208 171
4240 171 515 111 -172 -144 47 233 628 115 -60 -502 -165 -51 541 491 -76 -599 -370 172 511 699 -14
4261 -14 -169 -187 -50 55 448 87 -330 -452 -148 261 286 -135 -278 -309 -274 174 451 -34 -166 -85 -388 56
4283 56 260 255 -123 -420 -387 337 588 399 25 -412 -192 5 629 345 -31 -457 -443 -239 437 374 -82 -269
4305 -269 -562 -300 185 742 -11 -239 -525 -186 94 630 243 -256 -686 -242 508 509 405 -137 -469 -93 182
$$ packed form
4155B58k37l67K10J31K86J25k34m59l26K51Q63k53k5m93j9j06K84P56q4o50j47
4176b36k96P49K60l15l90k58j0Q15K29k40m57m66L96p3R23k54j63n09k18N00J64
4197A51J58j14k65k37j50L48P41o29m67NN28k37N38M2o21k73J10M73M35k72k55
4218Il87%N05K51M7l39m33l27M89P00k14l50j78k62M19L63K02m24k52l03K76L79
4240A71L44m04k83K8J91J86L95n13j75m42L37J14N92n0n67n23K29N42L39J88p13
4261a4j55j8J37J05L93l61m17j22L04M09K5m21j43l1L5M48K77m85j32Q1l03M44
4283E6K04nl78k97L3P24K51j89l74m37K20J97O24k84l76m26J4K04O76o3m56j87
4305b69k93K62M85N57p53k28k86L39K80N36l87m99m30M44P50Jj04n42l32L76K75
$$ plain form
4326 182 326 343 -200 -492 -259 173 404 535 84 -392 -384 37 479 458 310 -343 -412 -241 334 182 160 -153
4348 -153 -426 -22 246 324 295 -120 -194 -83 206 483 115 -92 -566 -313 231 410 250 -163 -331 -460 153
4369 153 419 401 -205 -489 -375 -49 299 614 -102 -298 -458 -334 381 203 -132 -546 -521 -377 264 300 136
4390 136 -128 -493 -279 93 320 206 -147 -492 -223 92 239 528 -30 -474 -210 61 323 368 -51 -438
4410 -438 -409 -220 457 -115 -3 -77 -201 145 227 244 273 -241 -517 -84 560 560 227 -223 -371 -301 116 709 452
4433 452 -279 -194 -49 -70 247 436 -67 -348 -291 219 232 349 190 -519 -337 -119 304 111 -25 -558 -540 -77
4455 -77 522 279 375 -387 -465 -98 385 438 233 -450 -454 45 187 398 94 -231 -304 -156 343 575 67 -307
4477 -307 -300 -116 -9 395 380 -419 -262 -308 16 708 459 17 -90 -99 -156 374 739 -4 -341 -442 -208 90
$$ packed form
4326A82J44J7n43k92K33M32K31J31m51m76QM21M42k1j48o53o9J71N75j52k2l13
4348a53k73M04K68P8k9m15p4J11K89K77l68k07m74K53N44J79j60m13j68j29O13
4369A53K66j8o06k84J14L26L48L15p16j96j60J24P15j78l35m14K5J44O41L6j64
4390A36k64l65K14L72K27j14l53l45K69L15J47K89n58m44K64K71K62M5m19l87
4410d38K9J89O77n72J12p4j24L46Q2J7K9n14k76M33O44%l33m50j48P0M17N93k57
4433D52p31Q5J45k1L17J89n03k81N7N10J3J17j59p09J82K18M23j93j36n33J8M63
4455g7N99k43R6p62p8L67M83N3k05o83mM99J42K11l04l25p3J48M99K32n08l74
4477c07PJ84J07M04j5p99J57m6L24O92k49m42j07rn7N30L65p43l37j01K34K98
$$ plain form
4499 90 510 287 -233 -327 -437 431 485 129 102 -381 -461 264 353 526 -16 -465 -319 56 347 554 23 -253
4521 -253 -300 -12 523 255 35 -313 -206 -168 348 471 -62 -539 -379 -291 766 271 207 -295 -503 -363 467
4542 467 287 100 -49 -488 -202 -46 542 519 -150 -393 11 41 447 218 -49 -403 -317 44 532 143 221
4563 221 -394 -258 60 305 316 -76 -282 -135 -55 620 307 -33 -272 -234 -267 277 463 370 -284 -665 -58 217
4585 217 597 240 -42 -357 -308 167 752 299 -123 -540 -289 243 408 710 -72 -686 -516 -52 587 246
4605 246 343 -503 -261 26 231 710 12 -212 -499 -162 374 291 -63 -174 -662 -587 -212 323 481 -258 -417
4626 -417 -331 -4 222 246 -58 -231 -320 -66 735 244 161 -343 -466 50 231 515 -32 -332 -271 23 149 452
4648 452 254 -441 -359 -121 204 587 311 -63 -482 -176 102 714 181 -163 -268 -332 -114 414 379 -331 -488
$$ packed form
4499I0M20k23n20r4j10Q68N4l56k7m83q0P25Q9J73n42m49J46L75K91K07n31k76
4521b53m7K88N35k68k20l48J07L8N16J23n33m77J60Q8J057m95o4n02k08J40Q30
4542D67j80j87j49m39K86J56N88k3o69k43M04L0M06k29k67l54Q6L61M88l89P8
4563B21o15J36L18K45J1l92k06J47Q0O75l13l40k39L8l3N44J86r3o54l81O07K75
4585B17L80l57k82l15M9M75N85m53m22m17K51N32J65L02p82o14J70M64O39l41
4605B46R7q46K42K87K05M79o98k24k87L37N36q3l54j11m88P5L75N35J58p39j59
4626d17Q6L27K26K4l04j73q9K54Q01m91q3n04j23N16J81K84n47l00O1K94J26L03
4648D52j98o95Q2K38L25L83k76l74m19L06K78O12n33l44j05o4K18N28l5p10j57
$$ plain form
4669 -488 -350 -6 537 479 -254 -259 -232 223 456 170 75 -608 -435 117 354 355 139 -314 -343 -70 133 536 148
4692 148 -356 -407 -88 129 274 111 -89 -579 -373 292 251 210 -146 -474 -230 113 450 471 -173 -344 -116
4713 -116 75 282 217 4 -61 -583 -71 431 651 51 -463 -281 -158 3 440 130 -255 -159 -330 92 445
4734 445 226 -80 -602 -90 411 294 153 -256 -548 -253 32 382 644 68 -177 -316 427 375 516 30
4754 30 -346 -385 -208 323 635 -94 -374 -366 22 28 545 216 -11 -528 31 332 604 311 -350 81 -171 -24
4776 -24 -42 164 -46 -454 -430 281 302 293 103 -277 -165 -210 261 207 33 -311 -406 -140 175 243 21 -67 -228 -104
4800 -104 81 765 124 -443 -414 -258 214 311 -36 -330 -496 -41 402 269 594 -382 -442 -513 -92 109 223
4821 223 -73 -686 -213 -93 370 259 -61 -130 -271 81 398 246 -13 -419 -300 -50 118 440 41 -340
$$ packed form
4669d88J38L44N43n8p33nK7M55K33k86r5o83J73N52K37Jk16m53k9K73K03M03l88
4692A48n04n1L19K17J45j63k00m90K06O65m1m1l56l28K44L43L37K1o44j71K28
4713a16J91K07o5k13o5n22N12N02K20o00n14J82J23J61M37l10l85R6j71M22L53
4734D45k19l06n22N12N01j17j41m09k92K95K85L50K62n76k45j39P43n2J41m86
4754C0l76l9J77N31L12p29k80QL88ON17l29k27n17N59L01K72k93o61M31k52J47
4776b4j8K06k10m08K4P11K1rj90l80J12m5M71n4j74l44r5K66L15O8k22q8j61J24
4800a04J85O84o41n67K9J56M72R7l47k94j66M55M43j33L25r76o0p1M21K01J14
4821B23k96o13M73J20M63j11l20o9j41L52L17j52k59m06J19K50J68L22l99l81
$$ plain form
4841 -340 -276 -262 473 198 117 -279 -578 -146 75 434 469 -131 -471 -182 4 554 248 38 -418 -224 -59
4862 -59 328 185 -134 -708 -272 -158 -44 176 -149 -124 -230 -11 356 263 129 -61 -579 127 250 358 337
4883 337 -386 -546 -41 261 392 136 -161 -206 -195 95 174 228 -91 -436 42 -106 547 302 245 -416 -331 -80
4905 -80 172 456 -171 -276 -269 -380 217 232 58 -277 -486 -236 76 583 187 -78 -243 -349 157 333 292 -339
4927 -339 -295 -335 28 435 336 -150 -440 -414 124 345 588 -133 -398 -306 -80 143 258 -10 -254 -330 -73 319
4949 319 573 234 123 -81 -12 21 476 -79 -180 -336 -186 305 436 386 88 -505 -241 64 916 349 -190
4970 -190 -387 -518 232 238 80 -213 -416 -418 378 207 44 430 -271 -255 113 571 380 322 -432 -454 -398 151 234
4993 234 87 -128 -554 -37 208 471 220 -229 -481 -256 25 416 434 -3 -523 -382 155 256 291 80 -515
$$ packed form
4841c40O4J4P35k75q1l96k99M32K21L59L5o00l40K89J86N50l06k10m56J94J65
4862e9L87j43l19n74M36J14J14K20l25K5j06K19L67r3j34j90n18P06J23J08k1
4883C37p23j60N05L02J31k56k97m5J1K90P9N4l19l45M78j48O53k45n7o61Q5K51
4905h0K52K84o27j05Pj11N97J5j74l35k09K50L12N07l96k65j65j06N06J76m1o31
4927c39M4m0L63M07r9m86k90K6N38K21K43p21k65R2K26K23J15k68k44p6K57L92
4949C19K54l39j11k04O9L3M55n55j01j56J50M91J31n0k98n93K64L05Q52n67n39
4970a90j97j31P50Oj58k93k03kP96j71j63L86p01J6L68M58j91n8p54k2N6N49Q3
4993B34j47k15m26N17K45K63k51m49k52K25K81L91J8m37n20J41N37J01L5k11n95
$$ plain form
5014 -515 -268 -28 300 398 165 -461 -347 100 97 353 108 -409 -353 -150 355 197 156 -199 -570 -286 -33 552
5036 552 -81 -176 -433 -361 518 154 -144 -188 -100 -226 309 409 197 -209 -272 -81 111 454 19 -41 -362 -378
5058 -378 -122 227 763 207 -310 -484 -33 221 389 71 -250 -530 75 36 516 274 -145 -125 -7 43 280
5079 280 205 -199 -187 -343 71 217 413 146 -496 -520 -150 424 247 165 -483 -405 -136 27 595 -10 -331 -451
5101 -451 -64 532 357 62 -467 -75 -158 143 71 279 65 -357 -183 -14 41 355 -102 -424 -65 53 112
5122 112 370 -93 -621 -218 159 102 366 -218 -249 -185 -93 299 63 -107 -195 -343 14 388 229 15 -119 -471
5144 -471 -559 370 272 246 3 -339 -232 -161 463 59 -153 -410 -139 211 23 310 -20 -435 -334 -238 -27 415
5166 415 -75 -357 -354 -171 321 225 77 -574 -588 23 255 346 -41 -362 -385 -46 265 217 353 14 -204 -77
$$ packed form
5014e15K47K40L28R8k33o26J14M47lK56k45n17N6K03N05j58m1l55l71K84K53N85
5036E52o33r5k57P2Q79l64k98m4Q8j26N35J00k12m06o3J91J92L43m35o0l21j6
5058c78K56L49N36n56n17j74M51K54J68l18l21k80O05l9M80k42m19K0J18N0K37
5079B80p5m04J2j56M14J46J96k67o42k4L70N74j77q2o48P8K69J63N68o05l21j20
5101d51L87N96j75k95n29L92q3L01p2K08k14m22J74J69N5L14m57l22L59J18N9
5122A12K58m63n28M03L77n7K64n84l1O4R2L92k36j70q8j48L57L74j59k14j34l52
5144d71q8R29r8k6k43l42J07P1O24m04k12k57K71L50j88K87l30m15J01R6K11M42
5166D15m90k82LJ83M92r6j48o51j4O11K32R1l87l21k3L39L11m8J36l39k18J27
$$ plain form
5188 -77 97 134 25 80 -229 -335 -147 470 254 116 -231 -421 124 420 763 -208 -268 -517 280 344 350 29
5210 29 19 -29 254 451 377 249 -105 -376 -431 153 424 161 -432 -389 -132 147 447 205 -263 -647 -334 114
5232 114 555 705 -358 -321 -128 437 386 291 -169 -281 -109 176 10 403 88 -442 -698 48 64 309 80
5253 80 -136 -400 24 441 392 186 -150 -364 -32 184 177 151 -253 -269 -191 13 -21 337 157 -331 -298 13 -11
5276 -11 -22 -197 -269 -447 -96 150 469 -112 -139 -611 -98 449 97 89 -502 -509 -147 342 580 144 -25 -185 -60
5299 -60 -35 422 240 -41 -428 -403 -59 342 490 -134 -482 -332 -100 410 201 -9 -237 -320 67 226 106
5320 106 -12 -519 -363 -89 169 115 -56 -318 -344 -119 206 27 290 -56 -333 -206 148 325 48 27 -276
5341 -276 -462 -199 330 324 141 49 -321 149 327 240 50 -468 -429 -308 142 272 138 -105 -275 -303 123 381
$$ packed form
5188g7J74L7j09N5l09j06J88O17k16j38l47j90N45K96L43r71o0k49P97O4Ol21
5210B9j0m8K83J97p4j28l54k71n5N84K71k63n93M3K57K79L00k42m68l84L13M48
5232A14M41J50j063L7J93N65n1r5m60j12J72K85j66L93l15n30k56P46J6K45k29
5253H0k16k64M24M17m9k06l36k14L32K16pk6m04j6P8K04l4L58j80m88L3L11k4
5276a1j1j75p2j78L51K46L19n81k7m72N13N47l52qn91pL62M89K38m36j69j60J25
5299f0K5M57j82k81l87K5L44M01J48o24l48J50K32N10k09k10k28q3L87J59j20
5320A06j18n07J56K74K58n4j71k62k6K25L25j79K63l46k77J27L54J77k77k1l03
5341b76j86K63N29oj83r2l70M70J78q7j90n18L9J21M50J30j34k43j70k8M26K58
$$ plain form
5363 381 599 -297 -403 78 92 229 410 57 -301 -49 308 383 386 70 -229 -133 122 500 245 241 -400 -77
5385 -77 269 192 316 28 -496 -414 94 323 281 99 -491 -414 -33 366 475 -32 -303 -294 -177 88 266 27
5407 27 97 -59 -14 46 217 310 -400 -281 -307 294 311 226 59 -122 -268 -113 288 166 -38 -527 -496 60 412
5430 412 305 -54 -104 -317 -227 208 344 224 105 -582 -121 235 197 35 29 -399 -173 291 219 130 -164 -127 -86
5453 -86 169 262 330 -148 -233 -344 -177 90 163 -43 -295 -43 79 371 544 120 -195 -479 -41 184 317 258
5475 258 -193 -529 -126 104 567 -82 -438 -377 -142 229 179 77 -222 -289 -356 317 461 398 52 -331 -308 258
5497 258 501 120 -123 -291 -219 229 210 212 3 -262 -260 -58 410 213 -185 -51 -438 248 151 342 211 -141
5519 -141 -76 -287 348 508 182 -143 -238 -373 187 517 323 -81 -400 -356 26 550 170 -201 -44 -93 238
$$ packed form
5363C81K18q96j06M81J4J37J81l53l58K52L57P5Ll16k99R6K55L78k55mo41L23
5385g7L46p7J24k88n24Q2N08K29m2j82n90P7L81L99J09n07k71RJ17K65J78k39
5407B7P0j56M5O0J71R3p10J19k6O01J7q5j67j81j46J55M01j22k04m89L1N56L52
5430D12j07l59n0k13R0M35J36j20j19o87M61L56l8j62om28K26M64p2q9k94L7M1
5453h6K55R3O8m78q5j11J67K67P3k06k52K52J22K92J73m24l15k84M38K25J33n9
5475B58m51l36M03K30M63o49l56O1K35L71n0j02k99o7o7O73J44o3l46l83K3N66
5497B58K43l81k43j68P2M48j9Kk09k65KK02M68j97l98J34l87O86r7J91j31l52
5519a41O5k11O35J60l26l25r5j35N60L30j94m04l19M4L82N24l80l71J57m9L31
$$ plain form
5540 238 458 262 206 -232 -141 -35 469 522 101 127 -246 -179 80 299 454 -288 -304 -229 197 674 412 -115
5562 -115 -412 44 16 340 113 -280 -370 -115 69 365 230 132 -384 -40 -157 140 422 24 -361 -380 -131
5583 -131 322 62 -204 -180 -206 -76 386 488 133 -175 -517 -109 236 178 439 36 -213 -334 57 476 190
5604 190 -161 -534 -317 -268 119 5 -187 -302 -259 60 337 58 -141 -372 24 -78 -78 442 149 -241 -90
5625 -90 -290 177 55 227 17 -509 -284 257 309 115 -77 -492 -148 109 153 -5 -119 -333 -297 75 264
5646 264 153 -211 -465 -85 -347 242 96 164 -217 -656 97 375 348 379 -425 -433 32 176 33 74 -348 -414
5668 -414 -119 247 52 -12 -244 -439 -86 202 385 200 -159 -267 -213 196 -2 18 -143 -178 -142 137 298 -9
5690 -9 -56 -517 -354 -36 -32 411 -105 -317 -169 -14 -129 90 84 21 -415 -299 409 157 259 -337 -249 -260 170
$$ packed form
5540B38K20j96n6m38R1J06N04N3m21K6l73O7K59K19J55p42j6P5M26M77k62n27
5562a15k97M56k8L24k27l93r0K55J84K96j35r8n16L44j17K97K82l98l85j9K49
5583a31M53k60k66K4k6J30M62J02l55l08l42M08L45n8K61m03k49j21L91M19k86
5604A90l51l73K17M9L87j14j92j15M3L19K77k79j99k31L96j02%N20k93l90J51
5625i0k00M67j22J72k10n26K25N41N2j94j92m15L44K57M4j58j14k14L6L72J89
5646B64j11l64k54L80k62N89j46O8l81m39P53K78k7L1q04qM65J44j43M1m22o6
5668d14K95L66j95o4k32j95L53K88J83j85l59j08N4M09j98K0j61l5L6K79J61l07
5690im7m61J63L18MM43n16k12J48J55j15K19oo3m36J16P08k52J02n96Q8j1M30
$$ plain form
5713 170 306 129 -423 -492 -165 445 234 305 -125 24 -60 76 242 15 -24 -308 -103 -66 125 172 222 -66
5735 -66 -52 118 -63 399 74 -200 -449 -430 380 310 43 -153 -120 -315 77 295 382 -47 -266 -365 -10 163
5757 163 117 -23 -537 -269 -28 406 288 -330 -405 -252 -12 397 167 82 -270 -281 -29 267 73 13 -202 -548
5779 -548 -103 45 258 89 -157 -515 -365 8 57 410 113 -337 -295 201 510 68 -88 -342 -59 210 421
5800 421 131 -313 -241 -129 -195 277 198 -105 -147 -513 0 61 399 100 -81 -281 -110 -33 622 -134 -100 -295
5822 -295 -277 281 169 333 -275 -95 98 -35 285 236 43 -327 -361 -194 136 314 -233 25 -177 -56 252
5843 252 318 -61 -428 -59 -205 221 557 200 -115 -235 225 -35 217 341 -177 -40 -196 115 295 11
5863 11 -277 -113 270 -28 490 294 125 -188 -281 156 222 43 -219 -306 -51 -94 316 104 -254 -209 -210 -140 103
$$ packed form
5713A70J36j77n52o9L27O10k11P1m30J49q4J36J66k27l9k84K05L7J91M7N0k88
5735f6J4J70j81M62l25k74k49J9Q10p0k67j96L3j95L92K18Q7m29k19r9L55J73
5757A63m6j40n14K68K41M34j18o18p5J53K40M09k30q5l52j1K52K96j94o0k15l46
5779e48M45J48K13j69k46l58J50L73M9L53k97m50M2M96L09m42j56k54K83K69K11
5800D21k90m44P2J12o6M72p9l03m2l66N13O1L38k99j81k00J71P7O55p56L4j95
5822b95J8N58j12J64o08J80J93j33L20m9j93l70l4J67L30J78n47K58k02J21L08
5843B52O6l79l67L69j46M26L36l57l15j20M60k60K52J24n18J37j56L11J80k84
5863A1k88J64L83k98N18j96j69l13r3M37O6j79k62q7K55m3M10k12l58M5jP0K43
$$ plain form
5886 103 296 73 -275 -232 -242 233 134 57 -113 -150 -159 50 167 182 161 -340 72 121 155 -25 46 -422 -155 124
5910 124 141 45 -9 -66 -341 65 139 164 160 -12 -23 -171 80 220 -190 -170 -129 -95 235 128 123 -184 -391 -282 -23
5935 -23 164 178 -251 -270 -323 66 337 253 -243 -255 -248 262 166 238 -391 -231 -267 -113 152 135 222 -70 -284 91
5959 91 182 20 -221 -4 -243 -75 626 212 97 -240 -188 104 -135 -224 109 -142 -138 -348 93 131 85 -98 -336
5982 -336 -45 464 371 194 -46 -193 -327 -186 463 372 222 -297 -131 -93 33 304 -1 -164 -357 11 222
6003 222 642 144 -208 -278 1 320 288 153 -55 108 -120 -91 288 184 -194 -73 98 83 536 156 -85
6024 -85 -33 -460 149 174 348 -210 26 -172 -109 29 41 -94 -259 -228 9 112 34 -219 -60 -36 -27 269 238 225
6048 225 -250 -33 -187 78 84 167 24 -81 -159 -104 236 -125 -264 -92 -195 -86 65 275 84 -520 78 164
$$ packed form
5886A03J93k23l48M3j0M75r9p7j70l7rK09J17J5k1n01M12M9L4j80P1m68K67K79
5910A24J7r6n4n7k75M06P4K5mj72j1j48K51J40m10K0M1L4L30j07nl07k07J09K59
5935b3J87J4m29j9n3L89K71q4m96j2PN10r6P2o29J60l6J54K65j7Q7k92k14L75
5959I1R1j62k41K17k39J68P01m14j15l37N2K92k39q9L33k51Mk10M41L8m6j83k38
5982c36K91N09r3j77k40j47j34J41O49r1j50n19J66L8J26K71l05j63j93L68K11
6003B22M20m98l52p0K79L19l2j35k08J63k28K9L79j04l78J21J71j5M53l80k41
6024h5N2m27O09K5J74n58K36j98O3J38J2j35j65L1K37J03p8k53J59K4RK96l1j3
6048B25m75K17j54K65OQ3j43j05p8N5L40l61j39J72j03J09J51K10j91o04N98Q6
$$ plain form
6070 164 121 159 47 -147 20 239 -118 344 268 -292 -268 -85 81 -98 29 -22 -160 -54 164 151 322 46
6092 46 -43 -150 82 15 205 229 -642 -147 -2 263 253 18 -51 -357 145 197 269 -34 -295 -258 -457 38 261
6115 261 126 -130 -71 176 -101 298 352 -136 -498 37 14 468 24 132 -352 18 237 293 269 -23 -388 -36
6137 -36 115 74 151 192 -108 -264 168 201 370 8 -327 -131 128 150 285 -58 82 -277 -87 230 196 191 -336
6160 -336 -166 -163 -66 35 -117 -427 -245 -204 132 300 77 191 -71 -72 -103 231 172 -182 -141 -352 75 191 223
6183 223 143 -292 -265 -48 271 183 101 -89 -97 -191 235 248 -20 -153 -453 162 -202 159 3 -225 -184 17 109
6206 109 417 134 220 -27 -94 196 70 47 -9 -289 40 -112 450 356 185 99 -359 76 14 30 -227 -183 -152
6229 -152 -19 282 197 68 -35 -323 -321 382 494 300 94 -224 -208 -38 -8 216 -277 -340 -117 84 224 106
$$ packed form
6070A64m3L8j12j94J67K19l57M62p6n60K4J83J66j79J27n1j38J06K18j3J71k76
6092D6q9j07K32o7J90K4q71M95J45K65j0k35o9l06N02N2P2l03k61L7j99M95K23
6115B61j35k56N9K47k77L99N4m88l62N35k3M54m44J08m84L70K19N6k4k92l65L52
6137c6J51m1P7M1l00j56M32L3J69l62l35J96K59K2J35l43J40l59J90L17l4nn27
6160c36J70LR7J01j52l10J82M1L36J68k23J14k62jl1L34n9l54M1k11M27J16L2
6183B23q0m35K7K17L19q8q2j90qr4M26J3k68j33l00O15l64L61j56k28M1K01R2
6206A09L08k83Q6k47o7K90j26k3n6k80L29j52N62r4j71q6m58M35o2J6k57M4L1
6229a52J33L01q5j29j03k88KP03J12j94k06l18J6J70L0K24m93o3K23K01J40j18
$$ plain form
6251 106 -49 -243 -377 113 22 99 200 -206 -292 -56 186 162 214 -323 -18 -8 206 -31 52 -430 -464 -213 283
6274 283 296 158 -143 -219 -434 89 123 13 -85 -547 41 -21 259 35 -314 -78 -191 -82 121 52 322 -72
6296 -72 -185 65 442 391 -172 -255 -83 -234 71 52 -12 -184 -74 66 71 532 149 -108 -367 -267 107 343
6318 343 -61 22 -285 -78 -75 262 105 31 -64 -246 -34 143 230 -34 -382 -37 20 148 248 85 -124 -234
6340 -234 64 627 -13 -303 -83 -165 -53 292 273 73 -121 -81 55 234 38 2 50 -105 -57 78 24 295
6362 295 52 -344 14 7 324 200 -37 -116 -74 -41 289 272 -153 -203 -362 2 208 153 112 -407 -147 -110 330
6385 330 281 -14 -87 -198 101 135 337 165 -66 -37 -71 -233 191 174 -151 -128 -261 -82 409 403 1 -210 -134
6408 -134 -167 198 151 147 -325 -193 -135 -232 260 -105 -151 43 416 144 -32 378 51 -420 -167 -117 490 44 -160
$$ packed form
6251A06j55j94j34M90r1P7J01m06q6K36K42k4N2n37L05J0K14k37Q3m82l4K51M96
6274B83J3j38l01p6k15N23L4j10r8m62N88o2K80k24l49K36j13J09K03o9K70l94
6296g2j13K50L77n1n63q3J72j51L05j9o4j72J10J40NM61l83k57k59J00L74K36
6318C43m04Q3l07K07LL37j57p4r5j82K12J77Q7k64l48L45N7J28J00j63k09j10
6340b34K98N63o40k90K20q2J12L45j9k00j94M0J36J79j96l6M8j55M8J35n4K71
6362B95k43l96L58pL17j24k37p9M2L3L30j7m25n0j59L64K06n5m1n19K60L7M40
6385C30m9k95p3j11K99L4K02j72k31K9l4j62M24j7l25K3j33J79M91om02k11P6
6408a34l3L65m7mm72J32N8r7M92l65m6J94L73k72j76M10l27m71K53N0O07m46k04
$$ plain form
6431 -160 -185 -87 -31 609 -161 -10 -242 -40 30 248 314 4 -157 -168 -99 336 10 -52 -199 -140 160 -114 190
6454 190 177 -216 -324 -72 22 158 -7 -117 -85 -81 -124 203 10 -213 -122 111 84 241 74 -139 -104 -157 174
6477 174 267 388 -146 -452 -331 -172 88 364 -95 -386 -304 -59 -106 238 -58 -11 4 -156 167 322 49 -112
6499 -112 -260 -208 20 166 48 -206 -195 -239 63 262 182 37 -141 -15 232 103 -118 -172 -168 -243 203 218 330
6522 330 39 -222 -20 65 136 -12 -22 -269 -168 100 70 260 196 -72 -180 71 63 275 -90 10 -336 -47
6544 -47 -153 34 330 -178 -192 92 -20 282 360 283 -412 88 100 -29 77 89 261 -61 35 201 -47 -88 -85
6567 -85 25 172 219 290 57 120 -378 -103 222 26 86 -265 -171 -152 -136 2 -5 -83 -208 -200 34 -51 270 -63 -331
6592 -331 -27 181 413 236 -93 -435 -63 26 198 137 139 -61 -363 250 -22 235 105 53 -101 -45 184 369
$$ packed form
6431a60k5R8N6O40p70J51k32K02P0K18O6l10j61j1O9M35l26o2j47N9L00k74L04
6454A90j3l93j08K52R4J36j65j10L2Mm3L27j93k23R1K33k7J57j67k13L5n3L31
6477A74R3J21n34l06J21J59K60K76m59k91Q2K45m7L44k96M7J5j60L23J55k73j61
6499a12j48N2K28J46j18k54J1m4L02J99q0j45j78J26K47j29k21n4Mp5M46J5J12
6522C30k91k61K02Q5P1j48j0k47J01K68l0J90o4k68j08K51qK12l65J00l46K89
6544d7j06J87K96n08j4K84j12L02P8p7o95N00J2j29J06J2J72l22R6J66k48m1L
6567h5J10J47M7P1k33O3m98K75L25j96O0l51R4J9J6J38pp8j25QK34q5L21l33k68
6592c31L04K08K32j77l29l42L72Q9J72o1Kk00l02O13k72K57j30n2j54N6K29J85
$$ plain form
6614 369 163 -36 -29 156 41 454 28 -286 -366 -146 31 236 119 -329 -52 -55 -204 -12 91 164 -587 -19
6636 -19 -227 22 139 -16 6 122 -357 219 286 125 -49 -77 -65 -340 139 185 -171 -324 78 107 115 159 -201
6659 -201 -140 -64 -99 -16 167 64 35 64 221 75 84 -29 42 -80 -68 274 77 -30 50 77 -65 352 -214 -55
6683 -55 -27 58 110 35 144 44 -272 -52 -461 326 114 58 86 -274 -41 -44 100 201 -6 -5 -127 43 44 187
6707 187 -163 -328 -33 156 270 72 -71 -251 -64 -264 164 190 -158 34 101 49 -10 -102 -30 -165 -15 -156
6729 -156 154 181 -129 -14 -196 -169 338 365 81 70 -154 -501 322 375 280 -166 -167 -202 177 125 -111 -176 -214 -233
6753 -233 142 205 99 379 -35 -336 21 -10 313 22 -7 -274 -121 -88 161 181 -292 -125 54 33 -26 98
6775 98 -7 -25 -204 108 411 224 108 -152 -145 195 304 330 -254 81 -312 32 132 -57 -102 -353 60 206
$$ packed form
6614C69k06j99PJ85j15M13m26l14q0K20J77K05j17m48K77lj49J92J03P3p51N68
6636a9k08K49J17j55K2J16m79N76O7j61j74k8J2k75M79M6l56j53M02K9QM4l60
6659b01O1P6l5Q3J83j03k9K9J57j46Rj13P1j22J2L42j97j07Q0K7j42M17n66J59
6683e5K8Q5N2p5J09j00l16K20m09P87k12n6K8l60K33lJ44J01k07Jj22J70JJ43
6707A87l50j65K95J89J14j98j43j80J87k00M28K6l48J92O7n2n9r2P2j35J50j41
6729a56L10K7l10J15j82K7N07K7k84j1k24l47Q23N3r5m46jl5L79n2k36o5l8j9
6753b33L75O3j06K80m14l01L57l1L23k91k9k67J53L3K49K0m73J67J79k1n9J24
6775I8j05j8j79L12L03j87j16k60PL40J09K6n84L35l93L44J00j89m5k51M13J46
$$ plain form
6797 206 -48 425 -6 -127 -373 -199 319 89 36 -51 -218 -293 246 295 126 22 90 -299 17 -42 155 114
6819 114 -231 27 43 15 23 -236 -121 -152 160 310 321 -114 -259 199 164 137 243 71 -243 -211 -36 -58 192
6842 192 111 -13 -236 132 123 160 11 -50 -31 -309 -123 116 -27 144 -268 -287 -115 140 -8 170 -69 -32 -532
6865 -532 157 -106 225 76 -230 147 90 85 -14 -93 99 -31 217 112 -294 2 -167 -24 227 291 -142 -52
6887 -52 -13 -193 -70 361 -187 300 -285 -280 133 260 -59 20 24 -437 -68 85 150 93 5 34 -175 354 33 -96
6911 -96 -251 80 -141 210 266 50 -250 -3 -125 9 160 123 -189 -288 -127 273 178 258 51 -269 -85 319
6933 319 227 326 -75 -125 -134 95 242 -81 -5 -24 -140 -73 509 -93 -141 -141 -225 108 248 238 188 -75 -178 -215 38
6958 38 314 -244 108 -442 -5 -159 249 49 -43 17 -127 469 173 47 -5 -38 -373 52 213 234 -188 -94
$$ packed form
6797B06k54M73m31j21k46J74N18k30n3q7j67p5N39M9j69j04O8l89L16n9J97m1
6819A14l45K58J6k8Qk59J15l1L12J50J1m35j45M58l5k7J06j72l14L2J75k2K50
6842A92q1j24k23L68rL7j49o1J9k78J86K39j43J71m12j9J72K55j48J78k39L7n00
6865e32O89k63L31j49l06L77n7nr9p9J92j30K48j05m06K96j69J43K51O4m33R0
6887e2L9j80J23M31n48M87n85NM13J27l19P9Mm61L69J53O5n7q8K9k09N29l21j29
6911i6j55L31k21L51N6k16l00K47j22J34J51l7l12r9J61M00r5Q0k07l20J84M04
6933C19r2R9m01n0rK29J47l23P6j9j16O7N82o02m8%q4L33J40j0n0k63j03l7K53
6958C8K76n58L52n50M37j54M08k00r2O0j44N96k96j26n2l3l35M25J61K1m22R4
$$ plain form
6980 -94 228 -254 218 261 112 100 -259 -216 257 66 -142 -58 -111 -260 56 105 -18 -217 -39 202 506 234
7002 234 372 144 -172 -259 181 375 -167 -47 -131 28 -38 255 220 43 -281 -410 154 215 272 125 -142 43
7024 43 13 -158 37 -40 -239 -76 92 90 78 348 -112 -453 41 330 -234 -3 -252 -178 73 169 356 29 -7
7047 -7 -192 -76 2 278 52 284 -128 -155 107 -46 69 -37 -48 123 37 308 112 9 -24 31 14 7 -170 96
7071 96 -206 -125 -45 48 15 295 -82 -118 54 158 234 41 -226 -309 -51 55 369 241 87 -406 -205 126 379
7094 379 170 -59 -107 -191 14 105 317 94 -331 -205 -186 10 119 -159 262 68 320 166 72 -86 68 221
7116 221 26 181 179 96 -95 6 -177 46 189 217 -286 -213 -63 -100 22 -96 133 -280 -286 -46 14 216 -133
7139 -133 -144 -66 91 -144 -47 105 -308 -41 143 230 295 18 -129 -260 -241 66 177 -54 230 -78 71 81
$$ packed form
6980i4L22m82M72M3j49j2l59M3M73j91k08Q4n3j49L16M9j23j99J78K41L04k72
7002B34J38k28l16q7M40J94n42J20q4J59o6K93l5j77l24j29N64O1N7j47k67J85
7024D3l0j71J95p7j99J63J68kj2K70m60l41M94K89n64K31k49P4K51R6J87l27l6
7047gj85J16P8K76k26K32m12k7K62j53J15j06j1J71q6K71j96j03l3N5j7pj77K66
7071I6l02Q1Q0R3l3K80l77l6J72J04P6j93k67q3K58J06L14j28j54m93K01L31K53
7094C79k09k29m8q4K05R1K12k23m25J26J9J96J09k78M21j94K52j54r4j58J54J53
7116B21j95J55kq3j91J01j83K23J43K8n03P3J50l7J22j18K29m13oK40O0K02l49
7139a33j1P8J57k35R7J52m13K67J84Q7O5k77j47j31J9L07J11k31K84l08J49J0
$$ plain form
7161 81 -207 202 129 -148 -206 -138 230 179 -47 60 -35 135 211 77 -138 -294 -320 -356 139 -6 -71 -241 -311 35
7185 35 -75 31 -60 -180 -341 -364 350 197 -194 -69 -235 -113 147 414 119 -17 -77 68 -201 -84 73
7206 73 -243 -185 -40 142 156 162 90 -307 -42 -26 416 139 4 97 -304 -145 171 332 -1 47 -56 -43 267
7229 267 150 170 285 -461 21 224 -66 95 -123 -93 60 -18 220 -62 -210 -464 -436 -46 -71 25 -29 -136
7251 -136 30 230 91 298 141 -333 62 231 -47 205 29 156 -311 121 -21 -76 201 -281 -23 -306
7271 -306 -57 64 154 11 36 -131 -3 398 -70 0 -70 -126 -229 -88 190 -166 -58 -150 129 166 292 -315
7293 -315 68 -160 -41 -110 173 -178 -42 -144 -105 -39 164 -165 -62 96 303 -16 167 169 183 63 -106 -198
7315 -198 -68 138 107 1 294 -275 185 237 1 -252 -261 -256 330 43 -10 26 -11 272 -67 -15 161 -286 -287 19
$$ packed form
7161H1k88M09p3k77n8O8L68n1k26J07r5J70P6j34k15j56k6l6M95j45o5j70p0L46
7185C5j10J06r1j20j61k3P14j53l91J25j66J22K60K67k95j36o0J45k69J17J57
7206G3l16N8J45J82J4Op2l97K65J6M42k77j35R3m01J59L16J61l33M8j03J3L10
7229B67j17K0J15p46M82K03k90J61k18L0J53p8K38k82j48k54K8L90k5R6n4j07
7251a36J66K00j39K07j57m74L95J69k78K52j76J27m67M32j42n5K77m82K58k83
7271c06K49J21R0j43K5j67J28M01m68P0p0n6j03J41K78l56J08r2K79L7J26o07
7293c15L83k28J19o9K83l51J36j02L9O6K03l29J03J58K07l19J83KJ4j20j69r2
7315a98J30K06l1j06K93n69M60N2k36k53rNN86k87n3L6l7K83l39N2J76m47jL06
$$ plain form
7339 19 -208 10 53 83 -59 -23 -23 174 95 -79 -84 -300 409 115 69 -67 -291 -34 -193 183 -135 49 127 -288
7363 -288 -72 125 267 -27 150 -195 -116 372 -4 -61 -15 -358 -48 15 -111 42 -230 -440 -237 26 -122
7384 -122 209 -175 -213 -167 -205 266 47 -172 105 -54 51 305 400 291 -165 -201 -95 -160 148 111 62 -376 175
7407 175 176 16 82 -258 -275 -29 66 91 58 67 -204 66 73 198 171 -57 37 -109 98 -173 173 67 -311 -305 9
7432 9 -100 166 -204 21 -250 70 317 170 18 -236 4 -193 141 48 1 36 -66 -172 115 379 185 -33
7454 -33 233 -203 170 223 210 -94 -293 20 91 49 290 -87 74 -16 -128 -22 81 -170 14 126 42 -32 -120
7477 -120 -191 -180 -356 157 243 142 -159 -70 -185 -157 -297 -69 20 -204 -212 18 -152 94 26 -137 -90 -299 219
7500 219 -40 104 232 -322 -112 249 300 286 -73 -42 -186 -68 -146 170 -82 -202 -2 -67 194 160 -136 175
$$ packed form
7339A9k27K18M3L0j42L6%J97p9j74nk16P09k94m6j36k24K57j59L76l18J84P8m15
7363b88K16J97J42k94J77l45P9M88l76n7M6l43L10O3j26J53k72k10K03K63j48
7384a22L31l84l8M6l8M71k19k19K77j59J05K54R5j09m56l6J06o5L08l7m9m38N51
7407A75Jj60O6l40j7K46R5K5l3Rk71K70PJ25k7k28R4j46K07k71L46j06l78OL14
7432Ij09K66l70K25k71L20K47j47j52k54K40j97L34r3m7L5j02j06K87K64j94k18
7454c3K66m36L73N3j3l04j99L13P1m2K41l77J61r0j12J06J03k51J84J12q4p4q8
7477a20p1J1j76N13Q6j01l01Q9j15K8j40K28Q9k24qK30j70K46o8j63M7k09N18
7500B19k59J44J28n54K10L61N1j4l59L1j44J18p8L16k52j20K00o5K61l4k96L11
$$ plain form
7522 175 -213 121 1 83 141 -240 -39 -127 77 159 197 4 -147 -40 178 202 183 157 -360 -423 -226 356 -153
7545 -153 153 -36 31 -283 9 189 -19 -186 -93 -172 -96 2 73 -260 -93 -188 -178 19 148 -166 73 -93 -122
7568 -122 22 -239 -107 -146 -124 -58 281 72 -47 -64 36 118 138 210 33 35 -124 164 117 133 -178 -286 -186 -24
7592 -24 185 173 63 151 22 -311 202 321 -147 -289 -330 -119 35 -207 119 85 -136 -304 10 615 249 89
7614 89 36 -33 -2 374 99 -255 45 -161 164 192 105 146 -47 -109 150 290 96 253 -347 14 34 46 -27 -147
7638 -147 -340 -135 -99 159 247 -153 -373 21 -163 -110 135 252 -37 -474 43 288 131 120 -142 -57 -354 18
7660 18 105 -206 -140 -206 -317 -362 116 104 155 -421 -1 38 -124 84 132 -304 -292 74 83 -23 -169 139 -75 -79 94
7685 94 115 -87 -13 -60 -54 265 -43 68 -122 -55 23 -65 121 -9 -32 8 -25 231 98 -107 -315 75 -85 -58
$$ packed form
7522A75l88L34j20Q2N8l81K01q8K04Q2L8j93j51J07K18K4j9k6n17o3J97N82n09
7545a53L06j89O7l14K92J80k08j67R3p9P6R8P1l33J67r5J0J97J29l14K39j66k9
7568a22J44k61J32l9K2O6L39k09j19j7J00Q2K0P2j77Kj59K88m7J6l11j08J00J62
7592b4K09j2j10Q8j29l33N13J19m68j42m1K11J54k42L26l4k21j68L14O05l66j60
7614H9n3o9L1L76k75l54L00k06L25K8q7M1j93o2K59J40j94J57o00L61K0J2p3j20
7638a47j93K05L6K58Q8m00k20L94j84N3K45J17k89m37N17K45j57j1k62Q5k97L72
7660A8Q7l11O6o6j11m5M78j2N1n76M20L9j62K08M8m36J2L66Rj06j46L08k14mJ73
7685I4K1k02P4m7OL19l08J11j90O7P8q8J86j30k3M0l3K56j33k05k08L90j60K7
$$ plain form
7709 -58 297 207 16 -62 0 76 328 229 43 260 160 85 175 28 332 -91 -189 -216 41 -143 -229 -185 -64 -137
7733 -137 -205 224 342 -102 -80 137 -186 39 151 126 -139 -179 -161 -28 68 167 26 -128 70 -170 207 -48
7755 -48 33 -91 -75 57 145 -278 -36 29 136 33 36 161 -280 65 -135 -90 -77 54 27 -306 -1 84 190 -7
7779 -7 -33 -70 -223 186 149 -384 21 -132 -38 -87 -51 158 -100 -233 -200 -114 203 -106 68 -322 190 -117 -85 121
7803 121 102 84 -113 -29 56 143 -318 -231 -109 -196 -105 209 120 59 74 -168 136 115 160 147 -173 -217 126 51 389
7828 389 -150 187 -210 -23 3 40 130 -192 67 -53 208 38 130 -236 -158 -174 253 37 366 44 -34 -65 -287
7851 -287 383 -114 376 -24 -275 183 330 217 -8 -362 195 196 138 234 219 31 184 -114 174 347 -24 113
7873 113 -281 -157 226 72 25 -136 22 -206 -176 112 -144 378 228 -46 168 -2 46 235 -36 -119 119
$$ packed form
7709e8L55r0j91p8O2P6K52r9j86K17j00p5R0j47L04m23r8k7K57j84q6M4J21p3
7733a37o8M29J18m44K2K17l23K25J12k5k65m0J8J33R6R9j41j54J98k40L77k55
7755d8Q1j24J6J32Q8m23K42O5J07j03LJ25m41L45k00M5J3J31k7l33L05Q5J06j97
7779gk6l7j53M09l7n33M05j53R4m9L6K09k58j33L3Q6L17l09J74l90N12l07L2K06
7803A21j9j8j97Q4Q5Q7m61Q7J22q7R1L14q9o1J5k42L04k1M5j3l20m4L43p5L38
7828C89n39L37l97J87K6L7R0l22K59j20K61j70R2l66P8j6M27k16L29l22p8l1k22
7851b87O70m97M90m00k51M58J47j13k25l54N57Jn8R6j5j88J53k98K88J73l71J37
7873A13l94J24L83j54m7j61J58k28L0K88k56N22j50k74K14j70M8J89k71q3K38
$$ plain form
7894 119 -39 -45 -153 -93 -145 33 74 314 88 -120 202 100 2 -110 133 9 95 -199 209 -22 -46 -215 -213
7917 -213 -13 -13 359 35 6 -252 -141 50 102 7 -47 135 -204 95 294 -26 280 -290 -93 -84 -202 196 186
7940 186 -15 15 -55 158 430 -188 102 -272 108 113 266 241 -63 -258 31 63 11 166 -146 -181 -122 -55 -27 -223
7964 -223 -37 44 -450 -440 -161 181 308 -282 13 128 -43 192 116 117 49 149 60 159 261 -5 -131 -270 149
7987 149 19 170 111 10 -145 156 466 112 -265 -84 -415 18 24 92 -25 53 180 -194 127 185 -110 -268
8009 -268 29 -49 86 177 165 -41 -281 -124 -13 90 108 -1 -136 13 -42 110 -113 -59 8 -212 45 -51 383
8032 383 -182 179 -166 0 -29 -136 -170 -280 -60 -225 -44 -4 -4 24 -181 183 -106 127 -100 -48 -178 -169 173
8055 173 243 124 -130 -25 111 107 316 234 -560 -98 -437 -103 -112 -68 -189 -136 -110 123 -76 353 -151 123 -291
$$ packed form
7894A19j58oj08O0n2J78M1K40k26k08L22j02r8j12K43j24Q6k94M08k31k4j69K
7917b13K00%L72l24k9k58J11J91N2r5n4J82l39K99J99l20L06n70J97Rj18L98j0
7940A86k01L0p0K13K72o18K90l74L80NJ53k5l04j95K89L2n2J55l12l5N9O7K8j96
7964b23J86Q1m94J0K79L42J27n90K95J15j71K35p6Jo8J00q9R9J02k66j26j39M19
7987A49j30J51n9j01j55L01L10l54l77J81l31M33OO8j17P8J27l74L21N8k95j58
8009b68K97p8J35R1j2k06k40J57J11J03J8j09j35J49n5J52k23N4O7k20K57r6M34
8032C83n65L61l45J66k9j07l4j10K20j65J81M0%K8k05L64k89K33k27N2j30RL42
8055A73P0j19k54J05J36mK09q2p94M62l39L34rM4j21N3K6K33j99M29n04K74m14
$$ plain form
8078 -291 31 405 -113 -62 -129 -95 107 -104 90 194 3 184 23 144 141 -25 -31 -102 -170 -106 154 -137 42
8101 42 -165 -176 223 -25 -50 76 72 -30 -176 86 -123 -78 -64 77 -3 -141 157 83 -61 -329 158 -17 33
8124 33 -79 -184 -46 123 256 186 -25 72 -188 172 108 60 105 454 84 -239 21 0 31 -49 -175 -148 -8
8147 -8 -55 104 -24 -2 19 8 148 76 -203 -376 -189 -160 -65 284 -79 -55 -136 14 -31 -176 120 -53 -292 -212
8171 -212 257 231 62 -338 -237 64 40 346 -85 -260 136 -79 -79 48 -15 172 -255 -342 -232 4
$$ packed form
8078b91L22L74n18N1o7L4K02k11J94J04j91J81j61J21lj66op1o8O4K60k91J79
8101D2k07j1L99k48k5J26mj02j46K62k09M5J4J41q0j38K98p4j44k68M87j75N0
8124C3j12j05J38J69J33p0k11R7k60L60o4m8M5L49l70l23K60k1L1q0j26K7J40
8147hm7J59j28K2K1j1J40p2k79j73J87K9R5L49l63K4q1J50m5j45K96j73k39Q0
8171b12M69k6j69m00J01L01k4L06m31j75L96k15%J27o3J87m27q7J10K36
8191D
$$ Imaginary data points
##PAGE= N=2
##DATA TABLE= (X++(I..I)), XYDATA
$$ plain form
0 0 0 0 0 0 0 0 6 -8 8 -8 8 -10 16 -18 24 -32 33 -40 48 -57 66 -79 90 -105 122 -138 155 -178 200 -226
30 -226 257 -289 321 -362 403 -449 501 -553 615 -682 754 -836 925 -1024 1135 -1259 1398
47 1398 -1559 1742 -1956 2210 -2516 2888 -3362 3986 -4844 6110 -8169 12106 -22411 106657
61 106657 253944 80324 -48646 -71833 62345 180959 200787 88150 -28877 -61369 27982
72 27982 135043 175319 108395 4503 -59996 -22602 84038 170288 137464 8614 -99876
83 -99876 -73787 56535 161554 130005 -7250 -118665 -92859 39680 142281 110607 -16782
94 -16782 -111398 -92684 3954 84974 82034 840 -91244 -117202 -53007 46094 89832 34063
106 34063 -76053 -140329 -91366 33790 112587 57971 -82132 -163518 -101010 38943 113935
$$ packed form
0@%%%%%%Oj4J6j6J6j8K6l4M2n6O5p3Q8j05J23j45J69j95K27k60K93l33L78m26
30b26M83n46O10o83P65q52R50j054J168j297J436j590J761j949K159k394K657
47A398k957L301l698M166m726N404o250P348q830J0954j4279K0275l4517J29068
61A06657J47287j73620j28970k3187J34178J18614J9828j12637j17027l2492Q9351
72B7982J07061M0276o6924j03892o4499L7394J06640Q6250l2824j28850j08490
83i9876K6089J30322J05019l1549j37255j11415K5806J32539J02601l1674j27389
94a6782r4616J8714R6638Q1020k940q1194r2084k5958O4195R9101M3738n5769
106C4063j10116o4276M8963J25156P8797n4616j40103q1386O2508J39953P4992
$$ plain form
117 113935 54597 -73283 -141527 -86468 34893 106436 67168 -35493 -102621 -79759 8712
128 8712 87476 91875 14279 -80889 -101520 -18053 97186 131338 46946 -72664 -107515 -17085
140 -17085 111809 149094 55679 -70771 -101351 -9753 104655 131348 56011 -41769 -73597
151 -73597 -16574 74573 119542 82412 -2758 -60723 -42206 38169 111791 108339 20388 -73532
163 -73532 -77960 19201 120534 121481 20061 -81031 -81930 14795 110715 110702 17782 -74731 -80499
176 -80499 -4433 75272 88529 30181 -47291 -80144 -39588 43069 94890 63482 -27890 -94693
188 -94693 -70121 27788 105285 81566 -26048 -112003 -84411 29032 111940 81541 -25808
199 -25808 -99208 -71130 24411 94120 77079 -6256 -76552 -72527 -3433 67164 79068 22933
$$ packed form
117A13935n9338j27880o8244N5059J21361P1543l9268j02661o7128K2862Q8471
128H712P8764M399p7596r5168k0631Q3467J15239L4152q4392j19610l4851R0430
140a7085J28894L7285r3415j26450l0580R1598J14408K6693p5337r7780l1828
151g3597N7023R1147M4969l7130q5170n7965J8517Q0375P3622l452q7951r3920
163g3532m428R7161J01333R47j01420j01092q99R6725R5920j3r2920r2513n768
176h0499P6066P9705J3257n8348p7472l2853M0556Q2657N1821l1408r1372o6803
188i4693K4572R7909P7497k3719j07614q5955K7592J13443Q2908l0399j07349
199b5808p3400K8078R5541O9709j7041q3335p0296M025O9094P0597J1904n6135
$$ plain form
211 22933 -55277 -85696 -33948 58342 102591 49027 -53018 -100629 -45489 58268 106501 49838
223 49838 -54900 -102848 -47416 51323 94173 44886 -40777 -81075 -46964 24493 70961 54191
235 54191 -11725 -71165 -72417 -11351 56728 68659 7412 -74600 -98105 -33879 58172 83588
247 83588 11987 -83787 -107256 -37716 51532 71899 7540 -77470 -102293 -48001 30129 59155
259 59155 17577 -52402 -89491 -63114 4507 56952 44843 -27737 -94683 -87834 -9497 66179
271 66179 62279 -19131 -98818 -94720 -7464 75209 70194 -15294 -91450 -83037 -5655 62412 60485
284 60485 -2718 -66508 -75179 -23126 42700 64584 24787 -40854 -73459 -41075 31541 78838
296 78838 52022 -28452 -82840 -53663 31990 87689 57918 -25872 -79183 -50497 29239 81632
$$ packed form
211B2933p8210l0419N1748R2290M4249n3564j02045m7611N5140J03757M8233n6663
223D9838j04738m7948N5432R8739M2850m9287q5663m0298L4111P1457M6468j6770
235E4191o5916n9440j252O1066O8079J1931o1247q2012k3505O4226R2051K5416
247H3588p1601r5774k3469O9540Q9248K0367o4359q5010k4823N4292P8130K9026
259E9155m1578o9979l7089K6377O7621N2445j2109p2580o6946O849P8337P5676
271F6179l900q1410p9687M098Q7256Q2673n015q5488p6156Q413P7382O8067j927
284F0485o3203o3790q671N2053O5826K1884l9797o5641l2605L2384P2616M7297
296G8838k6816q0474n4388K9177Q5653N5699k9771q3790n3311K8686P9736N2393
$$ plain form
308 81632 58214 -13863 -63211 -47694 11903 60594 57882 7737 -48254 -61709 -17901 46828
320 46828 70870 28234 -45099 -77500 -35366 43553 81221 36566 -48110 -88236 -41813 41339
332 41339 77109 32189 -44797 -79631 -43120 26620 64118 37826 -25494 -67976 -53542 4334
344 4334 53867 50804 -5409 -66574 -73108 -14443 55864 66130 3502 -70421 -80893 -16408 58130
357 58130 68101 5660 -66357 -76215 -18013 47994 59730 11282 -47779 -64093 -27106 29489
369 29489 56657 31913 -24349 -61517 -43497 15077 62079 50825 -11130 -66273 -57388 9739
381 9739 68159 59142 -8223 -65546 -56710 7513 62421 56525 -877 -54159 -54847 -5375 45843
394 45843 54852 14534 -38375 -58005 -25768 31987 62434 34439 -29606 -68131 -40803 28123
$$ packed form
308H1632k3418p2077m9348J5517N9597M8691k712n0145n5991j3455M3808O4729
320D6828K4042m2636p3333l2401M2134P8919L7668m4655q4676m0126M6423Q3152
332D1339L5770m4920p6986l4834L6511O9740L7498k6292o3320m2482J4434N7876
344D334M9533l063n6213o1165o534N8665P0307J0266o2628p3923j0472O4485P4538
357E8130R971o2441p2017r858N8202O6007J1736m8448n9061j6314L6987N6595
369B9489K7168k4744n6262l7168J8020N8574M7002j1254o1955n5143Q885O7127
381I739N8420r017o7365n7323Q836O4223N4908n896n7402n3282o88M9472N1218
394D5843R009m0318n2909j9630L2237N7755L0447k7995o4045l8525K7328O8926
$$ plain form
406 28123 71204 44038 -28550 -73460 -45388 27220 70731 43686 -24802 -66481 -43759 18178
418 18178 59233 44372 -10149 -53954 -48292 178 48370 52213 7329 -46852 -59573 -15567
430 -15567 45090 63739 19190 -45564 -65982 -20698 45693 66903 23321 -40314 -61549 -21323
442 -21323 38791 61457 28297 -26094 -50974 -26642 23467 54525 40322 -7051 -45685 -40112
454 -40112 7506 53892 54779 5287 -47429 -51845 -941 55788 61090 9448 -48225 -54912 -5356
467 -5356 50976 58910 13303 -40005 -51909 -13401 37934 55397 24111 -26223 -51568 -27397
479 -27397 24236 56756 38467 -16378 -56400 -40673 17196 61804 46945 -13647 -60103 -46498
491 -46498 13567 59503 46298 -11294 -55573 -46002 6089 49060 44580 -1226 -44340 -46317 -7364
$$ packed form
406B8123M3081k7166p2588m4910K8072P2608M3511k7045o8488m1679K2722O1937
418A8178M1055j4861n4521m3805N662M8470M8192L843m4884n4181j2721M4006
430a5567O0657J8649m4549o4754k0418M5284O6391K1210m3582o3635k1235M0226
442b1323O0114K2666l3160n4391k4880K4332N0109L1058j4203m7373l8634N573
454d0112M7618M6386Q87m9492n2716m416N0904N6729N302n1642n7673o687M9556
467e356N6332P934m5607n3308j1904L8508N1335J7463l1286n0334k5345K4171
479b7397N1633L2520j8289n4845m0022J5727N7869M4608j4859o0592m6456J3605
491d6498O0065M5936j3205n7592m4279R571N2091M2971m480m5806m3114j977L8953
$$ plain form
504 -7364 37718 47836 13741 -34602 -52946 -21314 31059 54868 25450 -29316 -56037 -27109
516 -27109 29720 58567 31416 -23919 -53181 -28503 23902 53084 33727 -14113 -45512 -32947
528 -32947 10750 45701 41272 1338 -38642 -40916 -2384 42010 50200 12526 -37193 -50460 -12416
541 -12416 40867 56116 18021 -36094 -52078 -15268 38126 56340 23108 -28805 -49028 -20328
553 -20328 28795 51528 28359 -18045 -46460 -30098 15789 49662 38916 -7942 -46859 -39759
565 -39759 7897 50000 44984 -3235 -48552 -46027 1074 46691 44717 -1144 -44699 -44634 -3694
578 -3694 38569 43300 8415 -33794 -44068 -13646 28032 43112 17997 -24712 -45919 -25568
590 -25568 19163 47047 29332 -17408 -48077 -31500 16266 47753 33281 -12891 -46595 -36451
$$ packed form
504g364M5082J0118l4095m8343j8344L1632N2373K3809k9418n4766k6721K8928
516b7109N6829K8847k7151n5335k9262K4678N2405K9182j9357m7840l1399J2565
528c2947M3697L4951m429l9934l9980k274L8532M4394Q190l7674m9719j3267L8044
541a2416N3283J5249l8095n4115j5984L6810N3394J8214l3232n1913k0223K8700
553b0328M9123K2733k3169m6404k8415J6362M5887L3873j0746m6858l8917P100
565c9759M7656M2103n016m8219m5317K525M7101M5617j974m5861m3555O5M0940
578c694M2263M731l4885m2209j0274L0422M1678J5080k5115m2709k1207K0351
590b5568M4731K7884j7715m6740l0669J6577M7766L1487j4472m6172l3704J0144
$$ plain form
602 -36451 7341 42478 34853 -6779 -41354 -38126 -1046 35429 39498 6306 -34080 -43682 -12476
615 -12476 30664 43797 14006 -31105 -48769 -21130 26700 48725 22267 -27174 -49727 -23323
627 -23323 25093 48007 24409 -21669 -47337 -28797 14799 42719 28083 -14001 -43494 -33470
639 -33470 6317 39136 35209 -2892 -40139 -40561 -2620 36807 38827 1575 -39144 -43408 -8642
652 -8642 33052 41132 8746 -32411 -41867 -11092 28584 40247 14424 -23451 -39774 -20202 18085
665 18085 39185 23128 -15083 -39450 -26347 11387 39990 31927 -5990 -38744 -33640 5117
677 5117 39665 35092 -3199 -38061 -36474 -589 34951 38207 5251 -31845 -37092 -5828 31254
690 31254 39669 12671 -25072 -38978 -15870 23488 41956 19903 -21271 -41871 -20793 21108
$$ packed form
602c6451M3792L5137p625m1632l4575L228L7080L6475M069l3192m0386r602L1206
615a2476M3140J3133k9791m5111j7664K7639M7830K2025k6458m9441k2553K6404
627b3323M8416K2914k3598m6078k5668J8540M3596K7920j4636m2084k9493J0024
639c3470L9787L2819l927l8101l7247m22L7941L9427K020l7252m0719m264L4766
652h642M1694Q080l2386m1157r456L0775L9676J1663k5823l7875j6323J9572L8287
665A8085K1100j6057l8211k4367J3103L7734K8603q063l7917l2754N104L8757
677E117L4548m573l8291l4862J587L5885L5540L256l2956l7096n247L1264L7082
690C1254Q415k6998l7743j3906K3108L9358J8468k2053m1174k0600K1078M1901
$$ plain form
702 21108 43637 26234 -15518 -41309 -25639 15682 41765 26635 -13694 -40169 -29390 7304
714 7304 35636 29782 -4833 -35285 -32559 1095 32485 32959 2440 -30894 -36505 -8899 26785
727 26785 36118 8528 -28647 -38491 -12384 24238 37288 15223 -21078 -37306 -18338 17787
739 17787 35726 18274 -16825 -36995 -23826 8998 32611 25128 -7653 -34568 -29185 4138
751 4138 33112 30224 -1424 -32832 -34289 -4362 29560 33931 3209 -31641 -36057 -6600 27888
764 27888 36135 10647 -24471 -35850 -12782 23198 36350 14476 -21502 -36952 -18703 16272
776 16272 35901 21667 -14374 -36653 -22909 13472 36810 24607 -10010 -35136 -27115 5438
788 5438 32243 26675 -6112 -33886 -29039 2337 29554 29174 2318 -26243 -30175 -5248 25071
$$ packed form
702B1108K2529j7403m1752k5791J5670M1321K6083j5130m0329k6475J0779L6694
714G304K8332n854l4615l0452K726L3654L1390M74l0519l3334n611K7606L5684
727B6785R333k7590l7175r844K6107L6622J3050k2065l6301j6228J8968L6125
739A7787J7939j7452l5099k0170J3169L2824K3613p483l2781k6915N383L3323
751D138K8974k888l1648l1408j457K9927L3922M371l0722l4850m416K9457L4488
764B7888Q247k5488l5118j1379K3068L5980J3152k1874l5978j5450J8249L4975
776A6272J9629j4234l6041k2279J3744L6381K3338j2203l4617k5126Q021L2553
788E438K6805n568l2787k7774M847L1376K7217l80k6856k8561l932K4927L0319
$$ plain form
801 25071 31549 6722 -24341 -32559 -11626 19246 32276 14490 -17420 -32798 -16124 17424
813 17424 34081 18691 -13017 -31974 -21146 9045 30949 22836 -8141 -31767 -24988 5269
825 5269 30111 27402 183 -26754 -28064 -1396 28449 31623 4241 -26085 -30899 -5957 24660
838 24660 33475 11185 -20969 -31516 -9109 23940 35296 14102 -17590 -31139 -14928 16162
850 16162 32840 18356 -13710 -32218 -18547 12904 32285 21974 -7325 -28580 -22495 6300
862 6300 30443 24914 -5165 -29190 -25368 1365 25890 26219 1980 -23926 -26590 -2824 24347
875 24347 28437 6327 -20304 -27561 -9567 16900 27727 11459 -17064 -30388 -14659 13976
887 13976 28864 16622 -10744 -28623 -19834 7940 28144 20029 -8666 -29790 -23856 2934 25195
$$ packed form
801B5071O478k4827l1063q218K0933L0872J3030j7786l1910j5378J6674L3548
813A7424J6657j5390l1708j8957J0828L0191K1904q113l0977k3626O779L0257
825E269K4842k709k7219k6937j310K6668K9845L174k7382l0326m814K4942L0617
838B4660Q815k2290l2154j0547K2407L3049J1356k1194l1692j3549J6211L1090
850A6162J6678j4484l2066j8508J3671L1451J9381j0311k9299k1255O085K8795
862F300K4143n529l0079k4025L822K6733K4525L29k4239k5906k664K3766K7171
875B4347M090k2110k6631p257J7994K6467J0827j6268k8523j3324J5729K8635
887A3976J4888j2242k7366j7879Q789K7774K0204q115k8695k1124N934K6790K2261
$$ plain form
900 25195 23226 -1673 -26188 -25939 -420 25635 26959 2588 -23620 -27740 -6718 20526 28106
913 28106 7779 -21173 -30155 -9470 19844 29693 12167 -15614 -28418 -13854 14875 29720
925 29720 15183 -14101 -29500 -17042 10351 26880 18171 -7694 -26428 -19632 6795 27112
937 27112 21318 -3621 -23934 -21933 541 22322 23262 1487 -21785 -24269 -2543 21224 25262
950 25262 6493 -17025 -23895 -8116 16591 26423 10776 -15280 -26507 -12941 11876 24855
962 24855 14801 -9595 -25446 -17048 8392 26303 18632 -6548 -25108 -20325 2965 23307 21351
975 21351 -1925 -24023 -23384 233 23355 24141 2941 -20259 -23855 -4382 20713 26130 7008
988 7008 -19502 -25934 -8015 16934 25635 10194 -14487 -25489 -11575 14520 27147 13533 -11924
$$ packed form
900B5195j969k4899k4515K49K5519K6055J324k4371k6208m120K1022K7244P580
913B8106k0327k8952q982K0685K9314R849j7526k7781j2804J4564K8729J4845
925B9720j4537k9284j5399J2458K7393J6529q709k5865j8734O796K6427K0317
937B7112n794k4939k0313K001K2474K1781R40k1775k3272k484K1726K3767M038
950B5262j8769k3518o870J5779K4707R832j5647k6056j1227J3566K4817J2979
962B4855j0054k4396j5851Q398K5440J7911p671k5180j8560M783K3290K0342j956
975B1351k3276k2098O39K3617K3122P86k1200k3200l596J9473K5095N417j9122
988G008k6510o432J7919K4949Q701j5441k4681j1002J3914K6095J2627j3614k5457
$$ plain form
1001 -11924 -24791 -14283 9219 24006 16097 -7488 -24334 -17382 5923 23602 18871 -2881
1013 -2881 -20162 -18496 1641 20981 21597 1665 -19540 -21368 -2852 17817 21406 5648 -15391
1026 -15391 -22054 -7530 15115 23843 9809 -13057 -22928 -11523 10331 22217 13287 -9360 -23912
1039 -23912 -16027 7576 22912 16258 -5414 -21763 -17879 2940 21562 19524 -2419 -22312 -21191
1052 -21191 -621 19818 20381 1553 -18866 -22256 -3861 18503 23078 4872 -17605 -22794 -7016
1065 -7016 14516 21837 7903 -14573 -23868 -10845 12217 22406 10933 -10940 -22156 -13081 8067
1078 8067 21692 14090 -7352 -22147 -15729 4989 19773 15678 -2860 -19223 -17212 722 18805
1091 18805 18661 1289 -17335 -18693 -3103 15276 19037 4978 -14337 -20742 -6699 13177 20450
$$ packed form
1001a1924j2867J0508K3502J4787p909k3585j6846O952K3305J7679m731k1752
1013b881j7281J666K0137J9340O16j9932k1205j828J8516K0669L589j5758k1039
1026a5391o663J4524K2645Q728j4034k2866r871J1405K1854J1886q930k2647j4552
1039b3912P885K3603J5336o654k1672j6349L884K0819J8622k038k1943j9893J121
1052b1191K0570K0439N63j8828k0419l390J8395K2364M575j8206k2477n189J5778
1065g016K1532P321j3934k2476r295J3023K3062J0189j1473k1873j1216R075K1148
1078H067J3625p602k1442j4795O418K0718J4784m095j8538j6363K011J7934J8083
1091A8805j44j7372j8624j358J5590J8379L761j4059j9315o405J4043J9876P273
$$ plain form
1104 20450 8576 -11016 -20340 -10174 9405 20810 12053 -8642 -21181 -13338 6922 20547
1116 20547 14593 -5105 -19903 -15764 3771 20129 17529 -1766 -19292 -17661 783 18234 18801
1129 18801 1482 -17226 -19751 -2795 17091 20490 4143 -14821 -19628 -5174 14337 20522 7322
1142 7322 -12681 -20859 -8424 11328 20006 9755 -8884 -19487 -10983 8135 19605 12630 -6253
1155 -6253 -18538 -12790 4857 17939 14202 -2660 -16851 -15406 1512 16834 16382 746 -14825
1168 -14825 -16073 -2133 14316 17585 4131 -12921 -17893 -5775 11627 17918 7347 -10339 -18361
1181 -18361 -9194 8943 18823 10559 -7567 -18606 -11643 6578 18529 12881 -4980 -18469 -14283
1194 -14283 3570 17974 14830 -2299 -17424 -15497 851 16585 16249 927 -15942 -17321 -1896
$$ packed form
1104B0450j1874j9592r324J0166J9579J1405q757k0695j2539P843K0260J3625
1116B0547n954j9698j4798M139J9535J6358k600j9295j7526J631J8444J7451N67
1129A8801j7319j8708k525J6956J9886L399j6347j8964m807J4454J9511O185j3200
1142G322k0003q178J2435J9752Q678j0251j8639j0603Q504J9118J1470o975j8883
1155f253j2285N748J7647J3082l737j6862j4191J445J6918J5322m52j5636j5571
1168a4825j248J3940J6449L269j3454j7052m972J2118J7402O291j0571j7686q022
1181a8361R167J8137R880q264j8126j1039O963J8221J1951n648j7861j3489M186
1194a4283J7853J4404l144j7129j5125J927J6348J5734l36j5322j6869j379J5425
$$ plain form
1207 -1896 14900 17497 3069 -13885 -17963 -5044 12270 17826 5739 -12167 -18201 -7112 10100
1220 10100 17529 7824 -9067 -17767 -9320 6925 16869 10162 -6040 -16607 -12012 4018 15671
1233 15671 12515 -2179 -15213 -13720 1172 14853 14130 596 -13573 -15031 -2297 12565 15563
1246 15563 3456 -11853 -16046 -4907 10650 16174 6345 -9433 -16472 -7656 8440 16676 8990
1259 8990 -7163 -16617 -10285 5919 16939 11748 -4577 -16296 -12170 3990 16464 13568 -2443
1272 -2443 -15693 -13878 1729 15079 14600 -156 -14431 -14630 -801 13821 15471 2671 -12100
1285 -12100 -15222 -3562 11339 15672 4968 -10619 -16216 -6154 9480 15784 7584 -7724 -15159
1298 -15159 -7656 7441 15546 9218 -5518 -14487 -9596 3980 13934 10704 -2463 -13474 -11581
$$ packed form
1207a896J6796K597j4428j6954m078J2919J7314N556j2087j7906o034J1089J7212
1220A0100P429r705j6891q700Q447J6245R944o707j6202j0567M595J6030J1653
1233A5671l156j4694j3034J493J4892J3681p23j3534j4169j458J2734J4862K998
1246A5563j2107j5309m193J1139J5557N524r829j5778p039Q816J6096Q236p686
1259H990j6153r454O332J6204J1020n191j6325j1719M126J6160J2474k896j6011
1272b443j3250J815J5607J3350m79j4756j4275j99J3829J4622J650j2800j4771
1285a2100l122J1660J4901M333j0704j5587n597J0062J5634O304q200j5308p435
1298a5159P503J5097Q105o328j4736q969M891J3576R954l230j3167j1011J893
$$ plain form
1311 -11581 1206 12832 12606 715 -11782 -12822 -2026 11243 13996 2800 -11117 -14974 -4718
1324 -4718 9891 14546 5592 -9093 -14963 -6430 8166 15183 7994 -7067 -15448 -9001 5792 14530
1338 14530 9307 -5064 -14921 -11232 3484 14422 11751 -2219 -14176 -11960 1439 13828 12552
1351 12552 -1033 -13478 -13654 -654 12096 13258 1121 -11717 -13098 -2397 10421 13427 4097
1364 4097 -9366 -13984 -5531 8054 13114 5740 -7221 -13686 -7395 5965 13775 8514 -4714 -12781
1378 -12781 -8481 3912 12534 9347 -2470 -12698 -10981 1093 11299 10629 34 -10860 -11269
1391 -11269 -1155 10115 12473 3144 -9623 -13196 -4183 8528 12716 4140 -8588 -13591 -6293
1404 -6293 7223 14093 7106 -6448 -13706 -7181 5782 13193 8096 -4939 -13024 -9519 2998 12976
$$ packed form
1311a1581J2787J1626k26j1891j2497j040J0796J3269K753j1196j3917l857J0256
1324d718J4609M655q954j4685n870Q533J4596P017p189j5061q381O447J4793Q738
1338A4530n223j4371r857L689J4716J0938k671j3970j1957K216J3399J2389j276
1351A2552j3585j2445j76J3000J2750J162j2137j2838j381J0701J2818L006r330
1364D097j3463m618Q453J3585N060p374j2961o465O291J3360P810n261j3228q067
1378a2781M300J2393Q622l187j1817j0228J717J2074J0206o70j0595j0894m09
1391a1269J0114J1270K358r329j2767l573R013J2711M188q576j2728n003P298
1404f293J3516O870o987j3554p258O525J2963P411n097j3035q085L505J2517R978
$$ plain form
1418 12976 9604 -2570 -12501 -10127 2209 12432 11228 -52 -11758 -11927 -416 11312 11669
1431 11669 485 -10721 -11924 -1937 9511 12167 3463 -8231 -11628 -3057 8148 11917 4833
1444 4833 -6403 -11987 -6399 5366 12051 7108 -4267 -11151 -6948 3893 11610 9464 -1406 -10781
1458 -10781 -9272 1285 10600 9548 -824 -9781 -10108 -736 9808 11229 2600 -8199 -11129 -2641
1472 -2641 8494 11514 3677 -7534 -12268 -5797 6407 12283 5694 -6274 -12094 -6149 5705 12561
1486 12561 7645 -4380 -12541 -8158 3748 11689 7644 -3934 -11648 -9128 1403 10638 9468 -975
1500 -975 -10680 -9930 173 9852 9850 263 -9450 -11068 -2732 8222 10649 2332 -8397 -10507 -2694
1515 -2694 7312 10547 4483 -5818 -10781 -5373 4885 9842 5191 -4661 -10371 -6687 2808 10032
$$ packed form
1418A2976l372j2174r931K374J2336J0223j204j1280j1706j69J1511J1728L57
1431A1669j1184j1206j203R987J1448K656q704j1694l397Q571J1205L769p084
1444D833j1236n584N588J1765O685m943j1375o884M203J0841P717k146j0870r375
1458a0781J509J0557R315j052j0372q957l27R372J0544J421q629j0799k930Q488
1472b641J1135L020p837j1211m734O471J2204N876o589j1968n820N945J1854O856
1486A2561m916j2025q161M383J1906P941m045j1578p714K520J0531R235j170j0443
1500i75r705P50J0103R679kr587r713j618Q336J0954K427q317j0729k110P813
1515b694J0006L235o064j0301m963N408J0258M957m651r852n710L684R495P224
$$ plain form
1529 10032 7945 -1643 -9491 -8233 1984 9914 8554 -351 -9171 -9681 -888 8512 10081 1491 -8691
1544 -8691 -9683 -1660 8004 10662 4093 -6327 -10602 -4310 6437 10826 4249 -6269 -10894 -5678
1558 -5678 4810 11124 6849 -4076 -10905 -6495 4341 10787 6867 -3640 -10789 -8142 1776 9565
1572 9565 8157 -1846 -9725 -8325 1150 9075 8545 722 -7875 -9366 -1419 7417 8872 1300 -7654
1587 -7654 -9272 -3042 6071 9509 4292 -4800 -9440 -4174 5095 9498 4749 -3973 -9002 -6106 2292
1602 2292 8506 6594 -2243 -8809 -6528 1781 8786 8026 83 -7475 -8363 -680 8334 9045 817 -7862
1618 -7862 -8693 -1751 6929 10075 3494 -6427 -9437 -2716 6835 10120 3300 -5462 -9460 -4977 4506
1633 4506 9878 5173 -4312 -9657 -5284 4036 9779 6487 -2329 -8725 -7072 2014 8973 6491 -2523
$$ packed form
1529A0032k087r588p848J258J0217P930j360q905q820n10Q793R400J569q590j0182
1544h691r92Q023R664K658o569j0420m275O292J0747M389o577j0518m625N216
1558e678J0488O314m275j0925o829M410J0836O446l920j0507p149K647R918P789
1572I565j408j0003p879J400R475P925n30p823q597j491P947Q836J455p572q954
1587g654j618O230R113L438n217r092m640N266R269M403m749q722n029K896Q398
1602B292O214j912q837o566K281Q309P005p60p943p558q88P683R014P11q228q679
1618g862q31O942Q680L146o581r921l010O721R551L285o820q762l998M483R483
1633D506N372m705r485n345M373R320N743l292q816o396J653R086O959k482r014
$$ plain form
1648 -2523 -9064 -7186 504 7298 7691 481 -7490 -7760 -654 7310 7888 795 -6673 -8236 -3322 4738
1664 4738 7681 2997 -5475 -8993 -3464 4318 8032 4454 -3366 -8448 -5602 2018 7766 5262 -3247
$$ packed form
1648b523o541J878P690O794L93p210p971k70P106P964N78p093p468j563M914Q060
1664D738K943m684q472l518N529P782L714l578p820n082K846P620N748k504q509
$$ [...]
8191B0
##END NTUPLES=NMR FID
##END=
