##TITLE=1H_CG-1126
 CDCl3, 8 sc, 
 6.2.2020
##JCAMPDX= 6.0         $$ Bruker NMR JCAMP-DX V2.0
##DATA TYPE= NMR FID
##DATA CLASS= NTUPLES
##ORIGIN= UXNMR, Bruker Analytische Messtechnik GmbH
##OWNER= root
$$ XWIN-NMR		Version 3.5
$$ Thu Feb  6 13:59:03 2020 Russian Standard Time (UT+4h)  she@DPX200
##.OBSERVE FREQUENCY= 200.1315
##.OBSERVE NUCLEUS= ^1H
##.DELAY= (6, 6)
##.ACQUISITION MODE= SIMULTANEOUS
##.ACQUISITION SCHEME= undefined
##.AVERAGES= 8
##.DIGITISER RES= 18
##SPECTROMETER/DATA SYSTEM= spect
##.PULSE SEQUENCE= zg30
##.SOLVENT NAME= CDCl3
##.SHIFT REFERENCE= (INTERNAL, CDCl3, 0, 15.7039)
##AUDIT TRAIL= $$ (NUMBER, WHEN, WHO, WHERE, WHAT)
$$ ##TITLE= Audit trail, XWIN-NMR		Version 3.5
$$ ##JCAMPDX= 5.01
$$ ##ORIGIN= Bruker BioSpin GmbH
$$ ##OWNER= she
$$ F:/spectra/data/she/nmr/H-F/1/audita.txt
$$ ##AUDIT TRAIL=  $$ (NUMBER, WHEN, WHO, WHERE, WHAT)
(   1,<2020-02-06 13:58:01.53 +0400>,<she>,<DPX200>,
      <created by zg, POWCHK disabled, PULCHK disabled
       configuration hash MD5:
       00 E9 B6 7A A2 85 ED C7 34 08 36 98 17 FE 4E 26
       data hash MD5: 16K
       93 C9 05 A5 B9 AD 2C B0 62 DA 88 4B 25 3F 5C 29>)
$$ ##END=
$$ 
$$ hash MD5
$$ 4E D6 21 75 45 30 64 FF F7 F4 AB 3E 13 DB 1B A5
##$RELAX= 
##$RELAX= 
##$RELAX= 
##$RELAX= 
##$RELAX= 
##$RELAX= 
$$ Bruker specific parameters
$$ --------------------------
##$DU= <F:/spectra>
##$EXPNO= 1
##$NAME= <H-F>
##$PROCNO= 1
##$TYPE= <nmr>
##$USER= <she>
##$AMP= (0..31)
100 100 100 100 100 100 100 100 100 100 100 100 100 100 100 100 100 100 
100 100 100 100 100 100 100 100 100 100 100 100 100 100 
##$AQSEQ= 0
##$AQ_mod= 1
##$AUNM= <au_zg>
##$AUTOPOS= <>
##$BF1= 200.13
##$BF2= 200.13
##$BF3= 200.13
##$BF4= 200.13
##$BF5= 200.13
##$BF6= 200.13
##$BF7= 200.13
##$BF8= 200.13
##$BYTORDA= 1
##$CFDGTYP= 0
##$CFRGTYP= 5
##$CHEMSTR= <none>
##$CNST= (0..31)
1 1 145 1 1 1 1 1 1 1 1 1 1 1 1 1 1 1 1 1 1 1 1 1 1 1 1 1 1 1 1 1 
##$CPDPRG= <>
##$CPDPRG1= <>
##$CPDPRG2= <>
##$CPDPRG3= <>
##$CPDPRG4= <mlev>
##$CPDPRG5= <mlev>
##$CPDPRG6= <mlev>
##$CPDPRG7= <mlev>
##$CPDPRG8= <mlev>
##$CPDPRGB= <>
##$CPDPRGT= <>
##$D= (0..31)
0 1.2 0 0 0 0 0 0 0 0.06 0 0.03 0 0 0 0 0.0002 0 0 0 0 0 0 0 0 0 0 0 0 
0 0 0 
##$DATE= 1580983080
##$DBL= (0..7)
120 120 120 120 120 120 120 120 
##$DBP= (0..7)
150 150 150 150 150 150 150 150 
##$DBP07= 0
##$DBPNAM0= <>
##$DBPNAM1= <>
##$DBPNAM2= <>
##$DBPNAM3= <>
##$DBPNAM4= <>
##$DBPNAM5= <>
##$DBPNAM6= <>
##$DBPNAM7= <>
##$DBPOAL= (0..7)
0.5 0.5 0.5 0.5 0.5 0.5 0.5 0.5 
##$DBPOFFS= (0..7)
0 0 0 0 0 0 0 0 
##$DE= 6
##$DECBNUC= <off>
##$DECIM= 24
##$DECNUC= <off>
##$DECSTAT= 4
##$DIGMOD= 1
##$DIGTYP= 9
##$DL= (0..7)
0 120 120 120 120 120 120 120 
##$DP= (0..7)
150 150 150 150 150 150 150 150 
##$DP07= 0
##$DPNAME0= <>
##$DPNAME1= <>
##$DPNAME2= <>
##$DPNAME3= <>
##$DPNAME4= <>
##$DPNAME5= <>
##$DPNAME6= <>
##$DPNAME7= <>
##$DPOAL= (0..7)
0.5 0.5 0.5 0.5 0.5 0.5 0.5 0.5 
##$DPOFFS= (0..7)
0 0 0 0 0 0 0 0 
##$DQDMODE= 0
##$DR= 18
##$DS= 0
##$DSLIST= <SSSSSSSSSSSSSSS>
$$ [...]
##$SUBNAM2= <"">
##$SUBNAM3= <"">
##$SUBNAM4= <"">
##$SUBNAM5= <"">
##$SUBNAM6= <"">
##$SUBNAM7= <"">
##$SUBNAM8= <"">
##$SUBNAM9= <"">
##$SW= 24.9337058887773
##$SWIBOX= (0..15)
0 0 2 0 0 0 0 0 0 0 0 0 0 0 0 0 
##$SW_h= 4990.01996007984
##$TD= 16384
##$TD0= 1
##$TE= 0
##$TE2= 300
##$TE3= 300
##$TEG= 300
##$TL= (0..7)
0 120 120 120 120 120 120 120 
##$TP= (0..7)
150 150 150 150 150 150 150 150 
##$TP07= 0
##$TPNAME0= <>
##$TPNAME1= <>
##$TPNAME2= <>
##$TPNAME3= <>
##$TPNAME4= <>
##$TPNAME5= <>
##$TPNAME6= <>
##$TPNAME7= <>
##$TPOAL= (0..7)
0.5 0.5 0.5 0.5 0.5 0.5 0.5 0.5 
##$TPOFFS= (0..7)
0 0 0 0 0 0 0 0 
##$TUNHIN= 0
##$TUNHOUT= 0
##$TUNXOUT= 0
##$USERA1= <user>
##$USERA2= <user>
##$USERA3= <user>
##$USERA4= <user>
##$USERA5= <user>
##$V9= 5
##$VALIST= <valist>
##$VCLIST= <CCCCCCCCCCCCCCC>
##$VD= 0
##$VDLIST= <DDDDDDDDDDDDDDD>
##$VPLIST= <PPPPPPPPPPPPPPP>
##$VTLIST= <TTTTTTTTTTTTTTT>
##$WBST= 1024
##$WBSW= 4
##$XGAIN= (0..3)
0 0 0 0 
##$XL= 0
##$YL= 0
##$YMAX_a= 519210
##$YMIN_a= -259324
##$ZGOPTNS= <>
##$ZL1= 120
##$ZL2= 120
##$ZL3= 120
##$ZL4= 120
##$ABSF1= 10
##$ABSF2= 0
##$ABSG= 5
##$ABSL= 3
##$ALPHA= 0
##$AQORDER= 0
##$ASSFAC= 0
##$ASSFACI= 0
##$ASSFACX= 0
##$ASSWID= 0
##$AUNMP= <proc_1d>
##$AZFE= 0.1
##$AZFW= 0.1
##$BCFW= 1
##$BC_mod= 2
##$BYTORDP= 1
##$COROFFS= 0
##$CY= 11.3945322036743
##$DATMOD= 1
##$DC= 2
##$DFILT= <>
##$DTYPP= 0
##$F1P= 16.9975609425685
##$F2P= -3.02152046262296
##$FCOR= 0.5
##$FTSIZE= 0
##$FT_mod= 4
##$GAMMA= 1
##$GB= 0.15
##$INTBC= 1
##$INTSCL= 1
##$ISEN= 128
##$LB= 0.24
##$LEV0= 0
##$LPBIN= 0
##$MAXI= 10000
##$MC2= 0
##$MEAN= 0
##$ME_mod= 0
##$MI= 1.114404
##$NCOEF= 0
##$NC_proc= 0
##$NLEV= 6
##$NOISF1= 3.799351
##$NOISF2= 2.8
##$NSP= 1
##$NTH_PI= 0
##$NZP= 0
##$OFFSET= 15.70392
##$PC= 1
##$PHC0= -9783.436
##$PHC1= 11.40081
##$PH_mod= 1
##$PKNL= yes
##$PPARMOD= 0
##$PSCAL= 0
##$PSIGN= 0
##$REVERSE= no
##$SF= 200.130013532006
##$SI= 16384
##$SIGF1= 3
##$SIGF2= 2
##$SINO= 400
##$SIOLD= 16384
##$SREGLST= <1H.CDCl3>
##$SSB= 0
##$STSI= 0
##$STSR= 0
##$SW_p= 3612.71676300578
##$SYMM= 0
##$S_DEV= 0
##$TDeff= 0
##$TDoff= 0
##$TI= <>
##$TILT= no
##$TM1= 0
##$TM2= 0
##$TOPLEV= 0
##$USERP1= <user>
##$USERP2= <user>
##$USERP3= <user>
##$USERP4= <user>
##$USERP5= <user>
##$WDW= 1
##$XDIM= 8192
##$YMAX_p= 0
##$YMIN_p= 0
$$ End of Bruker specific parameters
$$ ---------------------------------
##NTUPLES= NMR FID
##VAR_NAME=  TIME,          FID/REAL,        FID/IMAG
##SYMBOL=    X,             R,               I
##VAR_TYPE=  INDEPENDENT,   DEPENDENT,       DEPENDENT
##VAR_FORM=  AFFN,          ASDF,            ASDF
##VAR_DIM=   8192,          8192,            8192
##UNITS=     SECONDS,       ARBITRARY UNITS, ARBITRARY UNITS
##FACTOR=    0.0002004,     1,               1
##FIRST=     0,             0,               0
##LAST=      1.6414764,     0,               0
##MIN=       0,             -259324,         0
##MAX=       1.6414764,     519210,          0
$$ Real data points
##PAGE= N=1
##DATA TABLE= (X++(R..R)), XYDATA
0@%%%%jRqQj6K4l2L6m4N6p2Q8j04J25j49J74k05K40k80L26l74M30m94N60o34P21
30C84q15R15j028J154j289J437j603J784j981K197k433K695k986L304l657M054
46B132m501N002n571O233p003P910r005J0355j2068J4329j7470K2160l0010M6380
60B8873j37680K63304J91965m51671j54115K33443J25751k10940m0883J60463
70H510J4843j57659O2655J68457p2922j97531R5454K16221n6104j93276O0368
81e0984J27486j20924j24633K13629K07888k01106k73507J45181K80215q2575
91A20670k53078M2142K02757j4896j25843M8303O9983j16394o8921J79033J11954
102A95710j91330j53216J71129J73384j28164j60185Q7499J03270r4663n5790
$$ plain form
0 0 0 0 0 0 -1 8 0 8 -8 16 -16 20 -24 32 -40 48 -56 69 -80 94 -111 129 -151 175 -199 231 -263 297 -337 384
30 384 -431 484 -544 610 -679 758 -845 939 -1042 1155 -1278 1417 -1569 1735 -1922 2132
46 2132 -2369 2633 -2938 3295 -3708 4202 -4803 5552 -6516 7813 -9657 12503 -17507 28873
60 28873 -108807 154497 346462 -105209 -259324 -25881 99870 -111070 -151953 8510
70 8510 23353 -134306 -71651 96806 23884 -173647 -78193 138028 81924 -111352 -50984
81 -50984 76502 -44422 -169055 44574 252462 51356 -222151 -76970 203245 120670
91 120670 -132408 -90266 112491 97595 -28248 20055 90038 -26356 -95277 83756 195710
102 195710 4380 -148836 22293 195677 67513 -92672 -5173 98097 3434 -52356
112e2356J43394O7462j64302r6661J43531J03269j05902p2984Q2561J2260j12006
123e1734J9545J51986j8102j60123M0969J90330n7429k55766K608K65204O1803
134A89291k09764o7261J58249K5598j59077n912J70796J2783j57629r446J29299
145G6927l0859j40615M8398J53415m5292j41665N6805J25370r9580j52936J12276
156c7756J90515q8273k00850N3175J69975n8620j49908P8558J54459q5976j59918
167a34619Q1377J50589q6069j45272R0255J41814r1971j35484R7796J34631j01353
178A694j36272J02259J44640r0629j44403P5663J35012n9070j11817N4038Q4616
189E5731n4398m5229Q4330K6989j23457l7425J49811O8325j40761q3426J21944
$$ plain form
112 -52356 91038 158500 -5802 -102463 41068 144337 38435 -34549 48012 60272 -51734
123 -51734 -32189 119797 101695 -58428 -17459 172871 115442 -140324 -137716 127488 189291
134 189291 -20473 -87734 70515 96113 -62964 -68876 101920 114703 -42926 -52372 76927
145 76927 46068 -94547 -46149 107266 61974 -79691 -22886 102484 2904 -150032 -37756
156 -37756 152759 64486 -136364 -83189 86786 28166 -121742 -43184 111275 25299 -134619
167 -134619 -53242 97347 11278 -133994 -43739 98075 6104 -129380 -31584 103047 1694
178 1694 -134578 -32319 112321 21692 -122711 -47048 87964 28894 -82923 -28885 55731
189 55731 1333 -43896 40434 67423 -56034 -93459 56352 124677 -16084 -99510 22434
200B2434Q0093j08327o4479J12309N8108j13765n0863J21778N0782j33716p0688
211i6334J22579R1145p6352o9806L8731J4449m4439L2201Q3292m2743j20069K2546
223d4800J30908m178j28709j0148J15645K2393q5040p594N5079m0682p1341P1184
235B717J08411o2499j30159L6027J23383j8078j02723J4114P3761l5321o0728
246e1095O6419P0313r5472j06505R5150J44093n9045j52684Q663J13664R413o2443
258a9529P076K5178m6269j5394Q5613L1171j11421o4416J05079Q5743q3353q2647
270h3169O6772O0220p2027m2530R5535M4391j19388o9509J20330R7489r6984j09113
282a07983O2920J00278l0845p0204J4570K7598l0029L636O7962K56r3901k2015
$$ plain form
200 22434 102527 -5800 -70279 42030 100138 -13627 -64490 57288 108070 -25646 -96334
211 -96334 26245 117390 41038 -28768 9963 24412 -20027 12174 95466 52723 -67346 -44800
223 -44800 86108 81930 -46779 -56927 58718 81111 -3929 -11523 43556 2874 -68467 2717
235 2717 111128 48629 -81530 -45503 77880 59802 -42921 -28807 44954 9633 -51095
246 -51095 15324 85637 -9835 -116340 -21190 122903 63858 -88826 -80163 33501 42914 -19529
258 -19529 -12453 12725 -33544 -48938 36675 67846 -43575 -107991 -2912 82831 -522 -83169
270 -83169 -16397 43823 -28204 -70734 24801 69192 -50196 -119705 625 98114 1130 -107983
282 -107983 -45063 55215 24370 -45834 -31264 -3666 -33695 -30059 37903 38159 -55742 -77757
294g7757R5841L9726q0636m0880O2267K8125n0917l771N9688j1708p9518R857
306d9683R8992J2641r8919l5890P6607M1559m8235k2402L7204J115l8901J8106
318g806M9265k9511o7991K4808Q3035l320p4541j1596N4407J0190l7602J441L0211
331B0990j3924l1381K4278L8059k6596m1027K4034L7744k3952l0321L0425K3052
343C1381m3066k2984N7626L7604o1838n6676M7802O4922k9024n7565J6952M5328
355C0462j4448l2691J8632K4196k6301k0942L1195K0155l2483j9256L1184J5147
367B4850k9984o710L6250J711m8057r838N3134K1363m6756k6564L8380K5233l0060
380B952j8615K4720M721k9618L735M1496r46m8418j0125M6377J9612l6135k2315
$$ plain form
294 -77757 18084 57810 -22826 -63706 -1439 26686 -24231 -28002 31686 19978 -59540 -49683
306 -49683 49309 61950 -36969 -72859 3748 45307 -2928 -25330 11874 12989 -25912 -7806
318 -7806 41459 11948 -56043 -31235 51800 48480 -26061 -37657 16750 26940 -10662 -9221 20990
331 20990 7066 -24315 -37 38022 11426 -29601 -5567 32177 8225 -22096 8329 31381
343 31381 -11685 -34669 22957 60561 -1277 -57953 -10151 54771 25747 -31818 -14866 30462
355 30462 16014 -16677 1955 26151 -150 -21092 10103 30258 -2225 -21481 9703 24850
367 24850 -5134 -11844 24406 26117 -21940 -31778 21356 42719 -4037 -30601 7779 33012 2952
380 2952 -15663 9057 13778 -15840 -12105 29391 28445 -19973 -30098 16279 35891 -244 -22559
393b2559K1878J3942j6550k527K1289l165l0664j632L5046J1888k8410k0621J0011
406a2074J3190P051O819r461k8983n022L9983K8094l5099m8569J3271N2413J0437
419C2050l8324k2178J6483J6301k225k15J977j3128j2136J2654K1601J08j9943
432f975j3490L899J4976J5283O04k2929k3313J2698M0477J1520l9610l6955J7635
445b6180M6183J2546l0276l0906L081K9292K2069r721l1732j4570K1356K8466
457A9608K31k4539j4536J0578J7538L452p138o078m719l563O406J6324O194j7234
471B524k2640L659L2390K1112k3829m1356M77M5197K6709k9187m2454R25L8036
484A1563K3642j6663l0162p436K1734K1420l287k3320j3707J1053J7493j551j0482
$$ plain form
393 -22559 -681 13261 -3289 -5816 15473 12308 -18356 -19988 15058 26946 -1464 -22085 -12074
406 -12074 1116 8167 14986 5525 -23458 -28480 11503 39597 4498 -44071 -30800 21613 32050
419 32050 -6274 -28452 -11969 4332 2107 1892 3869 -9259 -21395 -8741 12860 12968 -6975
432 -6975 -20465 -16566 -1590 13693 14297 -8632 -31945 -19247 21230 32750 -6860 -43815 -26180
445 -26180 20003 32549 2273 -28633 -25552 3740 25809 16088 -15644 -30214 -8858 19608
457 19608 19839 -4700 -19236 -8658 8880 12332 5194 -884 -5603 -9166 -2760 13564 19758 2524
471 2524 -20116 -16457 15933 37045 13216 -28140 -27663 17534 44243 15056 -27398 -26473 11563
484 11563 35205 18542 -11620 -19056 2678 24098 20811 -2509 -16216 -5163 12330 10779 297
497B97J639N804q466p744J5650J4517j9636k9850Q054L6612J0419k7330k2785
510b2819R882K2024O325j1197j7757j1190J1900K7981N488l0806k0486K4089K7930
523B1364j3292k8356K970J9043j133j0120P113J0524j0176j4085R376J4864n589
536B503j1490L537M656n342N251J7136q547l1274J842M0294J1427l9149k2162
549c1318L0843K8188j7700k3993R685J4683j0207o535J3949K930j8028j635K2218
562A3080J842k2764J118K3278p357k9448Q292L7391m104m1798l222M2692J2813
575C1813l6183j7803K3452J2174j5518n22J5429j1463k4166J6839L5886j2280
587A7658l9824O603L6907m600l3823M267K8321j0857k8385J8662L8912j5254m6484
$$ plain form
497 297 1936 7740 -726 -8470 7180 21697 2061 -27789 -19735 16877 27296 -34 -22819
510 -22819 -12937 9087 15412 4215 -13542 -24732 -12832 15149 20637 -10169 -30655 -6566 21364
523 21364 8072 -20284 -17314 1729 596 -9524 -2411 8113 -2063 -16148 -6772 8092 2503
536 2503 -8987 -5450 -794 -6136 -885 16251 7704 -23570 -21728 18566 29993 -9156 -31318
549 -31318 -475 27713 10013 -13980 -4295 10388 181 -6354 7595 10525 -7503 -9138 13080
562 13080 14922 -7842 -6724 16554 9197 -20251 -11959 25432 21328 -20470 -23692 19000 31813
575 31813 -4370 -22173 1279 13453 -2065 -2587 12842 1379 -22787 -5948 29938 17658
587 17658 -22166 -15563 21344 16744 -17079 -12812 15509 4652 -23733 -5071 33841 18587 -27897
600b7897M267M3125L532l4422o964J8044k351o398K0836R377l5294k1597L9687
613C945L3203l7246m5537K4487M5406j2169l4553J0546K2827j8624k0010K7032
625f93K3529l1121k9813K6762L1346j9167k4579J3670J1192j6503L327L2559n866
638A4643n1519n376O1936K5228n6691l9923M1231M2046k3149k7470J8079J2578
650A1613j9570K222L1100q069m7601K23N2776J2730m1258j0384L6883L758l6601
663a2178K546L9841j1082n0234J1696O2772q29o6158j0878N8019J9559m1663j6326
676a4915K4881k884k5197J8228L5544k3166m5923K1478N2947j6552n7524O525
688b6558M9005n718l8333J5482L5331k8025m5056L0348N4830k3427n7761J2173
$$ plain form
600 -27897 -23630 19495 23027 -11395 -18359 -315 -2666 -9064 11772 21149 -14145 -35742 3945
613 3945 37148 -98 -45635 -21148 24258 12089 -22464 -11918 10909 -7715 -27725 -693
625 -693 22836 -8285 -38098 -11336 20010 843 -23736 -10066 1126 -15377 -12050 20509 14643
638 14643 -36876 -42252 19684 44912 -11779 -51702 -10471 31575 8426 -19044 -965 11613
650 11613 -7957 -5735 25365 17296 -30305 -30082 22694 35424 -5834 -16218 20665 24423 -12178
663 -12178 -9632 30209 19127 -31107 -19411 43361 42532 -23626 -34504 23515 43074 1411 -14915
676 -14915 9966 7082 -18115 113 35657 12491 -33432 -11954 40993 24441 -33083 -26558
688 -26558 22447 16729 -21604 -6122 29209 1184 -43872 -13524 41306 17879 -39882 -27709
700b7709N0473o893l9621Q464K8974j5834k3145K7833K2248m1043l1076M6100
712a229M4065l7371m6568K7150L7145k6178l0392K9334K6890l0977k2239L7841
724G471K2932m2598l0325L9174L2334l1201k4191K8897J2361l7054n967M8875
736B0708J0818n2159j5240N0021J5492n0236j7491M8989J9430m1735j2403M1896
748A8090M445m8288l990N3238Q074m9477n668M6661j065m8833O387N4321m715
761B9180n3615P072N5643r801o0354O133O1854l91n4653L391N0247j0188n2283
774b7765J5419N6289j4873n7256J3931N4809j5425n3109J5499M9993j7105m3837
786b3430K4406M2683l5592n4092L6220O3750k6432o3527J6522N2475j7992m5701
$$ plain form
700 -27709 22764 15871 -23750 -15286 13688 -2146 -25291 2542 24790 -16253 -47329 -1229
712 -1229 42836 5465 -41103 -13953 23192 -2986 -33378 -4044 22846 -8131 -30370 7471
724 7471 30403 -12195 -42520 -3346 28988 -2213 -26404 2493 14854 -22200 -28167 20708
736 20708 31526 -20633 -35873 14148 29640 -20596 -38087 10902 30332 -11403 -23806 18090
748 18090 22535 -25753 -29743 23495 31569 -17908 -23576 23085 22020 -26813 -20426 33895 29180
761 29180 -24435 -17363 38280 28479 -31875 -25742 36112 35721 -18932 -15541 34706 24518 -27765
774 -27765 -12346 43943 29070 -28186 -14255 40554 25129 -27980 -12481 37512 20407 -23430
786 -23430 976 43659 8067 -46025 -9805 53945 27513 -36014 -19492 32983 14991 -30710
798c0710K2405M2676k5518l8208K8066L2755l8021l7988L9525M3782l1721l8407
810c1364K7831K7164l7701k5752M7008L2326m8075l7892M3500L6284m0496l3651
822d0818L7641L2445l0202k3485K6459O480l7579J558N5234O894o1856j8419N7900
835A2252K3129n0061k1547M3443J5661l8160m142M0204p151m9567Q372N9369j464
848C0338n7096j769N0937k116m8686R421M9280j4706n2633J9664O0978k0152o8810
861d5350J3629P1671l020o2792q57M7909p045l9704J9279M2553k5790m4952L1124
874c345M7745l6158n5941L5368O2585k5487n6840K1778M3374l3067m2364M7204
886D852N6934m2728o5814K8267N8478k2072m8852K3409M2786k4901l6602K7735
$$ plain form
798 -30710 -8305 34371 8853 -29355 -1289 31466 -6555 -44543 -5018 38764 7043 -31364
810 -31364 -3533 23631 -14070 -39822 7186 39512 -8563 -46455 -2955 33329 -7167 -40818
822 -40818 -3177 29268 -934 -24419 2040 8520 -29059 -27501 27733 34627 -27229 -45648 12252
835 12252 35381 -14680 -36227 7216 22877 -15283 -19425 20779 13628 -35939 -27567 31802 30338
848 30338 -26758 -28527 22410 20294 -28392 -18971 30309 15603 -37030 -17366 43612 23460 -45350
861 -45350 -31721 39950 36930 -25862 -26719 21190 14145 -25559 -6280 36273 10483 -34469 -3345
874 -3345 44400 8242 -47699 -12331 50254 24767 -32073 -10295 33079 12 -42352 4852
886 4852 61786 19058 -46756 -18489 39989 17917 -30935 -7526 35260 10359 -26243 1492
898A492K8665l6514k6757M8125L3696n1603m3396M3139M1348l7650l2865L9673
910G353L0691m2355l0128L8895K5370m1277k4413M4882K6193m1513k5135L6555
922E118J7510l7305q697M2676L809n0506n866N4222R519n3213j3613M8306J5154
935B7114l9335q146L4812l042l8995P247M4533o203m3672P161M0442j3447m2078
948c3609K0788M8420k0223n0799J6319M8735j8496m7936K0195N1946j5533m9702
960b9895J0943M0370j5034l3520K5245L5456l0902l9615L1679L8695l3157l8100
972c7835L7639M2122l6707m3088L2558L8759l4927l5986M0255M0930m0043m6405
984d2728L3227M3907k5949l3422K7760K3450l5855k1398M3527K2772m6833k4960
$$ plain form
898 1492 30157 -6357 -33114 15011 48707 -2896 -46292 -3153 38195 545 -32320 7353
910 7353 38044 -4311 -34439 4456 29826 -11451 -35864 9018 35211 -6302 -31437 5118
922 5118 22628 -14677 -23374 19302 23111 -27395 -33261 20961 30480 -22733 -36346 11960 27114
935 27114 -12221 -20367 14445 11403 -27592 -20345 24188 17985 -25687 -18526 21916 8469 -33609
948 -33609 -12821 35599 15376 -35423 -19104 29631 11135 -36801 -16606 35340 19807 -29895
960 -29895 -18952 21418 6384 -27136 -1891 33565 2663 -36952 -5273 33422 265 -37835
972 -37835 -196 41926 5219 -37869 -5311 33448 -1479 -37465 2790 43720 3677 -42728
984 -42728 -9501 34406 8457 -24965 2795 26245 -9610 -31008 12519 35291 -11542 -36502
996c6502M9461K9681m7627l3118M1690L0487l8965k6344L9056K4407l8730k0834
1008b7338L9082J8772m0612j8226L9681J7570l5751j3364L1871N452l4498K233
1020a5128M1851k873m8895l113N0794J0746m6093j4123L7402J2434k9859o219
1032a3076K3715m941k4587J4920L2977j6256l9178J0417L7259q339l1808J1188
1044g709K9880j5499l1450J7673L2646j8180l4229J8425L4958j6086l4577J1513
1056a2635K7721j0283j7264J7309J2019k8940j5048L5736K1658l7081k7564L4265
1068a07L1148k9790l0434K4717K4394k4607j7267L0714J6840l6463k1573L4768
1080B340K4354k9608k1868K5136J6695k4129r996K7596N045l3627m852L9587Q565
$$ plain form
996 -36502 12959 42640 -4987 -38105 3585 34072 -4893 -31237 7819 32226 -6504 -27338
1008 -27338 11744 30516 -10096 -28322 11359 28929 -6822 -20186 11685 17137 -17361 -15128
1020 -15128 26723 23850 -25045 -28158 22636 33382 -12711 -26834 10568 23002 -6857 -13076
1032 -13076 10639 5698 -18889 -3969 29008 12752 -26426 -16009 21250 12911 -18897 -7709
1044 -7709 22171 6672 -24778 -7105 25541 7361 -26868 -8443 26515 10429 -24148 -12635
1056 -12635 15086 4803 -12461 4848 16867 -12073 -27121 8615 30273 -6808 -34372 -107
1068 -107 31041 1251 -29183 -4466 19928 -4679 -21946 8768 25608 -10855 -32428 2340
1080 2340 26694 -2914 -24782 354 17049 -7080 -17076 10520 15565 -18062 -22914 16673 25238
1093B5238m2908j3339M0224J7169l4631j4976L0773J0739l0295p870L1138O031
1105A7293l0659o098L2284O841l0659p872K7001O158k3472K16K4041n019k8834
1118a8779O196L2558k169l2020j085K8732J851k4193j40K0377k312j8559O504
1131c039J9639q976k2561P744K3185n321j9676O534J6290r950j6192J2656J6562
1144A6895j3687j7122J3776J7823j2698j7873J0528J5129r255j1845J1169Q866
1156A1706j5024r613J6982J2087j7447j2401J5170J0809j4382q230J3375M790
1168G822j5120j899J9209K031k3262o414K3428R841j9398j1128J5268P400j2865
1181e087l644J4399K75j7228j23J9311J416j8988m114J7051M737j2706k422J0270
$$ plain form
1093 25238 -17670 -31009 9215 26384 -8247 -23223 7550 18289 -12006 -19876 11262 17293
1105 17293 -13366 -19464 12820 19661 -10998 -18870 8131 14289 -9183 -8967 15074 10055 -18779
1118 -18779 -12583 19975 17806 -14214 -15299 13433 15284 -8909 -9049 11328 9016 -9543 -3039
1131 -3039 16600 7624 -14937 -7193 15992 10671 -9005 -2471 13819 3869 -12323 333 16895
1144 16895 3208 -13914 -138 17685 4987 -12886 -2358 12771 3516 -8329 2840 11706
1156 11706 -3318 -12931 4051 16138 -1309 -13710 1460 12269 -2113 -10343 3032 7822
1168 7822 -7298 -9197 10012 12043 -11219 -17633 5795 15636 -3762 -14890 378 7778 -5087
1181 -5087 -8731 5668 5943 -11285 -11408 7903 9319 -9669 -13783 3268 8005 -4701 -7123 3147
1195C147k580j2463N797J6390m647j9819J221K0555K491j6925m689J1974K575
1208C027p111K310O438p133j0285Q823J5662n150j6912m63J4342L849q720k423
1222c746M308j688l004P721N536r919r952P911J2877k073j0503j872N031J115
1236A742K26L910j584q465j632J0819P818r451j0785L982J0417J205n264k817
1250A21j556M8M291N397k483q928j978Q389N857m722o898m45L673K091L05L88
1266C550l162m751K000P601K152o594o535J170O133M077k587o697k991M719O638
1281D723P88o460n788K404P260K192n021o082P45N852K835l087l903J255K559
1296B72p26j845K551K487m798n010M218Q676j506r228k365O962N104k310m899
$$ plain form
1195 3147 567 -11896 -6099 10291 5644 -14175 -12954 7601 10092 -6833 -11522 452 3027
1208 3027 -4084 -1774 4664 -2469 -12754 -3931 11731 6581 -10331 -10794 3548 7397 -1323 -3746
1222 -3746 562 -1126 -4130 3591 9127 -792 -10744 -2833 10044 7971 -2532 -4404 627 1742
1236 1742 1968 5878 4294 -4171 -5803 5016 12834 3383 -7402 -3420 6997 8202 2938 121
1250 121 -1435 -1387 2904 8301 5818 -3110 -5088 3301 9158 4436 -2462 -2907 766 2857 3162 3550
1266 3550 388 -4363 -2363 5238 7390 796 -5739 -4569 1564 5641 3054 -3643 -6634 -1915 4723
1281 4723 5511 -949 -6737 -4333 2927 5119 98 -5984 -5239 613 3448 361 -3542 -2287 272
1296 272 -454 -2299 252 2739 -2059 -7069 -2851 5825 4319 -4909 -7274 -312 4792 2482 -2417
1311b417k151R39L399M068j142p571k249Q678N989o866p703M507P146l607n502
1326d482L755M756m634m880N344O430l598p224J858N228r36k181K331m35n438
1341d106J349R957M57j1710l933J1654O004q688o861N795M555m076j213N387j5
1356D556p418l65Q850P97q320j694O980J53o314L839O948o258j0721P400J4820
1371A3253n351j7131M62J5563K134j1407k331P767m43o452N492P414r363j1305
1385a1698R934J3949p686j4808N581J2403n636r577Q227R643j1753j1091J2216
1398b96J4913j1436j7188Q237J6261n450j1512O074O925j0639n605J7284P891
1411A5459k0704j3609J9659J8094j5347j9138R953J6190o235j0566Q050N809j3136
$$ plain form
1311 -2417 -4568 -3629 -230 3838 2696 -4875 -7124 1554 7543 677 -7026 -2519 4627 1020 -4482
1326 -4482 -727 4029 -605 -5485 -141 6289 2691 -4533 -2675 2553 1617 -564 1767 1332 -4106
1341 -4106 -2757 7200 7657 -4053 -7986 3668 9672 984 -5877 -82 4473 397 -816 4571 4556
1356 4556 -2862 -3227 5623 6420 -1900 -3594 3386 3539 -2775 1064 8012 1754 -8967 -1567 13253
1371 13253 7902 -9229 -8767 6796 8930 -2477 -4808 2959 2516 -3936 1556 8970 -393 -11698
1385 -11698 -1764 12185 4499 -10309 -4728 7675 2039 -7538 689 10332 -1421 -12512 -296
1398 -296 14617 3181 -14007 -5770 10491 5041 -6471 -397 6528 -4111 -9716 7568 15459
1411 15459 -5245 -18854 805 18899 3552 -15586 -5633 10557 4322 -6244 1806 7615 -5521
1424e521n173J6990P694j8166j0259J6099J0302j3407p272J3066L164j5318j425
1437i226J9023K477k2988o948K3067J1916j7979j2488J1613Q977q630k734R518
1450E598l203j3461N225J8158m565k0289J836K0407Q47j6843n98J3585l639j4858
1464a1800P206J8084o816k0682M802K0601j749j7331J002J2620m566q849J0113
1477B635P693j5984j1201J9367J7320j7660k0501J4093K0538j2344j8815J1350
1489c509J5877j2027j3573J4413J3029j6459j4049J6665J4930j4259j3144J2775
1501F69Q710j5672n331K0195O150k3988q253K6783J1771k6960j5735K3747J6458
1514A8544j8799j3636J6742Q757j7815n470K1338N923k2472p748K0984P270k0340
$$ plain form
1424 -5521 -10694 6296 13990 -4176 -14435 1664 11966 -1441 -8713 4353 7517 -7801 -9226
1437 -9226 9797 12274 -10714 -17662 5405 17321 -658 -13146 -1533 7444 -1186 -3920 5598
1450 5598 2395 -11066 -5841 12317 7752 -12537 -10701 9706 10553 -6290 -6888 6697 3058 -11800
1464 -11800 -4594 13490 6674 -14008 -9206 11395 9646 -7685 -6683 5937 1371 -7478 2635
1477 2635 10328 -5656 -16857 2510 19830 2170 -18331 -4238 16300 3956 -14859 -3509
1489 -3509 12368 341 -13232 1181 14210 -2249 -16298 367 15297 1038 -12106 669
1501 669 9379 -6293 -11624 8571 14721 -9267 -17520 9263 21034 -5926 -21661 2086 18544
1514 18544 -255 -13891 2851 11608 -6207 -11677 9661 15584 -6888 -14636 6348 13618 -6722
1527f722n496K0708M603k0338k917K1289R13k3814j051K5515L563k5260n910K1339
1541F422M703j7138q17J6274k440j8019N671J9667o416k3487M245K4142k336k0735
1555a0264K121J7612n395j5570R586J7310j1855k0771J0812K1365q619k0531O820
1568g379J7951o926j2386R139J0271j5521j1991J8537J6226j7673j7570J5393
1580a929J5411j4791j3397J5372J2396j6518j0084J8784Q994k2461j1904K3490
1592C363J6529j9766j6370J4947J1173j4532n429J8318L119k3132m570K5770O899
1605A6319k4943r286K3699J0172j9796q004J6547K690j9671J939K4845k58k7868
1618a3615l806K7528O498k4746n630K1305L462j9669L24J9313l094k2053M096
$$ plain form
1527 -6722 -12218 8490 13093 -7245 -10162 11127 12040 -11774 -12825 12690 16253 -9007 -14917 6422
1541 6422 11125 -6013 -6830 9444 7004 -11015 -5344 14323 7907 -15580 -11335 12807 10471 -10264
1555 -10264 -8143 9469 4074 -11496 -1910 15400 3545 -17226 -6414 14951 6332 -14199 -7379
1568 -7379 10572 3646 -8740 399 10670 -4851 -16842 1695 17921 248 -17322 -1929
1580 -1929 13482 -1309 -14706 666 13062 -3456 -13540 5244 14238 -8223 -20127 3363
1592 3363 19892 126 -16244 -1297 9876 -4656 -10085 8233 11352 -11780 -16350 9420 16319
1605 16319 -8624 -17910 5789 15961 -3835 -11839 4708 7398 -12273 -10334 14511 14253 -13615
1618 -13615 -17421 10107 16605 -8141 -13771 7534 10996 -8673 -8349 10964 7870 -14183 -10087
1631a0087K5201j637k5603k67K2578R11j9557J145J7647n299j6681R198J9308
1644A6857j1543k3006R878K6035n694k3582K431J7562n179j3882J0537J5009j2817
1657B606j7405J3103J8696j3075j9475J0699J9532r134j4959Q676J0177j2435
1669b994q622J7654J0180j9485j3475J8252J4049j5941j3605J5884J1680j5698
1681b121j0432J6298Q677j8033q168K0054R393k0240j1002J6967R917j3568n521
1694g779J3747J055j6807O23K0949k99k4270k654K5398N650k3162o685K0418M971
1708A1155j8632k477J8996J69j9995m72K0895J422j9722j970J8034J60j5564K622
1722e379J4803n979j7328Q880K0646q203k3884N480K3817k506k1075K109J7949
$$ plain form
1631 -10087 15114 13477 -12126 -12393 10185 11096 -8461 -7316 10331 5032 -11649 -2451 16857
1644 16857 5314 -17692 -7814 18221 12527 -11055 -8624 8938 3759 -10123 414 15423 2606
1657 2606 -14799 -1696 17000 3925 -15550 -4851 14681 5547 -9412 -736 9441 -2994
1669 -2994 -11616 6038 16218 -3267 -16742 1510 15559 -382 -13987 1897 13577 -2121
1681 -2121 -12553 3745 12422 -5611 -13779 6275 15668 -4572 -15574 1393 11310 -2258 -7779
1694 -7779 5968 7023 -9784 -9161 11788 11489 -12781 -15435 9963 15613 -7549 -14234 6184 11155
1708 11155 -7477 -9954 9042 9211 -10784 -11256 9639 11061 -8661 -10631 7403 7563 -8001 -5379
1722 -5379 9424 3445 -13883 -5003 15643 7440 -16444 -10964 12853 10347 -10728 -8619 9330
1735I330k852j5855M432J4529p118j4611Q349J6824q302j6893O602J4833p023
1748B245j1508J0582J0099j4136j2706J5868J6123j4022j7911J0718J7134p484
1760E002j4233O261R880p943n954J2232N329j5580q065J6360J0560j5334r672
1773a1157J3867P707j4055n854J5562N171j7157o026J8205Q213j7479j0312J4888
1786A573R290j1607n608J0059Q04j1588K484J6031k819j9981O27K1107K579j9383
1800f432n069J6020L867j3299j49J3994k859j7356K846J9626m76j9179j257J6108
1814F385J073j3028O81J1785m185j2276O784J4610p473j7412N370J7939k189j6143
1828h079J323J2672k675j0463N687R528q565j1070J0108J3525r803j5490P176
$$ plain form
1735 9330 6478 -9377 -4945 9584 2466 -12145 -3796 13028 4726 -12167 -5565 9268 2245
1748 2245 -9263 1319 11418 -2718 -15424 444 16567 2545 -15366 -4648 12486 5002
1760 5002 -9231 -2970 6910 -1033 -6987 5245 10574 -5006 -13071 3289 13849 -1485 -11157
1773 -11157 2710 10417 -3638 -9492 6070 11241 -5916 -11942 6263 14476 -3003 -13315 1573
1786 1573 10863 -744 -6352 3707 4511 -7077 -4593 11438 8619 -11362 -10735 10372 12951 -6432
1800 -6432 -11501 4519 8386 -4913 -5062 8932 6073 -11283 -8437 11189 10713 -8466 -9723 6385
1814 6385 7458 -5570 -4889 6896 2711 -9565 -2781 11829 4356 -13056 -7686 10253 8064 -8079
1828 -8079 -6756 5916 3241 -7222 -1535 7993 -572 -11642 -1534 11991 2188 -13302 -6126
1841f126J4697l886j1510L464P813o539o231R526Q144j1051j0341J0014J1173
1854I147p996r933O504O824o659l586R187K407j2833l948J5166P163j4105r161
1868a1823J1282R136r141p126P829N020q451j840R987O36j2318q99J3231K756
1882H279j1889l056R923J021r528J893J1479k621j4505K139J6364N03j6634l322
1896i954J4493M686r897l097O991q04p770M906R878n198j1934L517J2479k203
1910F093j1569K276J0531k535j0144L913R762m874j1647M979J3337l360j2605
1923e843J107R686o60o651K274M922m961m755P194O091q579q261P019J0712n421
1938C874r775L323O867l537n053O160M336p118o381O536P346n525o518L814M615
$$ plain form
1841 -6126 8571 4685 -6825 -3361 4452 -2087 -8318 1208 9352 -1699 -12040 -2026 9147
1854 9147 1151 -8782 -2278 4546 -2113 -5699 3488 5895 -6938 -10886 4280 11443 -2662 -11823
1868 -11823 -541 8595 -546 -7672 157 5177 -3274 -5114 4873 5509 -6809 -7708 5523 8279
1882 8279 -3610 -6666 3257 4278 -5250 -3357 8122 5501 -9004 -6865 9499 10002 -6632 -9954
1896 -9954 4539 9225 -672 -3769 3222 2418 -5352 -446 9432 4234 -7700 -4183 8296 6093
1910 6093 -5476 -3200 7331 4796 -5348 -1435 8327 3453 -8194 -3215 10122 6762 -5843
1923 -5843 -4736 4950 4290 -2361 -87 4835 -126 -4881 2313 8404 -175 -8436 -1417 9295 3874
1938 3874 -5901 -2578 4289 752 -4301 1859 6195 -923 -7304 -768 6578 1053 -5465 -1651 2964
1953B964l208j999L945L03p010m30R276L065j0045n111P954N387o126l616M859
1968B08J769m966n81O339l04p341m84P851K121o930k767N001J256l638J105M948
1984C587l114o664L018Q388j667q637l5P606J559n097q72K895j651l353M287N696
2000E946m739p726L008Q751q53p413k3N069j8l622J446L142l163l729M182N106
2016E364k999o092J306N034k94k987J058J672l150j232N062K521n904m421N158
2031I6O079l043n503q3L384O06m97Q59l82l246k57M949J644m215l630K647L249
2048B657r23j710J95n17j109K001L154j322m469j393L983K988k331l304K25J811
2064f4Q62L44L2k609j519K275L667j278m058p73K519J773k71o84r95q57L16J682
$$ plain form
1953 2964 -244 -2243 1702 2005 -5005 -5435 3841 6906 -3139 -8250 -296 5091 -1035 -4651 208
1968 208 1977 -2989 -3570 2769 2465 -4876 -5360 2491 4612 -2318 -5085 -84 1172 -2466 -1361 3587
1984 3587 473 -6191 -3173 5215 3548 -5089 -5124 2482 4041 -1056 -1928 967 -684 -4037 250 5946
2000 5946 1207 -6519 -3511 5240 4387 -3026 -3049 2020 2002 -1620 -174 2968 -195 -3924 258 5364
2016 5364 2365 -3727 -2421 2613 2319 -668 390 2062 -1088 -2320 2742 5263 -641 -5062 96
2031 96 6175 3132 -2371 -2454 930 1536 1039 1898 1516 -1730 -1987 2962 4606 391 -3239 -592 2657
2048 2657 1734 24 219 -298 -1407 594 3748 2426 -2043 -3436 547 3535 1204 -2100 -1875 -64
2064 -64 798 1142 1174 -1435 -2954 -679 2988 1710 -2348 -3121 -602 1171 900 216 -779 -1636 -1320 362
2082C62J652j628l505j02L825K140k025l572k13L092K227n64k661j496O97K023
2098B52J180j505j294l98J182J667L40j430j642K49O87J464M08j203k222n46K629
2115a82L309j210m470j060L951L060k620l771J232K523J2j168O87K80j605o49
2131a681K523J292k270k127J129J924k48n24J237r74k520J417M482o97n924j194
2147d155N224L320l566l803K095K626o61q77Q28m79k430Q17L127m57l176j45L258
2164A546N17k699O75K535j961l808K434N093j626o126LN741J524l755j801J642
2180f6K16j94J721N17m376j531M962L375m460m679M119L909l104l390L717K365
2196C101m658k882N529L988n552m703M179N207l068m329L052J744l949o73O192
$$ plain form
2082 362 2014 386 -3119 -3221 604 2744 719 -2853 -3066 26 2253 1689 -972 -2468 -1771 252
2098 252 1432 -73 -1367 -1765 -583 1084 1424 -6 -1648 -1399 -712 752 1160 -43 -2265 -2811 -182
2115 -182 3127 1917 -2553 -3613 338 3398 778 -2993 -1761 762 774 -394 293 573 -1032 -1681
2131 -1681 842 2134 -136 -2263 -1134 790 542 18 1255 281 -2239 -822 3660 2963 -2961 -4155
2147 -4155 1069 4389 823 -2980 -885 1741 1080 203 1031 552 -1878 -1061 2066 1609 -1567 -1712 1546
2164 1546 2063 -636 39 2574 613 -3195 -761 4332 2706 -3420 -3417 2324 3848 93 -1708 -66
2180 -66 150 -44 1677 2194 -2182 -3713 1249 4624 164 -4515 -396 3513 409 -2981 736 3101
2196 3101 -1557 -4439 1090 5078 -474 -5177 -998 4209 1141 -3188 -136 1608 -2341 -3014 3178
2211C178O53p816j781Q521L757q342m518O627M089n570k870N256J913p010r24
2226d837Q229J856q816l059Q494L335p697k528O523J081o734K23Q075L3r882r08
2242f612J0562K550r831l647P910K877o159j244O058q00o310J835P860j922r530
2257f403J274R245j69q155L59P073j168o656K579P315k985q158K370Q329j594
2272C256p385J522N685j836m298L935L493n836m713P508O434p038p582N982P030
2287F157m563o141M824M748n352l508O682K717p785l392Q182L968q005l010P624
2302C146K090q445r13R762Q80j1240j886J1944K603j1500l776J0726M046r259
2316a822k877Q467Q10r091N41J0131j190j0871R22J1282m77j1962J001J1473j170
$$ plain form
2211 3178 3831 -3985 -5766 2755 6512 -1830 -6348 279 4368 -1202 -4072 1184 3097 -3913 -4837
2226 -4837 3392 5248 -3568 -6627 1867 5202 -2495 -5023 1500 2581 -4153 -3930 4145 4178 -5704 -6612
2242 -6612 3950 6500 -3331 -6978 932 3809 -2350 -3594 2464 1664 -4646 -2811 5049 3127 -6403
2257 -6403 -5129 4116 3947 -4208 -3849 3224 2056 -4600 -2021 5294 2309 -5849 -3479 4850 3256
2272 3256 -4129 -2607 3078 1242 -3056 879 4372 -1464 -6177 1331 7765 727 -6855 -873 6157
2287 6157 1594 -4547 277 5025 -327 -3835 2847 5564 -2221 -5613 2569 6537 -1468 -4478 3146
2302 3146 5236 -3209 -4122 5640 6520 -4720 -6606 5338 7941 -3559 -7335 3391 7437 -1822
2316 -1822 -4699 3768 4578 -4513 -3972 6159 4969 -5902 -4980 6302 5825 -6137 -5136 6337 5167
2331E167j1599J722J1776k074j2934J747J3964r74j2978k22J1368j54j0196J375
2345d012R635k963r794M176R788l980j0874M467J1543m142j1748L730J0649m082
2359B393r736M571R389n448r137N403R771n392q991M667Q143m782o418N611N412
2374E456p252n496Q849O541r342o905Q627P268p802o613P191M901o952l363P727
2389B835K592r068k898R925L765r179l608Q659J930q857l61R832J03j0882N31
2404d681J1100r99j1472L58J1744N90j1466j01J0029j099r979L200J1092l891
2418D425j2682L155J3347k471j2633K387J1186k879j0029L773R974n563j0327
2431h337O946J1510o955j2697N581J2472m842j1204N211J0623o458j0704Q000
$$ plain form
2331 5167 -6432 -4710 7066 4992 -7942 -6195 7769 6795 -6183 -6405 4963 4809 -5387 -4012
2345 -4012 5623 2660 -7134 -2958 6830 2850 -8024 -3557 7986 3844 -7904 -4174 6475 2393
2359 2393 -7343 -2772 6617 1169 -7968 -2565 7206 1814 -7177 -2510 5633 851 -5567 44 5456
2374 5456 -1796 -7292 1557 8098 -1244 -8149 478 7746 -56 -6669 522 5423 -1529 -4892 2835
2389 2835 5427 -3641 -6539 3386 7151 -2028 -5636 3023 4953 -3904 -4265 5567 5670 -5212 -4681
2404 -4681 6419 5420 -6052 -5694 6050 6640 -4826 -4927 5102 4003 -5976 -2776 8316 4425
2418 4425 -8257 -5102 8245 5774 -6859 -4472 6714 3835 -6194 -2421 7553 1990 -8337
2431 -8337 -1391 10119 3164 -9533 -3952 8520 3678 -7526 -2315 8308 1850 -8854 -854
2444h54J0665p967j1828P721J1287o648j0786O285R684o186q379O480P660p805
2458f71p074Q811P585r270q804R044Q746p723p924Q105N348q439n086R860N497
2473H005j0685o032R639O127q533n106P718M883q037l773Q116K206r119q54R892
2488D447J029j0113j234R214J759r399m07R124l87r369P37R520q11r823J622J0199
2504F108k067j0478K039R584j817q685L157P889m534q677N656R555n221j0008
2518g499M544R641m814q770O005Q146o577q981O915R473o758r447P073Q606o702
2533H55q533O909P981o975p113P359P074q694o448R213O700r056p088Q910O781
2548G875q851o580R117O245q745n873Q731N209q861n213Q962N528q680m867P768
$$ plain form
2444 -854 9811 1844 -9984 -2263 9024 2376 -8410 -2125 7559 1373 -7006 -526 7134 -671
2458 -671 -7745 1066 8651 -619 -9423 -379 8367 644 -7280 825 6173 -2266 -7352 2508 8005
2473 8005 -2680 -8712 927 7054 -1479 -6585 1133 6016 -2021 -5794 2322 4528 -4591 -5445 4447
2488 4447 5476 -4637 -5871 3343 5102 -4297 -4704 4420 4033 -5336 -4599 4921 4110 -5713 -4091 6108
2504 6108 4041 -6437 -4398 5186 3369 -5316 -2159 5730 1196 -7481 -1825 7730 2509 -7499
2518 -7499 -2955 6686 1872 -6898 -893 7253 676 -8305 -1390 8083 1325 -8122 -1049 7557 855
2533 855 -7678 -769 7212 237 -6876 483 7557 -1137 -7585 1628 8328 -728 -7816 1094 7875
2548 7875 -976 -7556 1561 7806 -939 -6812 1919 7128 -1733 -6946 2016 7544 -1136 -6003 1765
2563A765L931q398k390Q971K504j0284k255J0029L129r323l521Q623K594q536
2577c161j417Q557J176q796p41P849Q52p827m68Q085l62p013M86O622j586p045
2593d789K601P795l169q547K857Q524k140q059K278P232k534o441K448O446l539
2608I63n943M313O044m332o739M695N427m396m500M921M650o560m701P326N718
2623F886p508o170O523O220n553o132N369N248n712l899N880L497o419l694P058
2638A594L355o928l307P052L183p036k768O985K357p378k183P975K483q037k937
2653e590P539K756o684k148O405J528o428p82O805Mp039n6P495R24q015j222P049
2670B541J204o093l80N872p8o194N86O103r47n915J649N460j580n604J907N365
$$ plain form
2563 1765 5696 -2702 -5092 3879 6383 -3901 -6156 3873 7002 -2321 -5842 2781 5375 -3161
2577 -3161 -4578 3979 5155 -3641 -4382 3467 4319 -3508 -3976 4109 3747 -3266 -2780 3842 2256 -4789
2593 -4789 -2188 5607 2438 -6109 -3252 5272 3132 -4927 -2649 4583 2049 -4392 -1944 4502 963
2608 963 -4980 -667 5377 1045 -5694 -999 4428 32 -4468 453 5103 -1457 -6158 1168 6886
2623 6886 -622 -6792 -269 5951 398 -5734 -365 4883 -829 -4728 1152 4649 -1770 -5464 1594
2638 1594 4949 -1979 -5286 1766 4949 -2087 -4855 2130 4487 -2891 -5074 2901 5384 -2653 -5590
2653 -5590 1949 4705 -1979 -4127 2278 3806 -2622 -3404 3401 3405 -3634 -3690 3805 4729 -3286 -4508 2541
2670 2541 3745 -2348 -2728 3144 3066 -3128 -2542 3561 2614 -3301 -1652 3808 2228 -3376 -1469 3896
2686C896j639n843K265N620k284o011K198N765j725n596J960M916j767m635J897
2701i83L456k112l045L543K645m171l045M152L171l600l763L764L898l963l690
2716c743L943L488l826l438L774L104l626k939L403K199l275j232L732M27m108
2731b117r83M732J044m928p22N111J388n497k242M965K084m055j317L583J173
2746B219m156m59L401L06k662k36L256n72l613P65L482o41m246J136N041r31n221
2763c131O5M825O70m498o2L710n45k942M25K765p04k600J059K633q31l063J428
2780g96K850j999k623K204L023k150l315K207L162j799k619J093K705j327k218
2795a602J294J918j335j331J436J421j976j633J815K066j921j505J864P42j480
$$ plain form
2686 3896 2257 -3586 -1321 4299 2015 -3996 -1798 3967 2242 -3354 -1394 3522 1755 -2880 -983
2701 -983 2473 361 -2684 859 3504 -667 -3712 440 3611 11 -3752 12 3910 -53 -3743
2716 -3743 200 3688 -138 -3576 198 3302 -324 -3263 140 2339 -936 -2168 1564 1991 -2117
2731 -2117 -3100 1632 2676 -2252 -2974 2137 3525 -1972 -4214 751 2835 -1220 -2537 1046 2219
2746 2219 -1937 -2396 1005 1311 -1351 -1587 1669 1097 -2516 -1751 1731 1090 -3156 -2020 3021 2090 -3131
2763 -3131 -3066 1759 2429 -2069 -2131 1579 1034 -1908 -1483 1282 578 -2022 -963 1670 839 -2224 -796
2780 -796 2054 55 -2568 -364 2659 509 -2806 -599 2563 764 -1855 -762 1943 616 -1602
2795 -1602 -308 1610 275 -1056 380 1801 -175 -1808 7 2073 152 -1353 511 1253 -227
2810b27j134J985J153k072j250K034J517k269j557J795J303j132j056J583P00
2825A373j982n29J865P62j862m07J397L88j440KR35N09j581J42J349q7j752k64
2843a182J712Q25j518n38J437J64j340N0J212j85j229J36J008M2j038k42P72L11
2861C97l83j46Q44r90l73P79O44n91j288Q68J532j317r48Q73Q30n58p31J51P33
2880C26l83m01QM36k26j19M86k10k48r3O95l86m06l7O14M18r70l01O77R59p59
2901H0k77lJ67K4k26j74K57J01J19j57N9j04J33Q2j43L96k15q9j35j16K43J54
2923A76K05l5n00n5P47L5n07o98M44J013m69m56j33R62k45o07J18Q39l63q26j12
2944d67J311j6j143l09J213J47o80L48K72n10l16M22P84r44j091R74J068k36j209
$$ plain form
2810 -227 -1361 624 1777 -295 -1545 489 2006 -263 -1820 -25 1278 146 -910 673 1373
2825 1373 -609 -1138 727 1489 -373 -780 617 1005 -435 -433 502 1011 -570 -428 921 834 -918 -1182
2843 -1182 530 1355 -163 -701 736 900 -440 -390 822 637 -592 -456 552 594 -444 -686 86 397
2861 397 14 -132 712 -278 -651 128 772 181 -1107 -239 1293 -24 -972 -99 731 173 -558 -407 326
2880 326 -57 -458 -450 -14 -240 -359 127 -83 -331 -424 271 -115 -521 -558 56 474 -496 -797 -120 839 80
2901 80 -197 -200 -33 -9 -235 -409 -152 -51 68 -89 -30 -134 -1 81 -62 334 119 30 -105 -221 22 176
2923 176 381 346 -154 -209 538 573 66 -632 -188 825 356 -100 -233 729 484 -123 -5 834 471 -355 -467
2944 -467 844 828 -315 -624 589 736 56 404 676 166 -150 272 1056 112 -979 -5 1063 827 -382
2963c82K40J274n98j216M81J166o62j516O73J604j17j382k76J058N06j127j10
2980c84M63l82l71R50Q79j571q76J148J055j153r78R53R22j359q03J615O85j237
2998d44j460J592R19r61j096R60J080q70n43P13K27j510L32K258k81k564L35K409
3016A096k17k212n0K220L73k298nJ998k90j925Q7K204j78j866J63J942m80k084
3034a522J172K046j057k426J181K727j125l176J004L335o12l196L88K948p37k700
3050a750J330K704j418k360J176K397j527k312J403K304j029k651J511K276j351
3065G03k804J780K639j691k432J306K657j376k409J774K232k288j907J703K267
3080B154k240j926K530J720j821k325J967J931j768j782J822J557k150j349K406
$$ plain form
2963 -382 -142 1132 534 -682 -201 965 303 -1213 -540 1064 947 -435 -711 347 853 -274 -384
2980 -384 79 -303 -674 276 1155 -416 -1292 -144 911 -242 -1220 -267 655 -704 -1507 108 793 -444
2998 -444 -1904 -312 607 -354 -1450 -490 590 -280 -823 -110 117 -1393 -1061 1197 916 -1648 -1313 1096
3016 1096 879 -1333 -1383 837 1210 -1088 -1093 905 615 -1310 -1223 981 803 -1063 -900 1042 562 -1522
3034 -1522 -350 1696 639 -1787 -606 2121 996 -2180 -1176 2159 1547 -1649 -1261 1687 950 -1750
3050 -1750 -420 2284 866 -1494 -318 2079 552 -1760 -357 1947 918 -1733 -222 2054 703
3065 703 -2101 -321 2318 627 -1805 -499 2158 782 -1627 147 2379 91 -1816 -113 2154
3080 2154 -86 -2012 518 2238 417 -1908 59 1990 222 -1560 262 1819 -331 -1680 726
3095G26R84k429j086K585Q79k526n88K562K59k904j03K792J008l512p22L082O65
3112A672l040m09K740J10k403QK872r56k666P08L252q31l208J013L184j175l501
3129b630J507L657j197m096J373L858j245m134J241L904j209l267J239K799j855
3144e5k384K344K983k793l387K653L917k940l955K790M227k586m239K672L981
3159C228k368m389L158L645k621l495K309K904j883k916K639K391k846k374L338
3174G20K370m215k296L993K934l609l332L613K948l460k225L021K120k954j788
3189b160L001J553l281j133K818J419k818j031L149M28l644J99L876l52l762m85
3205b223M079L46l882k67L509K68k894j62L125q27l223J267L503j017l936J198
$$ plain form
3095 726 1710 -719 -1805 780 1659 -867 -1455 1107 1366 -1538 -1641 1151 2159 -1353 -2075 1007 1672
3112 1672 -1368 -1777 963 1073 -1330 -1322 1550 594 -2072 -1364 1888 1057 -2151 -1138 2046 871 -2630
3129 -2630 -1123 2534 1337 -2759 -1386 2472 1227 -2907 -1666 2238 1029 -2238 -999 1800 -55
3144 -55 -2439 -95 2888 95 -3292 -639 3278 338 -3617 -827 3400 814 -3425 -753 3228
3159 3228 860 -3529 -371 3274 653 -2842 -533 2371 488 -2428 211 2602 -244 -2618 720
3174 720 3090 -1125 -3421 572 3506 -103 -3435 178 3126 -334 -2559 462 2582 -372 -2160
3189 -2160 841 2394 -887 -2020 798 2217 -601 -1632 1517 1945 -1699 -1500 2376 2024 -1738 -2223
3205 -2223 1856 2202 -1680 -1947 1562 1830 -1064 -1226 1899 1072 -2151 -884 2619 1602 -2334 -1136
3221a136L570j719l371K085L377j908l761K659L254k524l858K575M132k504m277
3236c406K726L449k302l629L186L378l631l577M105L179l695l706L920L615l509
3251A03l448L356L257m343k239L761K746l963l010M333L216m577l262M473K742
3266C145m168k350M592K034m588k552M654K736m368k529M198K226m296j804L824
3281G54J704l917j111M075Q81m417o85N008M44m779q84M206J096m199k01L644
3297A619L31l844k06L889K09l923j63L568K8l296P09L263j356l326K091L464j851
3314A206l822J694L572j743l137J697L120j865l213K372L406k829l270K889K826
3329B903k870k783L251K419l230k456L508K192l771j867M150K097m458k629M493
$$ plain form
3221 -1136 2434 715 -2656 -571 2806 898 -2863 -204 3050 526 -3332 -757 3375 871 -3406
3236 -3406 -680 2769 467 -3162 24 3402 -229 -3806 299 3478 -217 -3923 -3 3612 103
3251 103 -3345 11 3268 -1075 -3314 447 3193 -770 -3780 553 3769 -808 -4070 403 3145
3266 3145 -1023 -3373 1219 3253 -1335 -3887 767 3503 -865 -3394 804 3030 -1266 -3070 754
3281 754 2458 -1459 -2570 1505 2386 -2031 -2716 2292 2736 -2043 -2927 1279 2375 -1824 -2025 1619
3297 1619 1950 -1894 -2100 1789 1998 -1925 -2088 1480 1508 -1788 -1079 2184 828 -2498 -407 3057 1206
3314 1206 -2616 -922 2650 907 -2230 -533 2587 722 -2491 -119 3287 458 -2812 77 2903
3329 2903 33 -2750 501 2920 -310 -2766 742 2934 -837 -2704 1446 3543 -915 -3544 949
3344I49K354l821k455L963K232m530j432M127K076m660j881M439J656m625j505
3359c113M788J181m547r95M714R15n118j063M888J697n480r15M814J054m458p73
3375b411M355L35m235n87M440P4m139l32M784J42m642k70M383o4l842L91L624
3392B006j039l542P96M574j124m401O55M037j74l813O08L247j049l263J241L415
3408B174j617k929J818K991k020k658J993K515k368k424K845K121k840k204L131
3423E28K245k920k237K588K312k877j902K310K128k451j514L457O59l390j289
3438b353L878J333l785j164L872K76l390l44L560M57m270m4L794J108m467n01
3454b040L575Q81l620p37M012m92l360L86L927l14m273M04M024m37l479j33L644
$$ plain form
3344 949 3303 -518 -2973 990 3222 -1308 -2740 1387 3463 -1197 -3078 1361 3017 -1608 -3113
3359 -3113 1675 2856 -1691 -2686 2028 2943 -2175 -3238 1650 3347 -2133 -3048 1766 2820 -1638 -2411
3375 -2411 1944 2279 -1956 -2543 1897 1971 -2168 -2500 2284 2426 -2216 -2486 1897 1833 -2009 -1618 2006
3392 2006 967 -2575 -1779 2795 1671 -2730 -2075 1962 1788 -2025 -1417 1830 781 -2482 -1241 2174
3408 2174 557 -2372 -554 2437 417 -2241 -248 2267 -101 -2525 320 2441 -399 -2603 528
3423 528 2773 -147 -2384 204 2516 -361 -2263 47 2175 -276 -1790 1667 2326 -1064 -2353
3438 -2353 1525 2858 -927 -2091 1781 2057 -1333 -1677 1883 2340 -1930 -1974 1820 2928 -1539 -2040
3454 -2040 1535 2416 -1204 -1941 2071 1579 -1781 -1395 2532 2218 -2055 -1651 2373 1936 -1543 -1676 1968
3471A968m99l406N64L773p65m087R60L976o69m149O30L966r11k960N61K862j143
3488F71k640J094L246j556l539J435L171p93k899J122K194j384k104J361K735
3503B114k055k569K080K296j934j973J684J962j743j779J702J680j943j290K069
3518C01J387j707j860K071J549k332r84J809J059j876r70K670Q3k681n18L170
3534A171M39k572r89K512Q34j934p36J954L72k140M49K011l66k486O47K032k70
3551I28j937J35K100n57k337J185K245o95k626P42K597n07k689K35K553l24k023
3568i75M31J510q00j453J161J964j264k074J278J646j069j794J068J820r84k011
3584a546K019J207j268j999J509K090j223j819P44J151n17j044J101O69j121q33
$$ plain form
3471 1968 1469 -1937 -1373 2400 1635 -2452 -1492 2484 1815 -2334 -1704 2262 1351 -1609 -1048 1814 671
3488 671 -1969 -875 2371 815 -2724 -1289 1882 1089 -1810 -688 1506 122 -1982 -621 2114
3503 2114 59 -2510 -430 1866 -68 -2041 -357 1605 -138 -1917 -215 1465 -478 -1768 301
3518 301 1688 -19 -1879 192 1741 -591 -1575 234 1293 -583 -1553 1117 1200 -1481 -1999 1171
3534 1171 1610 -962 -1951 561 1395 -539 -1275 679 1051 -1089 -640 1371 1005 -1481 -834 1198 928
3551 928 -1009 -874 1226 669 -1668 -483 1762 1067 -1559 -817 1780 1273 -1416 -1181 1372 1048 -975
3568 -975 -544 966 166 -1287 -126 1838 574 -1500 -222 1424 355 -1439 -371 1449 465 -1546
3584 -1546 473 1680 412 -1587 -78 2012 789 -1030 -286 865 348 -696 405 1074 -47 -880
3600h80J105J000j216r22J460J028j512p73Q97Q97j511p08J306J323j626r77J573
3617D64L78j208m05O71Q30q32oQ31q01j035O35J190r3j470k53J581Q2q36l55R44
3637C12p7p10q3J048l82p31k77J315J68q48k35N33j95l40N47J46l27o75L21J381
3657H91m48j013l7R19K2n66r1L57k28o20R13P67j077o92Q97O74m04r64M45Q72
3677F17n92k78K40M89o51O5L07O96o28p24J87L61jl53K77J26o93L24P33N7q07
3698b48l0K91L81k77k35l8J56K60k27M53o94R1O7K34J87o62q2N26J40m83M53P8
3720C41J0l46P1L09n1m81l28O56K98J14p98p2O57m1k66N8m04K49N2L96l83k65
3742b24K13jL18l92K03mJ54n32p3J17N23k34l75O4R47J13j205k10L88O36k48q79
$$ plain form
3600 -880 225 1225 9 -913 547 1575 63 -710 187 1084 -427 -1135 171 1494 -132 -1109 464
3617 464 842 -366 -771 -100 730 -102 -108 723 -78 -1113 -478 712 619 -851 -1104 477 559 -277 -632 312
3637 312 235 -475 -558 490 108 -623 -900 415 583 -265 -500 33 -162 -502 45 191 -136 -811 -490 891
3657 891 443 -570 -607 312 334 -232 -323 34 -194 -814 99 866 -211 -903 -6 668 264 -700 -255 617
3677 617 25 -253 -13 476 -175 -110 197 893 265 -459 -272 89 88 -265 12 138 -555 -231 502 559 -248
3698 -248 -278 13 394 117 -118 -156 0 260 33 486 -208 -117 -50 184 371 -291 -373 153 293 -190 263 341
3720 341 351 5 76 385 334 -147 -475 181 479 593 -205 -277 380 339 73 131 -273 -24 28 424 41 -224
3742 -224 -11 -12 306 -86 117 113 267 -265 -338 -221 302 68 -307 -243 704 817 -388 -598 -210 426 178 -701
3764g01M38M51m09j79O63j14n92q0O39L5m39j67J27L28j96q9M57k19j73m04Q91
3785B67K70j064l16Q71Q62o92p89J64O79l13n83O24K36o74K1Q44%p01JN93K50
3806E50j027K84P01n29o83K53J042j14j114j47J125N00j242j98M87L63l34m9O33
3825E01n67n97L59J144l44j114N91M49q3p20M56O89m94q02O28R28n06j162M69
3844a75J327q26q79K15Q28k56n32Q00N21j197m83P50O70j046p16J257N53j056
3862b45n51J014O74j498k98J789K38j416p75J127J084j218m50N74Q06j345p8J452
3880H84q9j516k67J878l8j676j59J233O43j249o07J466J18j269j46J625J78k003
3898i94q7J724o8j315j46J316J32j048J57J154n30j344L87J588l27j816L74J431
$$ plain form
3764 -701 -263 188 -221 -400 263 149 -443 -523 116 151 -288 -455 -328 0 -196 -285 172 -47 -220 -624 267
3785 267 537 -527 -843 28 890 198 -591 -427 252 -61 -644 -20 216 -458 -437 407 407 -294 -293 300 550
3806 550 -477 -193 508 -21 -704 -451 591 477 -637 -784 341 841 -401 -599 -112 251 -83 -132 501
3825 501 -66 -663 -304 840 496 -618 -27 422 339 -381 75 764 270 -532 96 1024 518 -644 -175
3844 -175 1152 326 -553 -338 490 234 -298 502 1023 -174 -657 93 763 -283 -999 258 811 -245
3862 -245 -796 218 892 -606 -904 885 1123 -293 -1068 59 1143 -75 -525 49 855 -490 -568 884
3880 884 795 -721 -988 890 852 -824 -983 250 893 -356 -963 503 621 -648 -794 831 1009 -994
3898 -994 -1081 643 575 -740 -886 430 562 -486 -329 825 295 -1049 -662 926 599 -1217 -843 588
3916E88k5j566P40J140q15j073Q09J350q46j644Q31J417n24j269N27J054l02j372
3934i80Q01J015r06r60J192J086j328r40J213P55r81q56J050Q43j606n46J522
3951C74R73j624q31J287J195j137j284J262P26j525m54J678M18j471n75J650L91
3968A053j651n18J672N57k143N27J383o4j793P5J840N33k096o80J973O61j781
3985d52l64J742j90j418P9J897j007j425P74J417l20j542M2K002m05k047N10K182
4003A475p29j748K11K035n75j534m69J894K14j556J57J304o50j037J011Q99j206
4020c04j049J040J751r68j659O23J653j062j208Q46J281j159q63Q76J321q29j612
4037a322R43J259j005p08Q59M42q21o73J351R46k074m82J765R27j849j100J859
$$ plain form
3916 588 563 -1003 -263 877 62 -1011 -202 1148 302 -1342 -511 906 382 -887 -360 694 392 -980
3934 -980 -179 836 -70 -1030 162 1248 -80 -1020 193 948 -33 -889 161 1004 -602 -1148 374
3951 374 1347 -277 -1108 179 1374 237 -1047 215 941 -584 -1038 640 1058 -413 -988 662 1053
3968 1053 -598 -1116 556 1113 -1030 -503 880 816 -977 -902 938 1471 -625 -1305 668 1329 -452
3985 -452 -816 926 736 -682 -603 1294 287 -1138 -364 1053 733 -809 -767 1235 830 -1217 -707 1475
4003 1475 746 -1002 -791 1244 669 -865 -1334 560 774 -782 -625 679 29 -1008 3 902 -304
4020 -304 -1353 -313 1438 470 -1189 -566 1087 25 -1183 -337 944 -215 -1078 -202 1119 290 -1322
4037 -1322 -379 880 -125 -833 26 468 -353 -1026 325 1271 -803 -1285 480 1407 -442 -1542 317
4054C17O45j293p11J652O50j836n29J932L88j922l49J786N95k011n12K058M5j765
4072h60lJ959L64k211l45J883N26k110r4J842J2j585j52J789m52j949N81K266
4090A461l44k482O23J726K15k003n6J730Q1j774M63J485m92j649K57K038n56j680
4108i57N11J442m01j653J044J549j359j793J234J755q45j729M13J786m78j069
4124e50K86J199r52j090J560P23j285j112J093J431j456j031J295Q44j359l03
4140g07J166L80j242q10J560O94j030j083J055R71j550j54J208L39j409k93J607
4157G02J88j931m0K014J60j797m97K021K01j818l08K134j54j793k29K126L8k129
4175a112jJ876J69j938Q1J979m89k178R81J722j12k474M75K329l98k062K52J952
$$ plain form
4054 317 962 -331 -1042 610 1260 -576 -1105 827 1215 -707 -1056 730 1325 -686 -1198 860 905 -860
4072 -860 -863 1096 1460 -751 -1096 787 1313 -797 -891 951 963 -622 -774 1015 563 -1386 -805 1461
4090 1461 1117 -1365 -742 984 1199 -804 -860 870 951 -823 -360 1125 633 -1016 -759 1279 723 -957
4108 -957 -446 996 595 -1058 -14 1535 176 -1617 -383 1372 527 -1202 -789 997 519 -550
4124 -550 -264 935 -17 -1107 453 1176 -109 -1221 -128 1303 -153 -1184 111 955 -404 -707
4140 -707 459 839 -403 -1213 347 1041 11 -1072 -17 954 -596 -750 458 797 -612 -905 702
4157 702 890 -1041 -1081 933 1093 -704 -1201 820 1021 -797 -1105 1029 875 -918 -1147 979 1017 -1112
4175 -1112 -1113 763 932 -1006 -925 1054 565 -1613 -632 1090 978 -1496 -1021 1308 910 -1152 -900 1052
4193A052j39j862O4J952o41j620Q28J247k90j723O19J497n62j389O91J286j251
4210b41r49J161J479j207j841J258J708q80j413M77J440m80j328Q21J114r97q79
4227g57P11J357j013j057P80J010q55j168J423O18j480m65J398P22j730l18J504
4244F80M28j501p48J549N48j373k36J344l07j074J55J236K89j502l52J829m66
4261D99r44k25J524o2j911O62J653l32j921k18K233j57j641Q7J390k44j205K69
4279e43J208n81j465J013J557m68j941O27J504k97j740N03J306k52j650R59J691
4296A431p53j832L32K021q61j671J095Q05p56p30O00J111o65j498R94J488q06
4313C05j327M65J552j065p42R15O17r45m18Q71P03j385p14J404P60j322n53P51
$$ plain form
4193 1052 913 -949 -885 1067 426 -1194 -366 881 591 -1132 -513 984 422 -967 -276 1010 -241
4210 -241 -1190 -29 1450 243 -1598 -340 1368 488 -925 -448 992 512 -816 5 1119 122 -757
4227 -757 -46 1311 298 -759 21 1031 176 -992 431 1049 -431 -896 502 1224 -506 -824 680
4244 680 1108 -393 -1141 408 956 -417 -653 691 384 -690 -535 701 990 -512 -864 965 499
4261 499 -445 -670 854 792 -1119 -457 1196 864 -1057 -1275 958 801 -840 -753 637 393 -812 -543
4279 -543 665 84 -1381 -368 1189 721 -1220 -593 911 614 -1126 -623 683 431 -1219 -260 1431
4296 1431 678 -1154 -822 1199 338 -1333 -238 567 -189 -919 -319 792 127 -1371 -377 1111 305
4313 305 -1022 -557 995 -70 -812 103 720 -225 -643 228 931 -454 -1168 236 996 -326 -879 -128
4331a28O72q40n41R90N75r32m95J185L76j150k65J103l7p75p7P38J40j409M75
4350c95J061n8j075kJ035or60q5J373l15j209P08P17k87j071K9J268n7j155K11
4370b73Q66l63q27L68R30l88q88O50J075j067j176J270N64l78j283P92R31p13
4388I0q05N64J068j166m99P21O02m73p75N69N40m02q03O76Q19p90r84J111P77
4407H40q95j019Q79R46m16r79O06M74m99l20O09J67r10k30Q29M79o94o00P29K36
4427B32n25o7Q97j40j214O2J219K88j199j8M00N22n94j20K06K83m56K1P07m70
4447C4m59P6P13j33m63L7N44j36n85L64K08q8o92K03Q53o8n97k01P37m6l79J6
4469f2K33l58k79O38N36n48n15L80M96k92l19LL35n0k83p5N93m10m38N81K09l37
$$ plain form
4331 -128 544 -296 -837 153 728 -204 -699 486 862 -288 -553 550 513 -262 -339 399 539 -870 -395
4350 -395 666 608 -467 -469 566 560 -400 -485 888 573 -636 72 789 502 -569 -540 728 671 -484 -273
4370 -273 593 230 -597 -229 701 313 -575 75 1150 83 -1093 177 741 363 -920 -128 803 90
4388 90 -715 -151 917 -249 -748 -27 575 102 -673 -104 436 34 -769 -93 726 -64 -1048 63 840
4407 840 -55 -1074 -195 751 335 -644 -38 436 -63 -383 226 393 -517 -747 82 561 -133 -733 -4 232
4427 232 -293 -360 537 397 -817 -755 464 752 -447 -465 -65 457 -137 -257 -51 232 -224 -203 504 34
4447 34 -425 -349 364 231 -232 -195 349 213 -372 -8 200 112 -580 -377 476 408 -189 -390 347 301 -78 -62
4469 -62 171 -187 -466 172 708 160 -355 25 521 229 -90 -87 248 198 -85 -160 433 23 -415 166 375 38
4491C8k45R0J85j72K36J25j17k48J21J45J57l65p3K16O8j8l4j10RJ39k30J46k03
4514a40j32K65M89m34p6l08J6K87J10k3j6r7j88N08L4m32r4L32JJ94m68J61n4
4537f5J10j44L81m8n81K10P8j19J62l01k40K55N46Lr2n43K72J69k73K31k75q4
4559c48JJ24J72j12J2J5N5j68J80o0O4j23Q2P3N29m97n80N66K79K7m84j27N19
4582A99J12m09J54J77k86j38J15L66j50k27j46M85N9j71j75L51j80m45M76J76
4602C43l33o12N00L54K75q46k17Q29K06o29k26P28N0p65J57N40N0n03j46O65j23
4623B97n01j11L05M05o85O1Q15k94o70L34N14p0q64M7M29M13n06n6O33k01n16
4644b21K67O49o37m53K85L27k9n78M43M06o40q1L76M61o98l20P07N10n53q73L24
$$ plain form
4491 38 -207 -117 68 -104 132 257 140 -108 13 158 315 -50 -123 93 161 143 109 -1 8 147 -83 63 -140
4514 -140 -272 -7 482 48 -28 -336 -320 -33 77 54 38 -59 -247 261 295 -137 -231 101 102 296 -172 -11 -65
4537 -65 45 -99 282 234 -347 -137 -59 -178 -16 -317 -557 -302 244 247 155 -388 -116 53 -220 11 -264 -348
4559 -348 -347 -223 -51 -163 -151 -136 -81 -249 -69 -129 -65 -188 -106 -33 496 -1 -581 -15 264 291 -193 -320 199
4582 199 311 -98 56 233 -53 -191 -76 290 140 -87 -233 252 311 140 -35 316 136 -309 167 343
4602 343 10 -602 -102 252 527 -319 -536 293 499 -130 -356 372 422 -343 -186 354 404 -99 -245 420 297
4623 297 -204 -315 -10 395 -290 -229 586 292 -378 -44 470 400 -464 -417 12 425 -81 -137 496 295 -221
4644 -221 46 695 58 -395 -110 217 188 -390 53 459 -181 -262 114 575 -123 -443 264 774 221 -652 -328
4665c28P14n97l2L84J21m22RL93J03r26J81M49J59l28J9O54j91j006L84N77j3
4686C04q78j7J147j69r22m6J117m56o63j98J294j12j183K04J495n49j031N1J164
4705E52j1j025J37J170m46j181L39J303j76j557M85J394m71j168J29J161k32q67
4723d64L35Q79p13q88N44J247n98j218O31J064m45j194P59O84l91j075P58R38
4741H53n44j197Q59R14r56j022J068P59p69n72O90Q00q81n82Q06O93j170n65R09
4760I3O33q48k51Q69jr71j73J204J58j178o1J116J73j271M8R43N7j195o6J369
4780F48n5j279M30Q75q4j228J95J139l63r36L3J306l98j501R70J193n59j469O13
4799d70J334j40j650M61J487p03j247N95J396j165p20O29J212r51j205Q70J283
$$ plain form
4665 -328 386 -211 -243 141 262 -160 -151 242 345 -581 -400 49 208 -120 -101 553 362 -644 -260 317 304
4686 304 -574 -591 556 387 -535 -581 536 80 -583 -781 513 401 -782 -578 917 368 -663 -612 552
4705 552 541 -484 -347 823 377 -804 -465 838 662 -895 -410 984 513 -655 -526 635 403 -464
4723 -464 -129 750 37 -851 -307 940 342 -876 -245 819 374 -820 -61 623 232 -843 -85 853
4741 853 309 -888 -29 885 -71 -1093 -25 734 -35 -607 83 883 2 -580 226 919 -251 -816 93
4760 93 726 -122 -373 496 495 -476 -649 555 713 -465 -526 590 763 -508 -460 483 540 -655 -721 648
4780 648 593 -686 -256 619 535 -693 -498 641 278 -658 -625 681 283 -1218 -248 945 386 -1083 -470
4799 -470 864 724 -926 -465 1022 319 -928 -333 1063 -102 -822 -193 1019 68 -1137 -267 1016
4816A016q77j138J166N60r17j035J178R59q15j198O48J673j057r84O45J003q17
4833A0n78P04P83j371o91J440N29j256n94J321N80j364l11J243O17j521o48J706
4851E99M55j541l72J119M47r27m56J024M26j236k1Q82J64j303J93J260j74r24
4869c85j83J013N5r46j92J355j28j387M38Q35j54j141K91J116k03j069N41P73
4887F29j84j010M34J124p37j269Q83J200j153q60O65J155p12r50O12J132r26j019
4905i86Q39J221j263p82Q82J185j037r86Q19Q51p76p63J156M80j212p49J189Q40
4923I08j199j002J567M63j072o15J352L07j118o37J303N48j081j046J745L17j237
4940d97J94O53M92j358k82J453k19j273J82J078L80j353m4R76J96j149k61J619
$$ plain form
4816 1016 139 -999 167 727 -190 -1225 -47 912 97 -1101 -453 1220 163 -821 -176 827 10
4833 10 -568 136 919 -452 -1143 297 826 -430 -1024 297 877 -487 -798 445 1062 -459 -1107 599
4851 599 1054 -487 -859 260 707 -220 -676 348 774 -462 -483 399 563 -740 -547 713 539 -385
4869 -385 -568 445 500 -446 -638 717 589 -798 -360 475 321 -820 -529 587 384 -685 -144 629
4887 629 445 -565 -131 993 256 -1013 -130 1070 -83 -943 -278 877 165 -785 -173 959 33 -986
4905 -986 -147 1074 -189 -971 -89 1096 59 -927 -108 743 -33 -796 360 840 -372 -1121 68 908
4923 908 -291 -1293 274 737 -335 -950 402 709 -409 -1046 257 805 -276 -1322 423 740 -497
4940 -497 -303 350 842 -516 -798 655 436 -837 -655 423 803 -550 -594 382 578 -571 -832 787
4958G87k27j514M55J091P7j400L38Q08M8j119L34J049r3j169J74J029n46o71K45
4977c04R96p33p48N51J126n29j088O46P53k68j303O58J016n45p19N22N89o13o88
4996f81M06R23q04o69J029L73q51p88J363O44j090n45P82Q41j071p60J281N77
5014I60j437j77Q69N96r62m91Q26O63j038k96Q94L70j169q5R49k4j060j01J336
5033F23K78r42p26J193K28j124%J026j24p86j54R84jp76n09J293k13o90l2J057
5053F05m49p68J70R02p2j142O35N32k21q53J28J172l05j033O2J333n24n97J00
5072c25R26j65r66M22P27p49m93N88N40m72r47Q33L81k74r49J072M32q27l10K59
5092b97R15o20m76P47N31q32p89O91R26q72o05M04N49k00n19P04J54r11R9M05
$$ plain form
4958 787 560 -954 -499 592 669 -731 -393 415 463 -656 -322 727 634 -535 -361 668 122 -549 -304
4977 -304 692 -41 -789 -238 888 359 -729 -83 670 402 -901 -243 773 228 -491 31 620 7 -681
4996 -681 -275 648 -156 -825 204 577 -274 -1062 301 945 -145 -690 92 933 -138 -898 383 960
5014 960 -477 -654 215 811 -151 -642 184 847 -191 -487 407 777 -392 -477 472 448 -612 -713 623
5033 623 901 -41 -767 426 654 -470 -470 556 432 -354 -508 476 475 -301 -810 483 270 -420 -452 605
5053 605 156 -612 -442 460 388 -754 -119 413 192 -661 -533 639 334 -699 -637 696 172 -425 -325
5072 -325 601 436 -530 -108 619 -130 -623 -35 505 33 -914 -81 300 26 -923 149 581 -246 -556 -297
5092 -297 618 -2 -478 269 800 -32 -821 -130 796 -76 -681 -277 272 72 -447 257 411 -500 -401 4
5112DN45o92q8M17K30m40n19Q65K9o70j4R75J4q59m74R79J72m89p25J075L0o03
5134b38M6N21L06j099k3R66L1r99J08Q64p4p95J88Q97m95l97P3O55m38m36K36
5155a03N01K1o58K82J53l2o85M57O92n53n46O70K32r1o64J51O17q3j147O65K75
5176A54N3n47J15R52q35l41M89M11m87k50N18K79n76j22j25O08k98m37K08M46
5196B15k92o22O03N62o23o26R51J91o05k57O14K27n75l66O84M1l51l39M30M15
5216B77n30m0L97K82p73K5K59O09j041p8N12N83p32k42M83J42l79j38O17j2j60
5237F1l50J69R7j95Q3lk80K14j64M77ql91K40K64K06l75r6L06N6n56M3K00L50
5260C48k51k90M18M9l86j13K87R8l14L03M2j74m47L06O92l92m88L85M6q7j81J51
$$ plain form
5112 4 549 -143 -231 186 416 -24 -543 322 351 -319 -333 642 656 -203 -677 302 474 -15 -740 335 365 -238
5134 -238 -192 329 635 -464 -487 479 510 -489 -381 483 409 -386 -198 699 204 -193 -120 535 97 -339 -103
5155 -103 398 419 -239 43 196 164 -521 -64 628 75 -471 199 431 340 -324 -173 444 361 -786 -121 154
5176 154 207 -340 -225 727 -108 -449 40 451 -36 -286 232 511 -65 -187 -312 296 -2 -439 -231 215
5196 215 -77 -699 -96 466 -157 -783 168 359 -246 -503 111 338 -237 -603 81 122 -229 -568 -138 277
5216 277 -253 -293 104 386 -387 -362 -103 506 -535 -613 -101 482 -250 -492 -9 133 -246 -384 233 221 61
5237 61 -289 -120 -23 -218 -135 -138 -418 -204 -368 109 101 -290 -50 214 420 45 -51 255 311 -245 -202 -2 348
5260 348 97 -193 225 274 -112 -225 62 160 -154 149 191 17 -430 -124 568 176 -312 73 119 32 -149 2
5282BJ27l85K49P6L52l60R0j80K84l3k69p8J72l43J52K04K05n27J58K74O9k35
5304Dj71K98j26n6j28R3M5p5j4L53J11n4l40l89M20J93j60n3n1rK33j93j44l3
5328b46K87j07o5K05j49N5O7K9J94k91j49k36K52L37l48J72Qm6O7K50j5k71Q8
5351H8K33l80K56j84l02J77J32j15j83L28j34k58O79o9l38J07J6L2J48j98O7k86
5373a84K44N2J9nk82K62J96kk28l89L23J67m25M25o0MoMj40l6p3L34j66%M5L5
5399A14O7r7L42k93p5l86J13M85j32l15J81K62O1l58j31M85l55m07Q61n26K52
5420A48n71M18K95j81m02K40L71l28k87Q0K85P3l32j99N36j01m61M77J31J22n28
5441b14L14k9j21m38M33M60k22m31j94Q78m73n27N16L36k50o28O08M31j81n26
$$ plain form
5282 2 129 -256 -7 69 421 61 151 -29 255 222 -47 -125 47 -296 -144 60 265 -262 -104 170 239 4
5304 4 -167 131 5 -51 -179 -86 -41 -116 -130 223 334 280 -60 -449 -29 164 4 -49 -100 -109 124 -69 -213 -246
5328 -246 41 -66 -131 74 -75 -20 47 76 270 -21 -170 -406 -154 183 -165 7 15 -31 36 286 271 0 88
5351 88 321 -59 197 13 -289 -112 20 -95 -278 50 -84 -342 337 268 -70 37 53 85 233 35 102 -184
5373 -184 60 112 131 126 -156 106 302 300 72 -317 6 173 -252 173 113 117 111 115 -25 -61 -134 200 34 34 79 114
5399 114 181 84 426 133 58 -328 -215 270 138 -177 4 266 327 -31 -162 323 -32 -439 422 -104 148
5420 148 -423 -5 290 109 -293 -53 318 -10 -297 -217 68 141 -191 -390 146 45 -416 61 192 314 -214
5441 -214 100 71 -50 -488 -55 405 183 -248 -442 436 -37 -564 -48 288 38 -590 18 449 268 -258
5461b58o0P67k74m16J42M61n09l80N97L27k09p51M82K90j45k51M5P2n6m6J14K95
5483B37o34n8N94L51n09n9K34K01l41j88K04Q7l98M53M85m16o20K26J70K48n33
5504b66K63L54j98l75J48N57l74q97Q97M63n60n44N36M02m78k29K32K93k30m75
5524d81O42P26n33q30O33J97j40n29L93M13o38l37N15O99r08l47M55J012q98o72
5544f28P97M14n10p73Q92M05q01l97N62M73m54p24R99K89o26l53M97L82n54m37
5564e47P20M65q13m07O05N82o57o91O47O81p97n9N46n1o85l7J031l21r01L29N97
5585B37M5o30l10Q03j67o38N65O97m54p74R4J215o44l61n7O12l35m88O75N79q69
5606b05j81M24L72o50j93L08P60m10o80O45J19l44p98Q94Q96r72m50N25P97p48
$$ plain form
5461 -258 -318 449 175 -241 -99 362 -147 -527 70 397 188 -563 -81 209 64 -187 -142 -70 -126 -172 -58 237
5483 237 -397 -455 139 490 -19 -78 156 357 16 -172 32 119 -279 174 659 243 -377 -151 19 267 -266
5504 -266 -3 351 153 -222 -74 483 109 -788 109 572 12 -532 4 406 -72 -301 -69 224 -6 -481
5524 -481 161 887 354 -476 157 354 214 -315 78 491 -147 -484 31 730 -178 -525 -70 942 44 -628
5544 -628 169 583 73 -700 192 597 -204 -601 -39 434 -20 -744 255 544 -82 -435 62 444 -110 -547
5564 -547 173 638 -175 -582 23 605 -52 -743 -96 585 -212 -271 275 224 -461 -498 533 212 -689 -360 237
5585 237 282 -348 -658 145 -22 -660 -95 602 148 -626 -532 683 39 -322 -379 233 -102 -590 85 664 -205
5606 -205 -386 38 410 -240 -433 -125 635 225 -455 190 309 -35 -833 61 957 -15 -465 60 857 109
5626A09m88O87J62n25m01P47N3l68o90J079M68j133m34R74M07p15n12Q87Q63j216
5646d6p29J227O56j471o33J353N44r65n75R74J46p98k1Q28J75q31m13R96L28q13
5666f8n97J217J87j227l1R05j5n92J2P85k66r11Q8R61k5p18J78M26L15j051K55
5687a72Q11m43p19L79Q86n24p92N65P81p35q17N29P81p01l63N60N37n72o86O39
5707e6P95p87n26P53L16o78m36P12O19j145l87J134K94j111l49R08N82r24m86
5726g72Q94O27j402l7P64P43j320k44J171K54j178j61J316J12j331N8Q38L34j146
5745d80o5J122J39j186J2J069m7j448L66J339k72j339N36J205n21p20j42J068
5763F36J00j254J36P66K9j143J55J202j12j193J37J449n33q31o2J229l04j090
$$ plain form
5626 109 -379 308 470 -55 -456 291 344 -24 -714 365 833 -300 -734 240 647 -68 -580 307 1170 -46
5646 -46 -775 452 1108 -363 -996 357 901 -64 -639 335 481 -317 -338 490 665 -166 -579 417 745 -68
5666 -68 -665 552 739 -488 -519 386 371 -221 -209 576 310 -601 -513 448 423 -295 -117 309 624 -427 -172
5687 -172 639 196 -523 -144 742 218 -574 -9 772 37 -780 -251 530 -171 -534 26 563 -9 -695 -56
5707 -56 739 -48 -574 179 495 -183 -619 93 712 -433 -820 314 608 -503 -852 56 638 -286 -772
5726 -772 122 749 -653 -690 74 817 -503 -747 424 678 -500 -661 655 767 -564 -506 332 666 -480
5745 -480 -545 577 716 -470 -458 611 564 -884 -518 821 549 -790 -254 951 430 -290 -432 636
5763 636 736 -518 -382 384 413 -730 -575 627 515 -678 -541 908 375 -456 -518 711 407 -683
5781f83O15Q53o99p48N84R43n82q91N55Q19o54o67M13Q23n70r18J039P62j274
5800b80m99J001L97p42m61Q80K21p45n18J239K25r77k10Q47J53p35l12P09L54
5819E47r09K21N90m61p34J33J122P5j445L32R60N1j118L5J102q4r67N1J066k88
5839B79q00l41J649Lj225j6R42k09q05M63N20j75j329J077Q49m74j118J68R43
5858D01k58r92O22Q02l81r12M87J045o67j019P42O35m91p91L74P51l54n64P59
5877A89M35q58q8M05O46p25r55R55O62n87o61N61M38m91k20N83P2o27k10O63L12
5898D99o37m93J100P5n69l97O64J02p39m9J100j22j317L20Q24j13n69l9P36j38
5918B38m60mQ17l14n51q0O08J51p46K02O62j69q25N1Q16k98p60N01R40o86q43
$$ plain form
5781 -683 -68 785 86 -662 -78 865 283 -608 -53 766 112 -555 -142 681 111 -807 232 994 -280
5800 -280 -779 222 619 -123 -584 296 517 -228 -746 493 718 -259 -469 378 531 -204 -516 193 547
5819 547 -362 -141 449 -12 -746 -613 509 584 -861 -529 431 482 -636 -601 501 417 -550 -499 567 279
5839 279 -521 -862 787 790 -435 -451 491 282 -523 -60 460 285 -1044 33 882 408 -710 -542 401
5858 401 143 -849 -227 575 194 -718 -231 814 147 -872 -130 505 14 -777 -403 348 -6 -570 189
5877 189 624 -234 -322 83 729 4 -951 4 666 79 -582 -21 417 -74 -294 289 361 -266 -476 187 499
5898 499 -138 -631 469 544 -25 -422 242 344 -395 -444 656 534 -783 -463 361 248 -321 -360 376 238
5918 238 -222 -226 591 277 -274 -354 254 405 -341 -139 523 354 -471 -420 396 98 -662 -161 779 93 -750
5939g50M54Q62n62m98L56O84m46q12O86N14n57n98L35P87j60p84L20L46Q4o22
5959c61M44J41n45j22N31M61r38k30O49M77n06n09M22L58m75k45M81L36o67j0
5979c08M22L12m04m27M07L79o85lL30j0j23n4M02J33n18k11M53K85k94n38M59
6000GK96o87J07K91L58q19l3R08l9p42P1K22M0m3J98N31n64n73M44L97j47l42
6022a19k47P11q7l77J09K61j49l08L30K63j65n09L12L05l68l27M78K11l86j61
6042b23L26j8j94j60K36N02k61o34K92L73k55k43J00K47j38p3L82m1k82k70N43
6063B09k0l57m4M76N8k58K5L1k52j17j13P80j89n56K48J76r6j34P5J41m7o1j1
6086c6J1J63n87R1O02p5j33r2j90M36m40J49L82l07k92J27J92L21k56k26P8K01
$$ plain form
5939 -750 -296 566 4 -494 -138 546 100 -712 -26 488 -69 -667 -332 455 295 -489 -169 177 261 -361
5959 -361 83 224 -321 -443 88 549 -389 -619 30 507 1 -508 -86 272 -203 -448 33 369 -298 -308
5979 -308 114 426 22 -405 2 381 -304 -307 23 13 -110 -164 238 371 -147 -358 95 380 86 -452 7
6000 7 303 -384 -277 14 372 -447 -480 428 389 -353 -282 -60 -20 -63 135 666 102 -471 -27 370 223 -119
6022 -119 -366 345 258 -119 -10 251 102 -206 124 387 222 -287 25 330 -38 -365 113 324 -62 -223
6042 -223 103 85 -109 -269 -33 469 208 -426 -134 239 -16 -259 -159 88 -50 -123 259 218 -64 -334 209
6063 209 189 -168 -212 264 322 64 89 120 -132 -249 -362 418 229 -327 -79 97 1 -133 -58 83 36 -25 -36
6086 -36 -25 138 -449 -358 244 169 36 -56 -246 190 -250 -101 281 -26 -318 -191 1 322 66 -160 -82 119
6108A19k23J61j44M3p2J1J12j2k26J10N2J80m03M03k61K56o0l2L01n49k7J51L35
6131B25r7j88p4O6K35j42J35j88p6j49K42J51k66P2j53M65j95k97N41l03J53K23
6153C80m1l61n6l5J21J55k54J53k60J92P9K44l11k53K58o2L45m00K19j18m32O45
6175B08k43Lo9Nj78K99j03K10o35K50L27o5r8L88n5n26M00J59j18k31K83j83K07
6198B35k28R7K0j7K44n15L40o49O2N07Q0k32K8K19m17J06J32J55l15j4M7M21j96
6221A10j17J2K96k91pj83J95m3k35K95l09K06k12K90o9O5J6l33M96m41J25L08
6243A74j12j95j74L23J94l92j48L36J44J22n71L11Q7l48QL17N5k09k97M15o0j08
6265a28n6K00j0k97L48K11j05l14PM96q1l57j52M51J5k11l04M19j83m12L52K56
$$ plain form
6108 119 -104 57 -87 -44 -116 -105 7 -5 -231 -121 -69 111 -292 111 -150 106 46 14 315 -234 -261 -110 225
6131 225 128 -60 -134 -68 167 25 160 -28 -104 -253 -11 140 -126 -54 -207 258 63 -234 307 4 157 380
6153 380 339 -22 -78 -113 8 163 -91 62 -198 -6 73 317 6 -247 11 -51 294 -106 113 -5 -437 208
6175 208 -35 -32 -101 -96 -274 25 -78 132 -503 -253 74 9 -89 299 244 -282 118 277 159 -72 211 28 235
6198 235 7 104 124 107 351 -164 176 -473 -411 96 176 -56 -28 191 -226 -120 12 167 -148 -162 -115 306 110
6221 110 -7 5 301 10 3 -180 15 -28 -263 32 -277 -71 -283 7 -62 3 19 -314 182 -259 -134 174
6243 174 62 -133 -307 16 210 -182 -330 6 150 272 -299 12 99 -249 -241 76 131 -78 -375 40 -20 -128
6265 -128 -184 16 6 -291 57 268 163 -151 -144 352 271 -86 -238 213 228 17 -287 132 -51 -463 -111 145
6287A45n6l04R4K42m7j62J67K99m5n02K07N67o88l84M51L89j18n23O7L03Nk57
6309a50J24J06k25n7M51O7k44j85K47R8m4k25K44J49l67k73J47N12p61j32Q63
6330C45J03j77m85L35n0k35k42Q45k74n57K07N73K1m49l60N54n2l23n4L30R5o14
6352d64L77K81J21n76k0M92p6p32M16M60j02n75J62P16j03o48J01P42j85q00K00
6373b13K85P5o5k59L68rp79J62O99l64l38P4Q04n3p15K21M42l26k53Q2M33k56
6395A5o28N58L11k67n09L80L93m1l01J83J18n18N6N57R3n91j85K93L92n34NP6
6417a44O24o21J78K34K11q19O7J83K64l93M4J73M41p69k31R64k94n59M8O87J42
6438D30q25K40J41P33p83k61P13k02m36l5P00k00o88J61P14j52l84j87M53J40
$$ plain form
6287 145 89 -215 -121 121 74 -88 79 378 333 -169 38 605 -83 -467 -16 373 255 -268 -201 102 107 -150
6309 -150 -26 80 -145 -202 249 316 72 -113 134 232 188 -37 207 356 -11 -284 -137 375 -386 -518 345
6330 345 448 271 -214 121 71 -164 -406 439 165 -392 -185 388 409 -40 -400 154 102 -221 -275 55 150 -464
6352 -464 -87 194 315 -261 -281 211 135 -597 -181 279 177 -398 -236 480 377 -271 -170 572 387 -413 -213
6373 -213 72 147 82 -177 191 182 -597 -435 264 -100 -438 -364 440 387 -328 -107 335 9 -244 -162 271 15
6395 15 -613 -55 256 -11 -520 -140 253 212 -89 94 212 -306 -250 307 400 -191 -376 -83 309 -225 -220 -144
6417 -144 480 -141 37 271 482 -337 -270 -87 177 -216 -172 1 442 -327 -558 406 112 -447 -399 288 430
6438 430 -395 -155 -14 719 -64 -325 388 186 -250 -285 415 215 -473 -312 402 250 -134 -321 132 272
6458B72q68K29Q57j68q21K01Q65j31p23j12P62M4o14k20P45K7m03k04Q10m02p63
6479f17P10L97l19l10Q6L49j81r49O49L54j52j82J87N87l89q68O44L03k06l19
6499b26J95K89j73L5p4M77q01n7L09N48o04n91P13L92o51l0N37K66p41k36L33
6520i0K80k34n06O38K29n20K1L40M9o70M26M87n2p57K38P43j82o72l5O77j63m02
6542a55j44P47J13j139K00J064l29n76J2Q62k52p74L09N11j5q08K15N32n6o73
6562c56K58N19k73k57qQ30m90n69L38O70n17q80O57O24j85q71L22J049m59p59
6582c57K35O50m15o91M41Q00n47q51Q29Q84j025p76R97M04o28K9O0N83o17o14
6602f09O93N14q11q4K21O76q41k92Q59m12l52J06N25J95p70m1O78l8n48R7M90
$$ plain form
6458 272 -596 -367 490 322 -499 -298 567 436 -287 -399 363 407 -207 -427 318 345 -58 -262 548 146 -617
6479 -617 93 490 171 -139 -53 296 115 -834 -185 169 17 -165 22 609 220 -648 -4 299 93 -226
6499 -226 -31 258 85 120 46 523 -278 -335 -26 522 -82 -673 40 432 -219 -249 288 554 -187 -423 -90
6520 -90 190 -44 -550 88 317 -203 -182 158 207 -463 -37 450 398 -359 -121 622 440 -232 -267 410 247 -155
6542 -155 -299 448 561 -578 -378 686 357 -219 -207 655 403 -371 -62 449 434 -374 -159 373 317 -356
6562 -356 -98 421 148 -109 -117 713 223 -346 -8 662 145 -735 -78 546 361 -510 -188 861 402 -357
6582 -357 -122 528 113 -578 -137 663 116 -735 94 978 -47 -823 174 578 -50 -21 39 622 5 -609
6602 -609 84 598 -213 -297 -76 600 -241 -533 326 -86 -438 -332 193 388 -382 -423 255 217 -331 -234 256
6623B56l56j57l8O27q0r21K40R01j2j025J04P64j24n87J49P05l85o43L66R35n82
6644A37q83P29M06m16k91K03O59n01m20N06M91o16m43M03Q24o89n61N63N08p10
6664a01k97N19N5l13o62J012M33n06q59Q54M84n38m79N76M39o69p39Q11P77j028
6684b31l69P30N21r15j16O97Jk08l13K81M03n79k87N88K8m14k95N79N44q94j68
6705d17P19J83j129N62L87j08m80J43N96n0p15L02R4M2m76K38N17m80n89M67N31
6726C37l23l47o5P15k36k71j55Q00l13n74L48K36N2o86L56L83k28m94K86L71l87
6747a95o83J084J25n90j51N31L94n64l95L58K43j92l26K30P91q11m37N60L55n85
6767b58j22L58N61n06k62L37J12o97K82M12Jr07K11Q20Q3m60k93O01kl53k69M05
$$ plain form
6623 256 -100 -257 -295 332 252 -669 -429 472 460 -565 -461 303 179 -408 -259 446 61 -582 -216 719 137
6644 137 -746 -17 389 -27 -318 -115 544 43 -377 129 620 4 -439 -36 788 99 -462 101 609 -101
6664 -101 -398 121 176 -137 -799 213 646 140 -719 135 619 81 -398 178 617 -52 -791 20 797 -231
6684 -231 -600 130 651 -264 -380 317 318 110 -203 78 481 -98 -385 203 231 -183 -478 101 645 -249 -417
6705 -417 302 485 -644 -82 305 197 -283 -140 456 406 -309 -7 87 129 -347 -109 408 -72 -661 -194 337
6726 337 14 -333 -398 317 81 -190 -345 455 142 -432 -84 152 204 -482 -126 257 29 -465 -179 192 -195
6747 -195 -878 206 331 -259 -410 121 515 -49 -444 -86 157 -35 -361 -131 660 -151 -588 -28 327 -258
6767 -258 -380 -22 539 33 -229 108 220 -477 -195 217 218 -689 -478 342 425 -35 -328 273 271 -82 -351 54
6789E4K73n58j38M88K0m99PN54P6n23Q3L50R7o00K16N89l88p25J37Q72j74m71
6811b60J35L92k19k73K22L84k55l39J86L37m8k89j57O96o13j05L19nk08p0P4L24
6833B28o1o20K57K93j80o0J07K83o2o20N07K36j32m60J96M96l30m26L89K81m02
6854h0r8K46J36k69j20J35J83k60R4p3M72k80l4J50j46l66K43K22l9m90K08O05
6876D39m5m60l70M81K07l18l24K84j04J34K2J57J38l54jJ41j0k55O9L70j12n7
6898C2j27K58j04l9R3l07j43J36L71j99r1J24QN8R0o4n5L32o30K83j17K19j74
6921d6l0j6j29J14L1J90J58m15K2L9L60k4k86p0K58n3k70K15J27o9j9J22k45m3
6945g9J41j68k1K70k32O5K62j73j41j55O00j54J6l81J32L77k17j27l1q3L60Pj69
$$ plain form
6789 54 327 -231 -369 119 139 -360 -353 201 277 -246 -163 187 284 -316 -100 489 101 -624 -487 385 211 -260
6811 -260 -125 267 48 -225 -3 381 126 -213 -27 310 262 -27 -184 512 -101 -206 113 108 -100 -170 -96 228
6833 228 167 -453 -196 97 -83 -143 -36 247 185 -435 72 308 176 -284 -88 408 78 -348 41 322 -80
6854 -80 -178 68 204 -65 -185 -50 133 -127 -33 -106 366 86 52 202 56 -310 -67 155 116 -374 -166 439
6876 439 394 -66 -436 45 252 -66 -390 -106 -210 -76 -54 103 241 -113 -114 27 17 -238 -169 201 89 32
6898 32 -95 163 59 20 113 -194 -337 -201 170 -29 -120 4 12 70 160 96 41 373 -257 26 -91 128 -46
6921 -46 -76 -92 -221 -107 -76 114 272 -143 -121 -82 278 254 -32 -102 156 103 -167 48 175 106 87 209 -36 -79
6945 -79 62 -106 -127 143 -89 -24 238 65 -76 -231 369 215 231 -150 -18 359 142 15 -16 -99 261 268 99
6968I9k00J78j8j17J45P4l10l2N30m43l2L4J07K01qj36k28K34j02j9J16k65K39
6991D7k71J78J76j87j57J88j04J61Nl36M27q5k68K80o6k73J05j52J11L6M7N5%
7014h3j01N05M3l16j26j52j52M18j26j80L86R5m63M7K67r2J25p1j22L60m47J49
7036c6K07q5l0P0J6l31O7K57k20k2L12j35J9m1j65M74l93J20K29j80j7l23J12
7059i5K94j80j73o3J76N7q4Q0K26R1k22k29L58J13p29L71K98k97qJ96j52P8j30
7082b4n3K58k26j12q9K46J11m23J50M70k94k2M33j08k07l54nN73m05l95K84N33
7104C41n01J05J55R8k44m23O35J59k00m05J75J63n14M81rP3K1n45L68N22o60j97
7126d02L45L05k94o7J41j2K4j96K85K54m68j15M33k32k36R2M43l10J17l33L78
$$ plain form
6968 99 -101 77 59 -58 87 161 -149 -181 349 -94 -126 -92 15 216 208 72 -156 78 -24 -43 73 -192 47
6991 47 -224 -46 130 -57 -214 -26 -130 31 36 -300 127 42 -226 54 -12 -285 -180 -332 -221 -185 -138 -83 -83
7014 -83 -184 321 364 48 -78 -230 -382 36 -90 -270 116 211 -252 -205 62 -30 95 24 -98 262 -185 -36
7036 -36 171 86 56 126 142 -189 -122 135 -85 -107 205 70 89 48 -117 357 -36 84 313 133 116 -207 -95
7059 -95 199 19 -154 -217 -41 16 -68 12 238 329 107 -122 236 349 -380 -9 289 -8 -16 180 28 106 -24
7082 -24 -77 181 -45 -157 -246 0 111 -312 -162 308 14 -8 425 317 110 -244 -249 324 -81 -476 -192 341
7104 341 -160 -55 100 198 -46 -469 166 325 125 -280 -105 58 -456 25 16 89 110 -435 -67 455 -205 -402
7126 -402 -57 248 -46 -113 28 16 40 -156 129 383 -85 -200 233 1 -235 -143 300 -10 107 -226 152
7147A52j78k60N00N2j04n51L26N35m25k03j39M67k73J91L34l99k5k86L21L26k76
7168H5o15M19R9K06m03N2K11j4k86K07N91o20k77L06K81l65q8L08J28k91j81N51
7190C04J48o07l06P34Q3l85k12J62L97l44q8K17K66p20K6L10J55l84k22Q11P9
7211D24k94k50J92j36j87J9L95j93k32J78N92l34l96j65N35J89q58M97Q0L93o62
7232b13Q6K35R0m29P2N26k47k00L30O7m73J15p7L73Op71J96O76m34Q5k75O64m30
7255b8l65M74J43l31m73N49M00o91K39j23M01l43n1K79K86n57r8L65L6m5m62K97
7277i8L33l40n24N50P05o55l8K68k36j67m75P50J40m85ML85K02m23l14P23J37
7298D42o42k50M69M53o46k09N52p4l06k16P87k58k53j65Q68o57l82M82K34J28
$$ plain form
7147 152 -26 -286 214 266 162 -389 -63 472 47 -156 -295 172 -101 90 424 25 0 -286 35 361 85
7168 85 -530 -111 -12 194 -209 -157 54 40 -246 -39 552 -68 -345 -39 242 -123 -211 97 225 -66 -247 304
7190 304 452 -155 -461 273 356 -29 -241 -79 318 -26 -114 103 369 -351 -325 -15 140 -244 -466 345 424
7211 424 130 -120 72 -64 -251 -232 163 -30 -262 -84 508 174 -222 -387 148 337 -521 -24 56 449 -213
7232 -213 -127 108 198 -231 -159 367 120 -80 250 317 -156 -41 -118 255 261 -510 -314 362 -72 13 -262 402 -28
7255 -28 -393 81 224 -107 -580 -31 369 -322 -83 -206 195 -148 -199 80 366 -191 -289 76 112 67 -395 -98
7277 -98 235 -105 -629 -79 626 -29 -67 201 -35 -202 -677 73 213 -272 -268 117 319 -104 -418 305 442
7298 442 -200 -450 19 472 -174 -383 169 95 -211 -427 360 102 -151 -316 552 -105 -487 -5 229 357
7318C57n08J09L44j29m49K52L06J44n78K4K67O0n67J34M20J79n39J43N02l74n10
7339d13L14L71k97m53O20R3J3m23L5L81l31M8l1M69l48j82K10L27m62j06P7J96
7361A08J45l35L55j11k89j20N68o7l70j50L03M44p44j38O06o2k65L2K91M6n55
7382c08rM71Q7l05k99M55l7k13j98O02l3n47K57L63P7q62K18J33L85l91k90O80
7404B36j59j93j8P6j06k73K5M47L93r31K59M57O4n28KM62j43l47K63M56l18m48
7426c24J95O25l39k7l23L32Q5n33N33j13J17r10N72O19o65j43L41K68k40l85M43
7447A28K23o17j25M98L80n74l63J30N48k21k94K12L43j53n29L73K42k91r9L71
7467A82l14l3J15L27j4m74o9K04N59p35J16J01J59j33l20M98K31m14k46J44L22
$$ plain form
7318 357 -151 -42 302 173 -276 -24 282 426 -152 -128 139 199 -368 -234 186 365 -174 -31 471 97 -413
7339 -413 -99 272 -25 -478 142 235 248 -175 -140 241 -90 -42 -73 396 48 -134 76 403 -59 -165 -88 108
7361 108 253 -82 273 162 -127 -247 321 254 -116 -266 37 481 -263 -401 205 143 -122 -90 201 247 -308
7382 -308 -317 154 241 -64 -363 92 55 -158 -356 246 213 -334 -77 286 363 -499 -281 -148 237 -154 -444 236
7404 236 77 -116 -134 -58 -164 -437 -412 35 428 -503 -244 213 277 -251 -249 213 70 -277 -14 442 124 -324
7426 -324 -129 496 157 130 -193 139 224 -309 224 111 228 -682 -110 509 -156 -299 42 310 70 -315 128
7447 128 351 -266 -391 107 487 -87 -450 -320 228 7 -287 -75 268 115 -414 -41 201 -90 -189 182
7467 182 -132 -165 -50 277 263 -211 -280 -76 483 -252 -136 -35 124 -9 -329 169 400 -14 -260 -116 206
7488B06j99r7K23j17k12j8M77K32o47m25J011J92p25k43P25j83k79k68O07rl62
7509a11j4M17o7m31j03L15l0j68J49J69j54m50L56N08m7o22kM73q3l99M19M74
7531E99o89m69L19N87m09j66K38J8K21m53L26N9k40k51J81O69o87j39K98L60o37
7552b65Q3K07J13j24PK22k78k53n1K59N04j36o57M37L49m08n5m8L31o2l76K93
7574I2K52n17J5L57J97o01lK39K42k35J59R6k15m02O7O12j04n77j61O86K17m29
7596a3o2J81P5l80J14M85m62k31Q7M49K1m79J71J31J14k31j28M52l54l19K66K12
7618I9rm63K96P2J7k77L30k5J61l18K98L5k11m40J7N39J24l50J2N03l81qn4K60
7642B27l46k76K10M27l86N8R7J93p6l0m6k01q3J15J01j37l8K02j38K24l13k38
$$ plain form
7488 206 7 -90 133 16 -196 -214 263 495 -152 -577 434 626 -99 -342 383 200 -79 -347 260 251 -111
7509 -111 -125 292 225 -206 -309 6 -24 -192 -43 126 -28 -478 -122 386 339 -283 -285 188 105 -294 125 599
7531 599 -90 -559 -240 347 -62 -228 10 28 249 -204 122 181 -59 -310 -129 540 -147 -286 12 372 -265
7552 -265 -182 25 138 14 21 243 -35 -288 -339 -80 424 288 -369 68 417 9 -46 -94 237 175 -201 92
7574 92 344 -173 -158 199 396 -205 -208 31 273 38 197 293 78 -324 -257 355 251 -326 -487 199 416 -13
7596 -13 -75 106 181 -199 -85 400 -62 -293 -206 243 264 -215 -44 87 201 -30 -158 294 -60 -379 -113 99
7618 99 90 -373 -77 -5 12 -265 65 40 201 -117 181 216 5 -435 -418 121 245 -105 -93 410 29 21 -33 227
7642 227 -119 -395 -185 242 -144 -86 11 204 128 98 52 -149 -232 -117 -16 -153 -191 11 -127 97 -216 -454
7664d54M61L95m89J74m4P7m58K47L09l59j9q4L46j52P7k68K35p5j47K35J14K36
7686C57n07q5N40l45M2j7M2K82m33O2J34n4Q6m7L88o16k5pJ49OJ07P3j25n4K81
7711B34j97J40Km2l1L0K61l19l66M02L3r2O5M8n12J87K08k9j6j82J62no1J49J95
7736B64k75L0k8pK05n30PN34q7k56J62r9J01K42k34j23R6j12m1L13j60O2k53M07
7760B18l33NL22K07m72j17J33j77J93k28Q0K18qM8m86L12j50K08J05j55k40L02
7782a5k48K64K89m34qL28j50Q8j72j26P5K00n4Q1k11j37M6K42Q1n79Q5K55p5O7
7806a08K61j41j65L2j26J64L03p9j25l11L60N9J31j29Q2j02K24n02Q0l4Pk1J45
7829EM1j51j49K72J19qk05j47Q0L42j62K71m33Q1j40J44K76L79p93K4K76j53K30
$$ plain form
7664 -454 7 402 -87 87 43 120 -338 -91 218 -141 -160 -244 102 -50 27 -241 -6 -81 -228 7 121 357
7686 357 -150 -235 305 -40 2 -15 27 309 -124 -62 72 18 104 57 445 -171 -196 -203 -54 -48 59 132 7 -47 234
7711 234 37 177 179 137 106 136 397 78 -288 114 147 55 120 168 -344 -157 51 22 6 -176 -14 -19 -80 69 264
7736 264 -11 19 -9 -16 189 -341 -334 200 113 -143 19 -80 21 263 29 -94 2 -110 -151 162 2 64 -189 218
7760 218 -115 -110 212 419 -53 -170 -37 -214 -21 -249 -169 49 41 89 -397 -85 -235 -27 78 -77 -317 -15
7782 -15 -263 1 290 -144 -152 176 26 114 -58 -184 -109 91 37 118 -93 -230 -184 58 139 -440 -355 -100 -175 -108
7806 -108 153 12 -153 -121 -247 -83 220 141 16 -295 65 124 255 126 208 106 330 -172 -92 -126 -119 -140 5
7829 5 46 -105 -254 18 137 129 -76 -223 -143 199 37 308 -125 -44 -184 -40 236 615 -178 -154 122 -31 199
7852A99j66L20m17RnJ72M8l87K40N1k41K02p0J77r5K18j33o4p9K2J18j60k48M6
7876b43J61O7J20k32K92L6j85J62j15k68K21K36q9j56k28K90p5j08k61K81O0j6
7898e0j53P6L46k4l25j06M8K41j71j84L27k95m8M25K34l74l86K65M88k40j77K86
7920B03l26k0k6R1M58m11l11L05L67o32M3J14M01k69l11L98l31N0J83R3J52m51
7942b30J11L68j1k98k01L98Jm21P6J24L45l51l01Q60k2k90o56M02J55k89K44O6
7964H0l7M5j83K11o7l02j43L98L13k16P4O5j89Q8R1j95n1j72L25K43m13k8K22
7987A59p8j15j32Q5K13m78P3M87Q8m78K3P9L18l1k62P5K5k18K09o6J49o06K44
8010b37L30L48l70k03M5K50m63J53K61l04N7J07K63j6n33j06O25j43k13J20J37
$$ plain form
7852 199 33 353 -64 -55 -60 112 160 -227 13 64 -177 25 -45 132 37 255 122 58 -21 1 119 -41 -289 -243
7876 -243 -82 -15 105 -127 165 201 16 178 63 -205 16 252 163 7 -221 69 -6 -114 -375 -94 -34 -50
7898 -50 -203 -127 219 195 -130 -236 -188 53 -118 -302 25 -270 -318 107 341 -33 -419 -154 334 94 -83 203
7920 203 -123 -143 -169 -78 380 -31 -342 -37 330 -302 -259 -145 256 -13 -324 74 -257 -207 -24 69 221 -230
7942 -230 -119 249 238 -60 -261 137 138 -283 -207 -83 262 -89 -390 470 448 158 -498 -96 59 -230 14 80
7964 80 43 88 -95 116 49 -253 -396 2 315 99 173 238 49 137 228 33 -18 -190 135 378 -35 -63 159
7987 159 81 -34 -166 -81 132 -346 -273 214 302 -176 -153 -74 244 213 -49 26 51 -167 42 -24 125 -481 -237
8010 -237 93 441 71 -132 -87 163 -300 -147 114 -190 -133 -26 237 221 -312 -418 207 64 -149 -29 108
8031A08K2m92O3N55j16l15l1L74L30k54p05O44j72m36K54L27o6p34O54M3J46o38
8053d39L01L4L88l23N4qLr6k6N38m74l37N04R7l02Ql9L96j06n44N54J25p82K22
8077b52M19O6m55R9J51L56p01L26J27J42l19k13K30L40k49l16M58R3k55k64M49
8098B32k66l15J18L28J32n43L04K84k8o12l2N06ok39n4J96J27m53O1N39l72k93
8120c86L8N55J4m22K7M48l75O0l05O97l85n76J10Q10k46n89K34P16k43m50M67
8141A99K30j72m14j58L88Mj95k4K60l10J27lL35m38r9J19K96q0q8J72K24n55j31
8164c13M64j7l8m80M45j74N2j87M89o9l47k15M70J18k3k60K57j89l6l6K48P5l57
8187a23j6nN4k68
$$ plain form
8031 108 130 -362 -299 256 140 -175 -206 168 498 244 -461 183 11 -425 -171 156 90 -644 10 53 199 -439
8053 -439 -138 -104 284 -39 15 7 10 -86 -112 426 -48 -385 119 216 -86 -78 -117 279 173 -371 183 308 -474 -252
8077 -252 167 233 -222 -123 28 384 -317 9 136 278 -41 -254 -24 316 67 -249 209 302 47 -217 232
8098 232 -34 -349 -231 97 229 -314 -10 274 246 -366 -398 108 102 -137 -191 5 132 -321 -260 279 -93 -386
8120 -386 -348 207 221 -201 -174 274 -101 -41 -346 351 -34 -610 -500 310 64 -525 -291 425 182 -268 199
8141 199 429 257 -157 -315 73 77 -118 -142 118 -192 -65 -68 267 -171 -270 -151 145 65 -23 149 373 -182 -313
8164 -313 151 134 96 -384 61 -113 -61 -248 241 172 -175 -390 80 198 175 -85 172 -17 -53 -89 159 234 -123
8187 -123 -139 -144 -90 -358
8191c58
$$ Imaginary data points
##PAGE= N=2
##DATA TABLE= (X++(I..I)), XYDATA
0@%%%qJ6qQj9K7l2M0n6P2q5J01j21J45j75K07k42K83l30L82m42N11n86O68p61
28d05Q66r78J098j235J388j552J732j932K149k389K651k939L258l607L993m420
44b322M897n433O033o715P502q408R470j0745J2300j4247J6770k0186K5097l2804
58a8791M6726p9711K93470K77516n78704j42992K88494J69151k36775o3034J69812
69A25162M1404j67168L3678J49637o6638j93002R0964J99688p7653k21545N0425
80c5048J51971q2014j19583J73295J55300k21701k53518J73468K78039j13272
90A06937k73703N9440K29120k5057j69058K3248Q9621q1093o3836J51723Q5465
101A32807j91669j35624J83655J65813j52013j72529J05263J35346q2454p3134
$$ plain form
0 0 0 0 0 -8 8 0 8 -11 16 -16 24 -32 40 -45 56 -65 80 -95 112 -130 153 -177 205 -237 274 -312 356 -405
28 -405 461 -517 581 -654 734 -818 914 -1018 1131 -1258 1393 -1546 1712 -1895 2098 -2322
44 -2322 2575 -2858 3175 -3540 3962 -4446 5024 -5721 6579 -7668 9102 -11084 14013 -18791
58 -18791 27935 -51776 241694 519210 -59494 -202486 86008 255159 18384 -44650 125162
69 125162 166566 -602 33076 182713 116075 -76927 14037 213725 136072 -85473 -35048
80 -35048 116923 34909 -84674 88621 243921 22220 -231298 -57830 220209 106937
90 106937 -166766 -107326 121794 96737 -72321 -49073 40548 -40545 -104381 47342 132807
101 132807 -58862 -194486 -10831 154982 2969 -169560 -64297 71049 -11405 -84539
111h4539J19047N5695j59369q3017J57872J04708j24444r3612R0197M4041r0806
122f4227J1791J36438j8397j57271K5597J69065n5560k22834L8106K71617L5355
133A69680k41438p2977J79121M8179j52698j0296J67074Q196j68214j5485J41322
144E2464q136j29590M5187J50396m6735j49991M7383J30243p6848j33284J12545
155f366J73979j03600k00473O8916J88622m9531j55923P0004J51371q4596j58131
166a05728Q3592J56792q2567j47002Q9431J44202r0941j38692R4373J34097j00228
177C7329j35745J02237J40108r8749j47010Q2754J40595o7960j25438N4617R7971
188H0709n3627o6388O4780L0851j06285l0051J39123N1305j50309q0830J30809
$$ plain form
111 -84539 34508 90203 -69166 -152183 5689 110397 -14047 -107659 -17462 26579 -64227
122 -64227 -52436 84002 65605 -91666 -66069 102996 47436 -175398 -137292 134325 169680
133 169680 -71758 -144735 34386 82565 -70133 -80429 86645 94841 -73373 -88858 52464
144 52464 44328 -85262 -40075 110321 63586 -86405 -39022 91221 14373 -118911 -6366
155 -6366 167613 64013 -136460 -67544 121078 71547 -84376 -14372 136999 52403 -105728
166 -105728 -22136 134656 52089 -94913 -5482 138720 47779 -90913 3460 137557 37329
177 37329 -98416 3821 143929 45180 -101830 -19076 121519 53559 -71879 -17262 80709
188 80709 27082 -39306 25474 56325 -49960 -80011 59112 110417 -39892 -120722 10087
199A0087Q2736j14181p2835J07678N9085j13976n6151J16129M7969j28938n8713
210a21110J33056Q3248j02018q6305N3139M4198l5719J2813O1935m1925j04058
221a02746L5149J29561j1921j29828k325J25498J8261j02160j9372O7152j4606
232g337n6382O1703R1078p0466j21937N0018J29644k5400j13940J4179Q7963k1441
244A7682o4342N0104O2667q2499q6356J00253J26751q0833j54543L1956J37651
255E8491N491q7439m766M0561k5910j6436O6326J9947j01809m7822J11787P7887
267I6308r4597q7509P2507P2154o6119m9758Q2521M0161j09086n5075J23701Q4868
279A10076j10728j06032Q0082J07478m5436q8143J9911M9659j7730q655M8488
$$ plain form
199 10087 92823 -21358 -94193 13485 72570 -41406 -97557 18572 66541 -62397 -121110
210 -121110 11946 95194 -6824 -93129 -39990 4208 -31511 -18698 43237 1312 -102746
221 -102746 -67597 61964 50043 -79785 -82110 43388 61649 -40511 -59883 7269 -7337
232 -7337 -63719 -2016 89062 18596 -103341 -53323 76321 50921 -63019 -48840 39123 17682
244 17682 -46660 3444 66111 -16388 -102744 -2491 124260 43427 -111116 -79160 58491
255 58491 63982 -23457 -28223 12338 -13572 -30008 36318 56265 -45544 -93366 18421 96308
267 96308 1711 -85798 -13291 58863 -7256 -57014 25507 65668 -43418 -98493 25208 110076
279 110076 -652 -106684 -26602 80876 35440 -52703 -32792 16867 -863 -9518 38970
290C8970n440q3600j0430R7764L2292q8975m2378P1370L6461n4576j5833N2664
302B8289n622o8912J3482R0670p71j01953k5040Q9919M2252o1164l3984M0299
314G465J0886l6891R191M2612k5160n7795L0459P7441j4823q1516o628O5087J2983
327C3311m4994m685L3235q360k9563K0477L4581k6504m0389K5350M0494k3503
339I450l3706K6789K5726l5636k1676N0719K8819o1850m7346N6242O2871l7840
351B2562o2856K2114N1375j4718l8639J5833K7410k2876k1765K9027K0515l2249
363d267k0157L2161J7143l0391j1075L1721L161m2464m792N2382J5953n1129k5197
376c6951M2743K6109l4459k2813K6048J1664k5609J374L5289m036m6076m193M8284
$$ plain form
290 38970 33530 -50070 -60500 37264 69556 -19419 -61797 9573 46034 -8542 -24375 28289
302 28289 22667 -46245 -32763 57907 57136 -44817 -69857 20062 62314 1150 -32834 7465
314 7465 18351 -18540 -9349 33263 8103 -49692 -19233 58208 43385 -38131 -44759 20328 33311
327 33311 -11683 -16368 16867 8507 -21056 -579 34002 7498 -32891 -7541 32953 9450
339 9450 -24256 2533 28259 -7377 -29053 21666 50485 -11365 -58711 -2469 60402 22562
351 22562 -40294 -18180 33195 18477 -20162 -4329 23081 205 -21560 7467 27982 -4267
363 -4267 -24424 7737 24880 -5511 -16586 15135 18296 -24168 -28960 23422 39375 -11754 -36951
376 -36951 5792 31901 -2558 -25371 677 12341 -13268 -11894 23395 19359 -26717 -30910 17374
389A7374J5070m2225k1872K8334J9298j7665p851J7644j387k6719K127L4393O176
402B2697l4002j7099J9868J9300L73m672j0270j8424L606L6668J5782l9821l9761
415d5755K5750N2961m37m7459j8209K7353K1100p287q490J09p692o193J4714J8032
429A8497p404k2694p465J3678J6215O758r544k1218j1307K0142L3364j950m2594
442a5522k5362L0945M4604k481m1012k3765J6975L2986J0760k1304k9779k674
454b5629K8977K3603j1263k8515q698J8350J7683k923j3517o538L48K076P514
467A468J0555j408j8540j4715J2169K9107Q376l0673l2352J3328M5677J3687l9154
480b475l6712J5651M3156J2671k8064k9428M363K7476J5806j3231k3994o063J8319
$$ plain form
389 17374 32444 -9781 -31653 -3319 15979 -1686 -9537 8107 6720 -19999 -17872 16521 22697
402 22697 -11305 -28404 -8536 10764 11137 6465 -3805 -22229 -18623 18045 33827 -5994 -45755
415 -45755 -20005 32956 32519 -14940 -33149 -5796 15304 8017 -473 -364 -8056 -14249 465 18497
429 18497 11093 -11601 -19066 -5388 10827 17585 8041 -13177 -24484 -4342 29022 27072 -15522
442 -15522 -40884 -9939 34665 32184 -8828 -32593 -15618 17368 28128 6824 -22955 -25629
454 -25629 3348 26951 15688 -12827 -21525 -3175 14508 11585 -1932 -8470 -8122 -6046 1468
467 1468 12023 10615 -7925 -22640 -10471 18636 27012 -3661 -36013 -22685 22992 36679 -2475
480 -2475 -39187 -23536 19620 32291 4227 -25201 -20838 6638 22444 9213 -14781 -20844 -2525
493b525J7751m861j3722q5P608m916n831J2651R777j8591k1757J6152L5053J246
507B7950l3176j8008J8787K3559j714j7996j3479P68J6793K1310l544l1189j4080
520b4019K7932K4754j8988k9820P336K4174o95j4025L752R129r656j2733R555
533c304J4696p695j3909M071P884l270O21R557q702k4454N705L6965M257m0862
547a8440j7136L5741K5906k4644k7382J2517J9301q668r805J1554M727j5835k012
560a4176K0819J429k2638p73K2266l847k5531R124L4121p103l9404J272M2930
573A8489Q470m0431j6602L0105J6583j8402o742J5168n479j9164J5825L0516j5396
586A2940l8886Q710L8685n336l4958M287L0663o564k6644J5676L2996j8932m3956
$$ plain form
493 -2525 15226 10365 -3357 -3442 4166 -750 -6581 6070 15847 -2744 -24501 -8349 26704 27950
507 27950 -5226 -23234 -4447 19112 17398 -598 -14077 -13309 3484 24794 21250 -9939 -24019
520 -24019 3913 28667 9679 -20141 -12805 11369 10674 -3351 401 9530 -126 -12859 -3304
533 -3304 11392 3697 -10212 -6141 1743 -1527 -906 8651 -51 -24505 -18800 18165 22422 -18440
547 -18440 -35576 165 26071 1427 -25955 -13438 5863 -2805 -12610 -1056 3671 -12164 -14176
560 -14176 6643 8072 -14566 -15339 6927 3080 -22451 -13327 20794 13691 -25713 -24441 18489
573 18489 26959 -13472 -30074 31 16614 -1788 -8530 6638 1159 -18005 -2180 28336 12940
586 12940 -25946 -17236 21449 16113 -18845 -14558 16105 9541 -17103 -1427 31569 12637 -31319
599c1319R921M5870L20l9702o036K6555M224j0404J0957O635k9607j5281L8686
612A0819K7621m0261l9412L1919M7409j6968m0317R411K8289j3947k0047K2924
624G440K1338l0334k6333L0127L1578k2996k8968J5449J8602j3151l212K2908
636B2448o835m2474J457N8228J5047o1587l4251N0396M2631l1347l6109J8339
648d057J9554j8547n792K3929p247l9838O009N1859P132m7872j3689L7406O740
661A5587l7254j167L7286p227m4193J2808N7116p242o5765n075O2973J6294n0898
674a6757j9947L1911Q291k2558J1980L0404k1623m0380K2780N0064j9645n5803
686d1283J1568N5257m013m2869J0011L6209k2495l8796L1194N0657k7657n7368
$$ plain form
599 -31319 -21398 24472 24792 -14910 -20946 5609 9833 -571 10386 17021 -12586 -27867 10819
612 10819 38440 -1821 -41233 -9314 38095 21127 -19190 -9779 18510 4563 -15484 7440
624 7440 28778 -1556 -27889 2238 33816 10820 -18148 -2699 15903 2752 -460 22448
636 22448 15613 -26861 -25404 32824 47871 -13716 -47967 2429 45060 13713 -22396 -4057
648 -4057 15497 -3050 -8842 15087 7840 -31998 -25989 25870 33002 -14870 -28559 8847 15587
661 15587 -21667 -22834 14452 7225 -36968 -24160 32956 25714 -40051 -45126 17847 34141 -16757
674 -16757 -36704 -4793 3498 -19060 -7080 23324 1701 -38679 -15899 34165 14520 -41283
686 -41283 -29715 25542 21529 -21340 -11329 24880 2385 -36411 -5217 45440 17783 -39585
698c9585J8206N4916q228m4650P002L4131j1745k5256K1540K1290l4064k5626
710c2069M4993L8246m3216m7359L1269M1978k5466l3073K8030K8390k9767k4550
722b2594L3200K1369m1124k6752M1675L2400l4795k9076K8622J8005l1699p601
734a8370M2958P724n2086j3792N1652J5360m9815j5683N0718J9034m5384j6302
746b3986M0372P823m4505l138N1468O444n2145p663M7261K287m6805M862N1711
759C3986n781n4857M965N3824q690n8282Q258O2587l035n9056N07N1422p102n0892
773c2146J3328N4249j5833n7906J3966N5899j4421n4132J5321N2050j5958m7115
785c2698J9651M1500l0523m6915L7397N9382l1786o4525K0087N8383j6270m7657
$$ plain form
698 -39585 -21379 33537 25309 -19341 -12339 21792 10047 -15209 6331 27621 -6443 -32069
710 -32069 12924 51170 7954 -39405 -8136 33842 8376 -24697 3333 31723 1956 -22594
722 -22594 10606 31975 -9149 -35901 5774 38174 3379 -25697 2925 20930 -10769 -18370
734 -18370 24588 32312 -19774 -33566 18086 33446 -16369 -32052 18666 37700 -7684 -23986
746 -23986 16386 24209 -20296 -23434 28034 34478 -17667 -25330 21931 24218 -22587 -17725 33986
759 33986 28205 -26652 -21687 32137 23447 -34835 -26577 36010 32975 -26081 -25574 25848 18746 -32146
773 -32146 -18818 35431 19598 -38308 -24342 31557 17136 -36996 -21675 30375 14417 -32698
785 -32698 -13047 28453 -2070 -48985 -11588 47794 16008 -48517 -28430 29953 13683 -33974
797c3974K0754M3988k4252m0910K6228L4709l2639l3226M0499M1981l5995m2584
809c5421K8368L2739l1450k4443M2926K8942m8560l5699M6155L7567m1434l4761
821c5071L9489L3498l4843k9496K7158J4895l0387j68M6718Q41o0581j3035O0726
834A9744K1610n4314k3137M6438J9195m0507j0759L7744j767m4229Q890N5650
846C4558n626n9448j408N4069N1m8888N695M8731j1576n0948J7867N6582k0952
859A8707o4921J7662P2007q540o8715j18N5573j566m2275J3810M0569k3495m3547
872c4849K8102M6345l4035n1210L7157O0119l1115o0848K1583M9726k5489m0608
884c5122M1738M8888m7679o3670L5011O3511k4169n2534K1934M5389k4504m0094
$$ plain form
797 -33974 -13220 30768 6516 -34394 -8166 26543 -6096 -39322 1177 43158 7163 -35421
809 -35421 -7053 25686 -5764 -30207 12719 41661 -6899 -42598 3557 41124 -310 -35071
821 -35071 4418 37916 3073 -26423 735 15630 -14757 -14925 31793 32634 -27947 -40982 19744
834 19744 41354 -12960 -36097 10341 29536 -10971 -21730 16014 14247 -29982 -21092 34558
846 34558 28932 -30516 -31924 22145 22196 -26692 -20997 27734 16158 -34790 -16923 39659 18707
859 18707 -46214 -28552 43455 34915 -33800 -33918 21655 20089 -22186 -8376 32193 8698 -34849
872 -34849 -6747 39598 5563 -45647 -8490 51629 20514 -40334 -18751 30975 5486 -35122
884 -35122 6616 55504 7825 -55845 -20834 42677 18508 -34026 -12092 33297 8793 -31301
896c1301K5902L2118l1347k6715M2880K8635n1699l9622M8363M4071l9191l7204
908c5110L8391L0384m1775l1231M0891K8286l9488k3847M3857K4680m4005k6074
920c5041L8609K1524l5770j2479L9323N112m6826l990N3294Q067n4062j1828N1730
933A7663J5102m3773j2978L5834K402l5884N937M2768o793m5196O243M1693r310
946A3708m0311J7656M4716k1219n0563J7997N0187j6865m7514J9877M9876j8277
958A9268n1984J2337M5238j2031l5241K0010L3305k8790l7587L1669L9081l1681
970C594l8101L6379L9479l8217m3623L4703M1171l3143l6108L7782L7623m1352
982A87m3925L7483M6235k8969l9036K5333K7526l1601k1087M0224K1624m5545
$$ plain form
896 -31301 -5399 26719 -4628 -31343 11537 40172 -11527 -51149 -2786 41285 2094 -35110
908 -35110 3281 33665 -8110 -39341 1550 29836 -9652 -33499 10358 35038 -8967 -35041
920 -35041 3568 25092 -10678 -23157 16166 21278 -25548 -29538 23756 31823 -22239 -34067 17663
933 17663 32765 -11008 -23986 11848 14250 -21634 -15697 27071 20278 -24918 -18675 23018 13708
946 13708 -26603 -8947 35769 14550 -36013 -18016 32171 15306 -32208 -12331 37545 19268
958 19268 -32716 -20379 24859 12828 -22413 -2403 30902 2112 -35475 -3806 35275 3594
970 3594 -34507 1872 41351 3134 -40489 -5786 35385 2242 -33866 3916 41539 187
982 187 -43738 -6255 39980 11011 -28025 -2692 24834 -6767 -27854 12370 33994 -11551
994a1551k3932M8916K6930m9296l1850M4053L2654m0091k7823L9081K5226l9103
1006f786k2673L8755J9594l9994j8618M0462J7782l7602j6110L3435R580l2415
1018a4590q39L7702l327m5848L73N0628O547m8883j2892M1765J3960l3678r952
1031a9034K6447N08k2926J0950K8503j6875l7091J3492L8720q138l4569R493L0213
1044A9693j3766l0206J6877L2210j7741l3741J8142L4786j7309l5404J3764L2094
1056A9399r985k2587J3117J3334k3164j2648L3028J8469l7027k4736L5701K9724
1068C2625l1937l1089K6641K8223k3892k0128K7001J6009l4223j9160L6881K3268
1080C0219l2017k3964K7555J9914k4310j3267K4787P315l0278m650L6775O603
$$ plain form
994 -11551 -35483 13433 40363 -8933 -40783 3270 35924 -4167 -31990 7091 32317 -6786
1006 -6786 -29459 9296 28890 -11104 -29722 10740 28522 -9080 -25190 8245 17825 -14590
1018 -14590 -15429 22273 18946 -26902 -26529 24099 30646 -18237 -31129 10636 24596 -9082 -19034
1031 -19034 7413 7921 -15005 -4055 24448 7573 -29518 -16026 22694 14556 -20013 -10520 19693
1044 19693 5927 -24279 -7402 24808 7067 -26674 -8532 26254 8945 -26459 -12695 19399
1056 19399 9414 -13173 -56 13278 -9886 -22534 10494 28963 -8064 -32800 2901 32625
1068 32625 688 -30401 -3760 24463 571 -19557 7444 23453 -10770 -29930 6951 30219
1080 30219 -1798 -25762 1793 21707 -2603 -15870 8917 16232 -14046 -18696 18079 24682
1092B4682m1745j1440M2222J6473l7278j7239L2336J2813l0744q950L0676P123
1104A8929l0808o079L1378O048l1271p481K8715P046k4527l089K2820k656k6573
1117a7548O214L1286m470l2692p5L0929J816k6407j192K1894o48j9264M612J8577
1131A3032q209k1423R368K3471o609k1680N387J7480q218j5736J1607J6412j3503
1144A379j6746J3844J7724j3343j8048J1644J6605r600j3803R780J0479j3322
1156c407q693J6672J0438j7789j2909J6691J1611j4117r677J3363O888j4362k989
1169h280J6712J582k1796l742K3568Q686k1201j1848J6904J0395j3833n393J2951
1182D705J841j5991L5J8657O31j9634k504J8542M391j4846l822J0951m20j0322
$$ plain form
1092 24682 -17063 -28503 13719 30192 -7086 -24325 8011 20824 -9920 -18870 11806 18929
1104 18929 -11879 -17958 13420 19468 -11803 -19284 9431 16477 -8050 -11139 11681 9025 -17548
1117 -17548 -11334 19952 15482 -17210 -17285 13644 15460 -10947 -12139 9755 9107 -10157 -5545 13032
1131 13032 4823 -16600 -7232 16239 9630 -12050 -6663 10817 2599 -13137 -1530 14882 1379
1144 1379 -15367 -1523 16201 2858 -15190 -3546 13059 3459 -10344 -564 9915 -3407
1156 -3407 -12100 4572 15010 -2779 -15688 1003 12614 -1503 -11180 2183 9071 -5291 -8280
1169 -8280 8432 10014 -11782 -15524 8044 16730 -4471 -16319 585 10980 -2853 -8246 4705
1182 4705 6546 -9445 -9410 9247 9878 -9756 -12260 6282 10673 -4173 -7995 2956 2536 -7786
1196g786M585J4404n489j8519L329K0438Q76j9416l308J4701L940r097r90O696
1210D364m900p822Q789J2842p230j7032K240J6360K903j1585m107O570M07k676
1224h77M642L743r626p504R704J1799n202j2445K62P439J928j929J113j765o111
1239d829J86J0372M714j0927r406O316J1360r30p945l436J962J939L310L328m210
1254A804p545K86R144M346o882o804J620N998J461j217j566k182k425L321O367
1269E726m52p444m691M614O522J375m528n791k32O358N349k537p454l205M632
1284a758O827K45o769m608L340N830J627m427l738J604L039n93k277J398J892
1299A632l553l616M876P226l546r319NQ136M261n378n398j15L576L197J390k455
$$ plain form
1196 -7786 -3201 11203 5714 -12805 -9476 10962 11838 -7578 -10886 3815 7755 -1342 -2332 4364
1210 4364 -536 -8358 431 13273 6043 -10989 -8749 7611 10514 -1071 -5178 1392 1799 -877
1224 -877 3765 7508 -2118 -9622 82 11881 6679 -5766 -5504 1935 3863 1934 3047 1282 -4829
1239 -4829 -4643 5729 10443 -484 -9890 -3574 7786 6856 -1089 -4525 -2563 -624 2686 6014 1804
1254 1804 -5741 -5455 3689 8035 1153 -5651 -4031 1967 3428 2211 645 -1537 -3962 -641 5726
1269 5726 5274 -2170 -6861 -2247 4275 5650 1122 -4669 -4901 1457 6806 4269 -3185 -6390 -1758
1284 -1758 5069 5314 -1455 -6063 -2723 3107 4734 307 -3431 -1827 1212 619 -1658 -260 1632
1299 1632 -1921 -5537 -661 6565 3019 -6300 -6295 1841 6102 724 -4674 -4789 -1213 1984 3374 919
1315I19n803m64Q215M199p709p064N398P663l687n683L168N280m449m569N043
1330D57O276m915o906K446O547j121l654J161J157l674J461P459o00j1077k192
$$ plain form
1315 919 -4884 -5348 2867 7066 -643 -7707 -2309 5354 1667 -4016 -848 4432 -17 -4586 457
1330 457 6733 1818 -5088 -2642 3905 2784 -870 291 1448 -2226 -765 6694 6094 -4983 -7175
$$ [...]
8191A4
##END NTUPLES=NMR FID
##END=
