##TITLE=1H_CG-1126-1
 CDCl3, 8 sc, 
 7.2.2020
##JCAMPDX= 6.0         $$ Bruker NMR JCAMP-DX V2.0
##DATA TYPE= NMR FID
##DATA CLASS= NTUPLES
##ORIGIN= UXNMR, Bruker Analytische Messtechnik GmbH
##OWNER= root
$$ XWIN-NMR		Version 3.5
$$ Fri Feb  7 14:24:28 2020 Russian Standard Time (UT+4h)  she@DPX200
##.OBSERVE FREQUENCY= 200.1315
##.OBSERVE NUCLEUS= ^1H
##.DELAY= (6, 6)
##.ACQUISITION MODE= SIMULTANEOUS
##.ACQUISITION SCHEME= undefined
##.AVERAGES= 8
##.DIGITISER RES= 18
##SPECTROMETER/DATA SYSTEM= spect
##.PULSE SEQUENCE= zg30
##.SOLVENT NAME= CDCl3
##.SHIFT REFERENCE= (INTERNAL, CDCl3, 0, 15.7039)
##AUDIT TRAIL= $$ (NUMBER, WHEN, WHO, WHERE, WHAT)
$$ ##TITLE= Audit trail, XWIN-NMR		Version 3.5
$$ ##JCAMPDX= 5.01
$$ ##ORIGIN= Bruker BioSpin GmbH
$$ ##OWNER= she
$$ F:/spectra/data/she/nmr/H-F/1/audita.txt
$$ ##AUDIT TRAIL=  $$ (NUMBER, WHEN, WHO, WHERE, WHAT)
(   1,<2020-02-07 14:22:59.15 +0400>,<she>,<DPX200>,
      <created by zg, POWCHK disabled, PULCHK disabled
       configuration hash MD5:
       00 E9 B6 7A A2 85 ED C7 34 08 36 98 17 FE 4E 26
       data hash MD5: 16K
       7F 9F 0C 91 91 B4 5A 1C 58 A5 52 28 37 48 70 A0>)
$$ ##END=
$$ 
$$ hash MD5
$$ 9F 01 13 3B 09 99 E6 45 AB D5 7E 78 A0 BF 66 10
##$RELAX= 
##$RELAX= 
##$RELAX= 
##$RELAX= 
##$RELAX= 
##$RELAX= 
$$ Bruker specific parameters
$$ --------------------------
##$DU= <F:/spectra>
##$EXPNO= 1
##$NAME= <H-F>
##$PROCNO= 1
##$TYPE= <nmr>
##$USER= <she>
##$AMP= (0..31)
100 100 100 100 100 100 100 100 100 100 100 100 100 100 100 100 100 100 
100 100 100 100 100 100 100 100 100 100 100 100 100 100 
##$AQSEQ= 0
##$AQ_mod= 1
##$AUNM= <au_zg>
##$AUTOPOS= <>
##$BF1= 200.13
##$BF2= 200.13
##$BF3= 200.13
##$BF4= 200.13
##$BF5= 200.13
##$BF6= 200.13
##$BF7= 200.13
##$BF8= 200.13
##$BYTORDA= 1
##$CFDGTYP= 0
##$CFRGTYP= 5
##$CHEMSTR= <none>
##$CNST= (0..31)
1 1 145 1 1 1 1 1 1 1 1 1 1 1 1 1 1 1 1 1 1 1 1 1 1 1 1 1 1 1 1 1 
##$CPDPRG= <>
##$CPDPRG1= <>
##$CPDPRG2= <>
##$CPDPRG3= <>
##$CPDPRG4= <mlev>
##$CPDPRG5= <mlev>
##$CPDPRG6= <mlev>
##$CPDPRG7= <mlev>
##$CPDPRG8= <mlev>
##$CPDPRGB= <>
##$CPDPRGT= <>
##$D= (0..31)
0 1.2 0 0 0 0 0 0 0 0.06 0 0.03 0 0 0 0 0.0002 0 0 0 0 0 0 0 0 0 0 0 0 
0 0 0 
##$DATE= 1581070978
##$DBL= (0..7)
120 120 120 120 120 120 120 120 
##$DBP= (0..7)
150 150 150 150 150 150 150 150 
##$DBP07= 0
##$DBPNAM0= <>
##$DBPNAM1= <>
##$DBPNAM2= <>
##$DBPNAM3= <>
##$DBPNAM4= <>
##$DBPNAM5= <>
##$DBPNAM6= <>
##$DBPNAM7= <>
##$DBPOAL= (0..7)
0.5 0.5 0.5 0.5 0.5 0.5 0.5 0.5 
##$DBPOFFS= (0..7)
0 0 0 0 0 0 0 0 
##$DE= 6
##$DECBNUC= <off>
##$DECIM= 24
##$DECNUC= <off>
##$DECSTAT= 4
##$DIGMOD= 1
##$DIGTYP= 9
##$DL= (0..7)
0 120 120 120 120 120 120 120 
##$DP= (0..7)
150 150 150 150 150 150 150 150 
##$DP07= 0
##$DPNAME0= <>
##$DPNAME1= <>
##$DPNAME2= <>
##$DPNAME3= <>
##$DPNAME4= <>
##$DPNAME5= <>
##$DPNAME6= <>
##$DPNAME7= <>
##$DPOAL= (0..7)
0.5 0.5 0.5 0.5 0.5 0.5 0.5 0.5 
##$DPOFFS= (0..7)
0 0 0 0 0 0 0 0 
##$DQDMODE= 0
##$DR= 18
##$DS= 0
##$DSLIST= <SSSSSSSSSSSSSSS>
$$ [...]
##$SUBNAM2= <"">
##$SUBNAM3= <"">
##$SUBNAM4= <"">
##$SUBNAM5= <"">
##$SUBNAM6= <"">
##$SUBNAM7= <"">
##$SUBNAM8= <"">
##$SUBNAM9= <"">
##$SW= 24.9337058887773
##$SWIBOX= (0..15)
0 0 2 0 0 0 0 0 0 0 0 0 0 0 0 0 
##$SW_h= 4990.01996007984
##$TD= 16384
##$TD0= 1
##$TE= 0
##$TE2= 300
##$TE3= 300
##$TEG= 300
##$TL= (0..7)
0 120 120 120 120 120 120 120 
##$TP= (0..7)
150 150 150 150 150 150 150 150 
##$TP07= 0
##$TPNAME0= <>
##$TPNAME1= <>
##$TPNAME2= <>
##$TPNAME3= <>
##$TPNAME4= <>
##$TPNAME5= <>
##$TPNAME6= <>
##$TPNAME7= <>
##$TPOAL= (0..7)
0.5 0.5 0.5 0.5 0.5 0.5 0.5 0.5 
##$TPOFFS= (0..7)
0 0 0 0 0 0 0 0 
##$TUNHIN= 0
##$TUNHOUT= 0
##$TUNXOUT= 0
##$USERA1= <user>
##$USERA2= <user>
##$USERA3= <user>
##$USERA4= <user>
##$USERA5= <user>
##$V9= 5
##$VALIST= <valist>
##$VCLIST= <CCCCCCCCCCCCCCC>
##$VD= 0
##$VDLIST= <DDDDDDDDDDDDDDD>
##$VPLIST= <PPPPPPPPPPPPPPP>
##$VTLIST= <TTTTTTTTTTTTTTT>
##$WBST= 1024
##$WBSW= 4
##$XGAIN= (0..3)
0 0 0 0 
##$XL= 0
##$YL= 0
##$YMAX_a= 912148
##$YMIN_a= -320830
##$ZGOPTNS= <>
##$ZL1= 120
##$ZL2= 120
##$ZL3= 120
##$ZL4= 120
##$ABSF1= 10
##$ABSF2= 0
##$ABSG= 5
##$ABSL= 3
##$ALPHA= 0
##$AQORDER= 0
##$ASSFAC= 0
##$ASSFACI= 0
##$ASSFACX= 0
##$ASSWID= 0
##$AUNMP= <proc_1d>
##$AZFE= 0.1
##$AZFW= 0.1
##$BCFW= 1
##$BC_mod= 2
##$BYTORDP= 1
##$COROFFS= 0
##$CY= 11.3945322036743
##$DATMOD= 1
##$DC= 2
##$DFILT= <>
##$DTYPP= 0
##$F1P= 16.9975609425685
##$F2P= -3.02152046262296
##$FCOR= 0.5
##$FTSIZE= 0
##$FT_mod= 4
##$GAMMA= 1
##$GB= 0.15
##$INTBC= 1
##$INTSCL= 1
##$ISEN= 128
##$LB= 0.24
##$LEV0= 0
##$LPBIN= 0
##$MAXI= 10000
##$MC2= 0
##$MEAN= 0
##$ME_mod= 0
##$MI= 1.114404
##$NCOEF= 0
##$NC_proc= 0
##$NLEV= 6
##$NOISF1= 3.799351
##$NOISF2= 2.8
##$NSP= 1
##$NTH_PI= 0
##$NZP= 0
##$OFFSET= 15.70392
##$PC= 1
##$PHC0= -9785.656
##$PHC1= 14.20082
##$PH_mod= 1
##$PKNL= yes
##$PPARMOD= 0
##$PSCAL= 0
##$PSIGN= 0
##$REVERSE= no
##$SF= 200.130013532006
##$SI= 16384
##$SIGF1= 3
##$SIGF2= 2
##$SINO= 400
##$SIOLD= 16384
##$SREGLST= <1H.CDCl3>
##$SSB= 0
##$STSI= 0
##$STSR= 0
##$SW_p= 3612.71676300578
##$SYMM= 0
##$S_DEV= 0
##$TDeff= 0
##$TDoff= 0
##$TI= <>
##$TILT= no
##$TM1= 0
##$TM2= 0
##$TOPLEV= 0
##$USERP1= <user>
##$USERP2= <user>
##$USERP3= <user>
##$USERP4= <user>
##$USERP5= <user>
##$WDW= 1
##$XDIM= 8192
##$YMAX_p= 0
##$YMIN_p= 0
$$ End of Bruker specific parameters
$$ ---------------------------------
##NTUPLES= NMR FID
##VAR_NAME=  TIME,          FID/REAL,        FID/IMAG
##SYMBOL=    X,             R,               I
##VAR_TYPE=  INDEPENDENT,   DEPENDENT,       DEPENDENT
##VAR_FORM=  AFFN,          ASDF,            ASDF
##VAR_DIM=   8192,          8192,            8192
##UNITS=     SECONDS,       ARBITRARY UNITS, ARBITRARY UNITS
##FACTOR=    0.0002004,     1,               1
##FIRST=     0,             0,               0
##LAST=      1.6414764,     0,               0
##MIN=       0,             -320830,         0
##MAX=       1.6414764,     912148,          0
$$ Real data points
##PAGE= N=1
##DATA TABLE= (X++(R..R)), XYDATA
0 0 0 0 0 0 -8 8 -8 14 -16 21 -24 32 -40 49 -64 73 -90 109 -127 150 -177 206 -239 276 -318 365 -419 473
28 473 -539 610 -685 772 -868 971 -1082 1209 -1347 1494 -1658 1838 -2036 2256 -2498 2764
44 2764 -3062 3396 -3771 4197 -4684 5248 -5912 6703 -7667 8871 -10427 12521 -15515 20170
58 20170 -28452 47626 -183338 173377 587055 26232 -320830 -163810 79670 -81197 -225415
69 -225415 -184112 -121624 -170916 -70899 75765 15392 -191877 -162690 18960 45047 -62624
80 -62624 -23990 18387 -155033 -301450 -58653 268846 183432 -154707 -178113 92713 158280
91 158280 -88079 -223667 -57951 149368 174902 94173 -2579 -103502 -126180 10600 170627
102 170627 161150 23068 -49835 -2469 74454 98543 37855 -76357 -114728 14102 182265
113 182265 178484 12427 -98654 -42250 85022 154890 118093 -19395 -160352 -140830 42739
124 42739 158344 75842 -18576 43872 118679 38200 -74454 -58864 -4180 -12240 23291 137600
136 137600 133067 -47345 -133210 17929 148021 62071 -31719 49489 117393 13156 -63578
147 -63578 30528 82661 -20048 -20142 184250 252268 8575 -186243 -40242 179399 152836
158 152836 25043 35911 76958 5430 -25272 92043 146335 20512 -39416 107891 200816
169 200816 52853 -97562 -33936 74755 49550 25865 111919 136679 4895 -77424 18864
180 18864 104499 28742 -49810 18452 102119 55966 -26396 -25054 4494 5977 40372 97294
192 97294 57145 -63044 -86569 24975 97840 32967 -52300 -34775 43577 78191 37562 -34801
204 -34801 -66217 -10354 86469 108182 25982 -51674 -48086 -12488 9841 51786 94901 54926
216 54926 -37064 -40475 48072 74372 -1820 -42887 11459 57801 38246 14634 9221 -17755
228 -17755 -23717 57730 130552 51804 -89027 -85077 31920 56287 -13445 -5709 70131 54107
240 54107 -27396 -17129 41301 -14484 -109959 -38809 126254 118262 -55400 -121228 -11505 63231
252 63231 16307 -13801 14865 -7994 -61758 -19117 64976 22756 -87183 -62843 66894 90433
264 90433 -9874 -61317 -28860 -25522 -41708 20685 93385 33621 -82510 -64141 46276 49806
276 49806 -45778 -59538 19643 42848 -4002 -6445 26278 -7090 -67835 -35230 54468 56865
288 56865 -29847 -70455 -20844 34350 35973 5922 -28720 -43391 -9572 38057 12034 -69314
300 -69314 -74315 26499 85333 19870 -59376 -44341 7164 2213 -32014 -26855 4923 12398 -7123
313 -7123 -21601 -14257 10702 27363 -2131 -58475 -55407 21694 56684 -17426 -81142 -16379 81832
326 81832 61097 -38378 -66027 -12296 15060 -8872 -14879 12937 25309 10445 628 -3802 -15145
339 -15145 -10835 12825 7631 -26033 -14283 45710 49603 -26603 -59646 10033 62905 10718 -51608
352 -51608 -21400 37007 23596 -22396 -12693 28750 24256 -13106 -19287 886 5528 -2932 -3743
365 -3743 -2863 2837 27756 36922 -11618 -65225 -34526 46029 52511 -23063 -55891 7153 62534
378 62534 27012 -39035 -45225 -5480 16156 10111 17 -7793 -9655 2575 12463 3053 -9099
391 -9099 -5138 -5432 -23556 -24731 11391 34975 3421 -37480 -22887 24639 29342 -16085 -46832
404 -46832 -27762 8481 25249 14200 -14824 -34632 -14973 25729 28702 -16968 -48437 -23019
416 -23019 20844 26542 -3980 -26651 -18109 3855 15597 6185 -15955 -25451 -8087 15882 12891
429 12891 -10670 -15680 -979 584 -12064 -8367 11236 9603 -17042 -26978 274 26911 10526
442 10526 -30727 -39921 -2197 33091 17840 -29977 -47365 -9360 34781 24178 -28589 -49699
454 -49699 -11551 27974 14289 -26905 -37818 -12460 9681 5216 -9004 -12577 -7842 -8210 -10790
467 -10790 -3637 4595 -7206 -29975 -29686 4372 32908 15100 -29309 -37873 6580 41957 15167
480 15167 -40173 -49981 -3306 39645 30555 -10637 -26727 849 31271 22992 -9333 -23454 -11556
493 -11556 964 4634 13743 25641 16840 -10401 -16639 14611 36749 8177 -39366 -40773 8555
506 8555 50603 39797 -9730 -41777 -17126 36645 47206 -7519 -58867 -36987 27102 49685
518 49685 11414 -28284 -24755 626 14251 14471 4306 -19379 -34091 -10834 28631 32479 -3041
531 -3041 -31053 -23324 2839 22038 19516 -5744 -33044 -24726 21554 51518 20664 -37618 -50801
544 -50801 -5458 40543 38487 -288 -34313 -26730 19140 53069 26850 -36128 -56232 -9255
556 -9255 43123 38981 -5876 -35593 -22574 14076 36119 20068 -21140 -43940 -22940 13972
568 13972 21912 -768 -22020 -28443 -21674 6821 37242 18759 -47846 -74923 -13990 50344 24148
581 24148 -51930 -69624 -16527 27969 23185 -5545 -32720 -45662 -22687 22732 26301 -31627
593 -31627 -70401 -31259 22662 22390 -1033 -1938 -10239 -39017 -26804 34820 41038 -42966 -91883
606 -91883 -10623 84494 52913 -44285 -56808 12271 46377 17444 -14146 -26339 -30759 -7140
618 -7140 39372 41811 -11159 -35561 7926 39826 8691 -19231 3694 15952 -19521 -27002 30330
631 30330 56509 -12216 -72179 -20162 69613 66110 -14804 -57767 -22659 29855 41668 5065
643 5065 -44356 -50789 4527 60379 44577 -16642 -36855 1458 29885 10318 -18289 -21246 -11967
656 -11967 -4560 10237 24508 18935 4152 2606 6502 4261 680 -6470 -25057 -31073 5840 51877
670 51877 39014 -15748 -26912 16496 33361 -6382 -34176 -15585 759 -3649 13112 38378
682 38378 7955 -49757 -31979 44282 50230 -30556 -69242 -16311 31609 15247 -5772 0
694 0 -13837 -39256 -10558 42716 18101 -58152 -51184 33243 51747 -20761 -51217 -2543 14999
707 14999 -24296 -21893 31490 27625 -34177 -31917 42299 51618 -31444 -66252 403 49090 12458
720 12458 -20594 7608 27577 5713 4272 36963 28636 -25107 -36464 14404 44555 20910
732 20910 1220 11396 16911 13599 32385 45777 1441 -55941 -29566 58041 83513 12984
744 12984 -47556 -21878 39566 52887 11178 -26698 -17680 20144 33987 8397 -17208 -9860
756 -9860 6375 1801 -1779 17620 24070 -10708 -38773 -10769 30507 16345 -26049 -29375 -2594
769 -2594 7163 4934 8890 -8983 -42664 -24227 44554 50779 -36900 -86063 -16791 55299 20886
782 20886 -41370 -23657 18558 786 -21015 13941 27593 -37131 -71481 4711 71081 16344
794 16344 -58633 -32098 23141 3973 -25118 14963 40219 -25792 -73120 -2969 68136 9202
806 9202 -78913 -43976 46649 43900 -21107 -30496 -4103 -15891 -25353 17465 34320 -31964 -77579
819 -77579 -12675 59802 20517 -52079 -33037 26877 14182 -36796 -30034 3723 -10244 -30845
831 -30845 6182 43622 3919 -56447 -43799 14613 31139 2527 -17889 -17501 -15902 -6934 11787
844 11787 9383 -18837 -27118 5963 35865 22476 -13835 -33867 -24383 4854 29994 22043 -11425
857 -11425 -26485 -6346 12316 11313 11522 14300 -4618 -24212 890 37838 12703 -47139 -38501
870 -38501 36722 63158 5135 -39240 -15514 11922 3783 1743 14447 401 -21542 5492
882 5492 39869 623 -58979 -24741 58613 50939 -29648 -40201 23107 24298 -41771 -37332 44415
895 44415 54597 -32508 -61558 17668 65625 10193 -42519 -17890 16975 8310 -3011 1181
907 1181 -16956 -33578 10959 69490 39551 -43611 -50608 14451 26268 -24259 -24802 35226 40983
920 40983 -21761 -37267 19421 38197 -15893 -41687 8437 46565 10451 -38056 -28548 10747
932 10747 24952 12778 -2547 -12603 -7686 12258 18244 -7025 -27251 -6283 26351 23150 -4536
945 -4536 -20448 -19357 -13468 759 23535 32530 13893 -11668 -21517 -13828 3039 13953 2283
958 2283 -19880 -11312 30969 43651 -4932 -47799 -22986 24930 26173 1495 -364 1902 -16614
971 -16614 -18167 20143 37886 -26 -25763 8036 32862 -10020 -50172 -13799 40311 29179
983 29179 -7144 1119 18098 -9234 -30601 6703 41186 9599 -29760 -9280 23308 7398
995 7398 -17235 -814 14992 -5660 -8270 34403 42177 -25814 -67659 -5876 66526 40845 -28400
1008 -28400 -34097 4507 10955 -3118 7900 20539 465 -16692 3491 20506 -4018 -27372
1020 -27372 -6105 23395 17014 1801 8368 6398 -21529 -29538 6635 32422 8160 -20244 -7759
1033 -7759 16204 8991 -14002 -15626 1521 16610 19148 5847 -19175 -33467 -13573 20187 25822
1046 25822 3476 -10706 -7231 -5512 -5628 2105 4589 -7251 -10817 8369 21896 3698 -22966
1059 -22966 -25284 -8325 9227 21726 22274 -3580 -33086 -24573 12690 22273 -6714 -19006 4242
1072 4242 15498 -6043 -16791 780 7122 -9486 -9628 12788 12665 -17706 -28160 -1039 16630
1085 16630 3535 -6666 1236 -869 -16197 -11380 7840 1400 -21572 -10839 23023 19403 -21407
1098 -21407 -34430 -4305 16001 5025 -4961 -1682 -7824 -18766 -7726 14183 7490 -17030 -14149
1111 -14149 11154 12202 -12044 -16764 853 5867 -5570 -2140 11614 6279 -14660 -18233 -1326
1124 -1326 11201 10903 6726 -1342 -12065 -10067 6458 11297 -6726 -13818 9115 25760 4530
1137 4530 -22935 -15791 9335 13997 152 -5335 319 3264 340 -2180 -3967 -3381 4473 9227
1151 9227 383 -10131 -4564 5788 -2821 -15560 -2540 21020 13711 -18569 -26638 -627 16183
1164 16183 3677 -11775 -7829 2918 3953 -1957 -6370 -8062 -5464 1593 3653 -3711 -6670 -38
1178 -38 770 -10611 -11345 8928 17823 -4306 -24852 -10182 16402 12631 -12720 -19140 716 15398
1192 15398 5581 -11582 -14868 -3123 9304 10113 -3076 -13871 -8003 5907 5056 -7323 -7603 5274
1206 5274 6692 -7433 -11425 2190 8773 -5341 -17549 -6573 12238 12247 -5584 -17660 -10966 5973
1220 5973 15009 6079 -13890 -20351 -3287 14839 8548 -11187 -14819 757 12163 7734 -1306
1233 -1306 -6811 -7564 -3283 5855 10398 2204 -8916 -6826 6050 11487 5830 -819 -1581 -859 2150
1248 2150 8710 8963 -310 -8412 -2299 12404 18720 9352 -5588 -9444 2341 17736 17820 -305
1262 -305 -15850 -7128 16878 25885 6791 -13792 -9674 11577 22142 11316 -6232 -11324 -1211
1275 -1211 11628 13142 5456 -2499 -3864 598 8318 13757 9334 -5236 -14319 -3948 16886 20174
1289 20174 -861 -20098 -10234 17024 25475 5849 -16256 -14980 5737 18649 9332 -7950 -12404
1302 -12404 -1874 9105 11223 6278 -1314 -6613 -5589 2753 11238 9282 -5457 -17517 -8711 14557
1316 14557 23982 3762 -22946 -20219 11225 30164 8394 -25669 -25403 6184 24687 8960 -14454
1329 -14454 -15858 -470 10573 8631 235 -8439 -10988 -4671 5045 6555 -78 -6384 -7372 -4368
1343 -4368 3146 12348 8225 -12858 -24266 -2973 24414 16993 -17085 -28945 -2316 23956 17603
1356 17603 -6902 -16968 -7739 5903 13563 9797 -7200 -19506 -7056 18142 21710 -1054 -17040
1369 -17040 -7718 8708 12286 6101 -493 -7792 -9286 2354 17363 12606 -8576 -16180 642
1382 642 17748 13780 -2298 -11409 -10179 -73 13524 14810 -1350 -17748 -10888 12538 21543
1395 21543 4745 -16407 -17450 1582 17008 11644 -9690 -20951 -8403 13850 17981 1416
1407 1416 -13423 -12078 -3101 5355 9657 2912 -14630 -19810 1218 22042 11758 -15004 -21276
1420 -21276 -1872 14614 11839 -954 -15622 -21728 -7344 19977 23752 -7774 -29558 -7275
1432 -7275 22822 14727 -12493 -15353 -898 295 -3211 7692 12455 -10398 -28325 -2633 32380
1445 32380 22873 -18180 -30958 -6099 14362 10637 391 -9575 -16631 -4411 23239 24387 -13816
1458 -13816 -38327 -8261 31894 22210 -17567 -27790 -4168 9341 3251 3712 8336 -2535 -16850
1471 -16850 -5707 16297 11713 -15568 -24632 -5271 16697 19297 4376 -14447 -21526 -4769 20935
1484 20935 23596 -5485 -30392 -18743 13442 23809 4019 -17408 -13998 7659 21655 11082
1496 11082 -12181 -21407 -8574 8685 14101 8364 -2912 -14140 -12450 8909 24948 8798 -19759
1509 -19759 -17829 11200 21267 -2119 -20577 -11228 4631 10513 15349 14730 -7397 -29203 -10651
1522 -10651 27379 24684 -15201 -28548 -202 17397 4012 -4897 3093 -126 -11639 2642 27209
1535 27209 10189 -34377 -34484 13246 34115 3615 -17552 -2226 6068 -7974 -6406 14282 8470
1548 8470 -20753 -18236 19205 25398 -14395 -35037 -4273 25762 16202 -5837 -9090 -9062 -11702 -120
1562 -120 15210 3975 -20727 -12846 20514 23474 -11248 -28960 -6238 15485 7757 -4577 -1382
1575 -1382 -939 -15085 -17151 7755 26450 12156 -16098 -21338 -617 15511 6451 -15550 -20900
1588 -20900 541 22151 15850 -10774 -22657 -8346 10752 13639 3998 -5354 -7639 -4409 405
1601 405 -1441 -6980 -3369 9326 12018 -1631 -8666 -484 409 -11885 -7397 18301 21091 -13543
1615 -13543 -31857 -1683 29687 12012 -19353 -12735 12319 9412 -8271 -5723 2435 -8575 -11388
1628 -11388 15659 32396 1982 -30752 -16676 13161 10989 -4317 4365 12963 -5652 -19037
1640 -19037 3281 22762 490 -21614 1208 29622 11441 -22303 -15222 10711 8156 -5649
1652 -5649 4421 17512 2011 -15325 -730 18025 3558 -17614 -3700 21960 14128 -13270
1664 -13270 -15578 2671 9438 5383 9530 11128 -4330 -17916 -7330 10548 10919 -963 -4138
1677 -4138 1638 4387 4194 2852 -2427 -9678 -6111 8551 16002 5367 -10845 -14610 -4528 8520
1691 8520 12293 2901 -7026 -3439 6291 2565 -9750 -7738 7398 10414 -2955 -8032 128 2323
1705 2323 -4997 -1620 10709 8074 -7985 -9525 3679 2710 -10661 -5445 13034 9964 -8973 -4880
1719 -4880 13381 3225 -24572 -17710 19543 25964 -6122 -21566 -339 11438 -3654 -8755 7806
1732 7806 10642 -7474 -10672 5454 5640 -11231 -7749 12544 9713 -9953 -7114 13136 7258 -17815
1746 -17815 -13083 16295 18940 -8883 -16796 5205 11000 -8286 -10877 12659 20687 -1363 -14719
1759 -14719 -2882 6731 1059 -2314 4246 6234 2025 2157 5055 -402 -6558 2081 12861 7206
1773 7206 -5211 -2705 6610 3675 -4597 -53 10608 10179 1507 -1589 568 314 -965 1801 5031
1788 5031 5755 5525 1368 -6650 -6555 6198 14617 4633 -9365 -5249 7213 4975 -4911 -3343 3230
1803 3230 542 -1026 8844 11034 -7962 -20373 -4345 16564 10000 -8471 -8101 3464 2443 -4564
1817 -4564 -136 5450 -1845 -7207 3251 9241 -4170 -14026 -1708 9801 1631 -5703 3975 7560
1831 7560 -7894 -13525 5678 16839 -2085 -18052 -856 19598 7570 -16816 -14355 6362
1843 6362 13520 5290 -1359 -5667 -9564 -3463 9890 10285 -5095 -9999 3096 10713 1103 -6846
1857 -6846 -1532 1532 -5011 -2779 10783 10582 -8962 -18307 -2033 15636 10253 -5050 -10011 -3545
1871 -3545 4382 6354 495 -9019 -8439 5580 13552 2130 -13138 -9780 4614 7693 814 -1436
1885 -1436 1610 -1757 -5380 284 6683 843 -7623 -4345 6483 9457 2589 -5904 -10706 -6447 7928
1900 7928 18333 6221 -16701 -17085 6723 19827 4424 -13348 -8061 5719 7923 1782 -2478
1913 -2478 -5487 -7315 201 10979 8869 -5120 -11507 -4127 3153 2918 1770 1281 -4392 -8848 -430
1928 -430 9308 2022 -13959 -12187 6732 13839 929 -12691 -11984 -3470 4463 8062 2720 -10230
1942 -10230 -15016 -1665 12300 6312 -11401 -14711 -1634 8161 5953 -2122 -9786 -12512 -4306 10118
1956 10118 11899 -3223 -15750 -9623 3298 6467 947 -3062 -5538 -6217 424 9137 5207 -10523
1970 -10523 -16132 -1391 14030 9114 -6723 -13341 -6683 3883 9862 5544 -7388 -13411 -2849
1983 -2849 11429 8949 -6983 -13161 -2429 8503 7125 52 -5069 -8512 -7312 3156 13255
1996 13255 7023 -10062 -14336 169 13104 8818 -5582 -12995 -6035 7025 13242 4023 -11808
2009 -11808 -14110 1348 15513 10840 -4183 -9755 -2299 5168 6023 3850 113 -5766 -5753 4050 11663
2024 11663 5884 -6700 -9194 1338 12169 11303 -1245 -12566 -9222 6904 16502 7208 -9495
2037 -9495 -10799 4737 14991 6615 -7327 -9927 -2586 6029 9175 4999 -3473 -7830 -1629 9264
2051 9264 10756 1246 -8748 -7738 791 8191 6949 -1960 -9246 -5970 7237 14163 3977 -10432
2065 -10432 -10481 2558 11081 6651 -4323 -9186 -4779 3845 8905 6082 -3226 -9100 -2923 8391
2079 8391 10382 -944 -11772 -9287 4263 12064 6539 -5922 -9795 -557 9712 8725 -1442 -9746
2093 -9746 -7641 1657 8115 4855 -3013 -6132 -1867 5733 8381 3005 -5136 -8677 -3707 5678 8941
2108 8941 765 -9852 -8728 5204 14068 5878 -8681 -10555 1090 9700 5577 -4107 -7292 -3206
2122 -3206 3521 6264 4635 -413 -4164 -2322 3247 7087 3665 -4773 -8603 -2742 8362 11545 2399
2137 2399 -8516 -6578 6624 13395 4529 -8975 -10818 1715 12183 7311 -4242 -6290 2197
2150 2197 9800 6944 -77 -1753 -299 -761 -1090 3330 7405 2549 -5346 -3282 7496 11976 2422
2165 2422 -8014 -5854 4118 9774 5440 -4394 -8833 -1798 9934 12066 895 -9393 -3980 8142
2179 8142 7939 -3073 -6548 572 3528 -70 344 5507 3533 -5346 -5030 5105 9106 37 -8498
2194 -8498 -5569 1991 4134 2879 1342 -2695 -4111 1698 8289 2736 -8855 -8899 2165 8079 1794
2209 1794 -4569 -3257 692 1167 2032 3112 -221 -6000 -5631 1674 5113 44 -5210 -3502 2150 4042
2225 4042 1936 -2419 -4719 -3184 741 3337 2238 -2014 -5318 -3922 2256 6392 2268 -5580 -5579 2383
2241 2383 6138 -657 -7066 -4059 2065 2585 538 942 -120 -4859 -4035 4026 5591 -2177 -6587 -800
2257 -800 3033 -1428 -2595 2842 2020 -5912 -5039 7628 8739 -8183 -15304 636 14116 3072
2271 3072 -11378 -6663 5305 3221 -3771 -1293 2929 -2064 -5773 1236 5022 -3548 -8737 245
2285 245 7430 146 -5719 1243 5022 -5215 -9179 3565 11152 -1828 -13541 -3675 11054 5675
2299 5675 -8150 -6621 4160 5590 -1563 -2612 -202 -2257 -3874 1967 6135 577 -4933 -2731
2313 -2731 2729 1191 -1443 52 923 -1887 -3069 659 3040 -945 -5085 -1785 4987 5168 -671
2328 -671 -6182 -5070 737 3338 388 -3488 -1485 2015 119 -3754 -1277 2406 -481 -4787 -276
2343 -276 5087 16 -8635 -5222 5121 5621 -2709 -3795 1359 -734 -5840 -1424 6022 278 -9128
2358 -9128 -2715 9186 3696 -9745 -6821 6772 6313 -4502 -3560 4716 -265 -11257 -4213 11274
2372 11274 8125 -7699 -7639 6770 7489 -6093 -7429 4305 5003 -4653 -3269 7108 4120 -8376
2386 -8376 -6682 7784 10080 -2205 -6446 919 2403 -3270 -732 6854 3638 -6243 -2777 8948
2400 8948 5990 -7930 -8633 6101 11940 1656 -6663 -1767 3594 1133 -452 3139 5234 770
2414 770 -2530 -570 2263 1932 51 -847 1052 5705 7912 2157 -5974 -5362 3874 9273 4884 -2349
2430 -2349 -5285 -1762 4935 6920 2050 -3381 -723 6377 5510 -3156 -5611 1740 4105 -1458 -1320
2445 -1320 7863 6859 -7867 -11945 4368 14267 2361 -9952 -2459 7805 2388 -7138 -3553 3144
2459 3144 1139 -498 5330 3871 -7447 -10245 3630 10563 -790 -8300 799 6487 -2882 -7510
2473 -7510 3823 8447 -4512 -9917 4347 12857 -2630 -16098 -4743 12010 8724 -2552 -2571
2486 -2571 812 -4401 -6656 2948 9061 91 -7191 180 7408 603 -7497 -2830 4896 3501 312
2501 312 2445 1728 -5810 -7266 1863 6945 959 -4019 510 4188 -830 -4503 -1160 2468 1937 653
2517 653 1713 -97 -4622 -5293 196 5557 6266 2614 -3490 -6729 -2321 5079 4047 -3304 -4122 4022
2533 4022 7465 372 -5689 -2681 270 676 3528 7110 2842 -6282 -6179 1834 4408 1187 1999 5925
2549 5925 873 -6800 -2851 6453 3716 -5620 -1569 9784 6536 -7903 -8873 2967 8056 594
2563 594 -1380 3248 1174 -5491 -3217 4093 1112 -5381 -3 9563 4302 -8244 -8134 1324 2503
2578 2503 -2445 1985 8821 435 -12830 -8518 6348 8941 -2412 -6160 463 3692 -916 -3093
2592 -3093 -1267 -2725 -2896 3265 6868 -405 -7445 -4708 1809 1563 -459 2705 4409 -2336 -7371
2607 -7371 -2083 4019 1241 -3201 -1 5427 2465 -3725 -5206 -2239 1289 4729 4950 -1318 -6226
2622 -6226 -2562 4254 3779 -2486 -3399 1689 3168 245 -527 -442 -3434 -4878 2400 9734 3928 -6513
2638 -6513 -6902 -395 2566 1784 2768 2122 -3108 -4852 1281 5345 -194 -5801 -1473 5683 3873 -1992
2654 -1992 -3198 -1682 -2314 -20 6247 5395 -3662 -7202 1120 6534 -509 -6495 -349 6262 3166
2669 3166 -2680 -2507 -475 -2339 -1230 4633 6522 -826 -6627 -3831 1638 2464 1221 537 -1895 -2706
2685 -2706 2100 6098 -344 -9406 -6228 6197 8971 -26 -6825 -3879 385 126 690 3219 1662
2700 1662 -3094 -3604 242 1534 -1024 -1379 34 650 1784 3540 343 -6806 -6276 4066 9507 1195
2716 1195 -8014 -4279 5211 5140 -2064 -3969 185 2649 2041 1128 -642 -3771 -2851 2496 5482 1792
2732 1792 -1606 -1362 -1418 -2612 1147 5800 2526 -6046 -6155 3548 7687 -565 -7918 -3740 4082 5373
2748 5373 814 -3498 -5081 -3565 1633 5494 2217 -3566 -4209 332 1557 -494 -1634 -372 -864
2763 -864 -1318 1248 2641 -1930 -6627 -3016 5257 6041 -135 -4788 -3330 113 2128 2151 -247 -3327
2779 -3327 -2360 3095 5452 -88 -5271 -3685 2004 4765 3162 -165 -3546 -4882 -677 5950 5603
2794 5603 -2263 -5829 -143 5328 3215 -2227 -3818 -1418 1209 3317 3970 602 -4750 -4453 2156
2809 2156 5870 2076 -3269 -3654 -190 2256 3097 1266 -3474 -4365 1564 7230 4055 -5512 -7211 228
2825 228 6384 3674 -2542 -3704 -1008 1458 2823 2641 -75 -3257 -2107 2137 4315 1671 -2541
2840 -2541 -3740 -1070 3989 6249 2145 -5374 -6078 1818 8128 4772 -4393 -6461 22 5876 4685
2855 4685 -866 -4408 -2471 2922 4730 1413 -2964 -3838 -831 2245 3497 2126 -802 -3881 -2731
2870 -2731 2607 4890 1180 -5186 -4367 1930 6033 1962 -4375 -5378 -719 5020 5924 548 -4429
2885 -4429 -4538 794 4391 2254 -2737 -3775 -653 3374 4341 1260 -2154 -3614 -563 3950 5098
2900 5098 234 -4485 -3418 2738 5582 2901 -2527 -3601 -58 3581 3008 -309 -2696 -1934 970
2915 970 3812 3850 -364 -3805 -2756 2225 4645 1554 -3302 -3715 774 4231 2973 -1187 -4035 -1965
2931 -1965 2121 4876 2237 -2229 -3009 311 3268 2049 -1503 -2685 -1498 1036 3052 3464 1058
2946 1058 -2631 -2729 1448 5112 1807 -3865 -3992 1510 5499 3211 -1892 -2993 89 3524 2844 -326
2962 -326 -2930 -2210 393 2580 2019 434 -1000 -525 523 1125 1047 -764 -3091 -2659 399 3597 2332
2979 2332 -2810 -5184 -1116 4499 3806 -3101 -6631 -1593 4042 2052 -3318 -4267 -854 1298 194
2994 194 -481 -411 -1972 -3220 -1070 2278 857 -2953 -3349 -422 1445 828 455 -650 -3864 -2870 2324
3011 2324 4060 -1704 -6974 -2009 6050 4410 -3595 -4977 652 2851 -409 -835 1505 -9 -3087
3026 -3087 -1511 3068 2774 -1996 -2905 1089 2918 797 -709 -531 -1218 -1889 1805 4404 471 -4819
3042 -4819 -2682 3603 4142 -1166 -3472 -321 2240 861 -641 -496 -480 -1071 41 3231 2767 -1189
3058 -1189 -3318 -1326 1890 1830 256 -1041 -450 1137 1803 696 -764 -1020 -326 567 1584 1732 -539
3075 -539 -2482 -1039 2226 3269 27 -2393 -703 716 621 158 530 -176 -1363 73 2738 1181
3091 1181 -3889 -3461 2547 3720 -1086 -3457 937 2431 -2335 -4266 1283 3898 -1721 -5357 -382
3106 -382 4238 -60 -4181 -1591 1837 -190 -2318 119 662 -3185 -2861 2324 3380 -2494 -4780 1251
3122 1251 3713 -2318 -5702 972 5199 -623 -5308 -663 4699 58 -4773 -1723 3355 2207 -2352
3137 -2352 -1823 829 111 -1386 739 1691 -739 -1631 652 1598 -1456 -2498 721 2491 -8 -1853
3153 -1853 11 1566 -789 -2629 -367 2589 2352 -875 -2632 -899 1158 1746 -138 -1472 -127
3168 -127 1992 1154 -832 -798 617 295 -1203 887 2869 895 -2687 -1206 2472 2325 -1072 -587 1572
3185 1572 227 -1987 594 3142 202 -3137 -176 4891 1680 -4150 -2052 4013 2856 -1938 -797
3200 -797 2623 648 -3381 -428 4715 1144 -4767 -1657 6038 3828 -4144 -4269 2004 2678 -2175 -1367
3216 -1367 2939 1074 -3890 -1164 4938 2845 -3945 -3612 2397 2008 -1684 -1193 2298 556 -3085 113
3232 113 4425 919 -5423 -2950 4189 4170 -1705 -3110 1068 2643 -205 -993 -405 -118 -351 1272 2528
3249 2528 302 -2300 -874 1712 1683 -48 -391 -716 -1371 472 3054 2217 -1295 -3168 -554 2598
3265 2598 2038 -509 -2865 -1942 1497 3903 1943 -2840 -3849 1419 3861 716 -2510 -151 1784
3280 1784 -842 -1784 1547 2647 -1927 -3752 1396 5108 878 -4308 -1935 2618 2444 -184 -10 -640
3296 -640 -2398 79 5066 3545 -4456 -5484 2404 6722 427 -4516 -1086 2984 212 -893 2843
3311 2843 2585 -3522 -5134 2346 7332 963 -5401 -2533 3253 3141 295 -86 -800 -2230 -406 4637
3327 4637 3295 -3743 -4828 1133 5167 1587 -2443 -1221 405 -223 1037 2988 700 -4135 -3636
3342 -3636 3373 5124 70 -4420 -1467 2746 3115 725 -1463 -2978 -1765 2417 4853 1768 -2413
3357 -2413 -2512 623 2087 1722 710 -1364 -3451 -1068 4577 4493 -2366 -5582 -1009 4508 3330 -1589
3373 -1589 -3699 -2660 -225 2587 3657 -191 -4786 -2853 2692 2919 -1758 -3606 -785 483 -757
3388 -757 696 2344 -1435 -5941 -2305 5020 3845 -3793 -6181 -841 3500 1681 -1346 -1646 -1941 -1063
3404 -1063 1974 3329 -1319 -5624 -2208 4320 3721 -1800 -3207 -398 529 -452 1645 2527 -1082 -4326
3420 -4326 -866 4546 3144 -2480 -3250 633 3393 2576 802 -1601 -3610 -1398 4500 5132 -814 -4422
3436 -4422 -952 3849 2651 -932 -1201 318 513 881 2080 713 -2818 -2272 2096 4037 1316 -1864
3452 -1864 -1565 -344 336 1707 2126 -521 -3058 35 4318 2234 -3425 -4141 874 3592 1965 -336
3468 -336 -1449 -2454 -1381 2292 4033 89 -4293 -1846 3155 2985 -1221 -2672 -824 537 1190 2003
3484 2003 815 -2887 -3969 331 3992 1509 -2511 -2707 62 923 86 43 -850 -2351 -1210 2479
3500 2479 2580 -2424 -5302 -1413 2953 2887 -1369 -2933 -2178 -594 1313 1427 -1171 -3552 -1843 2153
3516 2153 2698 -1328 -3366 -1730 389 1101 1609 1135 -2209 -4732 -1401 3562 3635 -1217 -3718 -725
3532 -725 2266 1535 -426 -1998 -2161 213 3789 3117 -1376 -3950 -708 3433 2489 -491 -832 -171 -917
3549 -917 -389 1898 2592 -526 -2783 571 3880 2040 -3042 -3776 25 3130 2738 1257 -1442 -2929
3565 -2929 -607 2761 2550 -1622 -3396 54 3001 1448 -834 -1152 -340 -292 360 2359 1508 -1867 -3357
3582 -3357 -206 3569 2311 -544 -1577 -723 877 1748 308 -1310 -1744 285 2935 2056 -997 -2086
3598 -2086 -154 1413 977 399 245 -619 -585 315 1845 865 -957 -1603 222 1517 716 -663 -1324 -828
3616 -828 1351 2309 1208 -2023 -2610 20 1580 557 -895 -527 -339 -359 -218 523 264 -1776 -1449 822
3634 822 1621 -147 -1811 -1226 33 441 698 152 -487 -1203 -370 589 132 -703 -199 1302 677 -624
3652 -624 -648 260 -67 -744 66 1348 1288 -892 -1261 277 1160 629 -694 -287 478 850 234 -440 -924
3671 -924 59 1437 1216 -174 -508 100 374 -36 -529 588 902 204 -826 -35 738 412 -299 -835 381
3690 381 928 660 -289 -773 -259 1067 926 -668 -1096 133 1327 460 -1533 -867 907 1001 -74 -897
3708 -897 -294 467 267 -363 163 245 -18 -238 -335 -256 -12 442 108 -392 -246 223 446 -86 -782 -605 942
3729 942 687 -524 -912 -112 662 133 -473 12 250 -69 -630 -472 -10 -107 -539 -199 404 413 -644 -708 -281
3750 -281 234 -167 34 174 384 -640 -857 129 335 -434 -1066 189 560 120 -506 -208 149 -356 -376 501
3770 501 593 -868 -1090 221 693 -255 -644 265 1122 73 -870 140 896 -397 -1437 -443 1211 1307
3788 1307 -752 -870 -521 383 476 -94 -667 -748 -111 720 772 -203 -724 -63 866 756 -451 -290 -224 -329
3808 -329 -512 298 809 329 -873 -1221 840 1772 717 -1900 -2249 535 2417 1196 -1454 -1362 121
3825 121 836 110 -399 -143 -556 -629 475 1420 52 -1621 -1507 485 920 326 -286 -510 -1204 -360 1700
3844 1700 2091 -1468 -3030 -15 3222 1490 -2368 -2317 458 1438 -155 -622 296 -204 -1215 -18 1845
3861 1845 550 -2553 -1759 1319 2504 626 -1000 -910 -633 -361 1145 1819 -594 -2618 -697 3011
3877 3011 2274 -1849 -2673 160 1987 744 -477 -503 -379 -948 -107 1444 1017 -1427 -2235 360 1773
3894 1773 607 -1567 -1615 -790 860 1322 362 -1286 -1464 -347 1143 738 -620 -1625 -1502 434 1572
3911 1572 673 -1009 -1477 -319 959 631 -370 -641 -885 -567 1016 1700 90 -2184 -1409 2244 2608
3928 2608 -761 -2550 196 1607 14 -617 667 980 -793 -739 1819 1893 -1028 -2235 176 2488
3944 2488 1040 -882 5 594 -599 -30 2043 1477 -2116 -1829 1920 3187 -684 -3073 331 2815
3960 2815 1125 -1038 -205 1222 -440 -1421 1169 2380 -100 -2029 392 1877 1058 -1207 -389 598
3976 598 49 642 1270 857 -1479 -1416 1754 3116 -157 -2021 -302 1745 975 -721 -662 552 69 313
3994 313 913 794 21 -990 -69 843 1008 157 -984 -1222 147 1878 1107 -1127 -1760 -89 1562 412
4012 412 -613 -857 -559 -39 1115 1419 -1078 -2373 -907 1312 1230 -1082 -848 340 26 -791 97 1029
4030 1029 -474 -2338 76 2558 772 -2699 -2002 1037 1645 -496 -329 813 -260 -1918 653 2845
4046 2845 725 -2765 -1365 2533 2258 -1187 -2069 357 817 355 1437 1474 -951 -2739 128 3397
4062 3397 1521 -1764 -1306 1474 1792 -325 -384 874 -233 -1227 830 3061 1145 -2293 -1301 1330
4078 1330 2281 311 -716 -1027 -653 397 1205 836 -1104 -1506 801 2080 -29 -1985 -1141 392 854
4095 854 728 380 -703 -1372 -668 1286 1391 -303 -1207 -466 252 550 904 -44 -1871 -1692 1465 2772
4113 2772 555 -2383 -1664 760 951 -131 -510 467 -58 -717 604 963 -771 -1948 270 1556 247
4130 247 -1318 -632 203 -733 -622 1503 987 -1592 -2296 572 2526 -664 -2926 -781 2160 597 -1292
4147 -1292 -899 -368 -1137 -701 1367 1676 -985 -2371 -307 1100 432 -296 -87 -181 -841 -66 1505 963
4165 963 -1329 -1712 771 1808 -296 -1603 -212 430 -10 -227 929 295 -1043 -701 564 647 -700
4182 -700 -659 597 719 30 -99 -7 -310 -706 1103 1700 -207 -1418 -432 1301 694 -803 -412 183 311
4201 311 -487 711 537 -1037 -1753 263 1567 472 -796 -619 -405 -529 506 1284 297 -1456 -720
4218 -720 1130 686 -878 -1614 831 1612 -264 -904 374 226 -1006 -614 1143 1286 -785 -1168 167
4235 167 678 -168 -637 -211 237 224 966 936 -1212 -2288 12 2175 1200 -1416 -1602 488 667 -370
4253 -370 -443 151 -824 -1130 190 1087 -170 -1453 -953 399 763 377 -41 -559 -1574 -490 1515 1168
4271 1168 -934 -2184 77 1681 96 -1328 -571 427 369 432 839 -369 -1497 -744 1484 1264 -732
4288 -732 -1101 218 711 -395 -133 444 -200 -1136 103 1964 807 -1734 -1838 705 1929 531 -489
4305 -489 -632 -539 -396 636 1625 48 -1708 -162 1863 1312 -1080 -1137 2 619 705 863 674 -657
4323 -657 -1140 166 1974 672 -1188 -417 776 761 -197 -181 125 -176 -120 1189 1400 -384 -1314 -357 1046
4342 1046 1295 145 -352 -611 -58 806 923 -119 -1245 -312 1371 1334 -454 -1077 -280 491 686 509
4360 509 1052 33 -1098 -287 994 960 77 -458 -135 388 593 597 240 -1325 -533 1451 1578 -478 -2009
4379 -2009 -712 995 823 -810 -404 708 386 -698 42 260 -232 -206 57 829 283 -677 -205 -157 -366
4398 -366 249 669 174 -1172 -729 566 1240 -563 -1095 64 933 218 -662 -487 -190 94 -40 591 398
4417 398 -373 -1019 -115 422 131 64 145 -147 -352 354 531 -437 -730 -264 735 736 -218 -901 155 310 58
4438 58 14 -61 -105 149 313 270 173 -245 -28 541 407 80 7 -393 -65 306 1069 648 -137 -381 279 844
4460 844 70 -568 182 266 333 200 324 86 -296 -484 391 490 -94 -358 -306 141 211 120 435 -350 -383 92
4482 92 508 -165 -773 -486 210 702 -28 -477 -303 183 132 -140 -217 42 -396 -593 -55 361 76 -132 -468
4503 -468 76 330 563 -112 -576 -662 475 721 -396 -445 -311 198 427 16 -149 -276 163 289 -114 -319
4523 -319 -183 -157 -341 -130 -384 419 94 -357 -542 47 554 22 -793 -620 322 607 -333 -549 -89 203
4543 203 -127 -221 -231 -247 -356 -471 -476 -175 -70 153 -358 -103 -419 -25 193 -272 -431 -201 434 303 98 -264
4565 -264 231 540 277 -269 -321 266 377 -599 62 582 297 -182 -276 221 623 240 -331 -52 291 195 444
4586 444 393 -173 -447 -175 824 500 -421 -647 454 1279 406 -346 -157 152 -111 71 553 438 -455 -565
4606 -565 298 759 12 -807 -399 558 241 111 -50 -105 -441 -215 289 1047 241 -951 -548 300 611 -130
4626 -130 -729 -459 36 72 463 59 -573 -654 359 1130 444 -498 -852 150 621 331 -181 -345 -161 231
4646 231 314 255 293 -463 -859 -504 645 497 -703 -1070 -149 731 677 -421 -1016 -790 -93 379 180 -210
4666 -210 -990 -344 618 651 -282 -979 -478 596 251 -236 -202 -111 -415 -796 397 1011 -507 -1255 -379 1341
4686 1341 1187 -788 -1219 37 791 251 20 67 -68 -485 650 1318 329 -806 -591 1013 858 -216
4704 -216 -442 119 308 -93 212 643 -119 -1121 -466 1438 1129 -565 -788 169 723 320 -313 -362 -186
4723 -186 216 298 429 174 -388 -481 437 838 198 -855 -702 -3 400 767 332 -463 -795 124 685 310
4743 310 -318 -773 -5 862 1093 278 -573 -545 298 669 377 -93 -226 -206 -352 242 666 -52 -929 -649 1067
4764 1067 1551 -131 -1596 -518 1004 925 -104 -193 -495 -274 -74 786 499 -782 -1313 395 1396 399
4782 399 -654 -330 -153 -284 149 624 542 -1271 -1484 1061 1551 -168 -1637 -716 818 755 -180 -541 93
4801 93 -326 -21 736 669 -891 -1206 204 1286 649 -725 -484 6 -103 -10 714 -53 -1261 -916 630
4820 630 1015 -312 -1566 -742 472 864 229 -429 -871 -233 457 982 407 -477 -246 23 759 -33 -142
4839 -142 -225 -509 163 1238 669 -531 -1292 -274 757 431 285 -893 -470 128 761 485 -236 -895 -496
4858 -496 798 706 -471 -1026 -82 482 135 321 88 -406 -880 -234 1306 554 -906 -1115 332 1029 80
4877 80 -575 -243 -98 -195 586 1075 -129 -1314 -813 1000 850 -151 -883 160 287 -43 317 271 -544
4896 -544 -927 170 1121 612 -1078 -869 442 555 -126 -574 -137 -247 -187 211 403 -258 -953 -297 705
4915 705 516 -485 -442 -45 106 232 521 2 -773 -517 277 878 34 -602 -440 492 13 107 -136 -359
4935 -359 -323 331 676 210 -585 -427 140 250 -265 -82 -78 -338 -527 -108 912 26 -1003 -506 818 552
4955 552 -160 -802 -146 642 415 345 68 -556 -475 224 1021 44 -774 -260 581 87 -602 174 88 -508 -351
4976 -351 377 685 -289 -1133 -427 557 220 -333 -307 -92 -82 226 590 107 -456 -676 442 869 -260 -877
4996 -877 -108 708 518 185 122 70 -556 -594 632 464 -227 -178 120 293 80 -486 -183 -370 -340 310 771
5017 771 -14 -872 178 745 142 -410 -130 427 26 -459 -77 393 -80 -680 214 783 -157 -593 -415 -98
5037 -98 -14 -138 206 181 -239 -248 217 282 -214 -589 -1 674 150 -344 -108 289 -380 -570 204 708 -269 -477
5059 -477 -73 649 160 -508 26 439 129 -228 84 147 156 86 378 372 -369 -252 148 -255 -117 -97 202 258 -220
5082 -220 -219 279 217 -120 -33 137 519 137 -38 -109 -103 -197 169 179 -109 -277 477 99 147 -36 172 577 93
5105 93 -428 -166 148 -238 74 324 341 -87 132 243 60 -208 -445 292 319 -28 -38 86 72 -251 -1 440
5127 440 44 -580 -190 299 434 -303 -336 594 484 -159 -454 25 465 -279 -118 180 210 -91 -170 242 29
5148 29 -271 200 68 342 -59 -95 390 -174 -459 -146 644 475 -320 -318 209 563 -267 208 88 -308 66
5169 66 89 411 319 -199 -72 297 464 -43 51 -368 -298 162 250 480 -123 -588 -103 178 -282 -150 86 216
5191 216 104 -325 66 -180 -209 -139 104 73 -189 -79 -296 49 6 459 300 -337 -396 82 664 -117 -414 -358
5213 -358 551 349 -201 -171 -262 123 24 -205 216 3 -276 215 274 -100 -312 -132 68 39 -128 247 349 -406
5235 -406 -393 72 699 189 -597 -425 436 269 -97 -269 -301 207 256 219 -78 -401 -503 -89 356 78 -286
5256 -286 -171 -259 -90 105 27 -80 -516 -237 552 347 70 -384 -179 225 437 159 -317 201 -80 144 123
5277 123 -55 -362 -99 332 294 307 -71 -255 -109 -161 307 220 5 -281 -18 173 508 -189 -487 -233 -144 38
5299 38 -151 -158 -399 -262 360 192 -157 -421 -651 -37 138 228 -468 -594 -253 51 225 229 -294 -330 85 430
5321 430 -46 -32 -170 -52 49 263 6 -438 -40 7 87 71 -63 36 -140 -343 118 144 27 -539 -440 360
5343 360 289 44 -363 -232 191 379 269 12 -211 15 326 254 -186 -220 -581 432 329 35 -16 -348 -8
5364 -8 -183 442 606 10 -743 -60 461 541 -177 -94 -23 224 212 285 -264 -225 -174 -303 171 361 110 -166 -226
5387 -226 219 169 62 -55 -188 130 -139 320 -47 -396 -262 78 471 91 -257 -434 225 -12 119 -368
5407 -368 -118 -57 -185 37 341 -4 -140 -115 -77 -30 -51 4 -320 127 175 23 -275 -83 -568 63 -89 112
5429 112 -285 -610 94 439 182 -263 -246 -16 256 218 39 210 -284 -152 297 455 14 -678 -125 33 224
5450 224 65 -414 -134 117 225 211 -167 -238 -366 90 303 217 -117 -153 13 -57 -100 31 119 11 -99 -126 381
5473 381 190 -12 -315 293 148 168 -13 -280 -323 203 474 31 -359 263 114 294 300 38 149 -405 344
5494 344 267 96 -171 -67 -266 58 52 292 -58 -136 -59 320 368 -233 -327 -227 221 493 30 -407 108 -87
5516 -87 23 -118 347 133 -337 87 501 358 128 -211 -74 224 47 45 48 355 -232 537 250 399 -124 -125
5538 -125 355 584 -4 -543 61 89 26 209 -53 -25 -50 -59 187 326 61 -483 -20 17 -12 -239 135 -277 167
5561 167 -528 151 120 -225 -60 225 149 68 -58 -201 -143 -87 -53 152 -24 -31 -202 189 77 -64 -282 -268 210
5584 210 247 -108 -84 -198 15 330 -7 -450 -269 110 176 -67 100 242 8 -126 -111 379 34 -32 59 224
5606 224 287 -164 230 65 176 -249 -134 271 -57 -320 -298 688 331 -336 -353 136 -11 -19 80 273 145 -337
5628 -337 -86 228 426 -112 -223 291 88 200 -42 137 -67 99 -76 16 -244 -283 238 402 18 -137 -131
5649 -131 289 193 -419 235 274 -24 -76 -89 -94 -26 146 -165 -235 -148 -94 -60 -37 -39 -251 205 300 -14 -318 195 140
5674 140 143 170 90 79 57 79 -81 196 -264 -56 -104 95 -52 -103 252 -187 -257 278 353 -212 -272 2 264 55
5698 55 -518 18 -29 17 -132 -143 261 272 -188 59 52 106 8 -121 9 -92 -248 135 32 -80 -283 149 491
5721 491 -95 -142 98 37 -34 -359 -235 -306 35 -184 61 82 -232 -91 -67 333 -18 -124 24 -150 -219 -67
5743 -67 237 142 -40 115 294 334 -144 210 37 122 -119 -145 239 70 -21 90 86 129 -200 -140 132 420 -269
5766 -269 167 166 6 -5 352 -43 -63 -288 122 392 257 -257 -71 164 -197 -219 -320 298 -128 -514 -121 430
5788 430 98 14 -161 279 324 143 217 7 -183 -331 76 149 -232 -321 -154 77 -52 -106 -124 -180 -51 -265 135
5811 135 177 -260 -114 54 158 55 -347 -249 -190 -166 264 -149 -232 -195 -333 139 -284 -169 57 -77 -225 105
5833 105 158 195 -172 -338 -420 -63 87 -457 31 83 -38 230 72 58 -215 -163 86 25 -194 -504 120 124 -301
5856 -301 -149 175 40 -64 -86 218 41 -386 42 83 212 -49 -512 48 119 -208 11 268 -144 -212 -170 163
5878 163 31 -165 -401 334 90 -52 -212 260 176 -178 -227 520 109 -415 -271 89 329 -231 -389 10 47
5899 47 95 232 79 43 -50 73 142 54 223 -31 76 153 -370 -90 224 35 -271 287 88 -24 21 -278 -173
5922 -173 107 117 77 -161 -132 28 311 -145 -488 -84 238 82 -30 -114 -159 -87 17 107 111 -89 -275 -48 40
5945 40 290 -10 -147 4 283 247 174 -199 -336 -645 -86 358 -7 -175 160 185 113 14 -167 39 -412 -194
5967 -194 -144 182 209 -385 -136 246 125 -246 -272 45 140 43 55 -106 -227 -196 236 107 20 -388 -89 7 169
5990 169 -351 -205 39 -5 -137 197 196 -40 -218 -72 308 -15 62 -78 198 191 294 236 225 30 -20 39 195
6013 195 382 -116 -91 141 -68 -2 -101 -130 -401 -346 316 218 270 25 -295 308 536 256 -143 -36 88 363
6035 363 245 -122 -403 -129 75 87 -141 173 -72 -155 -6 255 388 -131 -387 27 -55 185 -43 -7 -53 107
6057 107 25 188 138 -160 74 -57 188 96 -227 -263 90 -113 235 38 325 -439 50 270 254 -69 -387 251
6079 251 91 140 -8 -186 -155 -131 139 -40 -597 -481 -91 83 93 -80 -241 -425 -69 62 76 72 -265 -184 63
6102 63 -20 95 -337 -374 -52 258 113 -157 -190 -142 66 395 43 138 -405 -661 211 151 140 -188 18 33 -28
6125 -28 157 197 -359 -27 -259 382 293 -339 -227 77 97 192 -162 -34 -72 139 561 252 87 -310 -287 -108
6147 -108 149 25 -139 -22 -194 -4 297 210 -298 -332 -86 458 439 -266 -296 83 313 154 -46 -437 91
6168 91 169 341 242 45 72 114 105 266 140 -231 -268 138 268 120 -331 -50 -180 92 72 245 102 -341 49
6191 49 52 253 208 -232 -412 -72 213 30 -12 -265 -37 -124 438 265 -99 -259 18 439 183 89 -119 -221
6213 -221 -142 454 136 -243 -189 -46 361 77 16 -189 -503 -153 339 53 54 -396 -74 436 297 86 -8 -222
6235 -222 -172 39 167 60 27 -390 328 347 124 -229 -331 71 362 148 -23 -347 -163 -55 555 636 -270
6256 -270 -337 -154 281 117 233 305 -193 0 176 234 -129 -780 -211 236 431 -159 -113 -140 94 213 336 -214
6278 -214 86 -65 113 225 262 51 -425 -176 237 705 144 -62 -421 206 43 442 84 -335 -438 263
6298 263 557 197 -483 -222 166 149 196 -136 117 -5 190 224 153 -324 -233 -222 282 445 107 -60 -560 243
6320 243 343 205 -479 -279 -52 175 77 51 -380 -290 -73 214 371 -157 -428 -98 295 523 131 76 -329
6341 -329 -267 -121 180 579 -318 -266 89 718 118 -498 -318 205 319 -61 -139 48 -67 -22 255 228 65 -240
6363 -240 -217 64 141 -158 -135 63 149 -185 -107 122 136 -205 -61 358 369 -328 -313 156 246 -96 -66 -40 -179 -113
6387 -113 78 139 263 -164 141 121 274 148 -10 -9 -245 275 247 -257 -244 -26 150 382 184 -164 -259 243
6409 243 231 102 69 -256 -62 200 231 -77 112 71 225 45 -212 495 45 24 -251 125 237 -73 -422 -143
6431 -143 274 -114 -38 -300 157 -167 14 18 46 -14 -218 -12 3 -90 -199 -118 303 -57 -144 -44 426 -134 -161
6454 -161 301 160 -175 -507 47 361 246 -299 66 464 -53 -32 14 -9 35 -180 99 98 -18 -132 71 84
6476 84 56 85 248 85 -307 -422 398 338 -53 -110 -207 7 56 15 -234 86 133 -41 22 -21 -152 145 108 -278
6500 -278 38 311 372 -23 -212 161 111 -75 -144 -78 -319 -202 -126 498 216 -467 -82 182 10 -187 68 -204
6522 -204 -145 -234 -132 238 314 -3 -21 479 202 81 -247 284 388 -397 -207 141 286 -395 -245 207 221 -220
6544 -220 -285 110 233 40 105 75 -190 -483 66 158 -216 -168 91 372 376 -93 -387 225 56 318 -10 53 203
6567 203 -417 9 112 -123 -314 -145 -224 -66 -115 104 -242 -317 -181 267 348 -165 -67 171 149 -62 -347 27
6589 27 262 -172 199 328 179 -403 -342 352 330 -247 -97 -4 -53 -18 23 176 -110 -619 114 587 212 -756
6611 -756 -410 91 275 165 194 58 236 -33 182 207 87 -494 -279 331 363 -160 -110 -195 97 137 168 358
6633 358 -245 -490 154 586 277 -535 -344 -23 -114 41 34 -121 -258 -199 112 676 -159 -716 -455 513 590 -137
6655 -137 -275 -214 -29 382 409 74 -249 -395 494 440 -77 -502 -311 218 220 280 -6 -182 -401 337 462 202
6677 202 -6 -324 -317 -28 194 19 -34 -433 -79 495 564 -31 -557 -438 474 241 73 -152 -347 -74 250
6698 250 402 -16 -290 -479 -66 729 178 -347 -475 -38 -123 13 120 -175 -626 -218 646 799 -413 -602
6718 -602 -82 627 148 -281 55 -33 -158 88 205 163 -676 -714 -142 437 191 -329 -37 -197 246 429 9
6739 9 -113 -428 -279 697 523 -321 -429 27 228 96 -68 -273 148 -17 465 130 189 -485 -449 217 243 -55
6761 -55 -148 -402 -203 208 383 195 -383 -434 269 415 201 -255 -119 295 474 276 227 -386 -657 -192 423
6782 423 542 -249 -294 113 330 238 199 -109 -250 -322 369 741 2 -384 -471 130 594 4 -39 8 -218 32
6804 32 192 242 -83 -217 38 597 383 -163 -247 -418 339 306 166 -318 -114 -513 87 523 272 -336 -401 250
6826 250 454 124 -268 -402 110 34 20 299 -432 -421 -13 303 675 -75 -619 -204 94 320 278 -336 -403 -171
6848 -171 397 341 -241 -706 -245 511 6 -149 -145 -295 -107 12 516 204 -144 -332 45 231 197 -221 -557
6869 -557 -145 129 441 304 -537 -559 -832 796 339 -315 -463 -415 234 330 -36 -303 -213 -279 349 280 95 -274
6891 -274 -597 -11 580 239 -238 -429 -298 -116 236 61 -406 -623 2 297 394 -146 -200 -121 380 110 28
6912 28 46 -510 -206 12 235 247 -319 -189 52 261 549 8 -266 -439 268 609 143 -579 -404 73 328
6933 328 211 -174 -204 -259 134 175 31 -348 18 -80 230 423 121 112 -2 -99 149 97 28 -458 -483 10 715
6956 715 115 -417 -92 320 205 -8 -205 -120 -117 19 15 192 3 -438 -347 456 198 89 -455 -197 121 -256
6978 -256 314 17 -183 -137 163 581 66 -544 -314 -150 525 -13 -233 -289 -60 -21 -262 -205 25 179 -69
6999 -69 276 130 -30 -263 -441 -149 473 -198 286 -9 -184 -173 -200 -93 -3 -370 -31 605 -212 3 -324
7020 -324 -242 233 21 -25 -30 15 -374 -105 162 114 -173 -376 126 408 -148 -238 86 59 330 -176 95 -73 -110
7043 -110 97 -12 182 273 -119 -3 158 41 153 248 99 -142 -67 161 304 -86 -307 -302 268 794 -81 -375
7065 -375 -301 99 33 15 36 -193 45 -83 138 86 106 -245 -10 336 212 -302 -301 18 6 -95 40 -22 9 -637
7089 -637 -375 434 128 -29 106 147 387 -106 -67 79 415 -368 -533 267 417 -322 -520 -381 246 224 -367
7110 -367 -150 -49 336 35 -126 167 -72 -67 379 181 -305 -30 -99 189 113 25 -85 -56 -91 -322 174 109 9
7133 9 -96 65 163 306 -39 -329 -88 288 261 179 -159 53 118 155 -68 360 98 -53 -201 -171 185 259 -386
7156 -386 -18 188 364 -15 -108 -60 209 -91 -268 168 -184 -405 127 193 132 140 -112 -133 -317 -186 -195 240 90
7179 90 -375 -65 473 300 -500 -107 458 655 43 -274 293 244 -206 40 300 124 -598 22 385 498 -293
7200 -293 -71 93 254 -183 -5 140 -20 -217 104 670 225 -183 -507 -34 642 -143 -385 -8 74 316
7220 316 218 -2 -179 -54 -142 305 117 55 -152 -182 104 69 615 221 -560 -160 447 258 71 -436 -35 5
7242 5 151 447 -94 -369 -444 513 216 39 -256 -343 176 264 -8 128 250 -8 -149 155 400 14 -444 -316
7264 -316 398 351 -118 -266 95 -176 30 244 122 -510 -526 107 575 -118 -347 -229 370 137 -280 -95 -76
7285 -76 -473 -380 233 683 -197 -728 95 603 379 -356 -421 112 150 322 -106 38 -141 -241 212 642 -43
7306 -43 -160 -22 86 8 395 255 58 -165 105 146 330 -269 -589 42 244 130 -98 -472 -485 99 680
7327 680 507 -489 -409 -256 142 136 53 -191 -249 -172 -100 286 82 -588 -200 354 469 118 -159 -240 -36 131 241
7350 241 217 -57 -603 -323 -38 716 -381 -646 207 226 40 8 199 178 -168 -299 541 703 -581 -660 235
7371 235 844 178 -548 11 362 14 234 66 -195 -425 33 602 489 -536 -516 66 223 399 -189 100
7391 100 -136 -305 -149 711 238 -711 -646 -21 448 14 -388 -455 -252 47 187 -42 -83 -88 -92 120 8 -9 -363
7414 -363 -290 -72 65 521 49 -461 -434 353 911 156 -234 7 92 223 -68 73 -293 -580 85 548 -101
7435 -101 -429 -289 119 249 22 205 146 -115 -49 -120 940 55 -821 -499 722 416 -78 -128 395 59 -178
7456 -178 248 572 -245 -667 -8 718 519 -446 -366 61 437 33 93 -86 -61 -480 414 466 166 -887 -367
7477 -367 631 549 -366 -399 -53 348 51 327 309 -68 -494 -5 336 310 -327 -400 23 455 200 176 -10 -474
7499 -474 -292 181 676 -383 -566 -253 363 250 -291 -174 -386 1 536 120 -137 -726 -137 224 58 -94
7519 -94 -328 -247 -504 16 423 102 -432 -772 -97 402 96 -350 -235 74 151 125 326 101 -407 -460 286 499
7541 499 -351 -631 -70 121 218 -207 -122 191 -339 -472 438 321 -470 -673 -87 760 417 -490 -374 78 -15
7562 -15 447 100 41 -201 -186 587 705 -313 -289 162 431 213 66 -106 -68 -281 -90 554 467 -557 -379
7583 -379 179 343 333 -267 -217 -265 82 312 394 -78 -551 74 656 343 124 0 -244 180 122 511 14 -489
7605 -489 -107 318 521 391 -555 -443 205 438 616 -97 -554 -290 -35 513 352 -103 -155 -205 205 80 -170
7626 -170 -398 -420 -269 49 594 151 -667 -590 196 563 -17 -326 -298 -22 245 293 -16 -306 -336 226 256 186
7648 186 -288 -424 -77 140 73 192 -202 -539 -241 4 438 79 -587 -322 295 450 37 -552 -331 197
7668 197 296 -14 208 -324 -616 109 564 405 -149 -342 -71 -324 29 172 -28 -458 -468 304 546 -230 -387
7689 -387 -161 352 490 33 -236 -389 -333 180 396 441 -358 -271 577 263 -91 50 -163 -16 181 174 486 121
7711 121 -281 81 246 444 -89 -138 9 343 495 252 -149 -210 -304 312 285 54 -300 -103 171 166 313 -11
7733 -11 60 -21 304 355 7 -126 -570 -30 324 16 -71 -769 -309 225 514 -20 -227 -384 418 288 78 -83
7755 -83 -332 115 365 181 9 55 -312 75 337 453 209 -404 -360 195 46 185 -51 -277 -85 107 150
7776 150 189 -448 -178 -94 440 88 -256 -258 -54 52 -68 215 -28 -566 -233 277 733 244 -163 -400 327
7797 327 669 53 -153 -503 155 205 184 9 -189 -330 5 261 11 -61 -20 109 6 182 -37 357 -61
7818 -61 -439 -127 396 289 -35 -573 215 577 238 -348 -349 -17 351 71 -177 15 -15 88 65 268 31 -107
7840 -107 -289 69 -10 4 -366 46 -161 -316 40 203 129 -104 -195 447 254 -486 -213 -127 158 -73 -37 275
7862 275 213 -360 -322 235 354 93 -357 -125 401 217 150 -230 -219 125 43 498 43 -180 -57 86 268 -26
7884 -26 97 -224 42 -184 -43 120 167 141 -239 -45 246 331 -345 -147 -97 322 149 -39 -350 86 242 -114
7906 -114 54 232 4 3 -246 -51 236 -2 -113 219 -23 80 -468 -105 87 -341 -229 486 -95 -271 -288
7927 -288 401 170 -125 -272 284 649 -188 -199 92 554 -230 -452 49 638 -198 -75 -104 618 169 -50 -134
7948 -134 -83 127 -280 444 138 -128 -242 280 269 147 -266 -111 110 267 128 -46 40 204 -268 99 373
7969 373 241 -314 -214 -56 133 22 -190 -283 -94 46 148 -44 -100 -229 28 88 -32 25 -154 -96 91 382
7991 382 364 -115 -351 -44 316 302 52 2 -426 -200 451 658 -300 -652 -215 583 266 -291 -209 304 102
8012 102 141 -247 266 92 -362 -156 296 50 -483 -323 30 359 -231 -525 256 26 -45 22 508 -194 -772
8033 -772 -293 614 333 -461 -426 10 171 276 -85 66 -254 -481 101 722 -19 -335 -461 272 425 228
8053 228 -425 -370 -338 184 316 -55 -483 -511 506 694 144 61 -213 -187 116 379 384 -41 -590 -363 234 646
8075 646 245 -231 -325 28 197 449 210 -638 -619 310 846 189 -360 -467 60 714 144 -143 -275 -22 -254
8096 -254 299 603 -263 -850 -540 989 635 -313 -337 -272 106 276 672 471 -771 -548 207 983 119 -1076
8116 -1076 -289 414 423 122 -83 -79 -496 -317 206 757 -79 -966 -276 691 688 -65 -505 -478 281 568 553 -249
8138 -249 -818 -604 163 873 341 -717 -514 160 499 290 -330 -345 -408 205 639 277 -475 -344 -75 109
8158 109 381 -276 -195 -492 -72 530 335 -345 -820 -177 769 53 1 -240 -133 -58 189 729 376 -680 -424
8179 -424 190 697 290 -458 -455 15 427 161 258 -503 -809 52
8191E2
$$ Imaginary data points
##PAGE= N=2
##DATA TABLE= (X++(I..I)), XYDATA
0 0 0 0 0 -8 8 -8 16 -16 24 -30 40 -48 57 -72 88 -105 129 -150 179 -211 246 -284 332 -380 440 -501 570
27 570 -650 736 -829 932 -1051 1176 -1313 1467 -1636 1817 -2016 2239 -2479 2747 -3041 3365
43 3365 -3726 4133 -4583 5096 -5681 6349 -7133 8059 -9174 10549 -12295 14589 -17760
56 -17760 22453 -30108 44779 -83184 391005 912148 78123 -277899 -28747 301240 113537
67 113537 -45618 34911 171900 128539 174569 251147 164315 -39993 8175 195282 201235
78 201235 37984 30064 82249 -17718 -96194 140177 379124 201012 -161960 -146928 149023
89 149023 195462 -63480 -155090 65655 253745 178989 11816 -77905 -95971 -42811 102746
100 102746 207498 126563 -42837 -88212 2680 81930 70038 -3225 -71610 -46210 94065
111 94065 206082 128543 -58758 -124025 -7726 122534 128272 29165 -93773 -147304 -48247
122 -48247 141039 204078 67475 -53421 1668 72604 -8491 -106737 -54286 43678 48923 47694
134 47694 102197 66055 -94362 -136007 39461 157815 42420 -75836 -551 74631 -19410
145 -19410 -89710 15089 89766 3935 -14187 134979 152808 -87978 -222223 -12344 214829
156 214829 138498 -41220 -35289 42868 6914 -18082 83911 129152 7428 -50150 84485
167 84485 153921 -3351 -129410 -17598 126997 97008 35450 82609 91831 -28629 -85633
178 -85633 31383 120710 37178 -45041 25844 102946 39729 -49777 -29026 29994 35985 38486
190 38486 57250 6676 -90741 -81270 40980 92141 633 -83688 -44579 37417 43980 -22218
202 -22218 -81418 -75411 -4047 65273 42784 -59477 -119699 -75784 -6993 16168 24569 29001
214 29001 -22671 -97692 -79621 15078 33275 -48297 -80481 -12328 35259 -934 -38671 -33084
226 -33084 -31216 -24186 33613 67596 -24033 -137266 -92686 48030 70623 -17088 -27466 39890
238 39890 21903 -62512 -54296 14099 -15202 -82169 -8860 123928 76005 -105018 -139796 6278
250 6278 85155 10166 -47102 -16737 -15687 -54474 -17966 51458 7329 -89905 -53501 69294
262 69294 66233 -57446 -103313 -36901 -431 -13646 20843 61223 -9128 -109987 -70411 47211
274 47211 43630 -57513 -65470 24752 45604 -18321 -34825 29 -16692 -59137 -19549 59122
286 59122 42274 -50068 -72519 -170 52490 28829 -18669 -41112 -33285 3353 36469 5831
298 5831 -58148 -42536 53534 85016 -5339 -82561 -45020 22475 16566 -22808 -16301 16959 17364
311 17364 -9881 -22061 -9325 9278 10653 -20107 -56746 -36827 33346 51054 -25798 -75153
323 -75153 -3946 77356 30041 -76246 -83534 -4218 30589 -2770 -17054 8093 15060 -9657
335 -9657 -23965 -20784 -20804 -14211 5325 2437 -23878 -13958 32108 24768 -45931 -64428 10944 55726
349 55726 -5269 -64083 -23017 39960 19800 -32401 -21989 20603 12359 -28324 -29775 337
361 337 7498 -4861 -6424 -745 2829 12013 9444 -31295 -61538 -16473 55664 44121 -36131 -57332
375 -57332 12502 56561 4234 -60341 -46279 10547 29767 9234 -8290 -11619 -8352 2253
387 2253 8725 -3523 -16631 -10839 -4221 -12704 -9237 19642 30777 -5583 -40110 -16545 28493
400 28493 22374 -25901 -43781 -8555 29575 30254 3913 -22628 -27375 -1420 30322 20701 -24862
413 -24862 -42786 -3859 37509 28580 -11089 -27215 -7375 16851 19712 2885 -15232 -14909 7469
426 7469 26195 15576 -9580 -11141 8037 13309 977 3018 19021 15777 -7270 -10405 18302
439 18302 36059 13025 -22082 -16776 25449 49093 20403 -23505 -23844 21230 54001 27640 -23944
452 -23944 -30038 17117 49420 22431 -20324 -20433 14528 33285 18403 -2121 -4329 3794 5105
465 5105 1828 5231 8332 -2319 -17546 -8660 21516 34441 4807 -34762 -30555 15160 36514
478 36514 -1909 -49773 -39448 16193 45451 16900 -28962 -35282 -518 23182 3558 -29996
490 -29996 -34038 -9602 8318 8736 7573 8969 -3770 -24941 -23324 6946 20412 -11287 -46283
503 -46283 -27901 25944 50041 16448 -34984 -47391 -8205 37242 29050 -29096 -60439 -18196
515 -18196 44613 46698 -8128 -44447 -24836 10176 17584 4435 -10804 -24569 -24834 2550 31471
528 31471 19970 -22227 -40344 -17162 13410 21301 5260 -19673 -32074 -11859 27933 37479
540 37479 -5706 -53104 -42090 15679 49817 26124 -20338 -38148 -12566 30911 44621 4189
552 4189 -47372 -42023 18866 60549 34981 -17758 -33073 -2122 34646 40072 10251 -25429 -29012
565 -29012 6199 40855 34849 2384 -15190 -6800 10703 30024 39483 10044 -43037 -45471 22940
578 22940 71024 24597 -49542 -46123 22545 57269 26358 -16725 -33119 -25027 3039 33776
590 33776 21872 -33515 -54458 -2137 49185 30631 -12329 -18801 -14479 -26781 -13317 32938
602 32938 27661 -46418 -70163 18833 94290 35335 -66276 -59165 26392 52792 3661 -32087
614 -32087 -23727 -6015 18520 47677 35415 -17209 -32471 17268 47244 9673 -21510 4705
626 4705 25467 -471 -7397 39821 54204 -11105 -53093 11630 89397 58455 -33701 -56945
638 -56945 3017 54495 43609 -4445 -36990 -18903 39186 72581 32985 -32636 -39592 10533
650 10533 36184 6599 -23637 -15099 7082 16407 21743 24000 10447 -7639 -9161 -1352 -2557
663 -2557 -7047 -8061 -12074 -6113 26803 53890 25313 -30064 -32456 16305 30729 -10866 -32984
676 -32984 -991 26490 18865 19549 31283 3426 -38916 -12769 56093 48817 -32497 -55551 15020
689 15020 63715 29899 -7956 -1848 389 -13285 10549 49438 19689 -46634 -29988 52639
701 52639 57682 -24531 -52055 7056 33734 -7159 -14035 29824 24531 -34620 -32487 33956 34493
714 34493 -46566 -68428 10227 55248 4374 -37817 -7699 17887 -7189 -18761 5423 -1657
726 -1657 -45036 -43505 13630 38099 1165 -25693 -10584 2368 -3803 1335 5433 -28467 -60927
739 -60927 -17973 60354 59248 -24885 -71939 -22545 42121 37612 -16041 -43737 -17923 22274
751 22274 26604 -5928 -28082 -11707 11520 8317 -1108 9413 11227 -18045 -35383 -1348 34939
764 34939 12976 -30588 -26094 10747 19058 4508 -1466 -11405 -28794 -7566 43710 33914 -48158
777 -48158 -76093 6942 72134 20771 -49252 -25834 26918 11402 -20073 4045 18391 -30943
789 -30943 -51306 23888 75577 7516 -66615 -27046 40978 21716 -19166 8304 31780 -22919
801 -22919 -57260 13990 74684 8797 -71669 -22957 69776 51016 -30370 -38335 6611 8375
813 8375 -6475 21001 31375 -25501 -55429 14116 74882 21445 -54647 -28808 36855 21138
825 21138 -34384 -25081 18167 10788 -13782 11371 36734 -6069 -57117 -28577 34792 38812 -7260
838 -7260 -29450 -16874 -3731 4121 13789 7170 -16683 -18281 14056 32687 5861 -31073 -34248
851 -34248 -7436 22303 32271 12224 -20648 -25170 4097 24623 15559 5112 4270 -6744 -16642
864 -16642 6833 35178 9584 -38156 -17752 53074 61652 -9335 -49186 -8729 30286 18104
876 18104 3704 12993 5621 -11995 8465 35072 418 -44674 -4880 68126 45672 -40707
888 -40707 -45443 25118 33048 -28573 -24730 49588 50181 -36097 -55811 28208 67397 -2623 -56187
901 -56187 -17172 28608 13758 -9412 -4180 -6384 -12753 21414 56749 13098 -62988 -53017 24121
914 24121 38594 -15749 -20636 33680 34404 -29268 -40496 19360 36771 -18225 -39795 13500 45141
927 45141 375 -44226 -20271 26706 31364 5093 -12711 -13254 -3014 12547 13321 -10092 -22876
940 -22876 2182 29582 15848 -17284 -25848 -9409 5934 16845 26445 20010 -6079 -28055 -24470
953 -24470 -4712 11584 15272 1646 -14552 -3601 28500 27004 -21995 -51257 -11856 37969
965 37969 28500 -9718 -15204 -3455 -10646 -9521 21101 29856 -10574 -34546 -575 24145 -13859
978 -13859 -44093 -259 50493 26479 -22306 -16721 7167 -10044 -26724 7854 35940 1
990 1 -38357 -12639 24318 7208 -21362 -5230 15903 -1157 -10072 19008 20568 -36874 -59512
1003 -59512 10240 70529 24473 -50615 -43492 11642 21969 -1896 -120 10893 -6169 -21908
1015 -21908 -1709 15445 -6578 -25700 -570 27705 13753 -11076 -8636 -4174 -20674 -20553 14650
1028 14650 32468 1201 -27275 -10215 15553 5604 -17007 -13723 7984 16909 7120 -10318 -26277
1041 -26277 -24999 2068 29264 21940 -8908 -22336 -11059 -2544 -1907 2091 3776 -5815 -8669 6706
1055 6706 13547 -7806 -28728 -19198 6622 20036 17489 4489 -18721 -34576 -15108 21910 24128
1068 24128 -9218 -21882 3213 14916 -7237 -18027 1619 10872 -5173 -8755 10134 8793
1080 8793 -18139 -21953 8868 24202 3799 -12124 -3098 -186 -11098 -6779 11484 6559 -14046
1093 -14046 -4848 22716 13030 -25673 -30284 6948 25749 5635 -11732 -6819 -5232 -11157 -1121
1106 -1121 16242 6827 -17473 -12944 11932 10352 -14367 -18102 3460 10122 -3901 -5345 6075
1119 6075 229 -17295 -14964 5865 15843 6715 -3484 -9377 -12703 -6630 8729 11140 -5818 -11120
1133 -11120 9050 19858 -3891 -26806 -11204 17245 17367 -2087 -8149 958 5169 1184 -1139
1146 -1139 -485 2300 7266 8912 -270 -8654 -1440 9308 3165 -7119 4104 21736 9772 -19847
1160 -19847 -19711 10900 25289 5973 -11223 -4059 8714 7205 -1337 -4386 -2287 2045 6898 6592
1174 6592 -928 -4431 2347 4592 -3607 -3742 12066 16405 -5976 -21229 -2156 22610 13378 -13104
1188 -13104 -14568 8858 19713 4427 -12450 -8755 6816 15655 10066 -4004 -10780 -817 12447
1201 12447 10407 -3330 -3252 9687 10236 -3832 -6358 7431 12584 -1583 -10384 2741 19128 12903
1215 12903 -7074 -14022 -221 15197 16398 1628 -14442 -12797 6846 20574 8507 -11831
1227 -11831 -10432 8097 15651 5035 -6966 -8126 -3453 2499 8384 8523 -1319 -9855 -3968 8725
1241 8725 10884 954 -6020 -3874 148 2731 5736 3790 -3824 -7774 1191 13556 13158 -305 -12140
1256 -12140 -8610 6213 16845 9960 -8314 -15956 -1016 20545 20427 -3064 -18619 -6691 15780
1269 15780 19454 2078 -13644 -10844 4379 14669 10745 -743 -7089 -3888 3129 8098 8316 156
1283 156 -11305 -12807 1544 16823 12520 -9966 -22085 -5523 19175 18031 -7514 -24599 -13587
1296 -13587 9530 15810 -30 -16620 -14621 434 9990 5422 -3971 -10050 -10509 -5348 2765 6233
1310 6233 335 -12123 -16960 -3245 15827 15322 -8666 -27585 -14736 16077 24358 -4057 -31672
1323 -31672 -20088 15028 25911 1191 -21430 -14528 5808 13249 4393 -6520 -10978 -7612 829
1336 829 8199 6147 -2596 -7697 -4501 954 6145 8130 1002 -15385 -17931 4920 25481 10186
1350 10186 -22754 -24973 7636 28214 10434 -17386 -20274 -2207 11370 11072 796 -12595 -16418
1363 -16418 -55 20306 15334 -10935 -21750 -4897 12782 10697 -1315 -8234 -9275 -5012 5920
1376 5920 14619 5218 -13992 -15325 4864 18304 7138 -11421 -14743 -4743 6926 13647 8667
1389 8667 -7836 -17441 -4486 16914 17773 -4365 -20994 -12587 9864 18859 5341 -14879 -17700
1402 -17700 1184 19937 14960 -6943 -18097 -8855 4281 9145 6377 -2736 -14457 -12366 8995
1415 8995 22064 4882 -20755 -18980 5803 17965 6281 -10753 -17489 -12506 4614 22708 16169
1428 16169 -15477 -29755 -1579 25928 10387 -19925 -18422 3626 7321 -614 3647 6542 -11175
1441 -11175 -21187 4756 31761 11844 -29102 -31109 3973 23356 9735 -7314 -11777 -9379
1453 -9379 3771 21190 13734 -21552 -34030 2184 36228 15824 -26884 -28091 5245 19365
1465 19365 6067 -1305 1753 -5260 -14556 -2510 15500 7138 -18066 -19195 6022 23227 14191
1478 14191 -7303 -20000 -14892 5206 22779 14441 -15545 -30389 -8029 23475 23733 -3348 -21082
1491 -21082 -9322 13598 18790 881 -19589 -19199 1477 17529 14448 958 -9202 -12467 -4288
1504 -4288 13676 20766 545 -23482 -14533 15683 19990 -6960 -21650 -3646 15881 15098 8113
1517 8113 1612 -14106 -24206 -1388 30172 19113 -21763 -28009 7184 24964 5200 -9427
1529 -9427 -431 2418 -6699 2388 18824 1040 -34239 -23332 26248 38475 -2232 -26033 -4889
1542 -4889 10319 -3050 -5575 11277 6712 -18155 -13263 20437 21726 -17954 -31072 6031 32950
1555 32950 12021 -16882 -15926 -4275 -1832 5371 15093 2989 -17613 -7638 21711 18266 -17271
1568 -17271 -28287 1825 23680 8758 -9662 -5742 51 -7714 -5643 15063 25103 2908 -23387
1581 -23387 -18855 6635 18651 3979 -15516 -12476 10498 24614 8998 -17325 -20430 1577
1593 1577 19137 13819 -1993 -9904 -7444 -865 4054 2726 -1356 1539 10920 9300 -5288 -11592
1607 -11592 -470 4406 -4136 -1257 17502 14816 -16663 -27072 6846 33081 8628 -23999 -13003
1620 -13003 15729 11286 -10459 -8050 5013 -206 -3688 15046 23005 -9045 -34852 -11615 22569
1633 22569 16308 -5814 -2556 8022 -6083 -16528 4911 21864 -548 -21598 1012 26161
1645 26161 4114 -27980 -14467 16522 13702 -5703 -8 12189 -1557 -16990 -1319 16805
1657 16805 2112 -17354 -2238 20978 9332 -17965 -15420 8697 15120 4331 1230 1342 -9533
1670 -9533 -16270 -1551 15712 11203 -4318 -6896 1439 4170 1064 -2149 -4693 -7204 -1360 10540
1684 10540 11887 -2869 -16494 -12179 2722 13106 9620 -2653 -11250 -5570 4493 1245 -9290
1697 -9290 -5716 8604 8430 -5923 -10878 -172 4316 -2890 -2019 7661 3871 -11682 -11462 4247
1711 4247 5620 -6689 -3270 13197 8350 -11010 -8536 8887 1821 -20017 -9402 24740 24004
1724 24004 -12480 -24943 1960 16869 21 -8370 6949 10238 -8234 -10746 6244 8617 -7116
1737 -7116 -5157 13497 10524 -10211 -8088 11339 6381 -15362 -9080 18625 17560 -12680 -18586
1750 -18586 6251 13975 -5727 -9101 11948 15888 -8181 -19637 -2510 10171 2747 -3681 2309
1763 2309 4766 -1180 -2572 423 -2559 -6525 1064 9658 2277 -9720 -6150 5182 2907 -5478
1777 -5478 -814 8408 5213 -5266 -7161 -1909 -150 -556 1799 4144 2788 70 -3345 -6702 -3805
1792 -3805 7412 11691 -831 -12971 -5789 7899 5221 -5765 -4168 4493 2799 -1349 3754 4146
1806 4146 -10685 -17291 1437 19108 7725 -13141 -10812 4713 4184 -4791 -2141 3910 -2360 -7965
1820 -7965 880 6339 -5891 -13711 -145 11215 1089 -8584 -743 4123 -8454 -12333 5631
1833 5631 13914 -5562 -18969 -1127 17280 2002 -20635 -12934 10719 14204 -1331 -9415 -8696
1846 -8696 -6756 121 9950 6724 -8594 -11747 2408 9405 -2410 -10492 -3034 2945 -2114 -1835
1860 -1835 7747 4990 -12533 -16266 2771 17164 6206 -11816 -12597 -1561 5587 3881 -3580 -9336
1874 -9336 -5267 6798 10002 -3756 -16053 -8085 7863 8342 -2906 -5935 -1484 -2467 -5340 -566
1888 -566 4661 -852 -8612 -3269 6631 5427 -3888 -9884 -8499 -540 10384 12918 -2594 -19668
1902 -19668 -12903 11728 19013 -838 -17136 -7211 9207 8281 -1639 -5548 -4166 -1790 4544 10891
1916 10891 5128 -8967 -11334 533 8859 5585 609 -190 -3127 -4990 2619 9633 1649 -11351
1930 -11351 -6323 11877 14511 -2771 -14303 -7430 5000 9949 6831 -1166 -10760 -9405 4741
1943 4741 14417 3852 -12837 -11658 4610 12179 3819 -6317 -9701 -6023 3098 12373 8428 -7661
1957 -7661 -16003 -4236 9672 8565 -761 -5197 -4487 -1576 3561 7679 1831 -11099 -10909 5136
1971 5136 16492 6311 -10836 -12014 -53 10159 9949 1348 -8766 -9748 2969 14014 7182
1984 7182 -8817 -10640 3121 12556 6690 -3940 -6708 -4510 230 8579 12819 2758 -11885 -10425
1998 -10425 6548 15868 5390 -9246 -11165 379 11810 11465 -1074 -12568 -8840 8238 17346
2011 17346 6960 -9412 -10291 1456 8873 5998 588 -2635 -4660 -1441 7022 10958 2180 -8425
2025 -8425 -6686 5888 13425 6942 -6497 -11546 -2670 12375 16019 2214 -12025 -8239 8414
2038 8414 15027 2338 -10608 -7880 3943 10671 8504 1146 -5597 -5535 2397 10775 7930 -3948
2052 -3948 -10585 -4890 5963 9828 4459 -4361 -7882 -1249 10099 11426 -1538 -12957 -7874 6812
2066 6812 11687 2118 -8225 -8954 -582 7378 7864 1198 -7630 -8652 -432 8450 6197 -6158 -12735
2081 -12735 -4835 8229 11077 1410 -9943 -9500 1832 9619 4311 -7476 -11232 -4249 5920 8422
2095 8422 2191 -5870 -6264 634 6521 5178 -2403 -8595 -7566 455 7977 6832 -2688 -9803 -4661
2110 -4661 8681 12381 538 -12489 -9143 4987 10675 2818 -6748 -6756 850 7218 6148 1563 -3491
2125 -3491 -4649 -707 4073 5783 73 -6482 -5839 2134 10655 8783 -2267 -10411 -4341 8251 10842
2140 10842 -1158 -12533 -8246 6255 12957 3894 -7763 -6956 3951 9100 2482 -5370 -5494 -1589
2154 -1589 109 -95 2659 4725 0 -6451 -2978 6866 7589 -3578 -11530 -5424 5440 7840 -187
2169 -187 -8415 -8438 570 9533 6881 -5640 -12881 -3954 7606 5029 -6683 -9064 45 4248 -688
2184 -688 -2133 1606 -350 -7005 -5473 4026 5601 -4362 -11193 -4422 4341 4564 57 -2656 -4465
2199 -4465 -4059 1181 4681 -1366 -10720 -7605 4866 8376 -648 -7470 -3647 1482 1727 184 -56
2214 -56 -2549 -6242 -4062 3613 4883 -1240 -6127 -2280 3035 3961 -756 -4777 -4737 -1338 2078 3073
2230 3073 86 -4034 -4878 -1570 3943 5276 -499 -7343 -5068 3501 5556 -2325 -7746 -2545 4191
2245 4191 3411 -1150 -1734 -1133 -3878 -2341 4076 4392 -4067 -7345 -417 3884 -399 -3040 1181 1436
2261 1436 -4998 -3957 6163 5760 -9061 -13140 3952 14882 1200 -13377 -5787 7426 4946
2274 4946 -4431 -2535 2418 -1940 -5085 1209 4755 -3048 -7182 1934 7893 376 -6569 -296 4285
2289 4285 -3821 -7352 4311 10039 -3082 -12983 -1189 12633 4951 -9776 -6549 6279 6314 -2831
2303 -2831 -4627 -375 192 -1373 2681 5727 -403 -5701 -1785 4156 2932 -1348 -756 1519 -545
2318 -545 -1570 1732 3660 -134 -3145 877 5754 3771 -2409 -6207 -2138 4152 5037 990 -2595
2333 -2595 -144 3290 1037 -2410 -537 3325 1117 -2960 318 5223 222 -6822 -1743 8107 6398
2348 6398 -3607 -4591 1926 1150 -3407 345 6560 1177 -6934 -736 9458 3337 -8971 -4852 9026
2363 9026 6963 -5137 -4607 4398 1266 -7058 -496 13150 7585 -8589 -7594 7791 7764 -5958 -6688
2378 -6688 5865 7061 -3311 -2811 6907 4403 -7111 -4202 9482 9291 -4577 -8221 1272 4831
2392 4831 -1202 -508 6355 2934 -6197 -2935 8165 4504 -8223 -6965 7777 10975 -2103 -9522
2406 -9522 -2436 4614 1822 -1170 1782 2831 -1525 -4372 -1403 2170 1109 -1058 -1391 920 3938
2421 3938 3168 -2891 -7941 -4217 5003 7944 922 -6270 -5862 532 5608 5133 -780 -5310 -1457 4662
2437 4662 3034 -5293 -5992 2329 5627 -698 -1839 5072 3610 -8461 -9487 6957 14128 -265
2451 -265 -12570 -2907 8407 2224 -7764 -3088 5618 3266 -1267 2177 1423 -7537 -7609 5669 10651
2466 10651 -2278 -10133 -367 6663 -2344 -7286 2945 7319 -4646 -9983 3506 10657 -5023
2479 -5023 -15480 -1195 14721 7303 -7687 -7042 -430 -2462 -4571 4096 8341 -1573 -8824 -493
2493 -493 6658 -578 -7995 -1928 6433 3787 -2008 -1062 -536 -5315 -4746 4349 8028 241 -5029 -327
2509 -327 3667 -1000 -4466 -238 4089 2273 -343 -518 -1206 -3835 -2414 3121 6624 3911 -2098 -6301
2525 -6301 -5748 608 6238 3415 -4055 -4260 3918 5631 -2319 -6945 -2185 3047 2617 2278 3414 -1277
2541 -1277 -8006 -5155 4261 6128 593 -545 2077 -1486 -6641 -2329 6790 3678 -5552 -1914 7545
2556 7545 3640 -9565 -7970 5704 9651 -212 -4097 945 584 -4916 -2569 4875 3022 -3775 141
2571 141 7602 1556 -10217 -7349 4571 5818 -1299 249 4855 -2401 -11986 -5261 9719 9544 -3958
2586 -3958 -8272 324 3836 -1574 -4262 -883 -608 -868 2938 4527 -2903 -8554 -3349 4274 2960
2601 2960 -980 328 1430 -3766 -6760 -485 5659 1982 -3220 -24 4067 509 -5769 -4797 761
2616 761 3731 4318 2027 -3575 -5856 -872 5809 3684 -3207 -3312 2526 3670 -722 -1973 -359 -1330
2632 -1330 -1463 4372 7707 748 -8346 -6240 3250 5744 1615 490 333 -2999 -4208 2401 5545
2647 5545 -533 -5537 -111 6472 2833 -4365 -4070 -184 650 1951 4944 2850 -5199 -6770 2320
2662 2320 6947 -498 -6179 218 6739 1969 -4858 -3649 631 487 854 4435 4415 -2967 -7283 -2354
2678 -2354 4572 4144 412 -917 -1692 -1622 2267 4298 -1937 -8383 -2604 8583 8473 -3043 -8745 -2599
2694 -2599 3776 2807 1036 1341 -96 -4014 -3548 918 2389 -677 -1578 396 1062 681 512 -2233 -6463
2711 -6463 -3603 5646 8243 -1929 -9582 -3572 6040 4519 -4191 -5288 676 3028 656 -1681 -2034
2726 -2034 -2910 -1389 3749 4927 -394 -4004 -2446 -812 -203 2006 4503 1143 -5994 -4281 5261
2741 5261 7317 -1486 -7932 -1177 7020 5640 -1531 -4565 -3161 459 4440 5940 1322 -4421 -3173
2756 -3173 2000 3540 194 -988 764 934 385 1479 2250 -1829 -4687 429 7108 5449 -2607 -5662
2772 -5662 -1579 2957 3203 1465 -992 -2514 -310 3892 4206 -1513 -5479 -1783 4661 5167 1021 -2434
2788 -2434 -3682 -2391 2343 6597 3632 -3934 -6034 976 6197 1940 -4108 -3538 844 3343 2856
2803 2856 1631 -1865 -4750 -2755 3664 5614 -465 -5282 -3337 1011 2912 1742 -1134 -3802 -3069
2818 -3069 2020 5702 875 -7305 -6408 2298 7096 1531 -5228 -4632 80 2248 1966 -2 -2436 -4127
2834 -4127 -1618 2477 2869 -706 -4010 -3289 843 4357 4157 -1514 -6348 -4174 3810 7804 1672 -6716
2850 -6716 -5749 2148 7015 3405 -3081 -4610 -471 4077 4283 -129 -3960 -2759 1909 4081 3125 570
2866 570 -2079 -2855 -738 3670 4042 -594 -5357 -2428 3862 5385 486 -5168 -4031 2334 6208 3679
2882 3679 -2634 -6419 -3305 2652 4693 722 -4102 -3372 1095 4175 2751 -1299 -3778 -3051 473
2897 473 3628 2743 -2505 -5631 -1837 3983 4997 257 -4461 -3768 1418 3502 1313 -2245 -3247 -975
2913 -975 2054 3891 1400 -2684 -4466 -1408 2917 3496 -780 -4491 -2743 2164 4252 1361 -2882
2928 -2882 -3694 -651 3154 3924 -249 -4092 -3398 1136 2812 -33 -3149 -2778 -176 1964 2260 836
2944 836 -1227 -3781 -2781 1673 3360 -625 -5406 -3490 2636 5055 341 -4417 -3754 863 3220
2959 3220 806 -2749 -3880 -1257 1707 2926 1110 -928 -2139 -733 74 447 -27 -1514 -2354 -957
2975 -957 1896 3366 1163 -3132 -3982 729 5186 2081 -4637 -5742 246 4969 1943 -4355 -3609 920
2991 920 2523 220 -1316 -1329 -1425 -2233 193 2647 582 -3234 -2658 841 1831 313 -1217 -1891 -3381
3008 -3381 -1572 2580 3448 -2668 -6308 -270 6305 2889 -5286 -5474 1248 3370 -667 -1885 331
3023 331 1 -2975 -796 3053 1955 -2588 -3125 1449 2470 131 -1822 -745 -569 -285 2007 3326
3039 3326 -869 -4940 -1426 4706 4007 -2038 -4066 319 2888 406 -1530 -368 218 -56 782 2579
3055 2579 1452 -2559 -3471 -546 2598 1898 -383 -1248 -372 1299 1405 -346 -1720 -1034 245 1125 1236
3072 1236 571 -1291 -2275 -500 2631 2963 -1028 -2473 -487 1870 1516 -238 272 181 -409 667 2486
3089 2486 472 -3112 -1917 3762 4473 -1579 -3525 1366 3003 -1392 -2842 2303 4540 -1262 -4379
3104 -4379 1438 4992 263 -4391 -1164 3217 909 -2081 -10 1103 -1342 -1634 2974 2988 -2790 -4443
3120 -4443 1651 3730 -2088 -4927 1784 5683 -788 -5381 19 4636 441 -4810 -1126 4213 1687
3135 1687 -2788 -2031 1774 737 -641 489 1646 -323 -1679 624 1658 -1085 -1736 1488 2972
3150 2972 144 -1710 566 1665 -330 -1914 758 3447 1524 -1976 -2345 264 1997 1737 -332
3165 -332 -1299 170 1721 797 -1095 -862 773 976 -200 959 2288 -312 -3008 -734 2862 1877
3181 1877 -1359 -1080 1296 756 -1422 412 2785 -47 -3188 39 4133 774 -4401 -1751 4222
3196 4222 2849 -2815 -1934 2396 898 -2622 -66 4400 921 -4539 -970 5856 2994 -5143 -4187
3211 -4187 3289 3681 -1887 -1703 2689 958 -3365 -501 4869 1862 -4781 -3289 2805 3014 -1513 -1722
3227 -1722 1855 950 -2427 -428 3365 -100 -5345 -2139 5010 3868 -2620 -3902 1141 2607 -593
3242 -593 -1885 -54 496 120 886 1462 -509 -2296 -459 2122 1523 -734 -1077 -356 23 1143 2746
3259 2746 1435 -2390 -2655 1040 3195 1373 -1395 -2255 -189 2561 3425 351 -3500 -2781 2081 4337
3275 4337 224 -2690 -346 1915 -103 -1444 1657 2310 -1902 -3114 2120 5185 -792 -5113 -1440
3290 -1440 3677 2404 -891 -1389 -520 -955 640 3980 1733 -5046 -4692 3528 6545 -1236 -5952 -656
3306 -656 3348 833 -1758 1208 1762 -3471 -3986 3289 6165 -743 -6469 -1543 4612 3411 -1487 -1884
3322 -1884 -920 -1455 175 3367 1486 -4428 -4707 2469 5340 329 -3977 -1977 895 392 120 1234
3338 1234 -889 -4541 -2376 3735 4169 -2381 -5512 -1077 3518 2161 -1927 -2963 -2751 -787 2640
3353 2640 3071 -668 -4196 -2605 1041 2145 170 -1457 -2135 -2625 337 3919 2436 -3861 -6060 213
3369 213 5320 2239 -3315 -4038 -907 1697 3222 2055 -1875 -4536 -1442 3785 2873 -2081 -3295 31
3385 31 2054 356 284 1201 -1533 -4386 -17 5647 2973 -4851 -5836 1403 4959 1394 -2349 -2257 -989
3402 -989 109 1799 2026 -2378 -4862 -278 5299 2749 -3472 -3890 285 1706 246 871 1082 -1536
3418 -1536 -3821 -40 4649 2081 -3686 -3364 1387 3600 980 -1391 -2534 -2328 265 4300 3494 -2789
3434 -2789 -5176 -64 4299 1755 -2348 -1900 357 919 534 951 -415 -2555 -1430 2428 3578 -466
3450 -466 -3431 -1727 513 755 1071 1074 -1565 -2890 134 3163 500 -4596 -3611 1958 4056 851 -2556
3467 -2556 -2593 -1716 -18 2401 2714 -1481 -4419 -1342 3672 2200 -2128 -3029 183 1900 1190 1089 -102
3484 -102 -2507 -2240 2166 4396 1104 -3161 -1978 1735 1982 263 -185 110 -1017 318 3292 2505
3500 2505 -2142 -4002 957 5024 2739 -2066 -2711 -558 1591 1849 1286 -1139 -2849 -509 3458 2385
3516 2385 -2067 -3157 -219 1991 1663 560 -398 -2558 -3405 314 4604 2485 -3163 -4080 67 2703
3532 2703 863 -1777 -2249 -752 1236 2917 1082 -2873 -4427 45 3623 1754 -2103 -2183 -51 75
3548 75 104 1485 1161 -1170 -2458 846 3088 409 -4143 -2724 2057 3861 1971 -1071 -2731 -2490
3564 -2490 578 3219 2006 -2427 -3151 995 3474 1259 -1653 -1741 107 883 627 1350 753 -2508 -2567
3581 -2567 914 3592 1251 -2088 -2737 -372 1254 1003 -100 -1553 -1409 1056 2446 917 -2104 -2438
3597 -2438 307 1828 821 -291 -351 -511 -437 408 1549 458 -1365 -1082 967 1885 596 -1103 -1055
3614 -1055 132 1684 1904 68 -2575 -1814 1323 2277 724 -912 -412 395 267 177 282 -30 -984 -365
3632 -365 1553 1408 -547 -1649 -739 1337 1225 304 -490 -754 -1110 -90 932 571 -984 -282 1178
3649 1178 289 -1451 -1175 197 258 -360 201 1139 469 -1317 -1213 719 1396 73 -1386 -352 365 833
3667 833 22 -739 -452 450 1436 1028 -639 -746 252 946 -109 -411 459 1095 143 -850 -124 431 437 -511
3687 -511 -280 436 758 409 -683 -963 108 1270 711 -638 -1019 301 1296 212 -978 -1061 856 1106
3705 1106 -785 -1218 -239 747 187 -583 -580 335 49 -836 -448 95 -81 4 82 -596 -516 166 184 -239 -920
3726 -920 -610 306 443 -1478 -1183 187 994 90 -993 -336 129 -349 -802 -345 106 120 -810 -366 312
3745 312 101 -584 -996 -219 -55 -268 -316 -137 -40 -553 -548 137 434 -275 -762 280 492 -3 -715 234 231 -285
3767 -285 -94 395 508 -764 -853 311 900 -189 -217 655 1024 -305 -717 233 799 -337 -1163 -222 1809
3786 1809 1147 -849 -1235 11 648 331 -122 -620 -288 620 1282 189 -555 -855 556 967 330 -889
3804 -889 -442 28 118 89 398 915 164 -975 -775 699 1167 -50 -1793 -1109 899 2584 258 -2006
3822 -2006 -869 1437 1524 315 -728 -408 311 367 1148 1261 33 -1689 -441 1315 1134 -255 -421
3839 -421 159 -130 362 1497 1060 -1371 -2283 815 3446 922 -2612 -2189 1651 2459 -312 -951 532
3856 532 21 -995 568 1704 379 -2298 -1093 2099 2109 -230 -1906 -797 -20 326 1221 1194 -1180
3873 -1180 -2602 158 3065 1520 -2558 -2584 1017 2655 664 -1218 -979 -126 -61 483 1600 435 -1792
3890 -1792 -1470 930 1983 525 -1686 -1092 345 1636 1259 -47 -1466 -957 670 1616 498 -1030
3906 -1030 -1386 -273 1116 1506 224 -1360 -1063 423 1427 455 -783 -1115 -424 -57 917 1038 -493
3923 -493 -2076 -677 2309 2227 -1585 -2772 250 2050 608 -1033 171 589 -394 -881 1055 1663 -1526
3940 -1526 -2270 1131 2820 762 -1814 -314 916 -420 -235 1401 577 -1955 -1303 2267 2944 -1736
3956 -1736 -3243 776 3264 386 -1786 -645 1426 -185 -1457 803 1682 -553 -2250 192 2218
3971 2218 751 -1626 -794 757 529 -257 627 39 -1664 -1200 1866 2077 -813 -2640 -107 1989 831
3988 831 -1307 -767 486 437 -47 92 177 -367 -809 83 958 672 -420 -1100 -598 1069 1689 505 -1521
4007 -1521 -1623 479 1473 222 -738 -580 24 745 1173 653 -1124 -2078 -297 2228 827 -1096 -1336
4024 -1336 401 589 -392 -190 474 -738 -1822 253 2471 -5 -3323 -1444 1721 1877 -755 -1337
4040 -1337 229 -115 -1697 491 2151 -220 -3119 -1066 2454 1892 -1997 -2432 793 1565 315 121
4056 121 298 -1452 -2464 357 3453 857 -2453 -1537 1533 1454 -958 -1112 474 382 -708 593 1980
4073 1980 -23 -2773 -1155 2077 2116 -632 -1488 -720 116 733 907 110 -1184 -1213 1085 1768 -562 -2667
4091 -2667 -905 1230 1342 134 -380 -963 -1221 -313 1341 912 -738 -1723 -402 633 245 8 -940
4108 -940 -1548 -737 1581 2151 -701 -3731 -1151 1721 1421 -612 -908 134 -525 -660 496 738 -792
4125 -792 -1655 522 1445 -252 -1747 -682 507 82 -456 918 537 -2061 -1816 1017 2400 -848 -2843
4142 -2843 13 2118 509 -1903 -949 426 -176 -225 802 1031 -1322 -2378 145 1930 -64 -986
4158 -986 -248 11 -737 -361 795 171 -1864 -1695 1501 1888 -687 -2029 -325 753 -19 -401 342 153
4176 153 -781 -788 872 1045 -161 -534 607 609 -219 -223 4 -174 388 1265 1364 -455 -1424 250 1744 746
4196 746 -1083 -285 924 637 -212 481 617 -725 -979 1109 2180 167 -1299 -429 372 375 517 1217
4214 1217 365 -1192 -520 1370 989 -1078 -1446 925 1478 -325 -1321 186 490 -1005 -426 1249 909
4231 909 -1225 -1205 411 1400 -310 -399 181 216 247 128 309 -931 -1603 706 2293 348 -1952 -1657 1102
4250 1102 1077 -118 -555 -14 -96 -553 52 1199 92 -1430 -376 1044 1080 -265 -542 -565 -594 288 1787
4269 1787 961 -1505 -1770 518 2006 8 -1487 -500 1083 631 163 7 -758 -1168 -404 1588 1065
4286 1065 -766 -1262 141 1007 -11 -45 596 110 -735 601 1638 451 -1951 -1362 1458 2235 15
4303 15 -1321 -659 146 155 782 863 -399 -1664 -50 1777 1131 -1211 -1202 410 1097 698 218 207 -856 -766
4323 -766 587 1716 177 -1448 -723 1066 775 -281 -451 92 91 46 875 984 -403 -1067 175 1388
4341 1388 1428 -450 -767 -308 -65 503 621 -628 -1315 189 1140 847 -801 -1117 20 539 393 262
4359 262 -43 -541 -877 -173 944 537 -619 -1146 -47 450 179 -79 -784 -960 -295 1156 1061 -989 -2123
4378 -2123 -86 1432 663 -963 -464 537 183 -401 -419 314 -135 -143 229 460 99 -1071 -493 79 -19
4397 -19 372 273 -25 -1063 -885 1063 996 -414 -948 323 1325 483 -685 -248 253 561 139 322 393
4416 393 -428 -580 6 911 -29 -401 -3 488 152 -46 344 -104 -851 58 830 291 -787 -741 48 595
4436 595 31 -197 -336 -64 -44 42 92 -305 -431 31 308 -56 -455 -239 -64 -120 189 892 494 -511 -520 227
4458 227 492 21 -579 132 518 720 3 104 216 68 -67 297 701 -175 -603 -234 695 393 356 -131
4478 -131 192 -351 14 495 53 -532 -456 390 685 -139 -737 219 152 280 -205 17 37 -61 -83 -502 160 205
4500 205 -282 -347 296 336 17 -665 -601 -268 495 665 -177 -1030 -170 530 -49 -3 -550 -30 272 -21 -288
4521 -288 -344 -171 -95 123 -105 -97 179 31 -547 -392 268 376 -255 -895 -145 422 704 -164 -277 -140 396
4542 396 -194 -501 -350 24 -190 -324 -71 207 159 39 -226 -94 -110 162 -137 -597 -258 7 578 323 -223
4563 -223 -615 218 748 143 -452 6 91 -143 -154 162 583 160 -340 -460 673 782 30 -552 -216 417
4583 417 624 218 -77 -78 -243 180 731 452 -642 -350 449 775 353 -482 -313 336 262 273 651 336 -328
4604 -328 -281 631 646 -121 -1025 -521 489 680 111 -273 -246 -388 -516 606 449 -390 -1074 -493 821 568
4624 568 -301 -793 -384 49 430 228 -297 -1031 -548 432 641 -284 -1030 -742 348 1124 -265 -871 -220
4643 -220 70 307 140 88 -22 -290 -390 36 734 437 -602 -964 35 1260 392 -721 -591 87 531
4662 531 524 96 -355 -762 -89 680 533 -401 -969 -239 1047 699 -520 -1062 163 28 -414 270 982 -380
4682 -380 -1162 -172 1306 628 -1167 -1063 722 1043 87 -391 -41 45 -128 429 948 170 -1020 -332 1100
4701 1100 835 -349 -477 562 787 -196 83 391 -267 -967 -281 1589 1088 -873 -1399 165 1104 346
4719 346 -383 -258 163 290 421 438 -224 -1076 -34 511 1023 3 -949 -556 151 609 452 -169 -888 -690
4739 -690 -2 816 -54 -346 -453 36 557 684 -165 -934 -637 255 576 169 -236 -641 -116 90 89 632 -149
4760 -149 -1057 -495 904 1106 -891 -1738 -360 1056 803 -555 -892 -221 -272 107 675 296 -1071 -710
4778 -710 617 1417 -230 -1265 -256 403 236 -96 179 78 -1307 -1039 1195 1419 -488 -1617 -377
4795 -377 1500 943 -292 -307 -118 328 -31 708 49 -840 -986 548 1407 509 -882 -337 460 246 -69
4814 -69 563 98 -846 -288 1300 1247 -296 -1217 -323 1126 806 -155 -715 -641 186 687 860 -45 -918 -553
4834 -553 459 492 142 -185 -148 27 341 909 248 -528 -1099 269 1134 701 -538 -477 -229 512 613 614 -357
4855 -357 -683 -239 1296 889 -721 -932 60 1051 328 246 -198 -471 -868 81 1028 624 -1036 -797 395
4874 395 911 134 -1247 -320 142 89 102 665 -480 -1630 -391 1269 646 -817 -1163 -86 231 -430
4892 -430 -168 235 -433 -580 238 1079 2 -1325 -905 685 679 -180 -782 -69 140 4 330 373 -530 -562
4912 -562 -85 771 435 -674 -347 -49 181 299 73 -80 -725 -364 736 990 -112 -960 -136 621 624 -416
4932 -416 -502 -666 -21 111 623 -166 -675 -68 516 706 -104 -228 298 28 -253 442 378 -218 -993 -178 903
4953 903 763 -732 -802 -236 454 162 56 -65 -342 -454 731 904 -123 -1004 39 795 576 -643 -141
4972 -141 499 -105 -377 443 954 -106 -781 -125 940 478 -442 -237 -104 155 31 201 103 -318 -622 599
4992 599 848 -328 -688 90 373 208 110 -193 -134 -499 -233 517 550 -553 -543 351 629 -26 -756 -305 -360
5013 -360 30 245 368 8 -549 -181 523 80 -502 -76 245 3 -378 -242 354 194 -554 -108 799 8
5033 8 -889 -388 251 578 -227 -20 261 -96 53 414 38 -112 -518 283 845 88 -387 309 242 -386 -183
5054 -183 288 489 -186 -441 45 648 282 -588 -25 566 53 -226 167 -26 -27 320 331 157 -499 -459 -91
5075 -91 632 -128 192 447 350 -502 -122 263 16 60 -416 161 456 -60 -141 -64 124 103 217 164 -111 -323
5097 -323 42 96 -139 95 446 343 -81 -290 408 567 -65 -330 378 337 -219 -205 232 223 4 -19 184 255
5119 255 83 -374 -15 -70 -276 -1 399 198 -764 -475 286 85 -236 -276 119 395 -410 -269 -136 200 -170
5140 -170 69 139 104 -95 -477 -7 135 -262 -289 27 67 -194 18 190 117 -307 -270 424 127 -380 -399 176
5162 176 370 -251 -42 62 8 -190 0 -30 -104 -109 -23 179 146 45 -341 14 47 -64 204 191 -295 -173 -87
5185 -87 224 -256 -288 264 -208 194 136 139 234 -540 89 232 43 -223 -142 60 -92 -92 38 62 -105 -337 228
5208 228 318 119 -401 -121 788 525 -466 -420 287 233 57 -138 45 122 174 102 -29 37 -231 50 92 164 126
5231 126 -218 185 -373 -309 98 453 -524 -855 -498 270 413 -202 -396 -120 -62 26 27 -323 -442 -81 -16 297
5253 297 -221 -468 -398 -451 -247 -182 -46 -203 -145 -319 381 238 -476 -442 -69 319 302 -30 -361 -460 -250 160
5275 160 150 -121 -230 -228 74 264 -128 -247 -109 -297 48 611 -53 -18 -152 -50 472 -34 -384 -282 -230 326
5297 326 110 229 67 -178 25 366 185 -281 -462 -198 175 469 61 77 -162 59 26 173 -88 -510 -430
5318 -430 167 395 58 -212 -444 204 -175 359 -359 -177 -34 -75 416 106 -34 -416 168 151 459 419 -348
5339 -348 -91 -60 479 301 -23 -626 -368 34 489 117 -260 -142 -70 501 303 221 65 -151 56 338 137
5360 137 -8 -224 7 -81 100 409 -57 -401 -173 413 384 -52 -492 -298 361 237 -136 -401 -72 -142 71
5381 71 -49 -178 -246 -147 315 131 181 -20 -480 -12 -9 -28 196 -251 -481 -91 274 251 -75 -505 -139 361 57
5404 57 -138 -549 -311 80 310 475 -322 -63 -210 -82 251 21 -231 -50 104 163 87 173 -109 164 -288
5425 -288 91 160 -4 -202 -266 169 205 -150 -687 -131 416 232 -120 50 -17 -116 -344 247 481 114 -293 -268
5447 -268 415 473 206 -125 -8 44 121 124 110 -226 -255 121 548 274 -149 -146 134 169 447 236 -251 -30 -54 190
5471 190 69 115 -61 -126 264 432 230 -238 -290 84 387 376 -125 -104 42 -164 -43 322 -74 6 88 259
5493 259 -141 125 10 -371 -39 109 50 -182 199 -152 98 164 503 -333 -193 -43 279 302 -402 -344 373
5514 373 389 -142 -164 -58 60 -110 230 192 201 -33 -434 -117 132 146 -234 -222 178 183 153 87 -126 -528 -335 -86
5538 -86 319 -46 -220 194 279 -41 -110 -37 175 -138 -177 -65 14 -128 -404 399 208 -174 -32 -40 -82 -88 118 -15
5562 -15 174 -40 12 32 426 -207 -39 40 119 424 -69 -46 -100 -257 -10 -87 60 -36 75 -36 185 -275 85
5585 85 -297 -158 229 18 -13 81 -30 169 374 -169 32 2 -6 -248 -207 98 44 -207 -69 -42 7 -299 -183
5608 -183 80 181 -162 183 28 -51 -160 -300 236 44 -80 -255 102 265 -271 -140 -111 -39 -197 -271 184
5629 184 120 28 59 48 211 45 -386 208 -198 2 -107 15 -78 -164 540 67 -196 -353 -179 171 -18 -340
5651 -340 64 101 144 -211 -58 113 -269 -157 -280 -27 10 -129 246 -82 -134 261 410 -58 -372 -289 222 -40
5673 -40 -101 123 81 59 -21 -220 184 157 -83 -279 498 1 27 -47 -86 -47 -180 109 160 159 -329 62 80 245 -49
5698 -49 -230 138 -48 -378 13 94 131 -630 229 442 369 -177 -90 -10 -107 -100 -26 173 163 144 220 354 -381 -366 18
5723 18 257 40 -123 -61 76 31 -5 -156 -85 -137 -135 167 235 23 -341 -238 44 -12 -168 176 200 -121 33 297
5747 297 373 -378 -185 275 254 -244 -45 270 -234 -221 245 357 -124 -115 -310 -57 359 -424 -191 34 193 -85
5769 -85 173 275 -362 -208 62 93 75 -208 -100 404 -120 25 0 254 81 -187 -105 450 136 -240 87 61
5791 61 -47 -319 16 -86 -436 -24 11 302 -430 -208 117 41 331 -268 -220 -180 -107 -28 132 275 -442 -263
5813 -263 -93 232 102 47 -33 -44 155 -3 135 133 -349 -158 155 176 -186 114 -70 197 283 181 -10 -383
5835 -383 -315 103 193 151 -169 -256 -131 38 138 283 -341 86 233 48 -126 -254 50 241 336 -392 -120 100
5857 100 -42 -154 -128 -85 102 -270 -370 -12 67 188 -242 137 204 -27 -228 -35 -61 35 109 274 164 -427
5879 -427 -317 284 231 -4 -187 48 28 -455 -290 201 -286 -407 -486 210 228 173 -376 -344 397 255 161 -372
5901 -372 326 143 307 94 -158 -338 116 116 159 -177 -252 -157 -86 -258 228 302 -22 -267 -40 379 206 -193
5923 -193 -145 8 131 90 188 -101 -405 1 268 167 -226 44 32 126 -38 -214 118 -173 -233 75 90 96 78
5946 78 -154 130 160 69 -136 -261 -130 8 103 81 -78 -359 2 138 101 -322 -444 246 166 92 135 220 206 -331
5970 -331 -303 -327 224 14 -78 390 -26 248 -39 -140 -81 126 226 -345 -194 -119 -7 236 392 -43 -33 166
5992 166 -390 -95 -193 -34 -56 -33 -9 176 -10 -341 -263 174 223 143 62 25 -311 -333 241 116 -37 -112 -100 -80
6016 -80 121 45 116 -13 -262 39 254 85 76 -135 -73 273 119 199 -33 -19 -163 174 -32 -131 -225 225 158 6
6040 6 -25 29 -207 -73 -170 371 144 -190 -319 -12 410 164 -161 -344 112 254 160 153 -263 -426 45 187 286
6063 286 -1 -15 -158 440 158 74 194 -88 -115 -132 260 444 -153 -303 140 523 2 -176 -496 160 220 452
6085 452 348 -313 -155 -17 170 56 44 -216 -68 -93 -76 -166 -57 -169 10 -103 300 285 -133 -293 185 86
6107 86 93 84 -280 288 211 296 181 -387 -250 113 148 44 -133 -38 -250 65 -4 118 126 -67 16 89 271 278 42
6132 42 -30 107 122 146 -297 -6 -236 -39 351 158 -219 -283 -41 42 186 -207 -241 -325 -182 168 76 -62 -217
6155 -217 -84 182 86 -326 -120 -400 103 289 -91 -77 -159 226 35 409 -130 -357 -274 -125 -12 70 152 -235
6177 -235 -405 -196 267 366 -194 -292 -56 -73 157 0 -374 -166 -167 341 167 -193 -227 130 117 42 130 -197 -46
6200 -46 -160 163 12 -85 -293 -457 -153 498 22 86 -387 158 382 623 102 -562 -231 -26 75 317 -137
6221 -137 -199 -191 80 169 -143 -279 -226 203 -203 -147 -46 -156 -182 -23 149 239 17 -294 -40 389 366 38 -258
6244 -258 -236 405 23 424 -268 -105 -226 -7 58 -110 14 -218 220 502 238 47 -131 216 64 44 151
6265 151 -48 -741 -591 366 332 -304 -518 49 397 124 -35 0 -347 -362 7 98 132 -20 -478 14 321 413
6287 413 183 -280 -452 92 152 383 -57 -338 -108 621 478 -146 -373 -210 248 206 66 -353 -235 -37 181
6308 181 257 -220 -130 -226 -213 534 -61 -59 -198 -163 567 496 124 -420 -139 141 136 -221 -200 -210 -332 -154 151 -10
6332 -10 -347 -413 -155 437 212 86 11 -206 -416 330 255 181 -386 -650 161 439 -92 -310 -408 187 696 -165
6354 -165 -238 114 -126 66 53 128 -13 -574 -312 375 76 -154 -366 -111 -101 41 -218 -178 -290 20 164 281
6376 281 289 -315 -247 289 188 3 -300 -124 27 -8 359 116 -68 -250 -112 193 222 -23 -273 -136 -6 29
6398 29 120 89 -91 -76 -115 501 114 -216 -6 56 176 106 -186 -13 206 -124 45 135 -78 -81 213 155 -100 137
6422 137 233 -147 -255 447 111 -69 -628 42 252 -268 104 76 106 -72 -248 135 113 -16 -324 -131 19
6443 19 -177 118 -99 24 -229 82 -27 -197 -67 -113 383 443 -46 -151 -114 94 -75 -342 190 200 -80 -263
6465 -263 38 88 -107 -190 -132 -158 -75 -18 -127 368 -213 27 -4 149 -226 -231 231 -45 165 -451 7 -30 -208
6488 -208 -235 -188 183 81 128 19 -25 -222 102 -62 -153 122 95 359 -157 -40 73 -102 59 -173 -35 -8
6510 -8 -219 -380 77 288 -91 -156 46 357 -254 -452 122 73 -32 111 276 125 4 -207 59 77 -142 -315
6532 -315 414 183 -77 -236 86 364 -190 -477 96 465 -5 -10 99 104 -410 -14 121 -70 -157 146 170 192
6554 192 -245 116 442 192 -419 -488 201 74 -210 -122 -20 -141 -160 -25 -16 235 -221 -376 -80 70 -87 -133
6576 -133 33 -94 -63 230 -6 -180 -485 -187 118 346 -129 -36 138 40 -4 420 125 -482 -348 366 9
6597 9 -99 -138 -172 21 81 137 -109 -154 -508 31 662 40 -448 -401 463 263 -64 -283 -123 276 -196 77 171
6620 171 -48 -579 -111 632 247 -342 11 -28 -66 -9 145 347 -266 -494 194 910 79 -748 -262 166 252
6641 252 -204 219 -58 -415 164 29 377 18 -611 154 485 140 -69 -298 -375 152 526 629 116 -691
6661 -691 -179 377 341 -130 -413 -240 104 241 250 -170 -490 -270 437 380 104 -17 -545 -56 11 5 -15 -449 -467
6684 -467 -102 681 334 -459 -569 118 802 122 -225 -69 -56 83 210 201 13 -624 -388 499 553 -405 -668
6705 -668 -475 398 301 157 -258 -516 -312 12 439 800 -267 -609 206 512 -41 -413 -168 -61 -340 170
6725 170 74 -26 -415 -446 217 382 278 -539 -415 -73 234 -90 237 -344 -506 67 496 318 -550 -591 166
6746 166 374 289 -191 -452 -74 25 8 222 -259 -592 -225 461 243 -212 -289 -526 12 632 242 399 -583
6767 -583 -208 350 539 -10 -229 -493 244 417 144 40 -354 -420 161 856 554 -465 -395 73 190 351
6787 351 231 -101 -442 -237 319 412 -38 -948 -416 542 748 -83 -353 -298 18 121 156 257 -248 -531 17
6808 17 561 245 -488 -486 42 336 455 233 -321 -354 -325 196 286 -199 -859 -127 423 610 -306 -370 -229 -130 242
6831 242 183 145 -464 -616 319 432 179 -420 -511 -23 153 315 48 -562 -526 86 204 446 -428 -445 -62 338
6853 338 242 2 -351 -76 -33 353 350 -311 -40 -146 57 446 497 -368 -311 -64 -134 520 81 -436 -336 376
6875 376 408 397 -347 -620 -147 472 209 174 -264 -212 191 80 415 -258 -254 -43 338 318 10 -82 -368 -198 292
6898 292 304 -9 -441 -59 145 509 249 0 -19 -171 313 -3 -36 -253 -197 49 39 478 -3 -304 -170 326
6920 326 394 164 35 -311 40 214 468 -169 -487 -352 224 379 189 -237 -211 38 106 227 130 -1 -398
6941 -398 398 437 6 24 -10 -236 74 234 123 -280 -193 -304 88 533 180 -225 -262 63 -92 247 -326 -53
6963 -53 72 104 -183 320 -170 -411 244 47 52 -153 -76 -119 44 -34 55 -89 -325 -3 168 52 39 -356 -578
6986 -578 214 60 109 -410 -297 97 72 -94 210 372 -216 153 24 59 -131 -174 -123 199 268 165 10 -126
7008 -126 -82 2 151 51 -295 -16 33 154 -63 -425 -241 -165 230 -277 -106 -172 -168 72 158 423 19 -379 -634
7031 -634 257 187 76 -407 -334 120 636 80 -68 -134 -127 29 270 110 150 31 -14 6 19 -11 -38 60 268 -177
7055 -177 184 73 -1 -106 -311 305 582 -34 -170 -111 374 103 -138 -190 -34 171 -44 132 -11 14 -35 31
7077 31 363 120 -222 -321 53 385 95 -20 7 343 -96 28 265 47 -156 -404 328 115 75 -171 5
7098 5 126 -80 60 40 505 -245 -422 272 295 -19 -393 -383 184 344 -386 16 -1 -121 -325 315 131 -71
7120 -71 89 247 206 16 -361 274 331 -67 82 153 344 -206 63 -134 233 361 -140 -428 -237 58 74 216
7142 216 -23 195 179 -9 -90 -205 -63 -83 57 63 254 -19 -328 -183 159 241 -245 -230 187 40 28 33 157
7165 157 -235 -295 420 380 143 -118 -182 -86 -27 -345 -225 78 -420 -167 32 431 97 -565 -578 501 669 -113
7187 -113 -377 -84 29 109 170 192 81 -523 30 474 149 -319 -297 663 374 -101 243 279 51 21 258 454
7209 454 64 -448 -280 198 310 -221 -127 -319 285 117 4 224 193 -9 58 92 183 -188 -269 10 -138 211
7231 211 329 -50 -245 -361 269 109 103 -374 9 107 113 147 -420 -480 237 456 338 -198 -525 93 129 105 -319
7254 -319 -55 112 18 -289 57 114 36 -279 153 394 112 -408 78 16 56 225 299 -82 -181 -342 74 597
7276 597 -537 -698 -335 620 444 -229 -333 -103 -53 22 458 412 -210 -570 230 577 -156 -483 -263 350 237
7297 237 0 119 34 -350 -364 368 308 -198 -327 -170 202 241 80 122 143 -406 62 323 336 -352 -380 60 964
7320 964 5 -433 -42 -100 285 427 162 -348 -581 130 293 111 -144 -211 -110 9 200 146 -3 -435 -546
7341 -546 174 485 -110 -653 -241 -43 326 37 -149 -202 -362 -53 484 383 -601 -711 187 492 -127 -492
7361 -492 154 -303 -144 -45 841 573 -548 -740 620 791 -10 -566 -161 442 405 53 99 -68 -347 33
7381 33 584 504 -326 -245 -334 503 -127 -204 -114 94 -171 143 513 15 -675 -82 211 415 -115 -537 -195 -103
7403 -103 280 15 163 -149 -174 127 229 250 -4 -417 93 74 117 178 -251 -375 -191 334 599 -68 -337 120
7425 120 394 309 186 -357 -293 -37 167 385 -44 -362 -222 458 -45 -158 -198 -119 249 -98 149 614 94
7446 94 -745 -243 560 386 -521 -589 -32 -88 183 107 126 -153 -325 -61 423 276 -486 -474 356 290 -209 -128 146
7469 146 84 -210 188 428 -301 -701 55 464 399 -322 -548 78 507 198 451 101 -50 -148 293 412 87
7490 87 -343 -225 39 382 -15 200 -128 -3 -70 308 403 -344 -534 -217 522 382 -91 -338 -183 -49 478
7511 478 141 -511 -424 -158 371 52 -60 -212 -42 143 58 388 231 -255 -526 -43 538 -72 -368 -383 149
7532 149 222 224 14 -225 -253 -50 451 270 -85 -530 -10 343 -97 -435 -252 -128 -95 165 631 436 -452 -505
7554 -505 180 843 197 -570 -423 404 483 372 55 -110 -244 -333 788 152 -186 -585 190 524 48 -453
7574 -453 11 -153 -195 230 369 45 -649 -479 -1 507 -62 -470 -178 -121 398 139 27 -228 -227 176 715
7595 715 307 13 -510 -326 210 322 226 -285 -227 -357 436 387 -179 -496 -610 359 545 23 -127 -244 -11
7616 -11 156 297 232 -495 -193 388 624 -135 -465 107 -51 -56 466 134 -246 -589 -61 503 561 -71 -652 -177
7638 -177 -361 333 223 -297 -232 -164 -39 370 218 -373 71 145 -89 146 -106 -109 -77 105 299 374 106 -460
7660 -460 -271 338 558 -177 -257 -53 27 479 110 -63 -196 -142 136 502 361 -294 -88 49 65 157 149 60 -202
7683 -202 64 372 731 -360 -774 -278 260 468 -65 -496 -396 163 575 278 -56 -560 91 414 415 -215
7703 -215 -205 113 -220 164 507 191 -355 -213 -495 299 226 -211 -467 10 398 170 -274 -634 -250 -45 115
7724 115 125 -123 -312 -203 460 531 -201 -56 -359 -307 57 -392 -59 -392 -269 157 197 49 -258 -181 107 -15
7746 -15 372 -257 -178 -74 84 400 88 -222 -411 307 -189 328 -349 -313 -433 169 450 302 -321 -405 -293
7767 -293 280 435 3 -219 -178 23 79 185 -151 -368 -587 392 411 135 -328 -240 0 99 -255 249 62 -147
7789 -147 -37 359 208 -125 -402 -188 217 163 -191 -505 -251 149 263 254 -168 -39 -274 -212 -41 19 -192 41
7811 41 90 17 -103 -105 133 -219 -622 82 404 253 -468 -587 259 657 60 -205 -320 71 246 34 -136 -176
7833 -176 219 329 335 361 86 -318 -96 577 489 -26 -355 -2 -101 -18 -357 -85 47 -525 -13 7 237 -455
7855 -455 -222 151 244 135 -74 -175 -53 -413 -188 592 375 -271 -551 -45 386 156 -305 -342 115 -35 188
7876 188 -77 -134 -199 -178 215 143 -390 46 -205 -40 115 83 243 249 61 -53 -38 267 551 20 -229 183 266
7899 266 -137 -119 -137 175 -18 -201 -237 206 485 -327 -160 194 300 -206 -442 98 182 24 -185 -244 -342 26
7921 26 -33 8 -128 -555 -148 300 292 -26 -675 207 481 15 -378 105 94 -305 -344 121 456 16 -255 -55
7943 -55 415 -61 49 -165 42 -148 -13 173 -36 -281 -308 257 393 30 -553 143 389 -114 21 109 284
7964 284 265 -145 306 309 -193 -301 -32 -51 105 -84 -236 266 79 231 -123 -247 -238 -165 -48 -94 -17 -123 -62
7987 -62 -16 10 -98 267 -397 -444 -2 523 172 32 52 -149 43 44 233 -190 -268 24 429 258 -196 -208 97
8010 97 228 -86 -227 459 120 -167 -85 549 382 -568 -376 194 447 270 -457 -124 -188 8 -82 146 -41
8031 -41 -347 25 557 177 -514 -603 137 361 106 -148 -10 -163 -194 105 405 -2 -362 -580 156 613 21
8052 21 -308 -462 19 327 234 -201 -504 129 251 516 292 -212 -424 -32 109 376 90 -314 -324 -50 669
8073 669 325 -222 -522 -112 277 590 363 -254 -456 -381 641 717 121 -863 -245 559 475 26 -350 132 135
8094 135 -33 323 261 -340 -536 38 878 86 -359 -506 21 244 353 -51 -65 -701 -405 330 794 -206
8114 -206 -895 -633 673 776 -499 -675 35 53 -144 568 465 -403 -881 35 649 419 -580 -600 -114 468
8134 468 419 320 -323 -719 -164 668 624 -243 -939 -420 525 486 -277 -193 -353 -102 350 787 126 -798 -390 -5
8156 -5 465 354 62 -267 -311 343 486 115 -555 -830 61 819 11 -315 -360 -164 28 291 386 70 -703 -454
8178 -454 329 838 -119 -711 -236 194 289 235 -58 -499 -253 171 885
8191H85
##END NTUPLES=NMR FID
##END=
