##TITLE=1H_CG-1125
 CDCl3, 8 sc, 
 6.2.2020
##JCAMPDX= 6.0         $$ Bruker NMR JCAMP-DX V2.0
##DATA TYPE= NMR FID
##DATA CLASS= NTUPLES
##ORIGIN= UXNMR, Bruker Analytische Messtechnik GmbH
##OWNER= root
$$ XWIN-NMR		Version 3.5
$$ Thu Feb  6 13:47:16 2020 Russian Standard Time (UT+4h)  she@DPX200
##.OBSERVE FREQUENCY= 200.1315
##.OBSERVE NUCLEUS= ^1H
##.DELAY= (6, 6)
##.ACQUISITION MODE= SIMULTANEOUS
##.ACQUISITION SCHEME= undefined
##.AVERAGES= 8
##.DIGITISER RES= 18
##SPECTROMETER/DATA SYSTEM= spect
##.PULSE SEQUENCE= zg30
##.SOLVENT NAME= CDCl3
##.SHIFT REFERENCE= (INTERNAL, CDCl3, 0, 15.7039)
##AUDIT TRAIL= $$ (NUMBER, WHEN, WHO, WHERE, WHAT)
$$ ##TITLE= Audit trail, XWIN-NMR		Version 3.5
$$ ##JCAMPDX= 5.01
$$ ##ORIGIN= Bruker BioSpin GmbH
$$ ##OWNER= she
$$ F:/spectra/data/she/nmr/H-F/1/audita.txt
$$ ##AUDIT TRAIL=  $$ (NUMBER, WHEN, WHO, WHERE, WHAT)
(   1,<2020-02-06 13:46:09.85 +0400>,<she>,<DPX200>,
      <created by zg, POWCHK disabled, PULCHK disabled
       configuration hash MD5:
       00 E9 B6 7A A2 85 ED C7 34 08 36 98 17 FE 4E 26
       data hash MD5: 16K
       6A E2 2E 0D AF B9 19 8D 7D 86 7C 37 2B CF 42 1A>)
$$ ##END=
$$ 
$$ hash MD5
$$ 3B 79 01 2F 2E 84 4F 0D C5 AD 0F E8 12 2B F7 53
##$RELAX= 
##$RELAX= 
##$RELAX= 
##$RELAX= 
##$RELAX= 
##$RELAX= 
$$ Bruker specific parameters
$$ --------------------------
##$DU= <F:/spectra>
##$EXPNO= 1
##$NAME= <H-F>
##$PROCNO= 1
##$TYPE= <nmr>
##$USER= <she>
##$AMP= (0..31)
100 100 100 100 100 100 100 100 100 100 100 100 100 100 100 100 100 100 
100 100 100 100 100 100 100 100 100 100 100 100 100 100 
##$AQSEQ= 0
##$AQ_mod= 1
##$AUNM= <au_zg>
##$AUTOPOS= <>
##$BF1= 200.13
##$BF2= 200.13
##$BF3= 200.13
##$BF4= 200.13
##$BF5= 200.13
##$BF6= 200.13
##$BF7= 200.13
##$BF8= 200.13
##$BYTORDA= 1
##$CFDGTYP= 0
##$CFRGTYP= 5
##$CHEMSTR= <none>
##$CNST= (0..31)
1 1 145 1 1 1 1 1 1 1 1 1 1 1 1 1 1 1 1 1 1 1 1 1 1 1 1 1 1 1 1 1 
##$CPDPRG= <>
##$CPDPRG1= <>
##$CPDPRG2= <>
##$CPDPRG3= <>
##$CPDPRG4= <mlev>
##$CPDPRG5= <mlev>
##$CPDPRG6= <mlev>
##$CPDPRG7= <mlev>
##$CPDPRG8= <mlev>
##$CPDPRGB= <>
##$CPDPRGT= <>
##$D= (0..31)
0 1.2 0 0 0 0 0 0 0 0.06 0 0.03 0 0 0 0 0.0002 0 0 0 0 0 0 0 0 0 0 0 0 
0 0 0 
##$DATE= 1580982369
##$DBL= (0..7)
120 120 120 120 120 120 120 120 
##$DBP= (0..7)
150 150 150 150 150 150 150 150 
##$DBP07= 0
##$DBPNAM0= <>
##$DBPNAM1= <>
##$DBPNAM2= <>
##$DBPNAM3= <>
##$DBPNAM4= <>
##$DBPNAM5= <>
##$DBPNAM6= <>
##$DBPNAM7= <>
##$DBPOAL= (0..7)
0.5 0.5 0.5 0.5 0.5 0.5 0.5 0.5 
##$DBPOFFS= (0..7)
0 0 0 0 0 0 0 0 
##$DE= 6
##$DECBNUC= <off>
##$DECIM= 24
##$DECNUC= <off>
##$DECSTAT= 4
##$DIGMOD= 1
##$DIGTYP= 9
##$DL= (0..7)
0 120 120 120 120 120 120 120 
##$DP= (0..7)
150 150 150 150 150 150 150 150 
##$DP07= 0
##$DPNAME0= <>
##$DPNAME1= <>
##$DPNAME2= <>
##$DPNAME3= <>
##$DPNAME4= <>
##$DPNAME5= <>
##$DPNAME6= <>
##$DPNAME7= <>
##$DPOAL= (0..7)
0.5 0.5 0.5 0.5 0.5 0.5 0.5 0.5 
##$DPOFFS= (0..7)
0 0 0 0 0 0 0 0 
##$DQDMODE= 0
##$DR= 18
##$DS= 0
##$DSLIST= <SSSSSSSSSSSSSSS>
$$ [...]
##$SUBNAM2= <"">
##$SUBNAM3= <"">
##$SUBNAM4= <"">
##$SUBNAM5= <"">
##$SUBNAM6= <"">
##$SUBNAM7= <"">
##$SUBNAM8= <"">
##$SUBNAM9= <"">
##$SW= 24.9337058887773
##$SWIBOX= (0..15)
0 0 2 0 0 0 0 0 0 0 0 0 0 0 0 0 
##$SW_h= 4990.01996007984
##$TD= 16384
##$TD0= 1
##$TE= 0
##$TE2= 300
##$TE3= 300
##$TEG= 300
##$TL= (0..7)
0 120 120 120 120 120 120 120 
##$TP= (0..7)
150 150 150 150 150 150 150 150 
##$TP07= 0
##$TPNAME0= <>
##$TPNAME1= <>
##$TPNAME2= <>
##$TPNAME3= <>
##$TPNAME4= <>
##$TPNAME5= <>
##$TPNAME6= <>
##$TPNAME7= <>
##$TPOAL= (0..7)
0.5 0.5 0.5 0.5 0.5 0.5 0.5 0.5 
##$TPOFFS= (0..7)
0 0 0 0 0 0 0 0 
##$TUNHIN= 0
##$TUNHOUT= 0
##$TUNXOUT= 0
##$USERA1= <user>
##$USERA2= <user>
##$USERA3= <user>
##$USERA4= <user>
##$USERA5= <user>
##$V9= 5
##$VALIST= <valist>
##$VCLIST= <CCCCCCCCCCCCCCC>
##$VD= 0
##$VDLIST= <DDDDDDDDDDDDDDD>
##$VPLIST= <PPPPPPPPPPPPPPP>
##$VTLIST= <TTTTTTTTTTTTTTT>
##$WBST= 1024
##$WBSW= 4
##$XGAIN= (0..3)
0 0 0 0 
##$XL= 0
##$YL= 0
##$YMAX_a= 460574
##$YMIN_a= -227641
##$ZGOPTNS= <>
##$ZL1= 120
##$ZL2= 120
##$ZL3= 120
##$ZL4= 120
##$ABSF1= 10
##$ABSF2= 0
##$ABSG= 5
##$ABSL= 3
##$ALPHA= 0
##$AQORDER= 0
##$ASSFAC= 0
##$ASSFACI= 0
##$ASSFACX= 0
##$ASSWID= 0
##$AUNMP= <proc_1d>
##$AZFE= 0.1
##$AZFW= 0.1
##$BCFW= 1
##$BC_mod= 2
##$BYTORDP= 1
##$COROFFS= 0
##$CY= 11.3945322036743
##$DATMOD= 1
##$DC= 2
##$DFILT= <>
##$DTYPP= 0
##$F1P= 16.9975609425685
##$F2P= -3.02152046262296
##$FCOR= 0.5
##$FTSIZE= 0
##$FT_mod= 4
##$GAMMA= 1
##$GB= 0.15
##$INTBC= 1
##$INTSCL= 1
##$ISEN= 128
##$LB= 0.24
##$LEV0= 0
##$LPBIN= 0
##$MAXI= 10000
##$MC2= 0
##$MEAN= 0
##$ME_mod= 0
##$MI= 1.114404
##$NCOEF= 0
##$NC_proc= 0
##$NLEV= 6
##$NOISF1= 3.799351
##$NOISF2= 2.8
##$NSP= 1
##$NTH_PI= 0
##$NZP= 0
##$OFFSET= 15.70392
##$PC= 1
##$PHC0= -9788.585
##$PHC1= 19.80081
##$PH_mod= 1
##$PKNL= yes
##$PPARMOD= 0
##$PSCAL= 0
##$PSIGN= 0
##$REVERSE= no
##$SF= 200.130013532006
##$SI= 16384
##$SIGF1= 3
##$SIGF2= 2
##$SINO= 400
##$SIOLD= 16384
##$SREGLST= <1H.CDCl3>
##$SSB= 0
##$STSI= 0
##$STSR= 0
##$SW_p= 3612.71676300578
##$SYMM= 0
##$S_DEV= 0
##$TDeff= 0
##$TDoff= 0
##$TI= <>
##$TILT= no
##$TM1= 0
##$TM2= 0
##$TOPLEV= 0
##$USERP1= <user>
##$USERP2= <user>
##$USERP3= <user>
##$USERP4= <user>
##$USERP5= <user>
##$WDW= 1
##$XDIM= 8192
##$YMAX_p= 0
##$YMIN_p= 0
$$ End of Bruker specific parameters
$$ ---------------------------------
##NTUPLES= NMR FID
##VAR_NAME=  TIME,          FID/REAL,        FID/IMAG
##SYMBOL=    X,             R,               I
##VAR_TYPE=  INDEPENDENT,   DEPENDENT,       DEPENDENT
##VAR_FORM=  AFFN,          ASDF,            ASDF
##VAR_DIM=   8192,          8192,            8192
##UNITS=     SECONDS,       ARBITRARY UNITS, ARBITRARY UNITS
##FACTOR=    0.0002004,     1,               1
##FIRST=     0,             0,               0
##LAST=      1.6414764,     0,               0
##MIN=       0,             -227641,         0
##MAX=       1.6414764,     460574,          0
$$ Real data points
##PAGE= N=1
##DATA TABLE= (X++(R..R)), XYDATA
0@%%%%%%%Qj6J6k4L2l8M6n6P1q5J01j20J38j61J91k22K56k96L41l90M42n02N72
30C04o45P24q14R12j018J138j270J411j567J740j928K136k367K618k897L213l564
47a874L963m420M942n553O277p151Q229r601J1422j3960J7776k4243L8022j17707
61i3878J90757K57500k51987k85093m4940J92599Q5061o8040r0818N4380J07567
72E3108L6895q8118j00372m3128K9930O0669R8539Q9073j4725j71263j70722L1317
84a88797K23628J52632q2231j81337l0738J35155Q7598j10211j72693M171K12276
95D9453J84847n1611k29680j65847M5189J82333J33311j0201r9527p5537p786
106d5056K8228K0538l922j6408K942N0842O9124j0730j40781j54553K6616K21905
$$ plain form
0 0 0 0 0 0 0 0 0 8 -8 8 -16 16 -22 24 -32 39 -46 55 -65 73 -88 103 -119 137 -159 182 -208 234 -268 304
30 304 -341 383 -431 481 -537 601 -669 742 -825 915 -1013 1123 -1244 1374 -1523 1690 -1874
47 -1874 2089 -2331 2611 -2942 3335 -3816 4413 -5188 6234 -7726 10050 -14193 23829 -93878
61 -93878 96879 354379 102392 -182701 -227641 -35042 50019 -18021 -108839 -54459 53108
72 53108 90003 1885 -98487 -141615 -111685 -51016 47523 136596 121871 -49392 -220114 -188797
84 -188797 34831 187463 105232 -76105 -106843 28312 115910 5699 -166994 -162823 49453
95 49453 234300 182689 -46991 -212838 -167649 14684 147995 137794 38267 -37270 -45056
106 -45056 -16828 3710 -212 -16620 -13678 37164 106288 95558 -45223 -199776 -173160 48745
118D8745J84979n7677k24528j37907O9906J56752N6014p8459p7794L4632R3229
129F7892R403j09752j10488Q848J16524J18504L3715o8946j30894r9846L0991
140a34049J52307J23696l5999j39816o7287P2166R0232k9582j17526l8980J21749
151c089J56699K116j70712j63205J3109J65424J44906k559j13505r4278j264N5973
163a0385L9912p891l1672m780M4555N1896j4607j00150r8921K1382J48425J33482
175A71246k3492j53457j22190K2334J19544Q3313k7024q2319k9254N1781M9492
186E9974l4392q8677l8992O5157J14689N6782n8242j29971q8815M0226J38979
197C6718J01614l9801j25995o2758N9537Q2788j0779q8343m1593P6629J16498
$$ plain form
118 48745 233724 176047 -48481 -186388 -116482 40270 96284 17825 -59969 -25337 67892
129 67892 77295 -32457 -142945 -134097 -17573 100931 134646 65700 -65194 -165040 -134049
140 -134049 18258 141954 105955 -33861 -101148 -28982 61250 31668 -85858 -124838 -3089
151 -3089 153610 155726 -14986 -178191 -165082 342 145248 142689 29184 -65094 -66358 -10385
163 -10385 29527 21636 -10036 -14816 29739 81635 67028 -33122 -132043 -110661 37764 171246
175 171246 147754 -5703 -127893 -105559 13985 97298 70274 -12045 -41299 10482 59974
186 59974 25582 -63095 -102087 -36930 77759 134541 76299 -53672 -142487 -102261 36718
197 36718 138332 98531 -27464 -90222 -30685 52103 41324 -47019 -88612 -11983 104515
208A04515J4804j17839j26501q63J19748J14884Q136q3633q2556j6783M0181M9467
220B3560K0278k1713l6863k903M4736L3271m3278r2179k9654R4986J33907K2130
232A46278j23968j36015j866J21960J01208k3490r9876m7214N4552O9044j7085
243D3528q3941m2712N2960R1353L7518m8045q6453n2351K3695Q2401P2517m672
255H5798p9148p2473R176O9267M1397l5521o4532m812P4040O6008l7541j12861
267f1202n9509P1221J27961M6997p7303j09839k7679O5382P1786N022n0901m1123
279c9187J2157M7748K4463l4299o1349k0001N2978Q0027K7209o0054r1830k9917
291i2055O4446R0262K1461o6090p5860l84O8967M4425l7574p0404j2354O5046
$$ plain form
208 104515 119319 1480 -125021 -125884 -6136 108748 116884 33251 -49305 -66088 -25907 23560
220 23560 43838 22125 -14738 -17641 27095 60366 17088 -75091 -104745 -9759 124148 146278
232 146278 22310 -113705 -115571 6389 107597 84107 -15769 -62983 -8431 60613 43528
243 43528 -40413 -83125 -30165 61188 98706 50661 -35792 -88143 -64448 17953 90470 85798
255 85798 6650 -65823 -56647 12620 54017 18496 -46036 -50848 23192 89200 51659 -61202
267 -61202 -120711 -49490 78471 125468 48165 -61674 -89353 -23971 47815 52837 1936 -39187
279 -39187 -27030 20718 45181 10882 -50467 -70468 -17490 62537 89746 29692 -62138 -92055
291 -92055 -27609 62653 84114 18024 -57836 -58220 10747 55172 17598 -52806 -65160 -114
303a14P1851k075p8888p3983J0059Q4653P1198j2835p8594n7823J8463O3640L2130
316D7682k9985n0760j2524M0966N0124j80n9459n5210J4588P7004O0099k0900
328F1445q1675n7426K6617P8788M3707l7481p3393k4550N3168O4654o260p2622
340b5028m8996L6416Q3110L7101m8460q0142k7182N1320P1452J8018m9535o0787
352d2713r352M7359M8166n870n1722l7499J9523N8671L6488l0758p1060l2763
364g1530N0072Q1853K1419o5877p8968l660P1487O0841k0168p3236l7822L8177
376b7412O9077J9699n2714o4270j16O3139N5681r977o0723m6912J1610N5605M1330
389E4017j6461n7730l8405K3370O2074L0039m0575o6413j1105N9369O4671m189
$$ plain form
303 -114 71737 69662 -9226 -83209 -73150 11503 82701 69866 -8728 -66551 -48088 15552 47682
316 47682 17697 -33063 -45587 -4621 45503 45323 -14136 -69346 -54758 22246 82345 61445
328 61445 -20230 -77656 -51039 27749 71456 33975 -39418 -63968 -10800 53854 47594 -25028
340 -25028 -74024 -37608 45502 82603 34143 -45999 -73181 -21861 49591 67609 18074 -42713
352 -42713 -52065 -4706 43460 37590 -14132 -51631 -32108 26563 63051 32293 -38767 -71530
364 -71530 -21458 60395 81814 15937 -63031 -66691 4796 65637 45469 -27767 -65589 -27412
376 -27412 41665 61364 8650 -55620 -55736 7403 63084 53107 -7616 -54528 -42918 12687 54017
389 54017 37556 -20174 -58579 -35209 26865 56904 16329 -50084 -61189 -1820 62851 58662
401E8662p0776n9809K1917Q0052M5516m1399q0912k6623N4398O8691L285o2303
413i301n3772J4349O2461M2567k0430o0202l5641K8816O3235K8246l8336o3773
425d1781k1384M4887O1677J0375n5662o1091L796O6416N5686k0865p5235m0938
437g4119M3986P8021K1068n8125o8893l778O4151N7532j4022o9216m6165K7600
449d1960O8334L2542l7716o3521j8415M6596N8427R047m7745n3467k587N4433
461C968N2642j0865o5187m7999K4532P0821L7869m0494p4229k2668N6928P2954
473E8272O794o8233o4314J6169P8546M7537l9237p7646k6699N0819O8045Q097
485E8150n7213n8813M337N9307M9546j0675n7694m1921J9467N9645L6005k6646
$$ plain form
401 58662 -12114 -71923 -50006 30046 75562 34163 -46749 -73372 -18974 49717 53002 -9301
413 -9301 -63073 -48724 13737 56304 35874 -24328 -59969 -31153 32082 60328 21992 -41781
425 -41781 -63165 -18278 43399 53774 -1888 -62979 -59183 7233 62919 42054 -33181 -74119
437 -74119 -30133 47888 68956 10831 -58062 -61840 2311 59843 45821 -23395 -69560 -41960
449 -41960 26374 58916 21200 -42321 -60736 -14140 44287 53334 5589 -47878 -50465 3968
461 3968 56610 45745 -19442 -67441 -42909 27912 65781 25287 -48942 -71610 -14682 58272
473 58272 65066 -3167 -67481 -51312 27234 74771 35534 -42112 -68811 -17992 50053 58150
485 58150 937 -57876 -53539 5768 55314 44639 -13055 -54976 -35509 24136 60141 33495
497C3495o2086l0627L5150O7503K1949n4445p3624n390P2314O7864j6872q2914
509b7683n0509M2207Q4685K7737n9288p4099l973O7840N9589j7694p1177m3720
521f6085L0131O3814K7749l2821n6567k0906L4333N5078K0006l7663n7089j3781
533e3801N0492O0567k223o6205n6734K0129P5136M4976l9585q1399k8899N9582
545a7964P8278N646p0638o2204J8356P5887M4912l6434p2203k7648M3369O6031
557D5388J6472n1476o3696p013N8331N8248m808o0667m8971J8095O5975L9788
569F5666l1184o8041k7175M5747O8321J2837o0911o6327L308O7738N4626j7099
581D7506o7333m2238K9349O9035L0170m1576o5265j4105N4348O1708j724o5823
$$ plain form
497 33495 -28591 -59218 -24068 43435 65384 10939 -62685 -68075 4239 72103 55231 -27683
509 -27683 -78192 -35985 48700 76437 17149 -56950 -60923 6917 66506 48812 -22365 -66085
521 -66085 -35954 27860 55609 22788 -33779 -54685 -20352 34726 54732 17069 -40020 -53801
533 -53801 -3309 57258 55035 -11170 -67904 -47775 27361 72337 32752 -48647 -77546 -17964
545 -17964 60314 65960 -4678 -66882 -48526 27361 72273 35839 -36364 -64012 -20643 45388
557 45388 61860 10384 -53312 -60325 -1994 56254 51446 -9221 -58192 -40097 25878 65666
569 65666 34482 -33559 -60734 -14987 53334 66171 5260 -61067 -57759 9979 64605 47506
581 47506 -19827 -62065 -32716 36319 66489 24913 -40352 -54457 -109 61599 59875 -5948
593e948n5773J6147O8693M5636k6434p0040l6843L8644P0125K1585m9849o1397
605d5454j426O1033N3604j6787o9035m4097L0623P2084L3044m3252p2636k1248
617f3547N2449O5093M990n5522m9835J1083N7454L9047k4161n9947k8746L5389
629a6253O2385K0180m6006o5455j4351N1853O2369N391n5913n5621O979O3491
641A9049M6763k6505o9667k9211M9617P2018Q247o9072o9478J0482P6284N5140
653G3667k5387p3317l7962L5235O3481J8927m1582m7910R65M5131L7566j1481
665C7333m8384l6343J3679N1687L9089j6023n8463m2851K0936O3907L5668l1490
677B8745o1216j8387M7186N8136m152o5726m9268L0406P8703L4133n2619q0875
$$ plain form
593 -5948 -61721 -45574 23119 68755 42321 -27719 -64562 -25918 44207 65792 15943 -45454
605 -45454 -46880 14153 67757 50970 -18065 -62162 -31539 40545 73589 30337 -42299 -63547
617 -63547 -11098 53995 58985 3463 -46372 -35289 22165 61212 37051 -22896 -51642 -16253
629 -16253 46132 66312 20306 -45149 -59500 -7647 54722 60113 4200 -51421 -44442 19049
641 19049 65812 39307 -30360 -59571 -9954 62064 70311 1239 -68239 -57757 18527 73667
653 73667 48280 -25037 -62999 -27764 35717 54644 13062 -34848 -33883 11248 48814 37333
665 37333 -11051 -47394 -33715 17972 57061 41038 -17425 -60276 -39340 24567 60235 28745
677 28745 -32471 -50858 -3672 54464 50312 -15414 -64682 -34276 44427 78560 25941 -54934
689e4934j8685O0641O9036K050n8149m7843J2468N1834K9929k4344m7081j3781
701c8859L5956M5864N540m3479m9783o422M5252N3626P473m7211n4034l488N0788
714A223M7898j0133n3301k9834L2357N5682J0005n3501n8524O491O9232N5216
726G2811k1330p3882m5973K9209O6354K8656l3360m8112n783L5468L2505q555
738B8008m0090k6689J8475M8028K7120k4248n6152l3300K3685N9989L4985k6227
750C3584n8142k4197L5677N0238K625m8335l5246K7372N8270J7132m9234o2426
762e2682o815N4929N5885J558m7958m3758r35L3991L2472J680k6309k2639Q084
775a2497L0169J7114k4035m6431j6704M4528O3737R040o4008o8566L007P0030
$$ plain form
689 -54934 -73619 -12978 56058 58108 -41 -47884 -35416 16418 46347 22003 -25078 -38859
701 -38859 -2903 42961 48501 5022 -44761 -51183 -5931 47695 55168 7957 -46077 -49565 1223
714 1223 49121 38988 -14313 -44147 -11790 43892 53897 396 -58128 -51637 17595 72811
726 72811 51481 -22401 -68374 -39165 27189 55845 22485 -25627 -31410 4058 36563 28008
738 28008 -12082 -38771 -20296 27732 54852 30604 -25548 -58848 -35163 24826 59811 33584
750 33584 -24558 -48755 -13078 37160 39785 -8550 -43796 -16424 41846 58978 9744 -52682
762 -52682 -59497 -4568 51317 52875 4917 -38841 -39776 -5785 26687 28367 2058 -20581 -12497
775 -12497 17672 34786 10751 -35680 -52384 -7856 55881 64921 913 -67653 -64646 5384
787E384N4668j9965n9738k2571L6219M0413q836m4921k3607K7891M7700J4542
799D7179l1719m2870j9110J5502L5916L1924K001l4370l9937l687L9307L5779
811C5915j3599m5116j1926M4273M4820k1255p1403l7863M5700Q0040K2782n6309
823A6059o5692m156M8143L6859q535k7968q402J6788J5288n736j9369j6636j694
836b5051J9869L3969J7835k7292n4897k8000L5028O4733K4249m1280n2835j394
848c5066M3859K6915k5826m2701N33M9157L9245k0523n8923l4891K0849N0281
860A2909L3471o997l5625l1625k187K5473K6269N12k2806j3219J7241K7698m493
873B6621m2192l5796J7521N9539L9228k4805o2303l2910K5524M7903K0677j8725
$$ plain form
787 5384 60052 40087 -19651 -42222 -6003 34410 25574 -19347 -42954 -15063 32637 47179
799 47179 15460 -27410 -46520 -31018 4898 36822 38823 4453 -35484 -39171 136 35915
811 35915 22316 -22800 -34726 9547 54367 33112 -38291 -76154 -30454 49586 72368 16059
823 16059 -49633 -53789 -5646 31213 22678 -5290 -13692 3096 18384 12648 -6721 -23357 -25051
836 -25051 -5182 28787 46622 19330 -35567 -63567 -28539 36194 60443 19163 -33672 -35066
848 -35066 8793 35708 9882 -32819 -32286 16871 56116 35593 -23330 -58221 -37372 12909
860 12909 46380 39383 3758 -27867 -30054 -4581 21688 22200 -606 -13825 3416 31114 26621
873 26621 -15571 -51367 -33846 25693 64921 40116 -22187 -55097 -29573 18330 39007 20282
885B0282k6192m036J5676J1015r686k2200j0199J7942L5177K0546k3773n2775
897b8223l0132K6908N9238L2245k7399n1607j6944K9351L1145p195l0647r010
909b2270K9145L2750o205m2943l5995N607L9771L8604P535k8525m1305j7891K1865
922a9857L8625J5979k2259k8806L283L0939J1703l2794m2196L193N4611M8369
934F0790j3797o2912m3047J8652N1377K7882j3008k7161j1260P213R626p85j0390
947f820q159N381K0930K1415n604m0578l9715P310N5845M9222j1098n8568l9282
960d9721K1559M8879J2309l3369k7530J7608M0123P730l9722m2742J590M1839
972a447L8541M557k6539l4396j7524J2483L2492K5149o729l0218j8673J6457K7292
$$ plain form
885 20282 -5910 -9946 5730 16745 7059 -15141 -25340 -7398 27779 48325 24552 -28223
897 -28223 -58355 -31447 27791 60036 32637 -18970 -35914 -6563 24582 17387 -13260 -22270
909 -22270 6875 39625 33420 -9523 -45518 -39911 -140 38464 45999 17474 -23831 -41722 -19857
922 -19857 18768 34747 12488 -16318 -13035 17904 29607 -3187 -45383 -42190 12421 60790
934 60790 46993 -15919 -58966 -40314 11063 38945 25937 -1224 -12484 -5271 4355 3570 -6820
947 -6820 -14979 -9598 11332 32747 27143 -13435 -53150 -45840 10005 59227 48129 -10439 -49721
960 -49721 -28162 20717 33026 -343 -27873 -10265 29858 37588 -2134 -44876 -43286 -1447
972 -1447 37094 41651 15112 -19284 -36808 -24325 8167 33316 26587 -3631 -22304 -5847 21445
985B1445n326l7758k1486L2968N6944J2277n3794o2919J85N9849M9708r065m4797
998a769k5805J3796K5250L302j8560j2853Q999K1269J3734q512k8423k7348J028
1011c5892L6961M2648O526m2227m8780k204M5019L7223j2770m1409j3296L1837
1023C636L1871j3711m8239k4555L1455N3870J9107l2776m8297j7734K5019L8825
1035A8471J6018j6004k6857j0648J2472J9079k1k2889j8329J4135L8445J9803
1047D3675k7734n2524j9482L7936N5788J5311l8136m5798n926L3514K9319q357
1059A7586l1802j2688K2795L1130J176l4645l5989K628M2055M0785j331m1847
1071a47l9882J294L9177L2464p700l4548j8459J7906K9225K136l0945k8845Q977
$$ plain form
985 21445 16119 -21639 -43125 -10157 46787 59064 5270 -57649 -57464 2385 52093 43028 -1769
998 -1769 -27574 -13778 11472 14774 -3786 -16639 -7640 13629 27363 18851 -9572 -36920 -35892
1011 -35892 1069 43717 50243 8016 -40764 -42968 2051 39274 26504 -14905 -28201 3636
1023 3636 35507 21796 -26443 -50998 -19543 34327 53434 20658 -27639 -45373 -20354 18471
1035 18471 34489 18485 -8372 -19020 -6548 12531 12510 -10379 -28708 -14573 23872 43675
1047 43675 15941 -36583 -56065 -18129 37659 52970 14834 -30964 -36890 -3376 25943 17586
1059 17586 -14216 -26904 -4109 27021 28197 -6448 -42437 -39809 2246 43031 41700 -147
1071 -147 -40029 -38735 442 32906 25206 -9342 -27801 -9895 19330 21466 -9479 -38324 -29347
1084b9347M2493L0825j4457m5927l1591J4827M6145L0132j6146m1150k0473J9846
1096a4823L3350N296k9065k8145J1024M0327K2760k4203m7473j8332L2193M9430
1108C2339J4085l2336m1416p461K8029K9604L32k6634k0767R488K8600J4283k0172
1121G974l4493j1253K9034M3535J1011l6250m5613o761M0463M1915l819m2256
1133f513k9537J7470M0228J1527l1740l6177K876M1455L2555j2142m2902k7668
1145d0568J5087M0407K3823j4547l5049j9038J4330K9788J1943j9928k9035m506
1157b7293K9982L0650o410m0185k9870J7232M7853K6229k5765m8276j5859L1126
1169a0586L9905K909l4136l0234R166L5253J9176j9450l5375j1450K5132L6628
$$ plain form
1084 -29347 13146 43971 29514 -16413 -48004 -33177 12968 43100 26954 -14196 -34669 -14823
1096 -14823 18527 23823 -5242 -33387 -22363 17964 40724 16521 -30952 -49284 -17091 32339
1108 32339 46424 14088 -27328 -34789 -6760 22844 23176 -3458 -24225 -14737 13863 28146 7974
1121 7974 -26519 -37772 -8738 34797 45808 9558 -36055 -42816 -2353 39562 35743 -6513
1133 -6513 -36050 -18580 21648 33175 1435 -34742 -31866 9589 42144 30002 -12900 -40568
1145 -40568 -25481 14926 38749 24202 -10847 -29885 -15555 14233 26176 6248 -22787 -27293
1157 -27293 2689 33339 26929 -13256 -43126 -25894 21959 48188 22423 -25853 -41712 -10586
1169 -10586 29319 32228 -1908 -32142 -22976 12277 31453 12003 -23372 -34822 -9690 26938
1181B6938R417k8329l6020o154K9495L4016K138l2690l0297N942L5112K2082j7724
1194A3926l7661j2485K8874L8681L515l7073l5398N902M0823K9498j2544l9546
1206a3488k1947J8371L4531J1533k2350l1055m428K7666K8997k741l2033k5926
1218c2870Q846L6191K4448j3949l8260k0001K0209L7008J2027k6468l5416l181
1230c1416L3757L0056q546l7342k2511J8935L8826J6021k4965l7096p353K9278
1242b356L1952o17l0932k5735O965L0374J8698j3251k9303j3392J7335L0087J1331
1255C1156k1020l0200p027K5407L0975J833l0643k9172N757L5205K3066j6682
1267A8655l7755j5033K6751L7571M035l4098l1791P458L6960K3761j5032l4149
$$ plain form
1181 26938 36355 8026 -27994 -34148 -4653 29363 31501 -1189 -31486 -25544 9568 31650 13926
1194 13926 -23735 -36220 -7346 31335 34850 -2223 -37621 -31719 9104 38602 26058 -13488
1206 -13488 -35435 -17064 17467 29000 6650 -24405 -28833 -1167 27830 25089 -6944 -32870
1218 -32870 -24024 12167 36615 22666 -15594 -35595 -15386 21622 33649 7181 -28235 -31416
1230 -31416 2341 32397 23851 -13491 -36002 -17067 21759 37780 12815 -24281 -31634 -2356
1242 -2356 29596 28979 -1953 -27688 -20723 9651 28349 15098 -14205 -27597 -10262 19825 31156
1255 31156 10136 -20064 -27091 -1684 29291 31124 481 -28691 -22934 12271 35337 18655
1267 18655 -19100 -34133 -7382 30189 34224 126 -31665 -24207 12753 36514 21482 -12667
1279a2667j5222J9426K9637O393k1964k5934j770K2613K2940j104k4673k1079
1291b3404M742K6567K1386p615l0249j9146J4275L2197J2887k2413l2340m714
1303b7827K9517K8569o415l4725k1714J6255L5245J4621k2135l2002o081K5515
1315a177K6213j473k5071k0623N865K3849J5636j0614k4278j2352J3637K5655
1327A5267J0596j7190k7532o530K2980K6746J449k6071k4456N070K8586J8022
1339B6937j3862k9476j0377K0227K7787L154k5190k4700L917K7672K0902p159
1351A9832k7401j6687J1002K5954J1847j4957k4893o723J8127K2737J090k2786
1363b858k0139N306K5527J8695r736k7695j4873J4832K8203R396j8622k4846m151
$$ plain form
1279 -12667 -27889 -8463 21174 27567 5603 -20331 -22101 512 23452 22348 -2325 -23404
1291 -23404 -18662 7905 29291 21676 -8573 -27719 -13444 18753 31640 9227 -23113 -27827
1303 -27827 1690 30259 23844 -10881 -32595 -16340 18905 33526 11391 -20611 -26692 -1177
1315 -1177 25036 23563 -1508 -22131 -16266 7583 23219 12605 -11673 -24025 -10388 15267
1327 15267 25863 8673 -18859 -25389 -2409 24337 25786 -285 -24741 -19671 8915 26937
1339 26937 13075 -16401 -26778 -6551 21236 24390 -800 -25500 -21583 6089 26991 19832
1351 19832 -7569 -24256 -13254 12700 24547 9590 -15303 -22026 -3899 18838 19928 -2858
1363 -2858 -22997 -17691 7836 26531 16795 -10900 -25773 -10941 17262 26658 8036 -16810 -20961
1376b0961K0235K1076l227k2869j6013R317K4021J2573j3850k4524p947J8012
1388d157K3781M251j9052k2253j618J9916J8662k562k1204j4968P349K1439J1353
1401B0937j3480k2656o170J9239K4246K089k3341k3744K642K6653J9185r533k6053
1414i986j2707J3357K2826M885j7502j8359K193J9886J5025n773k0342j3153P466
1427a2184K0534J2767q036k0932j2817P580K0799J0793j1574k1453n223J8152
1439a594K0128k908k3942j7330J2676K9161J1613j9533k8520o020K1710K3144
1451A8585o06k0707j5708N262J6743Q287p192j3536m924J0037J4209M873j1399
1464C924j7523o643J3468K2550O803j8607k4176l083K1068K0717l809k3253j3067
$$ plain form
1376 -20961 -726 20350 17123 -5746 -21759 -12442 11579 24152 10302 -14222 -22169 -4157
1388 -4157 19624 23875 4823 -17430 -19048 868 19530 16968 -4236 -19204 -11855 9584 20937
1401 20937 7457 -15199 -21369 -2130 22116 24205 864 -22880 -20238 6415 25600 16067 -9986
1414 -9986 -22693 -9336 13490 18375 873 -17486 -15293 4593 19618 13845 -6497 -19650 -12184
1427 -12184 8350 21117 13081 -7851 -20668 -13088 7711 18504 6930 -14523 -19746 -1594
1439 -1594 18534 15626 -8316 -25646 -12970 16191 27804 8271 -20249 -26269 -4559 18585
1451 18585 17979 -2728 -18436 -13174 3569 11856 4664 -8872 -13796 -3759 10450 15323 3924
1464 3924 -13599 -20242 -6774 15776 22579 3972 -20204 -23287 -2219 18498 14689 -8564 -21631
1477b1631J4468K3905L018k2575k0740N508K6912J7474j1104k5774j3345J0296
1489a3588K0618R818q148j5882o544Q379J2716L005r597j2736R10J6658J5230
1502B0839n261k3531j7352Q578K8017J6818j3277k8307j1190J6766K2889K191
1514A7180j8191j4435P695K0576P689j4886k1351l981J7552K1713L488j6984k1351
1527a5286m841J3779J8634N698j2319j5758j402J5067J1939p347j8904o816J6142
1540a414K4052K765k4604k6148Q31K5842K3279l305k4046j6582P232J9344P105
1553A4351j0902j3459N34J5346J2700n528j9926j5283O345K2939J7855n827k5106
1566e961j8759O662K3071J4850r060j9294o151J5343J6466n410k2885j2557J4022
$$ plain form
1477 -21631 -7163 16742 19760 -2815 -23555 -18047 8865 26339 15235 -10539 -23884 -13588
1489 -13588 7030 16848 8700 -7182 -13726 -5347 7369 10374 777 -11959 -11049 5609 20839
1502 20839 15578 -7953 -25305 -16727 11290 28108 14831 -13476 -24666 -7900 14989 17180
1514 17180 -1011 -15446 -7751 12825 20514 5628 -15723 -19704 -2152 19561 23049 6065 -15286
1527 -15286 -20127 -6348 12286 17984 5665 -10093 -11495 3572 15511 8164 -10740 -17556 -1414
1540 -1414 22638 25403 799 -25349 -24518 1324 24603 21298 -2748 -19330 -12098 7246 14351
1553 14351 3449 -10010 -9476 5870 18570 13042 -6884 -22167 -15822 7117 24972 19145 -5961
1566 -5961 -24720 -18058 5013 19863 10803 -8491 -14642 701 17167 11757 -11128 -23685 -9663
1579i663K7202J0706j8583k9339r026J8067K4726P281j4211j8446l476J3536J1740
1592A0514l514j3955p048J0969J8622N279j7465k5025n820K0830K7595N968k1525
1605E425k5616k681K0319J8198l418j7546q575J2059J7977N17k1276k0090M965
1618a9742K6469K1265o431k7445k1034N967K4857J6808o592j8423q799J0026J4439
1631A1365l44j6107j2446P790K2329J3624j1835k7916j6084J2390K8510J6566
1643B7842j0892k5525j1949J1929K0286L353j6025j3478P823K1899Q927j7873
1655F317k8490p178K3926L0012N022k3530k5401l085J9115J8294m98j4023q713
1668h232O020J2113K861j2467j6288j449J8272K2541K066k3136k7301k994K5382
$$ plain form
1579 -9663 17539 28245 9662 -19677 -28703 -10636 14090 21371 7160 -11286 -14762 -1226 10514
1592 10514 7000 -6955 -14003 -3034 15588 20867 3402 -21623 -27443 -6613 20982 26950 5425
1605 5425 -20191 -22872 -2553 15645 12227 -5319 -13894 -1835 16142 16659 -4617 -24707 -19742
1618 -19742 6727 27992 21561 -5884 -26918 -20951 3906 20714 14122 -4301 -13100 -3074 11365
1631 11365 11021 -5086 -17532 -9742 12587 26211 14376 -13540 -29624 -17234 11276 27842
1643 27842 16950 -8575 -20524 -8595 11691 15044 -981 -14459 -6636 15263 24190 6317
1655 6317 -22173 -29351 -5425 24587 29609 6079 -19322 -22407 -3292 15002 14504 481 -8232
1668 -8232 -2212 9901 12762 295 -15993 -17442 830 23371 25437 2301 -25000 -27994 -2612
1681b612K7118j09k4510j8464P673K1999O241j8227j9110O874K6305J5296j4967
1694A3507k9820j3496J5217K7015J2550j0511k0599j1068O253J5086Q334p096
1706E372j2483j305J3155J3333o960k4358j6056J5152L3018J5205k0693l4480
1718b1100j0609K2705K7885K105k0609j5188Q135J7667L308j6015j6593K054J9865
1731C610J7828j904j9920k0327k774J7838K3280N765j6843k0866j815J7116J4555
1744A5543p669j9835m449J9674K1734n510k9027k1826J0557L1686J9152j2012
1756A8018k6504j2805J0467J8309O361r206j1410M02J1957Q013o203j7219j1052
1769b0872R430K4651J4902j2675k8298j5292J4604K7275J0311j5313k0628p59
$$ plain form
1681 -2612 24506 24397 -113 -18577 -10904 11095 17336 -891 -20001 -13127 13178 28474 13507
1694 13507 -16313 -29809 -14592 12423 24973 14462 -6137 -17205 -10952 4134 12468 5372
1706 5372 -7111 -8416 4739 18072 11112 -13246 -29302 -14150 18868 34073 13380 -21100
1718 -21100 -31709 -9004 18881 20986 377 -14811 -6676 10991 14299 -1716 -18309 -16255 3610
1731 3610 21438 19534 -386 -20713 -23487 -5649 17631 23396 6553 -14313 -16128 988 15543
1744 15543 7874 -11961 -16410 3264 24998 19488 -9539 -31365 -20808 10878 30030 18018
1756 18018 -8486 -21291 -10824 7485 13846 4640 -6770 -6368 5589 13602 7399 -9820 -20872
1769 -20872 -11442 13209 28111 15436 -12862 -28154 -13550 13725 24036 8723 -11905 -12664
1781a2664J6901J1613r888j9301m667J7327K1825Q61k1224k2365j738J9781K2103
1794A8564L638j6531j8586j611J4575J2238m279j4607o069J2876J6828o75k1294
1807d933j9182M041K4591K0457n391k3238j7443N628J9046J1470o410j4347m853
1820a0564J0517J1604k788j6608j2213P284K2292J4346j0760k6071j3417J2307
1832a4071K4035J0520j2122j8497l853J3185J1165n023j4578n865J0912J6721
1844A2529M396j4883j9405m912J4927K0531P122j3216j9929n092J3213J5490n13
1857A0258j4898r688R124J7233L381j8072j9376K188K2107J9209m021k1507j5478
1870a9540N186J6918R833m484j1389m652N770Q316R75r587j0434J606J4154J4280
$$ plain form
1781 -12664 4237 15850 5962 -13339 -18006 -679 21146 22007 783 -21582 -23320 -3539 18564
1794 18564 22202 5671 -12915 -14526 49 12287 8008 -6599 -12668 208 17036 16361 -4933
1807 -4933 -24115 -20074 4517 24974 19583 -3655 -21098 -15470 3576 15046 8636 -5711 -10564
1820 -10564 -47 11557 8769 -7839 -20052 -12768 9524 23870 13110 -12961 -26378 -14071
1832 -14071 9964 20484 8362 -10135 -13988 -803 10362 5339 -9239 -15104 -4192 12529
1844 12529 16925 2042 -17363 -22275 -7348 13183 20305 7089 -12840 -17932 -4719 10771 10258
1857 10258 -4640 -14328 -5204 12029 15410 -2662 -22038 -19850 2257 21466 17445 -4062 -19540
1870 -19540 -14354 2564 12397 7913 -3476 -8128 -2358 5958 6933 -2654 -13088 -11482 2672 16952
1884A6952k441j9276j6707M653K1934J5402o804k0091r958J1326J5685J90j4837
1897c972j0019P873J6839N748j2710j7345l717J3169J5859M494r702j3849n353
1910a2685P769J1837L470p367r913J92J0448Q121o375j6008o349J2512J9654M693
1924A9999j6411j9546j100J7385J5561k737j5430q607O163J1710K228r901r972
1937a0658J917J2110R631k507j3284j1229K061J3734J2222j436j3103j0984K531
1950h995J2447P174o351j2143k130J0646J0883k534j5048j0287O626J7177R161
1963A6626q252j5816p110Q319J3471L855q392j0204m63Q725O895l346j0571n662
1977a1925O288J2937N675p988j4473n186R423J4469M205j0409j2481j144J0370
$$ plain form
1884 16952 14511 -4765 -21472 -16819 5115 20517 13713 -6378 -16336 -5010 10675 10865 -3972
1897 -3972 -13991 -6118 10721 16469 3759 -13586 -17303 -4134 11725 16219 6517 -7332 -12685
1910 -12685 -4916 6921 10391 3024 -6889 -6697 3751 11872 5497 -10511 -16860 -4348 15306 19999
1924 19999 3588 -15958 -17058 327 15888 13151 -2279 -10886 -4723 6987 9215 -686 -10658
1937 -10658 -8741 3369 13000 10493 -2791 -14020 -11959 1775 13997 12561 -542 -11526 -8995
1950 -8995 3452 10626 4275 -7868 -9998 648 11531 8997 -6051 -16338 -9712 7465 16626
1963 16626 8374 -7442 -14552 -6233 7238 11093 2701 -7503 -7966 759 7654 4308 -6263 -11925
1977 -11925 -5637 7300 12975 4987 -9486 -14672 -5249 9220 13425 3016 -9465 -10609 -239
1990b39R504l465j1696n836P713J2382K453j0506j2087o91J2645J2041q50j1474
2004a06j0538J293J0600Q327l149j0410n506N612R911K691q280j0188l40J1122
2018A039J1163j262j2830j0587L277J3298R098n768j3112n418P409J0698J924
2031H929r392r180J536J1650P744m730j1634o458O163J2580M878o907j1502l503
2045i826O889R848K136p944r640N41R598P935l112j1066o687O352J2926N153r100
2060D003j3406k987J0999J2399j79j2673j0327L819J2441O694o723j1813k843
2073a0596R010J0660Q4r652r408J397J0075Q273k268j0495q065K969J0334O795
2087I113l935j0644o112O554J2114K832r503j1467N46J2411J0627m521j4873p745
$$ plain form
1990 -239 9265 5800 -5896 -11732 -4019 8363 10816 310 -11777 -12468 177 12218 11368 -106
2004 -106 -10644 -9351 1249 9576 6427 -3983 -9489 -3877 6034 8725 445 -9743 -10083 1039
2018 1039 12202 10940 -1890 -12477 -9200 4098 13196 7428 -5684 -11102 -3693 7005 8929
2031 8929 -463 -9643 -8107 3543 11287 6557 -5077 -11535 -5372 7208 12086 5179 -6323 -9826
2045 -9826 -2937 6911 9047 1103 -8537 -7996 1602 9537 6425 -4641 -11328 -4976 7950 13103 4003
2060 4003 -9403 -12390 -1391 11008 10829 -1844 -12171 -8352 4089 10783 4060 -7753 -10596
2073 -10596 -1586 9074 9158 -494 -9902 -8505 1570 9843 7575 -2920 -10985 -8016 2318 9113
2087 9113 5178 -5466 -11578 -5024 7090 9922 419 -11048 -10502 1909 12536 8015 -6858 -14603
2101a4603P598J4269M530r777j2712j567J0876J0023j221j0147p683L802J0311
2114C699N725n160j0864m543O601J1450L939q635j2392k565J0808J1818o47j1335
2128b101r880L718J2814P188p123j2848l398J0153J2428J98j2937j1404K700J3171
2142B679R600m569j2737p048N783J2337M682p327j0645j552Q953R904q48j1286
2156b074r602K981J3215Q709n333j4454p382Q044J4302M370r569j2250r11J1178
2170A224J0477l333j2720p474O511J3588M776r437j3378k824J0619J1827J178
2183A1034j0257j0525N40J0833Q890k757j1551o607N621J2706M339r318j3936
2196a0988k502J2831J3321m29j4660j1865L814J5404Q844p656j3983m020J0214
$$ plain form
2101 -14603 -7005 7264 11794 2017 -10695 -12262 -1386 8637 7416 -2731 -10414 -6612 3699
2114 3699 9424 4264 -6600 -11143 -4542 6908 10847 2212 -10180 -12745 -1937 9881 9234 -2101
2128 -2101 -11981 -8263 4551 11739 4616 -8232 -11630 -1477 10951 11149 -1788 -13192 -10492 2679
2142 2679 12279 7710 -5027 -12075 -6292 6045 10727 3400 -7245 -8797 156 10060 9212 -2074
2156 -2074 -11676 -8695 4520 13229 7896 -6558 -13940 -5896 8406 12776 3207 -9043 -9954 1224
2170 1224 11701 8368 -4352 -11826 -5315 8273 13049 3612 -9766 -12590 -1971 9856 11034
2183 11034 777 -9748 -9208 1625 10515 7758 -3793 -10400 -4779 7927 12266 2948 -10988
2196 -10988 -13490 -659 12662 12233 -2427 -14292 -10478 4926 13770 6114 -7869 -11889 -1675
2209a675J1899l91j2044j0264L262J3046Q106n473j2572p061N715J2872N855o329
2223D946j2242m206P968J1719K128j0896j1531K235J3436J0052o790j5672p674
2236a6527J0176J6085M141j2640j3700K17J3133J0743l564j3049p243O835J1625
2249F232M060q295j1126k703R465J1551Q95r977j1357l03J1900J1297k237j3169
2263c767q961N767J4153N470r723j4233j905J3559J2631k878j4813j0277O237
2276h740J5434O756q447j2998l469R607J0883O99r907r766J690J0749Q446l551
2290G386j2075p784N405J3143O726p695j3930m058J0583J3066J045j2811j1481
2303a2480L724J4001P993p447j4137m713R505J3137K268j1575j1517R93J1771
$$ plain form
2209 -1675 10224 9833 -2211 -12475 -9213 3833 11939 6466 -6106 -13167 -7452 5420 11275 4946
2223 4946 -7296 -11502 -3534 8185 10313 -583 -12114 -9879 3557 13609 6819 -8853 -16527
2236 -16527 -6351 9734 13875 1235 -12465 -12248 885 11628 8064 -4985 -12228 -5393 6232
2249 6232 10292 1997 -9129 -11832 -2367 9184 10079 102 -11255 -11558 342 11639 9402 -3767
2263 -3767 -12728 -6961 7192 12662 2939 -11294 -13199 360 12991 10113 -4700 -14977 -8740
2276 -8740 6694 13450 5003 -7995 -11464 -1857 9026 9725 -182 -9948 -8258 2491 10937 7386
2290 7386 -4689 -12473 -7068 6075 12801 5106 -8824 -12882 -2299 10767 11812 -999 -12480
2303 -12480 -8756 5245 13238 5791 -8346 -13059 -3554 9583 11851 276 -11241 -10248 1523
2316A523R649k896j1979p259M963J1743N096o875j1942l494Q998J1808J163j1307
2330h09j0468J544J2189Q891m013j2766o874P103J3135L666r915j2406r73J1988
2344B92J0781k615j2609q739M978J2729O082p132j1691l270R152J0582Q26j0449
2358a083r752J974J0802Q590m003j1439o904M887J1252N810p220j0998l037R737
2372a384J0734n61j1399r219M048J2729O996o958j2979m886Q606J2080K004r819
2386hr665J429R794O907l322r240m821M808R804L979o728j0273l137P571J1092
2401H190K163r659j0145j18J0875Q327l111j0936n604O886J1209J987r733j0508
2415a0177R50J1619R045l272j1940o786M863R299N137n179p976j967N441O931
$$ plain form
2316 1523 11172 8276 -3703 -10962 -5999 5744 10840 3965 -7977 -11471 -2473 9335 10498 -809
2330 -809 -11277 -9733 2456 11347 7334 -5432 -12306 -5203 7932 11598 1683 -10723 -11696 292
2344 292 11073 8458 -4151 -12890 -7912 4817 10899 3767 -7924 -11194 -2042 8540 9366 -1083
2358 -1083 -10835 -8861 1941 10531 6528 -4911 -11815 -6928 4324 10134 2914 -8084 -11121 -1384
2372 -1384 9350 8789 -2610 -11829 -7781 4948 11944 4986 -7993 -12879 -4273 7807 9811 -8
2386 -8 -9673 -8244 1550 8457 5135 -4105 -8926 -4118 5686 9665 2937 -7336 -10473 -2902 8190
2401 8190 10353 694 -9451 -9569 1306 9633 6522 -4414 -10018 -3132 8077 10064 331 -10177
2415 -10177 -9227 2392 11437 8165 -3775 -10561 -5698 3601 8738 3559 -4417 -6384 -943 5988
2429E988M09o374p233J293Q688O939k357j0994p377L858J2231O373o204j1933
2443f693k787Q193R096q87r477o226N012J0021L197p200r439k269P627R413J256
2458H837p364p972j129N611O915O18n807n538J598P407M130n371q760k453Q075
2473a203R617J245j0348j0026J095J0120P738k723q535m102M229O631O89n639
2487a212n250J283O708N908k368q438o353K258Q595P086k385q654n436L036P762
2502B540K844m506o153M54O964N117l709r193m468N825R373L990n896r103l071
2517h992N190P165K110m196n073q7M649L610k600o593k267N149Q207J729o497
2532A504q873k134P084P810J969n943o496J68N049L941j862m984j910M333O039
$$ plain form
2429 5988 6397 23 -7210 -5917 2771 9710 7353 -3641 -11018 -7160 5071 11444 5240 -6693
2443 -6693 -9480 -1287 7809 6922 -2555 -8781 -3769 6252 9449 2249 -7190 -9459 -1832 7581 8837
2458 8837 1473 -6499 -7628 -2017 4898 5516 -291 -5829 -4231 3176 7306 1935 -6825 -9278 -1203
2473 -1203 8414 9659 -689 -10715 -9620 500 8238 5515 -3020 -7122 -2893 3738 4427 -1212
2487 -1212 -6462 -5179 1529 7437 5069 -3369 -9722 -7464 1131 8217 5832 -2822 -8258 -5222 2540
2502 2540 5384 878 -5275 -4821 2143 7260 3551 -5642 -10110 -4285 5088 9078 3182 -5921 -8992
2517 -8992 -3802 3363 5473 1277 -3796 -3883 766 4376 1776 -4817 -7084 -1935 6272 8001 1504
2532 1504 -7369 -9503 -2419 5391 7360 1417 -5079 -4911 138 4079 2217 -2767 -4677 -344 5695
2547E695P65o900p617L36P938P880n66p432p490J121P313M705k481n581j060M421
2563A047M157j454o433l849K841O930M448k284p406n510J434P131N541j434o151
2578i92l764K352N645J107n304m948K022Q030M436m574j0221m085O601R199K633
2593H137n309o708j652L984M383m91l074k083J769L427K050l287n742k821M243
2608c174Q092L563m983r209l141N912P990J525o259n384K034O226J665m980o777
2623f900J282P028N886j573p511n418M94O475N248L44m532m892o4M276L588j672
2639B059n386j530M704O509l99p884p598K148J0321O913l301r894m351L892P434
2654C637J788m509m491J109M676K778k664n706k921L331O607L878k939p083n372
$$ plain form
2547 5695 6460 -440 -8057 -7721 217 8097 7531 99 -7391 -6270 1043 5748 3267 -2314 -3374 1047
2563 1047 5204 3750 -2683 -6532 -3691 3239 7687 5403 -2003 -7513 -6079 1052 6593 5159 -992
2578 -992 -4756 -2404 3241 4348 -956 -5904 -3882 4148 8584 4010 -6211 -10296 -3695 5504 8137
2593 8137 2828 -3880 -5532 -1548 2835 2344 -730 -2813 -1044 2383 4433 1146 -4596 -7417 -3174
2608 -3174 4918 8481 3498 -5711 -8852 -2940 5050 6575 316 -5068 -3034 3192 4857 -123 -6900
2623 -6900 -5618 1410 7296 5723 -1788 -7206 -6712 -237 5011 5355 823 -4069 -4133 143 3731 2059
2639 2059 -3327 -4857 -153 6356 5957 -1927 -9525 -7377 2944 9857 6556 -3338 -7689 -3797 3637
2654 3637 5425 916 -3575 -2466 2210 4988 2324 -3382 -6303 -2972 3635 7513 4574 -2509 -7881
2669g881L097P835M692l629p121k284N204N783j400o996m005M643Q572K425o419
2684B516r259j720P371Q206Q11o380o554O98N491L932j485n758k246L669N723
2699E015J091n508o795n70P183P681l03p682p559J479P272N450k144o754l183
2714e327M219O001M67o215o205J362Q041O303k705r196n486L715Q339M565m292
2729C586p713k111N406N448J10o577n065K928P536L654l925q223m084N015R105
2744E090L188n397q285j749N812O566r8o609n189K937P646L188n627q192j753
2759h472P292Q246N18p573p103N30P093O109j883o895m165L619O605J660m785
2774G96p042m38O715P341r07p927p040J938Q524O224l174q415l885M840P892J105
$$ plain form
2669 -7881 -4784 3051 7743 4114 -3007 -5291 -87 5696 4296 -2700 -6705 -2062 6510 8935 2516
2684 2516 -6743 -8463 -1092 7114 7925 1545 -5009 -4311 1180 5112 3627 -2131 -4377 -708 5015
2699 5015 6106 598 -6197 -6767 416 8097 7794 112 -7447 -5968 1304 6754 4610 -2144 -5327
2714 -5327 -1108 4893 5360 -855 -7060 -5698 2343 8646 5941 -3255 -8741 -5026 3313 7878 3586
2729 3586 -4127 -6238 -832 4616 4726 -1851 -6916 -3988 3548 7202 3277 -4946 -9030 -4015 5090
2744 5090 8278 2881 -5404 -7153 -1341 5225 5127 -1482 -6671 -3734 3912 7100 1473 -6719 -8472
2759 -8472 -1180 7066 7584 11 -7092 -6562 531 6640 4757 -2138 -6303 -2684 3921 5581 796
2774 796 -6246 -6684 31 7372 6465 -1462 -8502 -6564 1960 8184 5010 -3405 -7290 -2450 5442 6547
2790F547o641o616J111Q239N611l688q820m119M401Q895L300m846p674k013N196
2805a117O243R15n945n367J211P155M264l506p826l571M764Q650K981o434q158
2820e741j673P176P727r02p753n662K881Q010L612n725p695j225O839P600l76
2835G093p829o378J941P279M848k047p143l836L479O522K110m765o149j019O380
2850D86O161n07p802o083K072Q713N135l392r101l264N524P803P08o693o249J434
2866e055P372M695l316p736l329M734P343K452n277o660j622N217O513L3n287
2881G7n835J075O622M515l219p466l100M891P955J820o771p392J02P608O185j849
2897E218p516m352L441P293J896m659o073n66N411N247q2n799n297J205O563M409
$$ plain form
2790 6547 -94 -6710 -5599 2640 8251 4563 -4257 -8376 -3975 4920 8220 3374 -4300 -6313 -1117
2805 -1117 5126 6041 96 -5271 -4060 3095 7359 3853 -3973 -7544 -2780 5870 8851 2417 -5741
2820 -5741 -7414 -238 7489 6587 -1166 -6828 -3947 4063 7675 1950 -5745 -6970 -131 7469 7093
2835 7093 -736 -7114 -5173 2106 6954 4907 -2236 -6072 -2593 3929 6039 1274 -4875 -5894 486
2850 486 6647 6140 -1662 -7745 -5673 3040 8175 4783 -4318 -7582 -2058 5745 6453 -240 -6489 -5055
2866 -5055 2317 7012 3696 -4040 -7369 -2635 4708 7160 1883 -4777 -6399 -1182 5331 5364 77
2881 77 -5758 -4683 1939 6454 3235 -4231 -7331 -2440 5515 7335 564 -6828 -6726 882 7067 5218
2897 5218 -2298 -6650 -3209 4084 5980 1321 -4752 -5318 93 5340 5258 -541 -5838 -4633 1930 6339
2913F339j590o872m112L449O745K933n245o512m10O175N661j525p243m837L574
2928c470P525L249m548o879j752N313N805o3n321m753J002N895M153k733o088
2943b665k596L166N970K317m122o134j356M804O199n13n280m755J246O164L576
2958F021l123o269j819M080N937N09m798n462J26O002M594j770n649l643K611
2973b653N997J714l812n127n80M148M775m75m830m256J360N220L586j865n528
2988b326k710K640N691J572l652n211p13M676M388p35n667l648K345N776K475
3003D901l042n489j702M310M904j11m754l313Q84M284L103k024l914k442K241
3018b164M027K019k968m052j553L591M384Q40m496l955M63M739L610k143m892
$$ plain form
2913 6339 4749 -2123 -6235 -2786 3959 6892 1647 -4865 -5275 900 6561 5036 -2207 -7044 -3470
2928 -3470 4055 7304 2756 -4123 -5875 -562 5243 5180 -141 -4894 -3892 2003 6156 3423 -2665
2943 -2665 -5261 -2095 3875 6192 2070 -4064 -5420 -616 5583 5070 -210 -4965 -3719 2445 6021
2958 6021 2898 -3371 -5190 -1110 4827 5336 538 -4924 -4798 1204 5798 4028 -1621 -5264 -2653
2973 -2653 3344 5058 1246 -3881 -4461 -313 4462 3987 -843 -5099 -3739 1481 5067 3202 -2326
2988 -2326 -5036 -2396 3295 4867 1215 -3996 -4709 -33 4355 3620 -2047 -5695 -3350 2426 4901
3003 4901 1859 -3630 -5332 -1022 3882 3771 -983 -4296 -3412 872 3975 1951 -1963 -4405 -2164
3018 -2164 1863 3882 914 -3138 -4691 -1100 3284 4124 -372 -4327 -3864 875 4485 2342 -2550
3033b550k174K983M869Q93l982m211N03M151L542j455m094j897J535L627J744
3048C484k142l344r64K176L320P54k798l554n4L526L511m71m221l511K085M475
3064B272K229k900m245q38L537L741n18m157k187J025L878J396j542l166j589
3079c064K279L157P80k057l120l83J953L319L39l291k638M27L581K199j243m060
3095a822j327K017L752R94l139l199q6L214L128q88l381k527J816K689J560j559
3111A242k823j603K573K855M04k359k830k9K564L047o36l393k270R87L373J933
3127C035j733l466j165K492K930M09k849k941M12L761K204j466l747j159J573
3142a710L438J109k404k964m03K634K384M5k839k038M93K823K400j500k705j782
$$ plain form
3033 -2550 -4724 -1741 3128 4021 39 -4172 -3669 482 4024 2569 -1525 -3422 -1887 1740 3484
3048 3484 1342 -2002 -2966 -790 2530 3284 486 -3068 -3122 404 3915 3444 -777 -4288 -2203 2272
3064 2272 4501 1601 -2644 -3482 55 3796 3278 -879 -3066 -2041 1837 3233 1691 -1475 -3064
3079 -3064 -785 2372 3152 1095 -2025 -2408 -455 2864 3203 -88 -2726 -2299 1282 3481 2238 -1822
3095 -1822 -3149 -1132 2620 3614 475 -2724 -2810 404 3532 2644 -737 -3264 -1448 1241 2801 1242
3111 1242 -1581 -3184 -611 2244 2648 289 -2541 -2570 -6 3041 2405 -988 -3258 -2271 1102 3035
3127 3035 1302 -2164 -3329 -837 2093 2502 -347 -3288 -2876 885 3089 1623 -2124 -3283 -1710
3142 -1710 1728 2837 433 -2531 -2934 -300 2084 2129 -710 -2748 -2255 568 2968 1468 -1237 -3019
3158c019J507L179J371k200l491m08K507L116K65l052l093R36L586K075j747l333
3174a801j042K158L648O3k717k747o6L309K079l73k812k463Q47K979J800j188
3190A674l000j181J657L066J303k506l728O7K915L677r50m259k243J865M110J418
3206C885k595l722m68K835L339j70l450k224J005L259J557j038l500j677J933
3221a031K815J622k174l195r78K893L235k16l453k699J233L574K492k276m298
3236b456j277K897L894M15k935l842M97L480K521r02l646j920J998L168J455k410
3252I37l518q83K906L601l0l118l148j12L863K831j381l545k154K220M068R28
3268C465k747m351J21L601L646p71m362k925J699M159K180k496l640j219K767
$$ plain form
3158 -3019 -1512 1667 3038 838 -2653 -3061 -554 2562 2827 -225 -3318 -2382 1204 3279 1532 -1801
3174 -1801 -2843 -685 2963 3026 309 -2438 -2504 805 2884 2511 -301 -2764 -1917 1062 2862 1674
3190 1674 -1326 -2507 -850 2216 3519 1013 -2715 -2648 267 3944 2994 -1265 -3508 -1643 2467 3885
3206 3885 1290 -2432 -2900 -65 3274 3104 -346 -2570 -1565 1694 3251 2213 -1287 -2964 -1031
3221 -1031 1784 3406 1232 -1963 -2941 -48 3187 2971 -482 -3181 -1948 1626 4118 1842 -2456
3236 -2456 -3733 -836 3058 3473 538 -3304 -2807 673 3194 2292 -1354 -3274 -1276 1892 3347 937
3252 937 -2581 -3464 -558 3043 3013 -105 -3253 -3365 498 3329 1948 -1597 -3751 -1531 2537 3465
3268 3465 718 -3633 -3512 89 3735 2964 -1398 -4323 -2624 1535 3715 1219 -2421 -3640 -873
3283h73L423M45l398k911O88L826K349j339l845k230J979L851J715k818l432j105
3299c675K909L991J43l949k855R85L937K586k184m392j722L574M188O46l861l971
3315c650K31M179K861j067m068j796J818M019J249k807l400n81L217L245K15l570
3331I5l889N88M122L340j176m595k378K131M297J462k902m552KM430L398j626
3347B747m380k636K374M419J675k940l780r35K916L288J36k977k810J81L715K590
3363C583j243l921k386K330M607J350l286m555p20M198L955o28m481k847J436
3378b608M599J662l047l919n33L607L486m21l630l022P06L652K533j079l364k393
3394c771J937L304J485k130l732n36L006L612m43l985l085J457M509K315k119
$$ plain form
3283 -873 2550 2995 -403 -3314 -2626 1200 3549 2210 -1635 -3865 -1886 1965 3680 862 -2570 -3675
3299 -3675 -766 3225 3368 -581 -3436 -2451 1486 4072 1888 -2504 -4226 -652 3536 4182 321 -3650
3315 -3650 -3419 760 3621 2554 -1514 -3310 -1492 2527 3776 969 -2431 -3012 205 3450 3665 95
3331 95 -3794 -3206 916 4256 3080 -1515 -3893 -1762 2535 3997 1095 -3457 -3455 975 4373 2747
3347 2747 -1633 -4269 -1895 2524 4199 1259 -2521 -3456 -540 2748 2884 -93 -2903 -2722 993 3583
3363 3583 2340 -1581 -3967 -1637 2970 4320 1034 -3521 -4241 -43 3912 3284 -1197 -4044 -2608
3378 -2608 1991 3653 606 -3313 -3846 -239 3247 2826 -804 -3826 -3120 532 3065 1986 -1378 -3771
3394 -3771 -1834 1470 2955 825 -2907 -3443 -437 3175 2732 -1253 -4338 -2881 1628 3943 1824
3409A824m525j489K870M061L73l366l117R46L465K140j651l346j805K152L354
3424A886J684k649l758n55K861L463R8l458k708Q72L650J988j663l854j193K930
3440d06L524J69l143l299J92L615L036q85l812k168J456L654J467j963l630n32
3456b725K969L019m76l396k436J289L304K178j764l735j231K183L224O39k059
3471I83k905j88K576K625m44l461j865J033L323J991k204l349r75K609L063J14
3487B926k837k544O62L027J976j571l218q60K026K533L62k335k501k01K666K489
3503B600l27k660k090O66K698J527j108k782j003J884K980J56k536l097R11L006
3519H25J929j174l143j133J646K852K83j882k037O8J779K064p68j857j611O63
$$ plain form
3409 1824 -2701 -4190 -1320 2741 3114 -252 -3369 -2423 1042 3182 1531 -1815 -3620 -1468 1886
3424 1886 3570 921 -2837 -3392 -531 2932 3030 -428 -3136 -2264 1386 3374 1711 -2143 -3336 -406
3440 -406 3118 3287 144 -3155 -2963 652 3688 2803 -1009 -3177 -1721 1933 3400 1437 -2193 -2725
3456 -2725 244 3263 2787 -609 -3045 -1756 1548 3726 1962 -1773 -3004 -821 2403 3042 983
3471 983 -1922 -2110 466 3091 2647 -814 -2679 -1646 1677 3668 1464 -1885 -2860 -251 2812 2926
3487 2926 89 -2455 -1793 1234 3210 1639 -1579 -2439 -413 2120 2482 147 -2354 -2555 111 2600
3503 2600 2273 -387 -2477 -1811 887 2414 1306 -1476 -2479 -595 2385 2541 5 -3092 -2181 825
3519 825 2754 1580 -1563 -2696 -1050 1802 2085 203 -1834 -1766 13 2077 1309 -548 -2159 -1496
3535a496K354J368j135k312r93J243K511O76j835k117R2J806J743l24k636j205
3551b260J294K303R11j861k156j67K192J773n77j694j322M76J759Q24q63j415
3567g83n18R81J401P26j636j528J21J489J380j94j884j219O48J944J043j106j839
3584i74l25J427J201L77j882j290O29J524Q74n96j615p00O77J461N83j107p54
3601d90n69J051J215j41q38j272K54J115P10m61j320p62J101J227K49o48r73p73
3619a325J348R35o2j354n69M39J212Q01j076j381n65J309P95M12j194o32M1P42
3637a24R16n52l53p92J63Q89N18l41j071m43N63R79M37r28r43j90R94R90j82r17
3657c87q21N99Q25L78p27q25K23J92Q92o6n69o04p9P46P80ro17p39l11J220P05
$$ plain form
3535 -1496 858 2226 1091 -1221 -2214 -971 1540 2216 381 -1736 -1644 162 1905 1581 -1055 -2260
3551 -2260 -966 1337 2248 387 -1769 -1936 256 2029 1452 -242 -1564 -1088 671 1495 632 -783
3567 -783 -1301 -320 1081 1807 171 -1357 -1236 253 1633 1439 -445 -1664 -1016 928 1971 865 -974
3584 -974 -1299 128 1329 1706 -176 -1466 -837 687 1561 965 -650 -1350 -673 788 1371 264 -490
3601 -490 -1059 -8 1207 1066 228 -1044 -790 325 1035 574 -746 -1508 -407 820 1069 421 -552 -1325
3619 -1325 23 958 896 -458 -1027 -588 624 1425 349 -1032 -1597 -288 507 919 -275 -907 -866 -124
3637 -124 792 240 -113 -905 -742 147 665 324 -747 -1190 -627 352 789 -139 -1082 -1272 -278 712 530 -387
3657 -387 -1208 -609 216 594 -133 -958 -735 -543 349 283 -286 -890 -969 -223 557 548 -69 -808 -1119 101 806
3678H06k05q22q12N17J001L02q76j150K57Q21R98j84p84o45K29Q47Q03m45r06
3697b48k97L34P24M08p45p34k11J116J044o31n34n35r7P26R33m24j115o23O34
3716b75J058L80q24r95LJ022P63l49o91j036K63J376K22nj096j34K53P56N88r06
3736C73j060J0Q73R46l11q17j046N02J081L05m5j320l19L79J381M19j220r90O2
3755g97R57R79o15p35j027O49J208M21m34j661j20R83J417j90j382r99M05J438
3773D97J007q49j446m88O43J358K33q82j098o9Q11J356j93j366j256Q70J651O06
3791A385q75j585m53J166J160K2j013j017k2J547Q94n78j514p39J243J230O89
3808A540j469j481J91R91J527j1j299j330L68J610R94q37j657q25J174J817L68
$$ plain form
3678 806 601 -221 -1033 -516 485 787 -89 -1239 -982 -161 837 653 -131 -776 -547 300 1103 658 -248
3697 -248 -545 -211 513 921 176 -558 -769 347 1391 760 226 -309 -406 320 1253 829 -286 -909 -275
3716 -275 783 1163 339 -656 -653 369 1132 783 92 -944 -681 695 917 912 -184 -318 -65 691 1279 373
3736 373 -687 -677 196 1142 831 14 -1032 -530 551 856 811 -509 -828 -449 932 1351 131 -859 -797
3755 -797 160 1139 524 -211 -1238 -589 619 1040 606 -1055 -1175 -192 1225 1035 -347 -1346 -941 497
3773 497 1504 655 -791 -1279 -636 722 955 73 -1025 -1094 -283 1073 880 -486 -1742 -872 779 1385
3791 1385 510 -1075 -1528 -362 798 820 -193 -1210 -1232 315 1209 631 -883 -1622 -379 851 1540
3808 1540 71 -1410 -1219 -228 1299 1288 -11 -1341 -973 637 1631 794 -863 -1688 -514 1303 1671
3825A671j620j546L58J777J034m54j708r28J211J439J42j234j255j81J509J406
3841A621k65j367j137O85J433P46k77k111p81R25J715O36j243k078K62K006J009
3858A779n17j888r17J125J696L91j020j965j00J458J641l11j512j063L32J378
3874E07Q48r54j271o38J285J504M59j402j757K16J498J581r09j639j001O86K019
3891A032K88j158j656j27J262J935n77j447j335O54J601J015j081j725k24J244
3907b99J183L40j076k011O28J335R20m12j360p95P70J469O13q67j817m64J560
3924b83J449j18j460j095L10J558J247j421j407j52R37J477J49j956o66J03J875
3941E47J055p29j730o40R62J410M72j085j654J5J633P98J00j404j124O08J567
$$ plain form
3825 1671 51 -1495 -1137 640 1674 1220 -488 -1416 -205 1234 1376 142 -1113 -1294 215 1621
3841 1621 1356 -11 -1148 -463 970 1716 1439 -672 -1453 -528 1187 1823 580 -1498 -1236 770 1779
3858 1779 1262 -626 -1543 -418 1278 1669 649 -1316 -1416 42 1683 1372 -140 -1203 -871 507
3874 507 1355 401 -870 -1508 -223 1281 1740 338 -1419 -1203 295 1876 967 -672 -1673 -987 1032
3891 1032 1320 162 -1494 -1621 -359 1576 999 -448 -1783 -1129 472 1487 406 -1319 -1543 -299
3907 -299 884 1224 148 -1863 -1235 100 1020 608 -752 -1547 -777 692 1305 438 -1379 -1843 -283
3924 -283 1166 1048 -412 -1507 -1197 361 1608 187 -1220 -1372 -435 1042 1191 -765 -1431 -1328 547
3941 547 1602 873 -857 -1497 -535 875 1347 262 -1392 -1377 256 1054 1154 -250 -1374 -766 801
3958H01R31r04j399p52R92J732l5j297j053R5J573Q73p72j345o22O49J574M00
3976A441j173j084j85J109J144k16j282o52L27J402N29q20j341n28R98J415oj081
3994cr14Q2J341R14l99j831n00J133R55O62j388j232J71J222J078p04p76r24N47
4013e66J156N60q93j214q3P10J099rj048j062K07J391O59n60r98l17P26Q99J47
4032H04r58q86M2Q54J166n21j344m69O34J405N9q65r95L5Q05J038l47q61n94M40
4052e58N00Q39p26r06j33P41R76k38o39r22M90Q82N14n07j026k80K76J217M30
4071I30r51q12K35R96M96k54r42n76M10J067J51n72q52J73O19O11q4q21l41J54
4091c63R65K60n15p71L6K66J036k72m70o89J10Q03M36k44m76m98K81P44r2p01
$$ plain form
3958 801 1732 828 -571 -1323 -331 1401 1366 69 -984 -889 684 1557 785 -560 -1182 -533 1041 1441
3976 1441 268 -816 -1001 108 1252 1036 -246 -898 -571 831 1360 540 -801 -1329 -331 1084 1078 -3
3994 -3 -917 -835 506 1420 1021 -810 -1310 -177 778 1440 52 -1180 -1009 213 1291 587 -189 -1113 -566
4013 -566 590 1150 257 -957 -1040 -330 769 760 -288 -1350 -1143 248 907 347 -651 -968 -242 657 804
4032 804 -154 -1040 -998 -144 1022 501 -843 -1312 -678 727 786 -79 -1074 -1039 -234 804 457 -404 -998 -558
4052 -558 -58 781 55 -851 -984 -243 733 495 -144 -1066 -576 306 820 313 -713 -993 -717 500 930
4071 930 -21 -833 -598 398 894 640 -302 -878 -468 599 750 178 -674 -501 118 729 645 -176 -517 -363
4091 -363 602 862 347 -424 -388 -122 914 642 172 -517 -407 396 832 588 112 -386 -105 639 547 -154
4111a54m03M8J154L35m82r80q8L36O48O59p63l88l66O15Q9j62l42j87O42L13N6
4132E80p96l06K18L02N32J64p03n25J75N07M84k78m35k56K14O74k94n95l04L86
4152b56N56L89k62p96j98J70M34K98k38n50kN37k0k31m29k4M02O27J69o32r08
4173i64J53M15O82k80l65J91m9Rk3R8n87M00L82J77J4r99k27M17N62N01n17l84
4195c94j28q3Q30R5o87J51J25K97J71p20l31J72L85O72R2l88p64Q0M67K01k36
4216GJ0j38P4Q38l35p69l71L11O82O47k64r02n00L00L05L70j95j24q1K14N4k97
4238a64R8k23M55M96N8o14o19O6L39M45L46l63o31K75J32K68o54r6N83L1P11o19
4260C20p83m99L68J048j58m1k83p96K79O49k32q7k37n0J023J91n76j022K69K85
$$ plain form
4111 -154 -557 -509 645 980 498 -482 -570 -234 414 1073 310 -78 -444 171 260 98 -244 -431 211 524 580
4132 580 -216 -522 -304 -2 530 694 -9 -534 -359 148 632 354 -81 -337 -123 551 257 -338 -642 -256
4152 -256 300 689 427 -369 -567 -397 37 335 97 -453 -455 82 62 -169 -598 -622 -220 407 576 -56 -964
4173 -964 -811 -396 286 6 -359 -168 -217 -208 -231 -133 -720 -320 62 239 253 -746 -973 -556 6 507 -10 -394
4195 -394 -522 -605 225 320 -367 -216 -91 206 377 -343 -674 -502 -117 555 647 259 -505 -425 42 243 7
4216 7 17 -121 -47 791 456 -313 -684 -373 309 956 692 -210 -710 -410 -105 265 70 -54 -135 79 133 -164
4238 -164 -66 -289 166 662 720 106 -513 -447 -108 337 683 320 -311 -36 96 364 -290 -386 197 228 939 320
4260 320 -463 -962 -594 454 296 255 -28 -824 -545 104 -128 -215 -452 -502 521 712 136 -886 -617 -332
4280c32Q20J31o99k73m09K66O78r1p3j37k6J42N9k31n77K57O16M66q8q93n31p9
4302a004M46Q34k43k45l19N60J32k76n17k24O72P31j02k53p04l75M02M38M08q1
4322B80l57l54K04M7L41m40l22N41M91r4k71o84j53N51P62O02j069p61K37M45
4342dM98k08m23L04L28J7j74o77l78M53M78O78j41q61n94J97P76M93k98k47k27
4363a0L98l36J05m35l61P96Q13j64n96o70o31R89P81J72m90k07j16k34L75o2l77
4384b60J66J71N64k15o93o32K93O89O35J38r48l73J80K77L61l26k17O3N22j13
4404B82n11j98j79M37R41j42n18l08m08M75J53P0j30k3l29L30J79n75n3k96R28
4425A25L17q3o92n05Q4M11M18K01k96l21J81J31k63N8L4lL62K10o40j61j52L08
$$ plain form
4280 -332 488 619 -80 -353 -762 -496 182 91 18 -119 -145 -3 56 -175 -752 -495 121 587 499 -394 -925 -1004
4302 -1004 -558 276 33 -212 -531 29 161 -115 -632 -856 -184 547 445 192 -512 -887 -485 -47 361 280
4322 280 -77 -431 -227 -180 161 -279 -601 -60 431 337 66 -618 -771 -220 542 1144 75 -686 -449 -4
4342 -4 494 286 -137 167 495 512 338 -339 -717 -264 214 892 751 -110 -704 -507 269 762 464 217 -10
4363 -10 388 52 157 -278 -639 157 970 806 210 -460 -1091 -102 679 851 361 154 38 -196 179 117 -260
4384 -260 -94 77 641 426 -267 -899 -606 83 718 856 -92 -465 -285 -8 353 27 -190 -127 395 282
4404 282 -229 -427 -606 -169 772 630 112 -196 -604 -129 24 94 -36 -59 -388 -58 121 -454 -507 -803 125
4425 125 442 359 -333 -838 -754 -343 75 276 -20 -341 -160 -29 -292 -234 -200 -203 159 369 -271 -432 -584 -276
4447b76O17m7K2m49m15J06O01m71K38J3o7M04k6n19k98J62P64O9L14r42jj3M13
4470A99R3l05J63p4K40l02Q4l16OL28N86q4k93n55M12m50N62J6j87k46K86mL5
4493A94j92J03l13N76M25k91n78l62M40J63M14m02l30j53K90K26L2l20O9K27K65
4514D83J55p10m56N4K13N64K54o01J7m20O98J04j40l67j75O34L18l94n73LK0L13
4536fJ80J73p33L0K8J63M15m84n9j24Q8L85k02k39jR2N03J79o02l29k80P28M65
4559C70o9m71l64n3O84N33o38p49J10O08O77j35q13n65N47O98K10n27n72J86j3
4580c46P21J15n14l72J1O42J70j74o31j12K33O53L60n86p06n7N35P18l55k90m40
4601d25L49M92J82j24q91O5M71P48k29r10l14n3J056L87n41o24K2M59O87J10q99
$$ plain form
4447 -276 341 294 316 -133 -548 -442 159 -312 -74 -61 -128 276 250 -269 -567 -405 359 428 742 -200 -201 -214 199
4470 199 292 -13 150 76 316 14 98 -218 -212 116 702 618 325 -230 182 -268 294 310 123 -123 163 159 194
4493 194 2 105 -208 368 793 502 -76 -438 2 165 579 177 -153 -306 -16 210 242 -78 -9 218 483
4514 483 638 -72 -528 -474 -261 303 557 -44 -27 -447 251 355 215 -152 -327 307 625 231 -342 -339 -319 -6
4536 -6 174 347 -386 -356 -328 -165 250 -234 -293 -417 -329 56 -146 -385 -386 -294 209 388 -214 -543 -823 -95 370
4559 370 301 -170 -534 -587 97 630 -8 -757 -647 -39 638 503 -310 -875 -328 370 580 53 -519 -333 -346
4580 -346 375 490 -24 -396 -385 257 427 253 -378 -490 -257 396 756 170 -536 -593 -58 660 305 15 -425
4601 -425 -76 416 598 474 -417 -352 119 867 638 -272 -586 -639 417 804 263 -361 -339 120 807 917 18
4622A8m58J69N97N29n86n44m64P42O27L13p87r07M04M14N90l3p30l50L70O43K99
4643H56l75j213j47Q67M05K18o13q89M15P91M45l83r67l87N37J052P5m85j154
4662i52J38J043J89k47m35n53M47J084j04o85n84j89J023O14k43p81n06J12P63
4681A34M90k91q80k39M39Q57O4o93p59O3Q82P26j25j012q71O69R57K29n80q65
4701h05k20R76Q85m14q71n17L34J248J02o58r37k54P57J107P3m73j033p6J148
4720C72M08j41q81m77K08J465k18r61n26n5J113P35l7r95r76M52R80L34m69q54
4740e23j33N68J120k45p73j014O03R17P27o64j271m09Q88R83L90n79j265j59J322
4759D83L95k13j058m59O86P38L11n04j007K8N37R04p9l69j189J19Q58O38p7r83
$$ plain form
4622 18 -440 -271 326 855 269 -275 -739 3 630 943 156 -751 -347 67 657 624 -106 -456 -86 557 856
4643 856 481 -732 -879 -12 393 611 -2 -891 -476 315 760 377 -590 -977 -440 612 687 202 -952
4662 -952 -814 229 418 171 -264 -817 -370 714 610 -75 -659 -848 175 789 546 -235 -741 -629 134
4681 134 624 333 -547 -786 -347 510 574 -119 -878 -815 67 793 668 -344 -1215 -546 411 640 60 -805
4701 -805 -1025 -49 836 422 -449 -966 -632 616 718 60 -877 -1131 -374 733 806 333 -700 -776 372
4720 372 780 639 -242 -719 -511 954 736 -225 -751 -806 307 1042 1005 10 -966 -514 466 800 331 -523
4740 -523 -656 -88 1032 787 14 -1000 -397 520 1247 583 -688 -1097 -209 774 1164 585 -680 -839 483
4759 483 878 665 -393 -852 -166 572 883 379 -628 -600 -63 841 762 393 -796 -677 181 819 742 -241
4779b41o54O97Q58J25r27p23JJ093R78l64j227n82K93J270L19r35p57j30R20O25
4799F39p9r52q22O97Q27N86n18j263j19N01J011L67r11q53L8O60R70l15q72l86
4819g94J76J284N19r47r14k89J223N72o0r20n83K46P62N31n11j040l43R15O41
4838D68L08p77j117L48Q02P04k05j079m12M87J154J10o09p08J8P40M34j59p64
4857b57l31P5P99M13Rj291k10P08O23L34n26j168J82R89K69J00n54r82L34R71
4877D87O02o58j071J00R69L71N7q26m07K9R87M83p89n07n47O03R81j68o12l83
4897b99j70Q02L74k30p17l80M35P20J74n73o44j41O53P22m9m35o56J24O28R5j41
4918B92m02k90Q7P67J19l47p23r3P85M40j91q06n42N14O85K84o23m53j68N63M04
$$ plain form
4779 -241 -895 -198 660 785 -142 -865 -864 229 1207 843 -384 -966 -673 597 916 -19 -776 -906 14 639
4799 639 560 -392 -1214 -517 310 896 378 -885 -1004 -503 508 875 -36 -889 -851 -191 779 464 -408 -794
4819 -794 -618 666 1185 238 -676 -965 258 830 770 -150 -733 -487 275 806 295 -745 -1088 -173 468
4838 468 776 -1 -1118 -770 32 736 531 -548 -960 -473 681 791 182 -526 -508 232 666 507 -257
4857 -257 -588 -513 286 699 708 -583 -793 -85 538 872 346 -822 -640 349 618 718 164 -818 -484 487
4877 487 1089 431 -640 -540 429 800 857 31 -376 -347 640 1123 334 -173 -720 -117 864 696 84 -299
4897 -299 -469 333 707 477 -240 -620 -185 535 709 136 -508 -649 4 726 677 242 -414 -290 338 433 292
4918 292 -110 -400 -313 454 573 226 -497 -590 195 635 444 -362 -904 -390 295 579 -44 -497 -665 -102 302
4939C02N1r55K32K43K88q0N8o23l67O35L96K83n00m76K36k09N65K1k21j86P5O12
4961C80j4m51l68o5L99M86N34q17m95j00L56K71L4j95j24Q0K96j16k27k96K05
4982b27N44L64m80k07l14l80N46N72j3j1m98J23K84j75j17J3Q6J26L48k52o17
5003b85j53K36M24M77k12m56j93k98L43K82p5L64l24j5l7K11q09J07L57M49J90
5024E83q1p06m99J51O59L77q3k29l00j17O4rj44J37L62j37L16m38j03n22M19O64
5046C64J09M4p88P7l69K21M43J41p7J19j93k19j7l28m6O15L83K67o23n84j87P9
5068e69N48M14J33q94k34K12J30K13k09n8M02K76J16o64l92m4J65J130Mk87p14
5089c22j63R2M79j75L3o5j12M66K5o88j27j60O32P13K02n20p67k34K98P60L87
$$ plain form
4939 302 353 -602 -370 -127 161 81 139 -484 -851 -216 180 463 -37 -513 -277 -486 79 100 -121 -307 -232 380
4961 380 366 -85 -453 -518 -119 367 901 84 -411 -511 -155 116 150 -45 -169 -89 207 91 -136 -432 -227
4982 -227 317 681 201 -6 -320 -700 -154 418 405 394 -104 19 303 128 11 24 110 236 584 332 -285
5003 -285 -438 -202 222 699 487 31 -162 -460 -117 165 90 454 130 115 78 289 -520 -413 -56 393 583
5024 583 502 -204 -703 -552 107 484 401 172 -128 -245 -181 -190 -334 -197 165 28 344 -94 -197 -719 -300 364
5046 364 473 517 -271 -194 -563 -342 101 242 165 284 91 -128 -145 -473 -519 96 479 746 123 -461 -648 -569
5068 -569 -21 393 526 -368 -602 -390 -260 -47 -256 -314 88 364 480 -184 -576 -620 -455 675 679 392 -322
5089 -322 -485 -393 86 -89 -56 -121 -233 233 258 -430 -557 -717 -85 628 830 310 -457 -691 -393 367 754
5110G54j62l28l06K22K3m87j61K57P69Q8r7q68k79P0P69O52l6p13o96J35P17k48
5132G5j68K02k34O17N0j69p42m42K47J080L80j83q60o53K01R58L99m92k87J37
5152A16K25J03m39o32J85L89Q54Q9o05r21q0K39J148J26l48q77J70N26L1l74m65
5173e40R9Q48K24l75m06r21M96N89R42k82q75p19J79N70O95k83n85j79L18N45
5193C40K53r28q00P51P88O98n69j396l25O13R12L93p64n67K18M94L33n68k19l79
5213g22N80O14M84n88r89n36P39J049J08o56m94l29Q10N78n61m74j73L93J219
5232A052m8j283r15m5J343J108l95j019p49N30Q08K64j76j070J77P92P89q29r79
5251f45l33M91R73R23o39j220n07M95J127L11l60j054j31Q66M80m06q73m74P38
$$ plain form
5110 754 592 264 -42 180 203 -284 -445 -188 581 669 572 -296 -575 -505 264 916 880 167 -529 -394 323 75
5132 75 -93 109 -125 492 542 373 -369 -811 -564 516 896 713 -147 -800 -599 359 758 266 -21 116
5152 116 341 444 5 -627 -442 -53 801 890 285 -636 -716 -477 671 797 449 -428 -258 268 299 -75 -540
5173 -540 -441 407 631 256 -150 -1071 -575 14 956 674 -201 -920 -741 -171 524 241 -344 -523 -205 340
5193 340 593 -335 -1135 -384 404 1102 533 -863 -1188 -575 337 730 -34 -601 -383 111 444 -124 -343 -722
5213 -722 -142 472 956 368 -621 -1157 -418 631 739 83 -411 -740 70 648 87 -387 -560 -167 1052
5232 1052 1004 -279 -1194 -1239 104 1212 817 -202 -951 -421 387 651 475 -595 -418 374 1163 334 -645
5251 -645 -978 -487 486 1409 770 -450 -957 -462 665 976 616 -438 -569 297 777 371 -502 -976 -238
5270b38J401k75q45j162N7J225P25J99q13j057M00M27Q78o15q43P3O13R16m3j250
5290b27p70j68J326Q03oj310o95M97P19O67o99q46J20P47O23m21q14o79L44J423
5310F34K11m42r95k83L66J193N05r28j240kR47O99k33r56p05P20R45R70j683p27
5330a004l07J104J020J29r88r25K95P03N96m72r87m2O85Q94k27q29l15l10J071
5349I1O58O3r98p94J62J317J97m92r62j10Q72P90j58j049n72L77J320L91l96j457
5369g50m04O66J331K14q03j200q4R05R08q4j253n72P37J139K59q01j234J39J070
5388A83M74J33q56q44M86Q45O32m94q82l94N18R16K96r74j144K30J045P25K9j056
5408a32q72L33J299K82l45j570Q0Q97J140m4j261k79k99R00Q57m20j214q9O39
$$ plain form
5270 -238 1163 888 43 -1119 -1062 163 888 1087 274 -783 -383 44 922 307 -536 -463 150 1066 1023 -227
5290 -227 -997 -1165 161 964 958 -352 -1047 -550 169 836 137 -709 -589 158 781 360 -454 -1133 -789 634
5310 634 845 403 -592 -875 -509 684 1189 261 -979 -981 -34 665 432 -524 -1229 -509 436 1406 -277 -1004
5330 -1004 -1311 -207 813 942 -46 -971 -676 27 623 151 -836 -878 -193 701 474 -355 -670 -980 91
5349 91 749 812 -186 -980 -818 499 696 204 -758 -868 4 794 636 -413 -985 -608 712 1103 707 -750
5369 -750 -1154 -488 843 1057 254 -946 -1030 -125 783 699 -554 -1126 -389 750 1009 208 -1026 -887 183
5388 183 657 790 -66 -910 -424 421 1053 559 -323 -717 -199 717 1013 39 -1105 -875 170 895 924 -132
5408 -132 -1004 -671 628 910 565 -1005 -925 -28 1112 1068 -193 -472 -771 129 986 566 -648 -737 -98
5427i8O06K77q03q89J83P74Q79l65p49q32M66P70N56m77j033k33R36R68k07r01
5447a72q95O76O93R01o26q79p62N17J060q6m53o11m07Q48O90K09j143l96L25Q37
5467C26M68r42p89n6O65J259l05p87p10O4P50O03L7r93k04L02O21L17o37o65j53
5488h29Q58O80k96l11r14QJ105N50k04o42l92J99Q04r1l73q28K19R65K23k32r45
5509d46k45L63Q00K99k63p85p2K54K62K82m95o29K37Q84j7J74j067k87Q68M24
5529E41K15k67r01m8N00N89l11l47l33R8O33K57l08q38j84O08N61K09l67r06J09
5550d90L69O89O1p15n40L71O01J34m66n06J81L18P45m16m33l65J09K53O75j03
5570D72n40p5o32Q46L83l04o17J26M38K20j65k38p70J92P51P10m16p53m08L47
$$ plain form
5427 -98 508 785 -18 -907 -724 50 929 564 -185 -1017 -551 219 775 298 -735 -968 -32 936 729 -172
5447 -172 -1067 -391 302 1203 577 -302 -1064 -547 513 427 -26 -637 -1044 -196 494 703 -440 -836 -511 326
5467 326 794 -148 -937 -993 -328 931 626 -161 -871 -807 -57 546 583 -410 -614 -312 309 626 -11 -676 -829
5488 -829 29 709 413 102 -812 -804 301 851 647 5 -387 -188 616 525 152 -676 -457 508 731 499 -446
5509 -446 -691 -328 472 771 508 -277 -349 -95 167 449 -46 -675 -438 446 429 603 -464 -751 117 541
5529 541 756 489 -412 -460 40 629 318 -29 -362 -264 369 626 318 -520 -704 -96 465 674 307 -599 -490
5550 -490 -121 568 629 -86 -626 -255 346 480 14 -492 -311 7 752 336 -97 -462 -353 -100 575 472
5570 472 -68 -143 -775 71 454 150 -467 -341 97 317 152 -86 -856 -664 87 797 381 -372 -780 -433
5590d33N48O18o03o01K33J33K68mm40j07L43L23Nk56l83n33M74N65N11m82p48
5611e69J00L62M16o3k75j10j46Q64j4n31o04O0M70O82K0n40m90k32O01K35J90
5632D26k02m69K43M92J03o75l26J7N25N28kr59m44J90Q63K68J0k34n39k10N39
5653A44O84o58k38j27L99L68Mm56q12K86P59N57k74p94m63L42P38P8n13m54K98
5674a32M49J02J78p65o36O51L49N08m11p63l64M64P21M96o50m45l87M63N95k63
5694A60n02k91PJ018K26l53r51J60M57J046j20r17m46k33P29O57l42o45k51J72
5714d19Q94K60m61j207J55Q44P21l86o89n57o0R97N37l61p27j74K20R84Kl26q39
5735e92j82J057M99m24o42m85K66R66L35n53o86m51O16R60Q9r02q06M50Q66M34
$$ plain form
5590 -433 115 733 130 -471 -238 -105 163 159 -281 -388 -45 278 283 27 -356 -889 -415 150 661 179 -569
5611 -569 -469 -107 309 246 -29 -139 -285 579 565 34 -570 -510 -40 642 662 122 -368 -600 1 236 426
5632 426 224 -245 -2 490 593 -82 -408 -391 134 662 660 -299 -743 -553 310 578 588 354 -185 -395 144
5653 144 828 170 -68 -195 204 572 576 120 -692 -406 353 910 636 -158 -621 -279 459 537 24 -430 -132
5674 -132 317 419 597 -168 -804 -153 196 704 293 -470 -834 -370 351 847 197 -248 -635 -172 423 160
5694 160 -342 -633 -626 392 618 265 -686 -526 -69 977 857 -60 -506 -739 -10 647 305 -340 -591 -419
5714 -419 475 735 274 -933 -778 66 787 401 -288 -845 -905 92 629 268 -459 -633 -413 571 573 247 -592
5735 -592 -774 283 782 358 -284 -769 -503 463 798 245 -441 -892 -276 684 773 -129 -935 -485 381 815
5755H15o56o96l54R22O31L1p58m07j37N87P34K30q28q29P3J053P39o02j100l27
5775h79P60J005Kr69r33L80Q96Q99k70j398m33O88R21J80o48p55K31O26L07J81
5795G91j001r24L80J444K80l95j536o6P05R49L40q28o97l67J309K47k18n76o89
5814h52M30J088J14o43j231M34N63R24j1j066q33M5J336N97m27j044o77Q87Q89
5833E23K00q39j047M24J251M94l07j459p26O72J320M98p94r50l20Q93P25Q5o49
5852fp33o7J143P85n22j468o10R06J512J28q04j144k16J173R74j47j184p42N91
5871d31R17L79o82j065R6J121M90L84j353j154M16R43J138j72j174q41M57Q66
5889C35N79m87j357k33J388Q93n29q89j120O72J565P66j022q55o85N20J259J81
$$ plain form
5755 815 159 -537 -891 31 662 693 -65 -472 -609 -22 712 942 114 -715 -642 411 1150 548 -552 -879
5775 -879 -119 886 888 -81 -1014 -634 262 1161 891 -507 -940 -252 669 849 201 -554 -323 303 610 791
5795 791 -210 -1134 -754 690 970 575 -961 -1027 -322 627 967 139 -558 -925 384 631 413 -163 -852
5814 -852 -422 666 780 137 -1094 -660 -97 827 816 -250 -1083 -1038 298 895 468 -576 -1253 -366 523
5833 523 723 -116 -1163 -739 512 1006 699 -760 -1486 -814 506 1004 210 -740 -1060 -167 558 643 -6
5852 -6 -739 -806 337 1122 600 -868 -1478 -572 940 1068 264 -880 -1096 77 1051 904 -280 -1022 -431
5871 -431 486 865 183 -882 -786 335 825 1209 -144 -1298 -882 61 1199 1027 -147 -988 -531 335
5889 335 914 427 -930 -1163 225 1118 589 -300 -1420 -748 817 1583 561 -294 -979 -459 800 981
5907I81j053o16J65Q51Q16m21j238l34M10J649M50j334j074m67R22J189o9r24
5925i7r24K48J296J25n02q71m48J064J228r8j323j176L47J512R98m06j432o89
5943a148N40J109K24n89q38j42Q34J003j60j500p12L81J500Q99q40j460m18N43
5961g74J486L99q43j229M35N52P06o54r67m21P36J231O94r34j672j59Q51J195
5979F32M15q97q55j75P94Q33j26j446J03M35J262J26j007j404K57J245Q92J18
5997A202j391r02J92J451K06p50o99l1J038N24j32j232q24P00J481M08p41r59
6015d59o84N26P70Q32m85p95o25J028M27K07r43q71N64J450L12q99j431k03R24
6034c55J287L41p91q81o48R74P83l3r47o22Q23Q40L20o83j492J83R68J236m80
$$ plain form
5907 981 -72 -688 -523 328 1144 723 -515 -849 -439 1210 1660 326 -748 -1215 -293 896 827 -97
5925 -97 -1021 -773 523 648 146 -725 -1173 -109 1119 1021 -302 -1478 -1131 381 1379 973 -459 -1148
5943 -1148 -608 501 725 136 -702 -844 -10 993 833 -667 -1379 -998 502 1401 561 -899 -1317 -774
5961 -774 712 1111 268 -961 -526 26 732 78 -889 -1310 -574 657 1351 417 -1255 -1414 -563 632
5979 632 1047 150 -705 -880 -86 747 621 -825 -722 -287 975 1101 94 -1310 -1053 192 1084 1202
5997 1202 -189 -1091 -899 552 758 8 -691 -722 316 840 708 -524 -1348 -648 833 1241 500 -459
6015 -459 -1143 -617 153 985 500 -295 -920 108 535 742 -201 -1072 -508 942 1254 355 -1076 -1279 -355
6034 -355 932 1273 482 -399 -1047 -73 710 677 -270 -892 -69 771 1091 408 -1084 -901 67 1303 823
6053H23o44r95Q4P66N54q1o37l97K89Q62J06q89r59L01J375P71o01j006p99o5
6073a142J294J200n52j010m63L28O54L28p08r42K89J323O36o80j282m75O56J041
6091D95P70j035o16m31L61R58n4p70k99K58Q09J91m94q74l76R67J109J60r17j085
6111h73k09Q87Q04K0n14o98K8J000J99n15o15m08J043P20M3j029r38L26Q89N46
6131G06N8j060n90K54O42O28l72m84l82M98P78j50o60p87K98J123N35p11o68m60
6151h04Q3R66K64p3n86p3L75M41r3p79o47M74J173K03l69j142m16N14J322L49
6171A182q70q74l13J046O12l49j103J52J55P56J35l69r70n8Q99O98K2m91r40K0
6191f60P60N39j23n48p04M79Q82K99q40n73k16M07P38N8l99j253M56O86J072m89
$$ plain form
6053 823 179 -816 -732 34 588 507 -130 -527 -238 624 730 -159 -1118 -817 558 1329 728 -278 -1077 -1142
6073 -1142 152 1352 800 -210 -673 -345 309 637 -71 -1013 -724 599 1235 555 -727 -1202 -546 495
6091 495 1265 230 -386 -817 -456 502 448 -322 -621 -363 446 637 143 -731 -1107 -140 969 1129 212 -873
6111 -873 -1082 -195 609 629 115 -583 -555 445 644 129 -486 -894 149 869 912 -117 -1055 -729 160 706
6131 706 764 -296 -886 -632 10 638 266 -218 -600 -102 676 526 -134 -921 -623 500 1035 324 -344 -804
6151 -804 -721 245 509 436 -150 -223 152 593 500 -279 -926 -452 721 924 555 -587 -1003 -489 833 1182
6171 1182 312 -562 -875 171 783 434 -669 -517 -362 394 529 160 -810 -868 31 729 751 260 -680 -660
6191 -660 100 639 516 -32 -736 -257 625 924 84 -489 -705 -298 440 498 99 -1154 -698 -12 1060 571
6211E71r95l09O39N60K10p93m33NN87O08j98n86r47N43N71R45n16p13m89M59Q80
6232E99J64q40n85l75J216K26J57j076l59M61O18R48p17j116l00R99L51M33p64
6251D0r87K20Q23Q14l13j006m85M77J235P3r02o98j53R30P77o8p99q88L95P78
6271B63N03l52p15o60J060Q05m9o48q08k42Q24R91Or91q54K48J384M1o24r30j36
6292h84O63J253m20o92r94N44Q63Q19p36p63o32N92J176K89q55j127R9Q01N92
6311E88M92j163q09K46J298M07m20j394r7P99Q13K02q00q67p8P76J249n46r45
6330b49q17M11J142M19o21j189l00P27J322p6q52j009J37J466M40l01j073p09
6348a132Q51J189l0q97j062J76Q87P58q9j130o51K85J099R63j047j007j86O21
$$ plain form
6211 571 -424 -733 -94 466 676 -117 -550 -545 42 650 452 -134 -1081 -538 33 978 462 -251 -740 -281 599
6232 599 763 -77 -662 -1037 179 405 562 -514 -873 -412 206 1154 437 -679 -979 20 371 804 40
6251 40 -947 -727 96 910 597 -409 -894 -417 818 891 -11 -709 -862 68 845 777 -22 -910 -515 263
6271 263 766 414 -301 -961 99 904 855 207 -601 -843 -19 972 978 -13 -867 -619 765 806 182 -748 -884
6292 -884 -221 1032 612 -80 -1074 -530 333 1152 416 -347 -979 -387 789 1078 223 -904 -805 -4 588
6311 588 1080 -83 -892 -646 652 1059 639 -755 -852 -53 760 962 162 -705 -783 -7 1242 696 -249
6330 -249 -1066 -655 487 906 285 -904 -1204 -477 845 769 -83 -1092 -955 511 951 650 -423 -1132
6348 -1132 -281 908 878 -19 -1081 -905 -18 740 651 -479 -1130 -845 254 1217 170 -837 -1023 -402
6366d02J265M07j370j086J20J241P78k10j579o03J007J467p8p37j439K43Q11R70
6384H05j63q73r02Q88O60R95p61j022o74O22J289J71p55j240K12R85R39r8j527
6403d49m75J80J527L73p18j244j71R73Q78M7j129j015J88J470N39j99j555l21
6421a101P29J343K34q50j336j11J104J122m9j499q02P88J317M60j249o82o13J273
6439G8R12N1q29j137L49Q23J099n36j136p77M51J496L00o72j356k91J018J194
6457A037k53j168r65M78J151P07l49j610l35J150J067j74q32q46j6J235R73l25
6475I25j322p79N88R20Q58r26j014n62J121J483r7j588r99N86J418M94q21j125
6493h40k59R48R35K12r31q38j36Q87J215o07j034m94J82J013R07p84j150n09R50
$$ plain form
6366 -402 863 1270 -100 -1186 -1066 175 953 743 -836 -1439 -432 1035 957 220 -1219 -976 -165 805
6384 805 642 -231 -1133 -245 415 1410 649 -373 -1047 -425 864 1035 280 -960 -748 237 1176 1078 -449
6403 -449 -924 -744 783 1156 438 -806 -977 -4 874 921 -208 -1223 -1035 435 974 775 -780 -1101
6421 -1101 -372 971 1205 355 -981 -1092 12 1134 1085 -414 -1216 -428 889 1349 100 -582 -1195 78
6439 78 990 1041 212 -925 -576 247 1346 810 -326 -1103 -652 844 1144 472 -884 -1175 -157 1037
6457 1037 784 -384 -1349 -871 280 987 638 -972 -1307 -157 910 736 -96 -942 -958 277 1250 925
6475 925 -397 -1176 -588 332 1190 264 -750 -1312 -191 1292 1195 -393 -1392 -806 612 1106 285 -840
6493 -840 -1099 -151 784 996 65 -773 -909 -22 1193 586 -448 -942 -760 253 1160 376 -774 -1283 -333
6512c33J819n18j037r14K14J430Q57j048j083n56Q85J027J66r66q25j67J209R25
6530A085q7j104r15N77J037P12o09j468m56J030J314j31j023j132K20J166Q67
6547A083j69j636n25R67R45L77p17r00j48Q08Q34j9p74j198L60J149J039r18j139
6566e81n23Q82J226J21r77j076jR86Q18j48j473k29P18N71O14p44q80o43J276
6585f3J185k13q07j102J95P45R61k96j141n70N18J342L58j005j137J05J250R18
6603A243l33j105r82M25J275L60n94r68J5M78O36K57m62j269P8J466P11o18j010
6622c97n88M29J240K18n47j350k09R22R98M47j317o48K25R00L60l26r74m98P21
6641c94R86L61q37o61n90Q10J032K98r50j075M83R97O66n85j544Q8P02J252o7
$$ plain form
6512 -333 1486 968 -69 -983 -769 661 1518 470 -613 -1169 -284 743 909 -57 -882 -1049 160 1085
6530 1085 998 -106 -1021 -444 593 1305 696 -772 -1228 -198 1116 985 -38 -1170 -950 216 1083
6547 1083 914 -722 -1247 -280 665 1042 325 -575 -723 85 919 900 126 -1072 -712 437 1476 558 -581
6566 -581 -1104 -222 1004 1125 148 -928 -929 57 875 727 -746 -975 -257 314 928 184 -696 -1339 -63
6585 -63 1122 909 102 -1000 -805 -60 901 605 -536 -1106 -588 754 1112 107 -1030 -925 325 1243
6603 1243 910 -195 -1177 -752 523 883 289 -679 -664 -186 450 707 245 -1024 -946 520 1231 613 -397
6622 -397 -985 -556 684 902 355 -995 -1204 -282 716 1163 -154 -802 -577 323 683 357 -617 -1115 -394
6641 -394 592 953 116 -545 -1135 -325 707 1005 55 -1020 -537 460 1126 541 -1003 -915 -213 1039 972
6660I72j501o56K42J233O26l02q99n42M77N88N49n09p34r1M31J117j2j100j087
6679a198N15J087O72n73p90m26L86J172L21j076q17J53R33L04J19j073p58O23
6697d26Q91M74k46j013o74Q65P28M30q63n74k01P28N43M2j155m10K94J485K20
6716A138j235r30l40J241R86k19o26j018M02P51M19k27p95k89O70M76M04n84j219
6735i95O3P23R56K16o63j421P3J175R62o42j042j13O13P21j69p92p11J06J459
6754E19M43k65j002n35J19J076N22m40q70l89N65P85j03n06o45L7J131Q69j047
6773B64q80o76O55J278M91n91r77p3M17O44J01q95k35L38J61O80l13j274j06Q43
6793a48R51K94p80j004l49Q30J157k79q18m06k1J102K99o65p43k42J009J051j91
$$ plain form
6660 972 -529 -1185 -943 290 916 614 -285 -827 -350 238 787 278 -456 -547 -116 1001 989 -111 -1198
6679 -1198 -683 404 1076 503 -287 -713 -327 845 1166 90 -727 -574 359 663 782 -291 -1049 -426
6697 -426 465 939 693 -320 -994 -129 599 1029 166 -408 -609 119 662 704 -451 -861 -567 918 1138
6716 1138 -97 -1027 -1367 -126 860 641 15 -1003 -601 150 569 342 -453 -742 -72 404 808 224 -995
6735 -995 -932 -209 747 963 300 -1121 -1048 127 1089 447 -595 -708 -95 626 457 -335 -1046 -940 519
6754 519 962 697 -305 -840 -721 355 877 437 -433 -822 -257 528 425 -81 -726 -689 442 1311 264
6773 264 -616 -1292 -637 641 1132 541 -436 -509 -92 552 653 -242 -477 -139 22 702 389 -885 -991 -148
6793 -148 803 1097 317 -687 -1036 -206 951 672 -146 -552 -573 529 828 163 -580 -822 187 1238 1047
6812A047r79r99l3J054N48K33j070n88J90P33N41l24r80j18O99R96k56j164o18
6831a088K80J281P81l79j504j29L7J249J04n62l04l89M63J259n56j156n38N95
6849e56J252N34j005j082l45Q44Q93N69j019r20K69P75N67l77o90m72O63R30K77
6868A107j142r66m21R40J355K21j199j157L52J075Q84o03p14o57O75J195j79j098
6886c32j200N15J363P19k12j027j135M47J398K87l25j002n55J041P94J6r63q23
6904i94K88J295P14q24j274m89O19J314R32j127j375j62J112R16l26p98n85M55
6922c09Q70K53n46j205J09N57J044L20q59r19l42R57P25R2j000o95L79J452Q3
6941I66o58j302l6J063J145l17r40j176J78J409O56m37q25m62L23J112J42q40
$$ plain form
6812 1047 68 -931 -964 90 638 871 -199 -787 -597 136 677 353 -627 -745 -46 950 694 -470 -1088
6831 -1088 -808 473 1254 875 -629 -758 -721 528 632 70 -234 -623 -160 1099 543 -613 -1151 -556
6849 -556 696 1230 225 -857 -1202 -358 535 1104 85 -835 -566 209 776 399 -291 -763 -100 830 1107
6868 1107 -35 -1001 -1422 -482 873 1094 -105 -1262 -910 165 1049 446 -268 -925 -250 945 766 -332
6886 -332 -1532 -1017 346 1065 853 -174 -1309 -862 536 823 498 -504 -1059 -18 776 792 -171 -994
6904 -994 -706 589 1303 479 -795 -1284 -665 649 1581 454 -921 -1083 29 945 619 -179 -764 -309
6922 -309 561 814 268 -937 -828 -271 773 1093 234 -685 -1027 -70 655 747 -253 -948 -569 883 966
6941 966 308 -994 -1030 33 1178 861 -79 -1255 -1077 332 988 551 -274 -736 -413 699 841 1
6959Aj012J01J373R42n94j227j072R34J187N42m14j460j60M92J310k20r51p43
6977i71K65J346L13l98j278m84P59J235M16p60j220m83J236P80L93j266r96M34
6995f79J413K99o54j272k44Q59J596p6j465p44J17J102P84j52j438k92K80J149
7013E83N05p53j079l60J267Q39Q0j462q37L99J186J005n92j588n15J074Q74M59
7031A085q30j178j35J138O60j30j070p14M88J190K35l22j154l78Q19J397k8j395
7049c22p16K34J216O06n95j167m29O62J674j4j010j198K01J294M54l0j123n83
7067h46L12Q73L73m90r93m04O71J521R6j064r92j41J464N52j45j335r41R44J404
7086H59J27n54j005l14R61J138l37j138n69J97J046M21m83r83p67J160Q13M72
$$ plain form
6959 1 -1011 -910 463 1405 811 -416 -1488 -554 633 1175 761 -699 -859 -367 943 723 -228 -971
6977 -971 -706 640 953 555 -723 -1207 -448 787 1203 443 -777 -1260 -24 756 1149 -117 -1113 -679
6995 -679 734 1033 379 -893 -1137 -278 1318 1242 -223 -967 -850 252 1036 884 -554 -846 -566 583
7013 583 1088 335 -744 -1104 163 1002 1082 -380 -1217 -818 368 1373 781 -807 -1322 -248 626 1085
7031 1085 255 -923 -1058 80 740 610 -460 -1174 -686 504 739 417 -737 -1115 -296 1101 1073 -322
7049 -322 -1038 -804 412 1018 423 -744 -1173 -511 1163 1149 139 -1059 -858 436 890 860 -263 -846
7067 -846 -534 339 712 222 -771 -1175 -504 1017 1113 49 -943 -1084 380 932 787 -548 -1489 -545 859
7086 859 986 432 -573 -887 74 1212 875 -263 -832 -635 411 832 349 -634 -1401 -241 572 1044
7104A044j023j242K03J112P17j50j218q08Q61R79M43p25j137K58O02N62P2p97
7122b47j088N66J261N04l38j038p88O06J346J88o21j180p9O93Q72r5j095n11O34
7141d10J041J32n77r47k54P47Q78J25j027n66J89N82R86l73q17p02O24J076P5
7160G82n79p95k76R39Q29K0j091r78O00R92O53o73j012j96M63J483l22n89j039
7179g89K1Q42Q94j30j242n25M19J120N89p70r87l89P49Q64J95j074o74M37R61
7198E11O53p44j116k30P07O56Q17j209q56j56N68J034L96j018o32K11R12M14q02
7217A16p03l52O89J123M06j140j153J1Q14J125j23j086n28K88R63L10p84n77n7
7236f58P82R68n74q17m83K11P02J026m56j165l87K72Q09N85n32r62K3N28Q53k41
$$ plain form
7104 1044 21 -1221 -1018 94 811 661 -557 -1365 -504 475 918 193 -944 -686 -84 478 550 -247
7122 -247 -1335 -769 492 996 658 -380 -1168 -562 784 972 351 -829 -908 -215 657 562 -533 -1044 -410
7141 -410 631 763 186 -761 -1015 -268 610 735 -292 -858 -669 -87 899 526 -291 -993 -369 707 782
7160 782 203 -592 -868 71 900 920 -171 -1149 -549 443 1096 423 -589 -785 -322 1161 839 250 -789
7179 -789 -768 74 968 838 -404 -929 -510 610 1199 429 -558 -947 -198 666 861 -213 -887 -450 511
7198 511 1164 420 -696 -926 -219 437 1254 45 -811 -967 -399 635 1031 13 -619 -408 504 918 116
7217 116 -587 -939 -250 873 1279 139 -1014 -1003 -189 936 813 -273 -801 -513 450 760 -24 -601 -658
7236 -658 124 1092 518 -299 -782 -571 131 1157 701 -464 -851 -579 230 815 283 -679 -656 -128 725 484
7256D84q16p00L98P87Q34n33j071l15K88J399J75r00o86J8P92O12k68q33n52M44
7276d43J231j23n51q10l25R02O27L43q61n90R4O96L98j33o06p53N72P17N67p38
7296B14p41k14Q98O77R5j146n53K11Q69O95l69j035k46N69P80r6p24j194P37O46
7316G3P92l80p58q11P51Q20O7k63m24p37N91J065j15p86p82M5J305M72n81q59
7336e15k15O10O30O53n54j108j19L68R54Q8q22m15o1Q70J73k98r14l79R93O52
7356E91L47q15j139p5J269N90k23j030k27R6P04Q68p63r69J86L56Q57q0n76p31
7376g64j37J161O28l74q82o05N00Q99L52m87j311Q6J030Q19m16j025n21L72J038
7395C63Q00o43j166l13Q52O62K97r02k30n11Q20J067o58p86n69L70R14L34k90
$$ plain form
7256 484 -332 -1032 -634 153 987 454 -617 -932 -644 755 930 30 -656 -638 154 766 498 -335 -887 -443
7276 -443 788 665 114 -696 -1021 -119 508 851 -10 -600 -506 190 588 455 -151 -904 -332 385 952 214
7296 214 -527 -741 157 834 929 -217 -770 -559 310 1005 636 -399 -645 -76 704 608 -116 -1310 -573 73
7316 73 865 485 -273 -1084 -333 487 554 291 -133 -870 -279 786 671 -115 -897 -852 453 925 344 -515
7336 -515 -730 -120 510 1163 609 -499 -618 -250 704 792 -30 -445 -506 364 537 239 -675 -1054 -61 591
7356 591 938 123 -1016 -1091 178 768 545 -485 -712 -616 88 956 193 -776 -590 -234 623 543 -33 -764
7376 -764 -901 260 888 514 -368 -973 -473 426 778 291 -1020 -934 96 915 499 -526 -1047 -675 363
7395 363 1163 520 -646 -959 -107 555 852 -50 -280 -791 29 1096 438 -348 -917 -547 367 701 411
7414D11q87m85R43O90K97j258o29M98N46P99n55p44j98K34P70K77p91p43j55J136
7434A56P86j11p93j175M69J074N75l49p78q64J023R44j29j113p32n7J677K85k01
7453F87j046p06M62J300K85o47o63n23R17Q23M9r01j139M16Q29Q44m30j047n39
7472a029O55J279K37r40j220L83P50R00j82j191q08R07N65N70o70q94k18O44R52
7491F90q7m65p37j90R50O60l33r28q92O99J332M72r25j172J59Q75O18J46j304
7510d32n39N80O63P93r24r68l50R79M28N63l95j098p0N16P45K30j066o25N54J108
7530F92M29n39j510l61J332J200m70j122p32R7J510P92j051o93m65P99Q15N0r51
7549a78n89J28P25P18j52q14o04J14J106N37l67r47p71O69J389J7q55p58K0J030
$$ plain form
7414 411 -476 -961 -18 672 969 -289 -918 -420 126 925 370 -374 -572 -338 432 709 -82 -825 -980 156
7434 156 942 831 38 -1137 -668 406 981 632 -146 -1010 13 957 828 -285 -1017 -1074 603 888 687
7453 687 -359 -1065 -603 697 982 335 -328 -851 66 889 938 37 -1102 -686 143 987 557 -490 -1029
7472 -1029 -374 905 1142 202 -1018 -635 115 1015 833 -358 -1166 -259 306 876 206 -688 -906 -262 690
7491 690 603 138 -599 -789 161 821 488 -440 -1332 -633 699 1171 246 -926 -767 108 726 872 -432
7510 -432 -971 -391 272 1065 141 -827 -1177 -198 230 793 398 -700 -770 -254 491 721 -345 -970 -416 692
7530 692 1121 582 -928 -1289 43 1243 773 -349 -1081 -984 526 1318 267 -426 -891 -92 723 773 -178
7549 -178 -767 -639 86 804 652 -162 -766 -652 454 991 624 -323 -1094 -425 964 981 126 -632 -612 418
7569D18M35j89j240m04O30R77N83r57j157J71O71R53P6j034l48K8R97L60r24p65
7589g19n08J218J272j99j324o74J4P96J064j84j306l04L39J003L54o08o69m50
7607h85J255Q33l46j204j020L35J330P09l69j178m71O98R34qo06p62P8R03N36
7626G62l40j107n05N70J399M63r45j503P7Q95J004P9j009o04L36N66P83o12q90
7645e81n87Q36R82J02p08j066j43J039J058j13j131p57O05N81M69l43p57k43P84
7664B7O37K8p94o11k11J186R74k16j312n26N4J129N30p97r70R2J295O14m43j012
7684c26n36R8J531L28m99r02n56L01R84L87p62m83l32O39Q51j51j029l14O31N91
7704D51N25o01j425K6J060N09K59r08o62L46N16N61m05n60m11R20J88K77n62j001
$$ plain form
7569 418 853 664 -576 -980 -350 627 1210 253 -904 -733 -62 891 967 -67 -415 -387 610 970 46 -719
7589 -719 -1227 -9 1263 1064 -260 -934 -920 -124 940 756 -550 -854 -515 488 842 234 -435 -885
7607 -885 370 1203 857 -347 -1367 -1032 298 1007 638 -540 -1011 -313 621 613 7 -755 -677 226 762
7626 762 422 -685 -1190 -620 779 1242 297 -1206 -1129 -234 770 849 -160 -764 -428 138 921 309 -581
7645 -581 -1168 -332 650 752 44 -1022 -1165 -126 932 819 -312 -1069 -464 117 586 243 -514 -757 27
7664 27 664 692 -102 -713 -924 262 1236 1020 -292 -818 -764 365 895 98 -872 -780 515 1129 686 -326
7684 -326 -862 -764 767 1095 596 -306 -862 -561 423 810 48 -435 -767 -128 723 572 -457 -771 -140 451
7704 451 976 375 -1050 -1024 36 545 804 -104 -766 -420 96 657 252 -308 -719 201 389 666 104 -897
7724h97J28R68O58J32j049j017L58O96Q81l16j084j23O10P04K26j158l74K21R42
7743E06K95n6j270p68O47J150M21l59r98n6M83L41R8p59p78N23P80Q75n73r20
7763d18o95R21P54L91p52j016K93M13N40j36n48k91L51M69M94p64j010jR09Q53
7783G57L73j274m91j62N02J131p2q68o41M67P88J69p88m57k19J063N81K0j042
7802a63m93r4Q59P88k21r12n47O29O93L12j129l92J63Q04O55l34j239m93O70J088
7822F44M41p65p24l10L08Q89N14j182l08k11R64M07l41o12n40J48J326L72o95
7841C25r63l52R08R14k79l32j000L19Q36K84j96r72k51P25P18J54p00j137P44
7860b55L46O14m20o58k9j14N27N78j25r30K2P6J093J71j101o32M7J191O59o5j474
$$ plain form
7724 -897 -769 199 857 989 -60 -1077 -719 -23 858 542 -542 -665 -55 649 875 -283 -657 -436 506
7743 506 801 745 -525 -1293 -646 504 925 566 -432 -488 -5 336 434 -325 -1103 -580 200 1075 502 -418
7763 -418 -1113 -192 562 953 201 -815 -522 -109 431 295 -253 -544 -193 276 770 6 -1004 -1005 -96 757
7783 757 1130 -144 -635 -797 -295 836 764 -104 -745 -278 510 679 -109 -566 -785 278 859 879 -163
7802 -163 -656 -750 109 897 676 -236 -783 -154 539 851 -278 -670 -507 297 952 618 -621 -1114 -444 644
7822 644 1085 320 -404 -714 -406 483 997 -185 -493 -704 260 667 326 -286 -826 -678 648 1020 325
7841 325 -638 -990 -82 832 553 221 -779 -460 376 660 464 -508 -759 -34 684 838 138 -999 -255
7860 -255 91 705 285 -373 -402 -516 11 589 464 -466 -444 -368 725 896 -205 -837 -790 401 1060 995 -479
7881d79m47K74J016N70q33n54M8O48J11J36o82o00L01O66P71p63p58k14K22R20
7901C53L72q55l80j48P67K03J64o71n96K25R66Mj77p95l55P48P28J69o75n07m75
7922i35R78O04m48m20o49M26R05K26m83r50J7P69P32M3r72m92k14J123M22k64
7942D18o51l86M05N23N88q41q58n6P75Q11j08p74o61J04J392L83q47r05m4M47
7962b85P82m7m65r27M44R66M30p61n66j76L90P62J93m07r24j14O67Q28r8n35r47
7983g90K58R30L48m45o05o74P14R70N1p82q74M00R17K52j25q71l21J46P78K88
8003E65l51p61m18J107O17p4n86j064K17N97J420p83q10m92J73J373K68q11r11
8022g24N7O97P85l80q27p98M61J097L52o95p12J7N21O25N2m16q91J85M66R73l38
$$ plain form
7881 -479 -926 -652 364 934 101 -453 -405 243 354 490 -192 -792 -491 175 946 183 -575 -789 -567 353
7901 353 725 -130 -510 -658 109 312 476 -195 -791 -566 400 404 227 -568 -923 -175 553 722 47 -460 -935
7922 -935 43 647 199 -221 -870 -444 461 687 204 -746 -729 40 772 815 -157 -649 -863 260 682 418
7942 418 -233 -619 -214 309 897 56 -802 -858 -83 728 620 -154 -815 -711 681 1064 217 -688 -732 -285
7962 -285 497 450 -15 -942 -498 468 898 137 -429 -605 -215 547 740 333 -591 -705 -38 790 692 157 -790
7983 -790 -532 398 746 301 -304 -978 -264 706 757 -25 -899 -499 418 670 545 -326 -647 -501 277 565
8003 565 214 -547 -965 142 759 685 99 -965 -748 -151 1269 486 -324 -816 -643 730 998 187 -724
8022 -724 -667 30 815 435 -392 -1190 -729 368 720 25 -687 -670 -149 476 528 112 -779 -594 -128 845 507
8043E07n87p67M14R04L46m38q78o18J010J055k97q20m96K81J084M5l61j059j25
8062h00P36N44K88p60p60R1O92P51o5j093k51L95Q28K09m28r23n70J004O70O15
8082A173j061r39K27N96J005p9j227p35N35J085K97q61j127L96P16R77j17j066
8100b05m87r1J051O42m23p67k79J86J257j27q50n91k55J102O91j92r25p61M82
8119e42J147N23j114r69R6P29J320l71j235m16M19Q99L89l00j169o30P51Q82P8
8138D87l04r94j03J035N00K7q04q80M83R55N18l99j203k34O11R83L15j257o46
8157i10O0J054O92l53r62n19R24L79N63q21q18k08R86P17k19p89o93M39Q42M22
8177G86l64m96j063Q55J102K23j310k72j31R98K69M27j253p57
$$ plain form
8043 507 -80 -847 -433 471 817 379 -499 -1117 -107 948 651 -169 -665 -384 700 745 384 -675 -800
8062 -800 -64 480 768 8 -752 -661 31 782 717 -376 -627 -232 596 805 377 -546 -1116 -112 558 1173
8082 1173 112 -827 -600 -4 1001 922 -305 -1040 -505 580 877 16 -1111 -715 1 978 861 -205
8100 -205 -692 -783 268 910 487 -280 -559 -373 884 757 -93 -684 -939 163 854 662 -263 -1024 -542
8119 -542 605 1128 14 -955 -859 -130 1190 819 -416 -832 -413 486 875 575 -594 -1224 -473 409 487
8138 487 183 -811 -914 121 621 648 -156 -1036 -553 402 920 521 -682 -916 -305 678 993 -264 -910
8157 -910 -850 204 896 543 -419 -938 -14 365 928 107 -711 -919 67 784 565 -224 -917 -478 364 786
8177 786 422 -74 -1137 -282 820 1043 -267 -539 -670 328 597 1024 -229 -986
8191i86
$$ Imaginary data points
##PAGE= N=2
##DATA TABLE= (X++(I..I)), XYDATA
0@%%%%QqQj6J6k4L3m1N5o6P9r5J15j39J63j92K26k64L07l53M05m67N33o06O91
29C68p81Q78r87J108j239J384j546J718j909K123k352K603k885L194l533L915
45B059m342M822n370N994o717P569q586R824j1375J3383j6097K0001k6127L7207
59B2245o3595K38139K63785m15185k65411N3735K72129O8375j03404r9232O9872
70D1453Q7022j1210j23081p7360J7922Q9094P2882N1239j498q2678j60583p8989
82a75787J20582K27539O8965j64261j90458J3632J54896O0607j24443j24595P2893
93f0430K13060R1307j55375k39565o8499J56806K09096O5804j02296j41114n4957
104h6163L8315N9279K4951p611j2930P497L3771K2523m8170j18171o5870J10044
$$ plain form
0 0 0 0 0 0 8 0 8 -8 8 -16 17 -24 31 -35 44 -51 64 -75 88 -104 122 -142 165 -188 217 -250 283 -323 368
29 368 -413 465 -522 586 -653 731 -815 903 -1006 1117 -1235 1368 -1517 1677 -1856 2059
45 2059 -2283 2539 -2831 3163 -3554 4015 -4571 5253 -6122 7261 -8836 11165 -14962 22245
59 22245 -41350 196789 460574 45389 -220022 -166287 105842 174217 70813 -28419 41453
70 41453 128475 117265 -5816 -83176 -65254 23840 96722 147961 146463 63785 -96798 -175787
82 -175787 -55205 172334 241299 77038 -113420 -99788 55108 115715 -8728 -133323 -60430
93 -60430 152630 243937 88562 -151003 -219502 -62696 146400 212204 109908 -31206 -86163
104 -86163 -47848 11431 36382 28771 15841 23338 57109 79632 31462 -86709 -152579 -42535
116d2535K16273Q4974j62602k37418n6146J57739J69775O993j18664p5918M8770
127h759P9254k2141j10335n9331P4547J35894O5559n2338j21080j05054j5891
138a39675J00920J50368N4880j07085j51967k8197J05413Q3616m7954j00626M718
149g5589J30664R8471p6842j86162r0944J08399J92657Q2896r1230j52787o5324
160a25791N2859Q5208L2489k6032l4369K514L7305K2187m0888q4259l6969Q1509
172c4237J44321O0217j03055j68844o1471R7134J41011M3845p5435r3286j0252
183f0052O4482L8389m6074o9062O252R1656Q6454r972j06043j12257j6224J03013
195b9438J35049L6945j01808j33124k1442R5212P9731l1098q3745j1600Q9013
$$ plain form
116 -42535 173738 258712 96110 -141308 -197454 -39715 130060 137053 18389 -57529 -8759
127 -8759 70495 48354 -61981 -121312 -46765 89129 154688 102350 -18730 -123784 -139675
138 -139675 -38755 111613 166493 59408 -92559 -120756 -15343 68273 20319 -80307 -75589
149 -75589 55075 153546 76704 -109458 -200402 -92003 100654 183550 92320 -60467 -125791
160 -125791 -72932 12276 44765 18733 -15636 -13122 24183 46370 5482 -78777 -115746 -34237
172 -34237 110084 170301 67246 -101598 -163069 -65935 75076 118921 43486 -49800 -60052
183 -60052 4430 42819 -3255 -72317 -66065 25591 112045 102073 -3970 -116227 -132451 -29438
195 -29438 105611 142556 40748 -92376 -113818 -18606 61125 30027 -53718 -65318 23695
206B3695P9939m0784j32934p7177O9541J43875P1440o1143j18199o2149L1183
217g2713P0891M4915m745l8546l1895P950L9899J4529m8350o1618J7606J08354
229D6277Q7862m6925j48421q9913O7947J46309O2985p5076j11842j9696P6722
240c771O0721l5717p7277q402P8130P5247j0672q2941p4421l244O7521Q2256K8930
253I6360n1965r0448m1596M6444P9104K1443n3441n4501J7487P2537L2814o4652
265I586r5618o348J06598J04989j4050j18370r2686K2886R6849O0320k8185o5973
277b0002k7791L1627M7126N910m4542m4834J2345O7187N5726j8235q2808o8486
289h6777J8744R0266O9133k2673q8654n7390L3372P8677K5915n3748n9513J6078
$$ plain form
206 23695 103634 62850 -70084 -147261 -77720 66155 137595 76452 -41747 -103896 -72713
217 -72713 -1822 43093 38348 -198 -32093 -24143 15756 30285 -18065 -79683 -62077 46277
229 46277 134139 87214 -61207 -151120 -83173 63136 126121 51045 -60797 -80493 -3771
240 -3771 56950 21233 -56044 -64446 13684 88931 78259 -4682 -79103 -82347 -14826 67430 96360
253 96360 44395 -46053 -87649 -41205 37899 59342 5901 -48600 -31113 41424 74238 9586
265 9586 -86032 -92380 14218 119207 105157 -13213 -105899 -83013 13836 74156 45971 -20002
277 -20002 -47793 -16166 30960 36870 -7672 -52506 -40161 27026 82752 64517 -18291 -86777
289 -86777 -68033 22233 91366 68693 -19961 -77351 -43979 34698 60613 6865 -52648 -36570
301c6570P4920M4456l9651q6272l8808N1582R0992L6248n5859q6980k8899N2482
313b2359O8721J0779m8988m5355R270M9723L3293k3984n9844k7979M4091P4859
325F2227K3173n7483q2347k1956O0775P7564J1652o4094o5513N970O8054M8201
337F6223l1306p3219k1449O0881P2926j218p4375o6502J0569P3959N6874j8311
349E5052o8934m5631K0372N9656L3729k7863n3741j6930L9631N3279P214n0806
361E028n9684R80O8681O2294j7555q3210n6581L2905Q3290L6393m8872p2926j0377
374e9634O0575N9773j0437o6349m5658K9464P0329L0820m1694o6574k2676M0521
386b1540N9018J7010m0794n5887j2429M6012N6182K888n6276n1290J7148O9522
$$ plain form
301 -36570 38350 82806 43155 -43117 -81925 -30343 60649 96897 41038 -45942 -74841 -22359
313 -22359 46362 57141 8153 -37202 -27932 21791 55084 31100 -28744 -56723 -12632 62227
325 62227 85400 27917 -54430 -76386 -15611 61953 73605 9511 -56002 -50032 18022 66223
337 66223 34917 -38302 -59751 1130 74056 72838 -1537 -68039 -57470 16489 73363 55052
349 55052 -13882 -59513 -39141 20515 54244 26381 -27360 -44290 -4659 48620 55834 5028
361 5028 -54656 -53676 15005 77299 59744 -23466 -80047 -47142 36148 72541 23669 -49257 -59634
374 -59634 941 60714 50277 -16072 -61730 -32266 38063 68883 27189 -39385 -62061 -21540
386 -21540 37478 54488 13694 -42193 -54622 -8610 47572 50460 -5816 -57106 -39958 29564
398B9564M1505l6699p5471l0863N1516P6553J3238o8035p0205P575P4431N4052
410F7161k6630p1622l1460M2038O4485J6922m6641n8035q729N0325N5702j547
422E1969n7805n1752R227O0948M6339j8663o5497l8948L4190P1343K9140m8353
434B2138p2032j0885O5436O4761j2572p5484n0751K9329P3870L4041m2692p0303
446d5144j8082N3700O3815M201n8212n3334J0568O1227M3335k0729o0047l5942
458e4644K5005N9750K9876l7231o5418j9798N0619O6133P100o1704o1272J0649
470e0935P2808N2726k8173p7657l9215M5454P8215J6530o4631p0195O509P0550
482A1986N2508k2775o9150l7484L4522O6562K6857l9413o0891j7815M2861N6872
$$ plain form
398 29564 71069 34370 -41101 -71964 -20448 56105 69343 1308 -68897 -61322 13109 67161
410 67161 40531 -31091 -62551 -20513 43972 60894 14253 -43782 -52511 -2186 53516 51969
422 51969 -5836 -57588 -48361 12587 58926 40263 -25234 -64182 -29992 41351 70491 22138
434 22138 -49894 -60779 4657 69418 56846 -18638 -69389 -40060 33810 67851 25159 -45144
446 -45144 -63226 -9526 54289 58490 278 -53056 -42488 18739 62074 41345 -18702 -54644
458 -54644 -29639 30111 59987 22756 -42662 -62460 -11841 54292 61392 -312 -61584 -50935
470 -50935 21873 74599 46426 -31231 -70446 -24992 53223 69753 5122 -65073 -58564 11986
482 11986 64494 41719 -27431 -64915 -30393 36169 63026 23613 -37278 -55093 -12232 44640
494D4640Q566m9613n5024j911N4529N3982r452o7906n1957K8278Q1161M0565m9394
507B6464q2533j8391O8819P4403q175p9100n7275K8787P7605L5264m6418p2840
519e3390j5128N6225O0846J74n4133m8097O723N1577M3957q452n2622m3381J4075
532d1626N9492M0095l0515p0566k9558M8179P3076J3686o3285o9235O900P8583
544A5226N8937k8834q1791l7937M8098P5580J4798o1444o5624M045O4402N2485
556E7941j5000o5763m4547K5624O8633L6858l4255o5987k4386M3952O3794J1634
568E8498n4528o0417L095O2302N2692j9203p1550m3515L6024P5448K9089m6441
580B1494o8064j4047N3955O1950N03o0402n2927J4918O5374M0991l2148p1211
$$ plain form
494 44640 53206 3593 -51431 -53342 1187 55169 45717 -22189 -74146 -45868 35293 75858 26464
507 26464 -56069 -74460 -5641 68762 60587 -18513 -75788 -47001 30604 65868 19450 -53390
519 -53390 -68518 -12293 48553 48727 -5406 -53503 -46780 4797 48754 40302 -12320 -55701 -41626
532 -41626 17866 57961 27446 -43120 -72678 -24499 48577 62263 -1022 -70257 -63357 15226
544 15226 74163 45329 -36462 -74399 -26301 49279 64077 2633 -62991 -58946 5456 57941
556 57941 42941 -22822 -67369 -41745 26888 63746 29491 -36496 -60882 -16930 46864 58498
568 58498 3970 -56447 -53352 8950 61642 42439 -29111 -72626 -36602 38846 67935 21494
580 21494 -46570 -60617 -6662 55288 55791 -4611 -57538 -42620 22754 63745 31597 -39614
592c9614k9170M5968O9845J7142n3272o4467m709O0198N9653q704o5726m6415
604e9271K6714O7085K9365m3332o7804j5509N6216O4327P96o4385n9065J2383
616e2480P0494M9281k4638o6546l1360L5956N8849J5914m5821n4667k705N3539
628E816N0063r184o1190m8228J8485O6972M4484k6330o5830l4260L5085O5949
640D1832K1728m9075o3659j040O5116N4221k4613p8401m2013M4605Q1534K6231
652G6466n5789p1734q593N8900N7871o646n6998l7380K2442N0894J9136l2220
664A6349m8132j3745L5972N0637J3488l9430n5440j4090M5887O0359R299n2284
676H870n3654O476N8620M0502k8104o7023k3151N3409O9064N70p3343o3817J8667
$$ plain form
592 -39614 -68784 -22816 47029 64171 10899 -53568 -58277 1921 61574 52870 -12856 -59271
604 -59271 -32557 34528 63893 20561 -47243 -62752 -6536 57791 58587 -5798 -64863 -52480
616 -52480 18014 67295 42657 -23889 -55249 -19293 39556 55470 9649 -45018 -47723 5816
628 5816 55879 46695 -14495 -62723 -44238 22734 67218 40888 -24942 -59202 -24117 41832
640 41832 63560 14485 -49174 -50214 14902 69123 44510 -33891 -75904 -31299 50235 76466
652 76466 20677 -51057 -59650 -750 57121 50475 -6523 -43903 -21461 29433 48569 16349
664 16349 -31783 -45528 -9556 41081 54569 15139 -40301 -54391 -8504 51855 61154 8870
676 8870 -44784 -38308 20312 60814 32710 -34313 -57464 -4055 65009 65579 -7764 -71581 -52914
689e2914Q0106N0529l0534p0355k9840L7337N5267J0782m0611m2202N981M5297
701A8843L0979j8433n0471l1245K1889N6094L5052k2191n8498l5608K4726N9316
713C0453K9909l2677n4964j1594M5454M4856j4063o0378l6266L5212P1017K6066
725G3025n1622p3077j4719N8098O4281K355n3699m3719J2098M4018K0911k3861
737A4089l9082r300L3350M1151K566m3148m8076l675M7624N4620O734m9120n3250
750d5517j20N0522M0958j6187n2268k0272M0191M8635p675o0595m3073K5192O6695
763B6486L6691k9334n9965k8538K4933M5396K2248j6756l2648j4599J7078K6858
775A7850L162l0133l3644P493N2168M2218k2407p2123m2858L8431P8420L0700
$$ plain form
689 -52914 27192 77721 47187 -23168 -53008 -15671 39596 50378 9767 -32435 -26454 18843
701 18843 49822 31389 -19082 -50327 -28438 27656 62708 40517 -17981 -53589 -28863 30453
713 30453 60362 27685 -27279 -38873 6581 51437 37374 -23004 -59270 -24058 46959 73025
725 73025 21403 -51674 -66393 -8295 55986 58341 4642 -39077 -26979 17039 37950 14089
737 14089 -24993 -34293 -943 40208 42774 -374 -48450 -52125 -4501 50119 56853 7733 -45517
750 -45517 -45637 4885 45843 29656 -22612 -42884 -2693 45942 38267 -22328 -65401 -40209 26486
763 26486 63177 33843 -26122 -54660 -29727 15669 37917 21161 -11487 -26086 -9008 17850
775 17850 21012 -9121 -42765 -35272 16896 59114 36707 -35416 -78274 -39843 38577 69277
787F9277m7635o3294m953M9368L3526k2890m4806o527M0208L8586r015m5474l4848
800d8477O800L6214L5300J1157k1148l9848k5101J7404M4449K2574k7180m2406
812c0262O68M5743K6715l7520o1502n328O6271O5737j2870p6679n1257K6565O3767
825B0048K6913k7135l5259k820K1255J1155j2565j8838n300J2248K3491J9537
837C2730m950l7561m0696K090N3668N3475m913n9539m4683J8885N1029J6593l5331
850G97l4877J5299M8056J8288m0432n4852p684M6678N1252J0205l3250m2267j6858
863c9645J7907L3642J8523j2003k6511q531J9094J8969j4266l6808j3525L6377
875f777N3292J0906m8827n8914n719M9421M8571N55l5811k8151M002K0397P715
$$ plain form
787 69277 21642 -41652 -46605 2763 36289 13399 -31407 -37934 2274 40860 31845 -13629 -48477
800 -48477 -41677 -5463 29837 40994 19846 -20002 -45103 -27699 16750 39324 12144 -30262
812 -30262 -29594 16149 42864 5344 -56158 -61486 4785 70522 57652 -19027 -70284 -43719 20048
825 20048 46961 19826 -15433 -18253 3002 14157 1592 -17246 -22546 -10298 13193 32730
837 32730 27780 -9781 -50477 -48387 5281 58756 53843 -5696 -50379 -31494 19535 36128 797
850 797 -34080 -18781 29275 47563 7131 -47721 -55405 -8727 42525 52730 19480 -22787 -39645
863 -39645 -21738 11904 30427 18424 -8087 -16618 2476 21445 7179 -29629 -43154 -6777
875 -6777 46515 57421 8594 -50320 -56039 -6618 41953 42508 6697 -21454 -17452 2945 10660
888A0660j3332j6516K604K3994K4503j915l6234m1334j219M7734N2650L464m9568
901E491m8472K282M2973K7827j7113l1261l40L0662K0126k1677m2694j5882L0184
914a7894M6003K0613j9205m1737k9893N460L7316L4112j635l3300k5312J1130
926a4342K9341K741l3301k6436K3462N4697K3070m0324o3489j7551M6094N5714
938C9676R287l4137l3672l404J6063J2051k952r113j940J0160J6100N989j8869
951E239l5404j5978L0874N5484K3483l8974o1994j7915M2658M9500k292m1372
963f691k1795K5656L3387p353m3586k6540K5426M9453K2912k1504l9660k5483
$$ plain form
888 10660 -2672 -19188 -16584 7410 31913 29998 -6236 -47570 -48789 -1055 51595 55059 5491
901 5491 -42981 -40699 2274 30101 12988 -18273 -18613 12049 32175 10498 -32196 -48078 -17894
914 -17894 28109 48722 29517 -12220 -42113 -36653 663 34775 33140 -160 -25472 -14342
926 -14342 14999 17740 -15561 -41997 -18535 36162 59232 18908 -44581 -62132 -16038 39676
938 39676 48963 14826 -18846 -22250 -6187 5864 2912 -6201 -8141 2019 18119 24108 5239
951 5239 -30165 -46143 -15269 40215 63698 24724 -37270 -55185 -12527 36973 34681 -6691
963 -6691 -28486 -2830 30557 23204 -20382 -46922 -21496 27957 50869 29365 -10295 -35778
$$ [...]
8191a10
##END NTUPLES=NMR FID
##END=
