##TITLE=1H_CG-1124-9
 CDCl3, 8 sc, 
 13.11.2019
##JCAMPDX= 6.0         $$ Bruker NMR JCAMP-DX V2.0
##DATA TYPE= NMR FID
##DATA CLASS= NTUPLES
##ORIGIN= UXNMR, Bruker Analytische Messtechnik GmbH
##OWNER= root
$$ XWIN-NMR		Version 3.5
$$ Wed Nov 13 13:54:00 2019 Russian Standard Time (UT+4h)  she@DPX200
##.OBSERVE FREQUENCY= 200.1315
##.OBSERVE NUCLEUS= ^1H
##.DELAY= (6, 6)
##.ACQUISITION MODE= SIMULTANEOUS
##.ACQUISITION SCHEME= undefined
##.AVERAGES= 8
##.DIGITISER RES= 18
##SPECTROMETER/DATA SYSTEM= spect
##.PULSE SEQUENCE= zg30
##.SOLVENT NAME= D2O
##.SHIFT REFERENCE= (INTERNAL, D2O, 0, 15.7039)
##AUDIT TRAIL= $$ (NUMBER, WHEN, WHO, WHERE, WHAT)
$$ ##TITLE= Audit trail, XWIN-NMR		Version 3.5
$$ ##JCAMPDX= 5.01
$$ ##ORIGIN= Bruker BioSpin GmbH
$$ ##OWNER= she
$$ F:/spectra/data/she/nmr/H-F/1/audita.txt
$$ ##AUDIT TRAIL=  $$ (NUMBER, WHEN, WHO, WHERE, WHAT)
(   1,<2019-11-13 13:53:02.21 +0400>,<she>,<DPX200>,
      <created by zg, POWCHK disabled, PULCHK disabled
       configuration hash MD5:
       00 E9 B6 7A A2 85 ED C7 34 08 36 98 17 FE 4E 26
       data hash MD5: 16K
       73 76 BB AC 2F 6C D9 1D E6 EC F5 50 2C BB F1 6D>)
$$ ##END=
$$ 
$$ hash MD5
$$ 5D 37 16 28 70 F8 30 25 2F 68 6B E7 EB 28 10 2C
##$RELAX= 
##$RELAX= 
##$RELAX= 
##$RELAX= 
##$RELAX= 
##$RELAX= 
$$ Bruker specific parameters
$$ --------------------------
##$DU= <F:/spectra>
##$EXPNO= 1
##$NAME= <H-F>
##$PROCNO= 1
##$TYPE= <nmr>
##$USER= <she>
##$AMP= (0..31)
100 100 100 100 100 100 100 100 100 100 100 100 100 100 100 100 100 100 
100 100 100 100 100 100 100 100 100 100 100 100 100 100 
##$AQSEQ= 0
##$AQ_mod= 1
##$AUNM= <au_zg>
##$AUTOPOS= <>
##$BF1= 200.13
##$BF2= 200.13
##$BF3= 200.13
##$BF4= 200.13
##$BF5= 200.13
##$BF6= 200.13
##$BF7= 200.13
##$BF8= 200.13
##$BYTORDA= 1
##$CFDGTYP= 0
##$CFRGTYP= 5
##$CHEMSTR= <none>
##$CNST= (0..31)
1 1 145 1 1 1 1 1 1 1 1 1 1 1 1 1 1 1 1 1 1 1 1 1 1 1 1 1 1 1 1 1 
##$CPDPRG= <>
##$CPDPRG1= <>
##$CPDPRG2= <>
##$CPDPRG3= <>
##$CPDPRG4= <mlev>
##$CPDPRG5= <mlev>
##$CPDPRG6= <mlev>
##$CPDPRG7= <mlev>
##$CPDPRG8= <mlev>
##$CPDPRGB= <>
##$CPDPRGT= <>
##$D= (0..31)
0 1.2 0 0 0 0 0 0 0 0.06 0 0.03 0 0 0 0 0.0002 0 0 0 0 0 0 0 0 0 0 0 0 
0 0 0 
##$DATE= 1573638781
##$DBL= (0..7)
120 120 120 120 120 120 120 120 
##$DBP= (0..7)
150 150 150 150 150 150 150 150 
##$DBP07= 0
##$DBPNAM0= <>
##$DBPNAM1= <>
##$DBPNAM2= <>
##$DBPNAM3= <>
##$DBPNAM4= <>
##$DBPNAM5= <>
##$DBPNAM6= <>
##$DBPNAM7= <>
##$DBPOAL= (0..7)
0.5 0.5 0.5 0.5 0.5 0.5 0.5 0.5 
##$DBPOFFS= (0..7)
0 0 0 0 0 0 0 0 
##$DE= 6
##$DECBNUC= <off>
##$DECIM= 24
##$DECNUC= <off>
##$DECSTAT= 4
##$DIGMOD= 1
##$DIGTYP= 9
##$DL= (0..7)
0 120 120 120 120 120 120 120 
##$DP= (0..7)
150 150 150 150 150 150 150 150 
##$DP07= 0
##$DPNAME0= <>
##$DPNAME1= <>
##$DPNAME2= <>
##$DPNAME3= <>
##$DPNAME4= <>
##$DPNAME5= <>
##$DPNAME6= <>
##$DPNAME7= <>
##$DPOAL= (0..7)
0.5 0.5 0.5 0.5 0.5 0.5 0.5 0.5 
##$DPOFFS= (0..7)
0 0 0 0 0 0 0 0 
##$DQDMODE= 0
##$DR= 18
##$DS= 0
##$DSLIST= <SSSSSSSSSSSSSSS>
$$ [...]
##$SUBNAM2= <"">
##$SUBNAM3= <"">
##$SUBNAM4= <"">
##$SUBNAM5= <"">
##$SUBNAM6= <"">
##$SUBNAM7= <"">
##$SUBNAM8= <"">
##$SUBNAM9= <"">
##$SW= 24.0689530833862
##$SWIBOX= (0..15)
0 0 2 0 0 0 0 0 0 0 0 0 0 0 0 0 
##$SW_h= 4816.95568400771
##$TD= 16384
##$TD0= 1
##$TE= 0
##$TE2= 300
##$TE3= 300
##$TEG= 300
##$TL= (0..7)
0 120 120 120 120 120 120 120 
##$TP= (0..7)
150 150 150 150 150 150 150 150 
##$TP07= 0
##$TPNAME0= <>
##$TPNAME1= <>
##$TPNAME2= <>
##$TPNAME3= <>
##$TPNAME4= <>
##$TPNAME5= <>
##$TPNAME6= <>
##$TPNAME7= <>
##$TPOAL= (0..7)
0.5 0.5 0.5 0.5 0.5 0.5 0.5 0.5 
##$TPOFFS= (0..7)
0 0 0 0 0 0 0 0 
##$TUNHIN= 0
##$TUNHOUT= 0
##$TUNXOUT= 0
##$USERA1= <user>
##$USERA2= <user>
##$USERA3= <user>
##$USERA4= <user>
##$USERA5= <user>
##$V9= 5
##$VALIST= <valist>
##$VCLIST= <CCCCCCCCCCCCCCC>
##$VD= 0
##$VDLIST= <DDDDDDDDDDDDDDD>
##$VPLIST= <PPPPPPPPPPPPPPP>
##$VTLIST= <TTTTTTTTTTTTTTT>
##$WBST= 1024
##$WBSW= 4
##$XGAIN= (0..3)
0 0 0 0 
##$XL= 0
##$YL= 0
##$YMAX_a= 214177
##$YMIN_a= -83493
##$ZGOPTNS= <>
##$ZL1= 120
##$ZL2= 120
##$ZL3= 120
##$ZL4= 120
##$ABSF1= 10
##$ABSF2= 0
##$ABSG= 5
##$ABSL= 3
##$ALPHA= 0
##$AQORDER= 0
##$ASSFAC= 0
##$ASSFACI= 0
##$ASSFACX= 0
##$ASSWID= 0
##$AUNMP= <proc_1d>
##$AZFE= 0.1
##$AZFW= 0.1
##$BCFW= 1
##$BC_mod= 2
##$BYTORDP= 1
##$COROFFS= 0
##$CY= 11.3945322036743
##$DATMOD= 1
##$DC= 2
##$DFILT= <>
##$DTYPP= 0
##$F1P= 16.9975609425685
##$F2P= -3.02152046262296
##$FCOR= 0.5
##$FTSIZE= 0
##$FT_mod= 4
##$GAMMA= 1
##$GB= 0.15
##$INTBC= 1
##$INTSCL= 1
##$ISEN= 128
##$LB= 0.24
##$LEV0= 0
##$LPBIN= 0
##$MAXI= 10000
##$MC2= 0
##$MEAN= 0
##$ME_mod= 0
##$MI= 1.114404
##$NCOEF= 0
##$NC_proc= 0
##$NLEV= 6
##$NOISF1= 3.799351
##$NOISF2= 2.8
##$NSP= 1
##$NTH_PI= 0
##$NZP= 0
##$OFFSET= 15.70392
##$PC= 1
##$PHC0= -9457.077
##$PHC1= 20.00088
##$PH_mod= 1
##$PKNL= yes
##$PPARMOD= 0
##$PSCAL= 0
##$PSIGN= 0
##$REVERSE= no
##$SF= 200.130013532006
##$SI= 16384
##$SIGF1= 3
##$SIGF2= 2
##$SINO= 400
##$SIOLD= 16384
##$SREGLST= <1H.CDCl3>
##$SSB= 0
##$STSI= 0
##$STSR= 0
##$SW_p= 3612.71676300578
##$SYMM= 0
##$S_DEV= 0
##$TDeff= 0
##$TDoff= 0
##$TI= <>
##$TILT= no
##$TM1= 0
##$TM2= 0
##$TOPLEV= 0
##$USERP1= <user>
##$USERP2= <user>
##$USERP3= <user>
##$USERP4= <user>
##$USERP5= <user>
##$WDW= 1
##$XDIM= 8192
##$YMAX_p= 0
##$YMIN_p= 0
$$ End of Bruker specific parameters
$$ ---------------------------------
##NTUPLES= NMR FID
##VAR_NAME=  TIME,          FID/REAL,        FID/IMAG
##SYMBOL=    X,             R,               I
##VAR_TYPE=  INDEPENDENT,   DEPENDENT,       DEPENDENT
##VAR_FORM=  AFFN,          ASDF,            ASDF
##VAR_DIM=   8192,          8192,            8192
##UNITS=     SECONDS,       ARBITRARY UNITS, ARBITRARY UNITS
##FACTOR=    0.0002076,     1,               1
##FIRST=     0,             0,               0
##LAST=      1.7004516,     0,               0
##MIN=       0,             -83493,          0
##MAX=       1.7004516,     214177,          0
$$ Real data points
##PAGE= N=1
##DATA TABLE= (X++(R..R)), XYDATA
0 0 0 0 0 0 0 0 0 0 0 0 0 0 0 0 -1 6 -8 8 -8 8 -11 14 -14 19 -21 23 -29 32 -36 41 -46 52 -59 66 -74 84 -93 104
38 104 -115 128 -142 156 -174 194 -214 236 -260 288 -320 356 -398 445 -502 570 -648 747 -866
57 -866 1003 -1115 855 6917 125626 93695 -7773 16642 23437 10759 8474 -41208 -48373 68751
71 68751 99639 8287 3247 51035 27456 27670 43524 7203 38221 115666 48439 -30404 44465
84 44465 82975 2771 -16166 22560 39424 74232 61165 -23829 -4773 77171 20610 -58329
96 -58329 -12624 24904 18472 43653 11435 -58269 -14819 28557 -44359 -61047 15518 23549 -4889
109 -4889 -6854 -44208 -56266 -8442 -34274 -78457 2722 53402 -27442 -53570 -10726 -30710
121 -30710 -41727 -14144 -41573 -41650 34053 23005 -52650 -37591 -6336 -25501 -10797 -6653 -43470
134 -43470 -2494 50387 -16961 -57026 5304 124 -49461 -12532 16301 -6893 11505 15154
146 15154 -32263 -17610 8237 -42712 -40542 33666 28835 -5877 10550 -13929 -45813 4536
158 4536 14685 -41065 -4405 61264 21907 -18480 -5394 -18703 -13474 22081 -1919 -14722
170 -14722 46213 40151 -27614 -6716 27017 -14131 -12832 23668 2720 4506 42580 4092 -34975
183 -34975 11294 19596 -24653 -12559 8102 140 27201 22482 -44066 -32413 23824 -18442 -53479
196 -53479 7331 28595 -6154 -3194 -16022 -47651 -16324 66 -40791 -16401 39317 7335
208 7335 -28469 -15116 -31416 -31019 15111 -3814 -40020 21209 51799 -20397 -41559 79 484
221 484 242 13347 -10198 2312 51564 14924 -38639 4725 30918 -5142 4065 24038 4976
234 4976 27252 49057 -10823 -30707 30019 28095 -13668 8377 31324 24313 32863 5285 -38777
247 -38777 3414 42289 -9253 -17439 43700 36394 -6149 -3315 -14514 -23256 20055 19969 -24046
260 -24046 5965 46054 1792 -30841 -16671 -16322 4104 28658 -16251 -34968 31937 33125 -41416
273 -41416 -39607 3902 -1570 -2256 2330 -22143 -3344 32839 -11378 -49128 -7938 5730 -18658
286 -18658 -1396 6074 -10465 14558 13392 -48800 -38893 25622 8178 -27821 3773 20315 4462
299 4462 -602 -30629 -46225 13724 37379 -17745 -17491 27104 7489 -17384 -8027 -23946 -17523
312 -17523 33484 19873 -28600 -151 27299 -11087 -22743 -3573 -5619 10934 22845 -15880
324 -15880 -12910 39871 13328 -42231 -11654 23196 5430 7203 11389 -6841 17742 39265 -13125
337 -13125 -36067 12453 27441 12447 21865 11729 -570 29451 18580 -32208 -4560 46600
349 46600 20119 1884 30882 21632 -2935 4977 -3357 -3821 36917 31981 -12998 6149 35070
362 35070 2317 -13435 1183 -7441 10288 43876 4335 -33980 9518 28148 -14400 -21188
374 -21188 -4762 -5696 13611 18068 -20909 -15309 18434 -13208 -39429 -1701 5908 -17163 2388
387 2388 8708 -18669 -7958 -1460 -39664 -29961 19038 9057 -15048 -2924 -7593 -14518 2605
400 2605 -17855 -41416 6887 35615 -9635 -19195 7954 -7189 -16664 4375 -5181 -9507 21845
413 21845 12843 -15685 7113 15845 -15870 -8502 14142 2807 11432 26363 -6742 -10057 33564
426 33564 16964 -29363 -6694 25247 17286 18059 11880 -10136 8854 25643 -14203 -21303 22602
439 22602 22362 3559 18659 8739 -16787 2708 7847 -19639 3043 34738 3882 -14027 9567
452 9567 3924 -10335 -2359 -11421 -6057 34557 19594 -32963 -12711 24395 -840 -16343 -395
465 -395 -3940 7115 29152 -2915 -28506 8195 18399 -13649 -9176 6554 983 15836 15952
478 15952 -19321 -8996 26065 -6556 -34583 8316 28675 4089 32 -2861 -12687 8421 8279
491 8279 -30424 -14270 32442 17645 -10239 -4462 -10789 -9938 15714 -653 -28010 11532 36876
504 36876 -6459 -22738 3309 2921 -1361 5409 -7658 896 31955 7353 -28286 3243 24200
517 24200 -5328 -8438 6733 1367 15909 26923 -13310 -25380 18158 17254 -17742 -8515 9366
530 9366 10436 18243 -1120 -34533 -8142 22204 -14169 -29064 11403 13719 -9760 -7579 -17390
543 -17390 -27356 -63 2297 -29355 -13139 15384 -8395 -25608 -14835 -20841 -13569 7612 -16055
556 -16055 -31239 9867 14527 -30462 -25407 3925 -5325 -9397 -1966 -12720 -980 21983 -5749
569 -5749 -27455 5264 13987 -9416 -233 10106 918 18061 21768 -17798 -15254 25569 13794
582 13794 -10804 10425 21842 12639 14695 -700 -17486 12453 26276 -6556 -1414 29420 11262
595 11262 -8646 4182 -2561 -7029 18088 11477 -14474 7583 22766 -8300 -15171 2095 -1801
608 -1801 3313 11658 -13084 -11908 23046 7000 -28912 -6541 13550 -7055 -4663 6314 -5881
621 -5881 2122 13573 -13872 -20321 10763 5197 -14392 4317 10485 -2414 7177 -697 -27035
634 -27035 -2726 26649 -4939 -19854 11913 14129 -5663 -5899 -13857 -13589 16617 12880 -20175
647 -20175 -5538 15890 -7940 -15574 -100 -10724 -9860 11931 -3903 -20077 6807 7448 -25007
660 -25007 -16016 6450 -3958 -6464 -3125 -13323 1965 18906 -16706 -35138 5564 17248 -8574
673 -8574 -6041 3105 -3683 9872 10493 -21469 -14718 21095 11967 -5356 8005 7531 -550 10551
687 10551 129 -13776 16909 27724 -7796 -4689 25785 10429 -9973 596 2459 7038 23786
700 23786 4092 -18649 10249 25011 -5442 -11073 3014 -1060 8675 18080 -11556 -15927 19032
713 19032 11036 -20684 -6345 10159 -1875 1778 4683 -7013 4672 11865 -17855 -16551 19570
726 19570 11512 -12821 1627 8936 -385 8467 -206 -22037 4098 33446 5792 -14665 3340
739 3340 7939 4786 8081 -9110 -11048 23934 20986 -15263 -5014 16592 -1254 -7010 6958
752 6958 -1074 -1311 13280 -2472 -13441 10861 8611 -18645 -8662 7865 -394 2972 1729 -18993
766 -18993 -4328 21899 -6923 -31637 -806 14666 -2383 -3177 -5725 -12750 4915 7958 -19489
779 -19489 -11483 16364 2472 -11119 3126 -1919 -10241 5472 -1436 -15760 9777 19692 -13262
792 -13262 -15153 10505 5448 -5343 -2489 -9573 17 23212 1843 -25477 288 17406 -6067
805 -6067 -8470 2008 -5876 3020 14610 -8575 -15778 10343 5241 -15444 -2629 6087 -2990 3334
819 3334 1804 -13581 2739 14275 -14865 -17381 17363 13666 -10573 -4243 -476 -2879 10160
832 10160 3546 -17288 2104 23204 965 -10452 3490 767 1874 13264 -2041 -10635 17897
845 17897 17960 -12655 -4341 16255 4068 -1274 6665 451 6322 18127 -2345 -11813 15276 14969
859 14969 -9866 -1198 10646 1548 8211 10462 -11264 -4451 19463 2465 -15593 4286 11354
872 11354 -448 1478 -4014 -11198 8427 10090 -17790 -8663 17711 1025 -15825 -1823 -1737 -6389
886 -6389 4677 -4096 -17568 4262 12380 -13820 -15245 2297 -1885 -3307 890 -13630 -8946 15542
900 15542 -71 -24345 -3015 12160 -6751 -9337 -178 -4532 2212 7837 -12523 -12604 12584 3691
914 3691 -14402 -970 5456 -3659 3985 1187 -15579 443 17379 -6527 -15022 9018 9031 -5900
928 -5900 -1774 -3205 -4387 11222 3434 -16716 1604 17795 -5541 -12769 4582 1890 -671 7926
942 7926 -5305 -12057 12817 12771 -14181 -8387 9140 2619 1372 1410 -9876 1421 18514 -2990
956 -2990 -16842 8563 11999 -8106 -1297 7173 -2343 3589 7285 -8912 -1501 16454 338 -11436
970 -11436 6719 8958 -1113 4089 -2022 -9207 12741 16183 -13655 -10807 15973 7959 -6366
983 -6366 -247 -1204 106 12506 491 -13622 4976 12444 -8658 -6421 7109 -2332 -2901 5590
997 5590 -7533 -7705 13033 1532 -19312 -1985 11101 -3309 -7352 -4551 -7590 5220 9920
1010 9920 -15487 -15855 11817 6238 -13018 -4051 135 -6196 3766 2883 -14405 -3964 11608 -5176
1024 -5176 -10789 5199 1214 -6742 1881 -3187 -6499 9906 2696 -19040 -1344 17660 -3479
1037 -3479 -14253 29 1057 841 5950 -9519 -14742 9716 9824 -12908 -8097 2253 -4114 561
1051 561 2461 -14413 -7725 12488 -2566 -17122 1842 5905 -10338 -5683 424 -5243 1836 1396
1065 1396 -13688 -2830 15113 -3308 -15562 2740 6499 -993 5588 -1086 -11225 8974 16554
1078 16554 -7209 -8474 10925 7893 1610 6046 -1199 521 15804 5175 -9336 10221 16647
1091 16647 -4829 -2093 12883 4293 1029 6761 -3481 -1064 17882 6047 -12910 1634 12060
1104 12060 964 181 -1860 -9404 6951 16776 -8832 -15402 9481 7235 -8865 -2292 553 -4596
1118 -4596 4900 3371 -11364 -290 9474 -8262 -9333 8522 2472 -5539 3018 -2582 -6315 11035
1132 11035 6144 -16224 -2880 16878 2532 -7303 -842 -1981 3569 10847 -6659 -12711 11509
1145 11509 11532 -9588 -3465 5859 -3981 -238 4350 -8886 -4126 12198 -1272 -13607 2577 4840
1159 4840 -7777 -4164 -2185 -5754 6735 5246 -17169 -8769 13043 -1228 -15189 -1388 2755
1172 2755 -2330 4002 -3267 -13529 3593 10028 -8609 -6683 7689 1100 -1972 4324 -5026 -4258
1186 -4258 12952 2608 -13102 6499 16406 -3351 -4957 6240 2975 4165 6639 -6475 -2081
1199 -2081 18722 7683 -10603 1770 9068 -785 3406 3987 -7229 5219 16867 -4761 -12345
1212 -12345 7388 6275 -5348 354 1024 -1653 8601 1684 -14900 -166 12981 -5943 -10277
1225 -10277 6995 3382 -3196 3238 -4209 -8781 8876 7747 -10737 -2544 11305 1001 -2278
1238 -2278 2423 -4703 1619 13313 -3208 -11088 12472 13729 -8115 -3807 6812 623 3042 4558
1252 4558 -6527 1478 16162 -63 -12375 2707 4646 -3554 3203 593 -7697 6268 8838
1265 8838 -13958 -11354 8727 209 -9805 -341 -386 -4417 1594 -7231 -15547 3166 6945 -13217
1279 -13217 -9279 5955 -2775 -6987 -1049 -10118 -9312 8524 596 -15526 -1260 8440 -4466 -5403
1293 -5403 -1443 -6951 753 7577 -7988 -6699 13531 3531 -13758 -492 6552 -3213 1618 3767
1307 3767 -4688 4671 12160 -7608 -11249 7889 6172 -2315 2814 -1199 -3905 10284 4121 -15530
1321 -15530 -2685 14551 -258 -6539 5055 1031 -2520 4099 -3576 -7373 8375 5304 -9649
1334 -9649 2052 11439 -2968 -3979 3423 -3766 786 11986 -2097 -9897 11536 13009 -6859
1347 -6859 -5233 2720 1804 8789 7280 -7611 1373 16557 5 -10738 5437 6582 -1451 7198
1361 7198 5691 -5041 4751 7281 -9244 -3695 12846 2885 -4796 3755 824 -698 5940 -5759
1375 -5759 -13594 8684 13889 -9413 -8979 6224 1472 -2704 139 -9194 -6724 9861 1732 -11572
1389 -11572 511 5068 -7125 -4201 -590 -8322 318 8305 -7612 -7674 10485 430 -16579 -4283
1403 -4283 5667 629 1757 -2615 -9879 4396 10021 -11930 -13619 7178 6524 -1464 2121 -4713
1417 -4713 -8593 7768 4804 -13719 -3430 11649 743 -4865 2215 -2239 -1837 4325 -6281 -7519
1431 -7519 11107 6210 -11811 -739 10644 -2386 -4988 -423 -5675 2520 13897 -1786 -11549
1444 -11549 5559 7864 -5057 -3199 -1092 -2196 10470 9647 -10393 -5080 12406 205 -9742
1457 -9742 4827 6937 442 5355 1021 -6583 5535 6846 -8262 -1464 13413 3827 -2111 3525
1471 3525 -2086 -1304 10955 472 -12223 6153 15267 -1196 -4514 3642 -231 1460 4975 -6329
1485 -6329 -3709 13018 4677 -7897 3122 4548 -7552 -1659 3944 -4006 2577 9605 -5566 -8198
1499 -8198 6918 201 -10317 -609 3818 695 5845 -1549 -13972 -499 9585 -7893 -9286
1512 -9286 7254 3257 -3870 1539 -4398 -8673 4242 3447 -9177 -19 7892 -3452 -3590 2696
1526 2696 -4721 -3331 5425 -5239 -7719 10701 7253 -10745 -3187 5724 -3064 -3252 985 -4525
1540 -4525 2818 11088 -3363 -9872 4430 2553 -7955 582 4006 -2275 5108 4877 -10760 -5462
1554 -5462 8916 -2080 -8811 3705 5256 -954 1098 -4988 -8420 6344 6279 -10720 -3102 11066
1568 11066 1036 -5512 1289 -2824 -2903 7337 112 -8439 6246 11361 -3788 -3783 3511 -841 2395
1583 2395 5274 -4813 1091 16853 4155 -10654 2164 8640 -1100 1259 4976 950 8514 10192
1597 10192 -6358 -6585 9644 5331 -2979 5121 5274 907 7103 733 -11100 2951 13316 -2827
1611 -2827 -6403 7535 5566 -1471 -9 -5788 -4003 9695 3285 -11309 424 10113 -1718 -5046
1625 -5046 -911 -5885 -1435 7715 -4028 -9066 7408 7184 -8111 -5495 677 -2972 1635 2792
1639 2792 -5372 2125 10350 -6143 -12987 3555 5182 -4284 827 2120 -2113 4650 2588 -12845
1653 -12845 -6249 9318 2292 -5283 480 -425 -1475 4117 -5364 -12568 4135 9000 -7607 -5719
1667 -5719 5621 -1132 -5484 -1240 -5600 -3950 5814 -1511 -9477 3629 6706 -6615 -5709 -481
1681 -481 -4251 2572 6644 -6529 -5121 11097 3518 -11342 -3390 3564 1533 5612 3455 -4748
1695 -4748 3364 8040 -6212 -6012 8185 3923 -1653 6623 4051 -2214 4233 1818 -7832 2974
1709 2974 12368 -300 -4046 5141 3171 1330 2564 -5921 -5326 11072 7447 -8670 -1148 7815
1723 7815 -743 -2587 550 -5467 -1327 8723 773 -5275 4553 1987 -7594 -1138 2186 -2710 3991
1738 3991 5534 -5595 -721 7875 -5074 -11366 4128 7899 -23 1929 80 -4086 4052 3365
1752 3365 -8634 -2413 9581 2040 -2055 3919 -1879 -4216 4846 -124 -8053 3663 6851 -4974
1766 -4974 -2618 5284 -2078 -4977 -890 -4950 -1361 7165 -2436 -9916 3027 4808 -8674 -7100
1780 -7100 16 -3326 1918 5251 -6358 -7516 3894 -1610 -10113 -1249 1624 -1271 3392 965
1794 965 -7881 -652 3911 -8290 -5095 9881 4048 -5160 1329 1781 -1618 2430 -902 -7113 5181
1809 5181 11404 -1845 -4089 4197 1580 979 3969 -3923 -4253 10941 7808 -7025 -661 7627 -612
1824 -612 -3163 1102 -1247 3879 8634 -2984 -5804 6806 2775 -8799 -1122 5993 1860 5083
1838 5083 2984 -7871 -1572 9123 -2223 -8581 4027 8061 2408 1882 -3421 -5126 6896 5976
1852 5976 -7995 -972 11970 3342 -3343 2180 645 -195 5378 -1171 -5729 7683 10267 -3376
1866 -3376 -3165 4345 1019 1065 1598 -5602 891 13692 2317 -11197 -109 6130 -2372 -3078 186
1881 186 -813 5279 5990 -8155 -8497 4360 771 -6326 364 2241 -893 3143 -2194 -12012 -1310
1896 -1310 7452 -4726 -7495 4391 3352 -2198 -2033 -5963 -5004 5535 602 -9310 125 8023 -1722
1911 -1722 -4475 784 -3322 -1880 4446 -3108 -6224 6782 6205 -6370 -3899 1327 -1812 542 1166
1926 1166 -4280 2261 9877 -3573 -10044 1757 3229 -4034 1453 3261 -1740 3034 2799 -8111
1940 -8111 -4254 5567 529 -2508 4720 1747 -1958 2784 -1663 -6754 4118 6561 -5233 -1214
1954 -1214 8470 1953 -3206 1291 -1057 -634 5813 571 -4608 6125 7546 -3331 -951 3305 -2211
1969 -2211 1180 6864 -195 -412 8741 1653 -7021 1537 4943 -1501 1331 4289 364 3900 3452
1984 3452 -7872 -4042 8624 2534 -4725 3371 4121 -1780 1539 -1000 -7869 991 7463 -2449 -3504
1999 -3504 4307 423 -3195 459 -3223 -4092 4610 835 -7706 2390 7901 -4923 -7355 946 -581
2014 -581 -1043 1528 -4132 -2444 8001 1892 -10403 -4507 2312 -555 1222 1367 -4947 993 6982
2029 6982 -5875 -10718 2637 4569 -2314 64 1451 -2235 1344 -1193 -8938 -190 8699 -1225
2043 -1225 -5694 3621 2147 -2813 -416 -3452 -4959 6472 6480 -7312 -4501 6303 2432 -2786 -2332
2058 -2332 -4325 677 8566 -824 -7213 4388 6002 -5522 -4677 1867 -250 2168 4743 -2714 -1038
2073 -1038 6941 -1252 -8433 1025 6174 1421 2377 221 -3170 4885 5672 -8173 -5857 9422 7139
2088 7139 -1791 -32 507 209 5475 445 -6773 2981 9422 -387 -1953 3879 539 -292 3322 -2434
2104 -2434 -2735 8003 4527 -5898 674 7088 -1575 -4746 -710 -479 4121 6589 -4127 -5995 5812
2119 5812 3160 -7708 -3191 2251 501 3982 2814 -7024 -3436 5060 -2583 -7014 1893 3183 -907
2134 -907 600 -2124 -5324 2306 1210 -8198 -1406 7896 -639 -5952 239 -38 -1577 1862 -3061
2149 -3061 -6374 4268 5840 -4912 -3663 2140 -1683 -1004 456 -5116 -2022 7573 878 -7508 628
2164 628 2431 -5619 -3193 1703 -689 2052 2755 -5349 -3679 4017 -2863 -7657 1626 3899 -761
2179 -761 1378 -1344 -6776 543 4705 -4798 -5031 5166 2869 -2267 -189 -2015 -2361 4264 735
2194 735 -5838 3368 6993 -2704 -2879 4067 170 -1261 3353 -486 -1033 7100 4077 -4888 715 4705
2210 4705 -982 -494 2290 -323 4334 7365 -3134 -5374 5269 3180 -4540 860 5357 1447 2489
2225 2489 1462 -5108 -367 5094 -2411 -3868 5109 3450 -1617 603 -1460 -3814 4020 3035 -6508
2240 -6508 -1089 7533 113 -4634 301 322 -417 2646 -2259 -3932 5816 4368 -5424 -2371 3490 -1268
2256 -1268 -1484 1958 -1631 717 6652 -1320 -7611 1042 3770 -3155 -1435 1865 137 3295 1567
2271 1567 -8092 -4138 6075 -203 -6256 1304 3688 -1640 -728 -2822 -5794 1540 4016 -5461 -4066
2286 -4066 4188 650 -4251 -1632 -2739 -1676 4436 -1300 -8363 1700 7417 -3017 -5922 605
2300 605 347 556 1972 -3247 -1685 6933 2447 -6606 -1007 3709 -474 1046 2489 -781 3013 6107
2316 6107 -3783 -5892 5669 5389 -1983 390 3541 2415 4208 -251 -7123 1469 9260 96 -4526
2331 -4526 3252 3580 -303 1787 -2001 -3823 5084 5168 -4221 -1350 5473 872 -2214 74 -1789 773
2347 773 5505 -1542 -4978 5673 5935 -5213 -3706 2753 1211 1466 2268 -2753 -84 6868 -163
2362 -163 -6851 709 4065 930 2662 958 -3003 2554 4579 -5162 -4198 5678 2721 -3162 1323
2377 1323 1160 -1521 1037 -1399 -4826 2484 4481 -4536 -3668 3529 -236 -2914 -428 -3646 -3556 4718
2393 4718 748 -7318 -1347 3934 -2257 -4202 -1725 -2879 128 3418 -3488 -4209 3379 -641 -6761
2408 -6761 -1136 2559 -1999 -136 2026 -2786 -847 2326 -4622 -5288 4124 2868 -2461 -223 -165 -1811
2424 -1811 3126 773 -6547 -368 7398 -399 -4431 1859 1041 -1492 1329 -917 -3042 3410 2852
2439 2852 -3993 124 4621 -1386 -2792 1483 -1074 494 4538 -1166 -4802 4428 4604 -5267 -3536
2454 -3536 2395 1671 2521 1539 -3959 -404 6039 -775 -5787 2566 4322 -453 1672 1726 -2559 1824
2470 1824 3613 -3677 -1304 7066 2507 -2922 1059 1872 573 3180 -1163 -3823 5081 6993 -3908
2485 -3908 -3729 4391 2104 -1150 313 -1956 -994 5883 1597 -5728 -118 3592 -2248 -2255 -84 -1524
2501 -1524 1820 4159 -4128 -4777 4398 984 -6905 -1581 3509 -141 101 -1191 -4729 545 4017
2516 4017 -4548 -5620 3297 2536 -2765 -1116 -2232 -3319 2951 1243 -6653 -1627 5829 -504 -4887
2531 -4887 -170 -83 -644 990 -3157 -3860 4603 3134 -6021 -2107 3677 -1108 -2542 171 -2091 328
2547 328 5211 -1155 -6349 1350 3574 -2960 -1894 418 6 2824 2055 -5951 -2664 5807 205 -5235
2563 -5235 1729 3755 -1055 362 -568 -3157 2411 4017 -3470 -1975 5327 1418 -2536 643 -319
2578 -319 -545 4475 602 -5163 2559 6885 -2006 -3097 2327 1216 402 2060 -1640 -298 6188 1356
2594 1356 -4995 1053 4599 -1131 -400 2474 -654 2261 4973 -2704 -4318 4665 3407 -2786 -52
2609 -52 1987 356 2287 271 -4922 814 5611 -2025 -4013 3694 2051 -2519 58 -508 -2487 3071
2625 3071 1407 -5216 -515 4997 -1442 -4031 110 -696 -626 2532 -2691 -5141 3979 3539 -5825 -3162
2641 -3162 1939 -845 -1319 628 -2582 -684 3978 -2214 -5882 2097 2363 -3600 -895 1576 -1789
2656 -1789 1018 1460 -5600 -2655 5513 75 -5623 522 2176 -785 -69 -2025 -3968 2875 3887
2671 3887 -4548 -3017 3955 129 -2913 464 -999 -1797 3367 415 -4998 1726 4503 -2981 -3071 1812
2687 1812 181 176 1794 -3010 -1049 6327 897 -6447 331 5356 -64 -605 1163 -1164 2125 4542
2703 4542 -3064 -3483 4866 3458 -1760 1307 1602 -834 3070 1806 -3801 1488 6744 -1533 -3535
2718 -3535 3778 3095 -1156 243 181 -462 5184 2105 -5312 730 6065 -525 -2633 1015 -498 827
2734 827 4648 -1452 -4469 3704 3974 -4096 -2304 2406 -306 263 909 -3087 -28 4585 -2650 -5616
2750 -5616 3023 3385 -2942 -1003 732 -1384 1882 1894 -5026 -2387 5574 795 -4512 -540 505 -291
2766 -291 1999 -1256 -4976 2668 4412 -4413 -3701 3180 -78 -2559 -16 -1304 -1428 3110 -805 -5245
2782 -5245 1503 3439 -3584 -3039 1057 -944 135 1671 -4342 -3216 4978 1169 -6723 -1296 2815
2797 2815 -145 -627 -718 -3743 1010 3851 -3592 -3795 3942 1675 -2818 646 687 -1544 2317 1391 -4130
2814 -4130 1056 5786 -1141 -3399 2337 2046 400 1572 -1556 -1418 6063 3267 -4945 -44 5314
2829 5314 395 -1152 1520 -233 822 4441 -811 -3603 3329 3524 -2882 -264 2489 -165 1602
2844 1602 1698 -3463 44 5615 -1343 -5308 2630 3750 -1516 -750 -55 -1300 3055 2404 -4398 -1677
2860 -1677 4859 481 -2849 704 -87 -968 2765 -449 -4510 2408 4554 -3132 -2690 2752 566 -1220
2876 -1220 128 -1739 -403 4041 -779 -5539 1464 3936 -2878 -2293 913 -1388 318 1914 -3557
2891 -3557 -3481 3537 714 -5096 -822 1154 -1382 15 -1191 -4329 820 3451 -4353 -4650 3187 1083
2907 1083 -3915 -857 -333 -1945 1770 -211 -5276 -147 4063 -1986 -3583 865 -76 -492 1793 -2309
2923 -2309 -3386 4272 2882 -4934 -996 3818 -158 -1473 626 -905 1084 3871 -2248 -3697 3756
2938 3756 3209 -3252 -811 1615 -574 1847 1656 -3554 -198 5742 229 -4372 1763 2880 -525
2953 -525 392 -230 -1578 3438 2878 -4277 -1167 5282 865 -2909 1371 1090 -36 3010 -356 -3374
2969 -3374 2717 4871 -2359 -2148 2732 1105 472 1417 -2494 -804 5751 917 -4688 1651 4512 -1237
2985 -1237 -980 1076 -457 1116 2717 -2857 -1973 4651 812 -3829 101 1395 -618 1405 -88
3000 -88 -3953 1006 4825 -3260 -4589 2325 1727 -2151 -585 -1377 -1461 2833 140 -5395 -225 3819
3016 3819 -1982 -3063 1084 -571 -1265 1544 -2250 -3557 2805 1788 -4662 -1422 2661 -484 -1461
3031 -1461 -950 -2957 414 3969 -2663 -4919 2938 2543 -3175 -1501 272 -1159 1217 1817 -3592 -1220
3047 -1220 4104 -571 -3604 947 1120 -884 1207 -619 -2395 2683 2769 -4518 -2078 4551 883 -2501
3063 -2501 282 43 401 3151 -990 -3914 2402 4094 -2051 -1234 2069 -30 805 2189 -2597 -1316
3079 -1316 4883 1388 -3405 1095 3419 -742 -441 666 -439 2404 3084 -2622 -1553 5221 1141
3094 1141 -3403 522 2096 133 2049 674 -3432 1556 4944 -1419 -3109 2357 1766 -286 1074
3109 1074 -1200 -1398 3597 1140 -4463 384 3937 -1015 -2179 1520 292 -422 1576 -2255 -2877 3549
3125 3549 2221 -3609 -1002 2083 -460 -416 -369 -3302 -32 4486 -1539 -4863 1694 2157 -2512 -1341
3141 -1341 -63 -1390 1155 1158 -3814 -1196 3619 -1287 -3903 973 826 -1411 599 -1226 -3443 2191
3157 2191 2551 -4241 -2856 3211 702 -1982 -352 -1544 -290 3045 -1664 -4692 1955 3754 -2429
3172 -2429 -1977 1605 -994 -361 1361 -2356 -1351 4030 712 -3840 256 2759 -1166 -305 96 -1675
3188 -1675 2396 3272 -3476 -2874 3965 2179 -2609 -12 967 99 2232 310 -3133 1337 4498 -1624
3204 -1624 -2112 2715 1447 -71 1641 -1187 -1393 3823 2024 -3827 137 4659 466 -1461 847
3219 847 -34 1171 2842 -1708 -2615 4375 3444 -2851 -503 2057 -258 590 1281 -2372 362 4576
3235 4576 -907 -4022 1366 2312 -1183 112 -195 -868 2425 1715 -4292 -1149 4226 176 -3608 405
3251 405 751 -554 1459 -1350 -3657 1616 2729 -3563 -2146 1912 7 -921 169 -2477 -1454 3179
3267 3179 -689 -4803 1299 3569 -2135 -2548 -89 -1138 -84 1176 -3032 -1479 3554 248 -4446
3282 -4446 -464 1042 -1104 241 -30 -3041 927 3277 -3141 -3978 2240 1222 -2188 -416 -399 -658
3298 -658 1701 -390 -3778 399 3337 -2206 -2466 1933 612 -600 1097 -1592 -2407 3003 1915 -3391
3314 -3391 15 3364 -2 -716 174 -1567 732 3605 -1140 -2554 3911 2623 -2937 -487 2047
3329 2047 -41 1008 1368 -1659 890 4257 -747 -2747 2040 2458 -527 1070 314 -1035 2816 2521
3345 2521 -3850 -1297 4634 879 -2412 960 880 -34 1906 -1054 -2783 2326 2870 -2662 -988 2791
3361 2791 -9 -1048 456 -1874 -770 3574 -302 -3752 1863 3580 -1612 -2162 -374 -709 1906
3376 1906 1679 -3223 -1527 4024 229 -4228 -102 1620 -846 662 7 -2828 892 2590 -2989
3391 -2989 -2910 2513 930 -1861 -380 -1049 -550 2299 -900 -5174 489 4129 -1783 -3446 765 536
3407 536 -410 485 -3230 -2482 3130 1333 -3795 -614 1918 -772 -1110 -391 -2216 514 3678 -1686
3423 -1686 -3908 2633 2026 -2918 -1246 896 507 1888 813 -3518 97 4298 -936 -3447 1509
3438 1509 1654 287 1163 -547 -2108 2641 2672 -3212 -1053 3647 1106 -1022 665 60 518 2757
3454 2757 -1108 -2921 2945 3745 -1849 -667 2599 700 -377 1070 -1785 -159 4611 931 -3280
3469 -3280 786 2703 -612 -317 325 -953 2424 3267 -2527 -2197 3432 990 -2501 392 1609 223
3485 223 1279 91 -2301 1234 2655 -2660 -1786 2649 1146 -722 661 -1265 -1268 2673 214 -4175
3501 -4175 -122 3531 -421 -2012 334 -700 -63 1073 -2571 -2285 3084 1373 -3552 -391 1401
3516 1401 -1644 -1106 -17 -1767 172 2777 -2010 -3554 1581 1000 -2553 -922 2 -804 1676 325
3532 325 -4282 -884 3268 -1322 -3056 973 771 -933 740 -845 -2246 1588 1000 -3221 -1047 2791
3548 2791 126 -1447 295 -1086 -271 2295 -1303 -3074 2579 3510 -2160 -1600 1098 -168 -54 552
3564 552 -1654 27 3849 119 -3173 994 1728 -1062 459 1066 -959 1902 2323 -2518 -1616 3536
3580 3536 1297 -1922 928 1523 274 1814 -315 -2591 2062 3218 -2142 -1810 2996 1252 -203
3595 -203 792 -880 -889 2613 652 -3032 1058 3445 -194 -936 374 -441 712 1838 -1888 -1408 3593
3612 3593 1566 -3517 -724 1844 -281 29 -9 -1473 864 2855 -2446 -3345 1481 1428 -1441 -158
3628 -158 -142 -970 1446 243 -4044 -578 3392 -800 -2709 688 847 -167 295 -2419 -2448 2107 1330
3645 1330 -3745 -1170 2635 39 -1642 -607 -2069 -531 2258 -1390 -3497 1684 2587 -1882 -1901 -113
3661 -113 -704 970 583 -2543 -526 3417 -386 -3978 433 2063 -444 124 -165 -1319 1632 1745
3677 1745 -2797 -1928 2835 1506 -1116 -181 138 25 2186 -244 -3733 707 3632 -1394 -1828 1702
3693 1702 1407 103 652 -1771 -954 3111 1135 -2513 819 2692 -362 -710 142 -968 1055 3328
3709 3328 -1265 -2190 2943 2398 -2129 -799 1289 545 1522 902 -2076 764 3238 -1144 -2224 1900
3725 1900 1652 -172 699 -16 -1094 1796 1128 -2759 -841 2793 260 -1641 796 303 292 1425 -1662
3742 -1662 -3147 2097 2424 -2239 -1024 1956 -148 -1014 -260 -1973 -741 2468 -122 -2447 630 1245
3758 1245 -2067 -877 266 -1057 742 915 -2523 -1483 2405 -336 -3225 239 1177 -707 346
3773 346 -641 -2280 600 1585 -2708 -1862 2219 147 -1300 617 -315 -988 1421 -196 -2898 537
3789 537 2448 -1533 -1590 1043 10 -609 202 -1602 -1194 2979 379 -3147 153 2093 -1280 -1628 291
3806 291 -666 985 2102 -1292 -1907 2197 1189 -1981 -124 1364 183 1190 667 -2005 582 3095
3822 3095 -1480 -2357 2138 1980 -435 340 -24 -292 2163 684 -2887 212 3468 205 -1120 1094
3838 1094 407 309 1537 -1029 -2064 3045 3131 -1755 -983 1891 388 -225 -12 -1046 961 3490 -632
3855 -632 -2850 1513 2337 -1311 -874 437 -39 1450 1653 -2704 -1153 3131 549 -2852 -4 1070
3871 1070 217 909 -1125 -2337 1518 2556 -2573 -2400 2022 870 -1054 -217 -1024 -761 1744 -620
3887 -620 -3338 647 2715 -1019 -1731 -135 -790 192 866 -2473 -1543 2988 1197 -3635 -1290 1280
3903 1280 -535 -437 218 -1921 689 2322 -2133 -2690 1508 1115 -1525 113 206 -506 955 514 -2999
3920 -2999 -256 2894 -552 -2573 1024 1096 96 623 -951 -1583 2259 1450 -2704 -259 3042 343
3936 343 -726 838 -611 -389 2314 -122 -1772 2187 2151 -1301 -567 757 159 556 1257 -1051 514
3953 514 3476 -35 -2754 1182 2156 -349 380 577 -425 1480 1593 -2188 -1113 2886 594 -1497
3969 -1497 878 843 61 1691 -49 -2187 1314 2459 -1651 -1291 2035 639 -863 78 -931 -790
3985 -790 1933 199 -2440 1235 2469 -1243 -1472 470 -456 113 1365 -1395 -1470 2521 621 -2894
4001 -2894 -645 1212 -543 365 156 -1637 647 1851 -2149 -2534 1599 823 -1793 -101 311 -731
4017 -731 914 145 -3052 -169 2390 -946 -2195 735 184 -441 692 -1372 -2031 1706 872 -3099
4033 -3099 -696 2404 -394 -1881 -155 -796 -287 1574 -1055 -2277 1802 1331 -2319 -1091 640 -381
4049 -381 672 605 -1993 -398 2684 -487 -3054 804 1686 -282 -33 41 -1382 1409 1353 -2573 -891
4066 -891 2722 639 -1570 1115 899 244 1196 -365 -2126 1565 2959 -1190 -1034 1863 972 210 481
4083 481 -1041 29 3246 807 -2619 875 2767 -497 -740 1037 340 863 2081 -1292 -1485 2905
4099 2905 747 -2182 -62 1884 150 882 -37 -2225 871 2767 -1724 -2312 1942 1361 -992 60
4115 60 -219 -486 1761 294 -3125 -175 2403 -720 -1830 621 109 -306 954 -1567 -2176 2107 1572
4132 1572 -2772 -1128 1550 -771 -945 -539 -1466 387 2479 -1220 -2644 1144 1192 -1904 -1150 355
4148 355 -662 736 667 -2456 -1330 2296 -247 -2863 179 900 -454 392 -783 -1975 1326 1630
4164 1630 -2349 -1516 2531 313 -1068 236 -308 -455 1474 -352 -2296 1198 2779 -1132 -1261 974
4180 974 -445 29 1091 -1433 -759 2598 842 -2476 402 1833 -472 -120 576 -311 1237 2081 -1541
4197 -1541 -1084 2338 1029 -1805 436 1178 -267 1273 797 -1923 536 2449 -906 -1660 1732 966
4213 966 -307 923 -107 -633 1943 1044 -2208 652 2853 -497 -914 1105 -22 -215 1272 -787
4229 -787 -1021 2546 1347 -2093 -612 1155 -754 -354 466 -1107 268 2534 -1060 -2268 1331 1225
4245 1225 -1714 -474 900 -505 739 410 -1764 -385 2205 -530 -2263 1061 739 -1094 310
4260 310 -1042 -1707 1040 1211 -2774 -1206 1630 230 -1612 -67 -959 -631 1344 -627 -2555 1137
4276 1137 2028 -1880 -1470 763 -412 -233 462 -1290 -572 2260 -239 -2880 81 1571 -718 -439
4292 -439 7 -998 1271 1705 -2427 -1766 2566 1084 -1612 -76 552 -157 805 339 -1997 836 2568
4309 2568 -975 -1712 1607 1087 -256 515 -659 -752 2514 978 -2305 176 2902 -159 -1387 221
4325 221 -127 519 1405 -992 -1446 2522 1825 -2091 -581 1074 341 896 881 -1289 435 2698 -681
4342 -681 -2346 1320 1615 -483 214 234 -470 1689 1301 -2241 -100 2706 -16 -1715 678 600 -12
4359 -12 666 -367 -1713 1467 1778 -1867 -812 1625 206 -523 177 -1203 -506 2221 -167 -2349 1134
4376 1134 1834 -1324 -1158 384 -561 70 864 -1499 -1160 1936 -247 -2515 -230 668 -357 -63 -447
4393 -447 -1818 460 1438 -2058 -2207 1623 637 -1407 -137 -395 -490 845 -397 -2614 304 1732 -1287
4410 -1287 -1186 870 -3 -872 373 -661 -870 1757 891 -2003 -107 1769 -518 -751 563 -432 473
4427 473 1788 -1065 -1272 2108 1116 -1771 -239 1230 -136 388 740 -1206 331 2389 -574 -1684
4443 -1684 1359 1428 -543 165 127 -886 1479 1394 -1997 -287 2595 40 -1339 736 387 -218 1026
4460 1026 -597 -1248 1722 1921 -1477 -530 1873 364 -326 303 -710 -86 2339 189 -2461 657
4476 657 1862 -1062 -859 665 -23 657 1375 -1516 -982 2208 179 -2328 503 1224 -234 399 -118
4493 -118 -1555 484 1625 -1498 -1599 1692 674 -1133 -193 -394 -531 1361 -224 -2462 247 1742
4509 1742 -1064 -1420 686 60 -687 520 -968 -1235 1512 560 -2195 -424 1364 -687 -921 320
4525 320 -943 225 1656 -1275 -2209 1408 815 -1830 -550 679 -287 470 200 -1896 -557 1725
4541 1725 -639 -2354 821 780 -558 175 -313 -1285 1002 1074 -1928 -707 1615 101 -1287 425 -117
4558 -117 -14 1188 -870 -1761 1470 1860 -1542 -569 1219 340 224 433 -662 100 2426 489 -1831
4575 -1831 640 2027 -569 -8 423 -235 1250 1493 -911 -916 2214 652 -1557 857 1251 129 823
4592 823 236 -1180 984 1918 -1104 -1040 1575 737 -287 420 -194 -422 1587 460 -2377 -78 2072
4609 2072 -563 -1358 378 -291 80 782 -1117 -1276 1756 642 -2235 -570 797 -359 -399 127 -1439
4626 -1439 -67 1531 -1153 -2141 1127 1072 -1531 -395 22 -631 805 59 -2499 -214 2031 -563
4642 -563 -2055 507 639 -776 335 -494 -1191 837 671 -2118 -758 1447 -226 -971 -161 -631 -85
4659 -85 1063 -524 -1717 1112 1361 -1547 -968 1026 -254 -126 506 -1228 -443 1985 -213 -2038 516
4676 516 1033 -417 -95 285 -645 994 1606 -1395 -1129 1904 743 -1113 184 736 145 881 251 -1124
4694 -1124 968 2136 -1231 -907 1559 432 -338 739 -300 -446 1728 625 -1796 544 2015 -232
4710 -232 -769 716 258 521 970 -1013 -1035 1910 858 -1759 -116 1530 -398 143 312 -1014 382
4727 382 1653 -1178 -1638 1572 991 -781 -108 340 -254 1145 364 -2119 -108 1980 -280 -1581 472
4744 472 402 -261 362 -606 -1111 1322 827 -2132 -470 1455 58 -981 124 -722 -76 1268 -576
4761 -576 -1904 638 1355 -1559 -1115 321 -518 374 63 -1622 -439 1763 -396 -2247 -23 1101
4777 1101 -863 -123 -187 -1138 482 1100 -1710 -1226 1344 53 -1183 -56 -162 -281 826 -360 -1876
4794 -1876 433 2051 -1410 -1196 1177 548 -336 327 -410 -266 1707 331 -1890 285 1891 -435
4810 -435 -420 605 -496 521 1428 -725 -1229 1965 1086 -1231 349 1046 182 315 609 -1184 572
4827 572 2223 -764 -1300 1265 1065 -548 330 -67 -419 1157 819 -1422 -80 1917 197 -1186 96
4844 96 247 116 874 -666 -1008 1505 1584 -1300 -469 1370 208 -563 74 -531 47 1697 -359 -1663
4862 -1663 779 1113 -920 -510 384 -306 581 531 -1795 -406 2043 -123 -2080 332 673 -643 -120
4879 -120 -510 -1388 591 897 -1756 -1456 1138 48 -1014 -18 -274 -818 998 -360 -1676 487 1775
4896 1775 -1169 -1068 711 -156 -306 -93 -1116 -933 1436 -117 -1955 389 1375 -641 -540 -18 -798
4913 -798 294 1264 -905 -1039 1457 636 -1180 -451 460 -233 533 150 -1203 645 1895 -791 -1510
4930 -1510 1533 514 -754 19 114 -323 1211 809 -1329 64 2050 -6 -796 -94 218 329 948
4947 948 -687 -1289 1348 1349 -1632 -164 1356 177 -99 359 -689 48 1696 -428 -1588 1161 1210
4964 1210 -867 -428 72 -240 945 533 -1433 -449 2011 331 -1623 309 820 7 558 -421 -1006
4981 -1006 1148 1249 -1221 -915 1770 351 -696 -56 -75 -163 1129 -58 -1777 593 1476 -830 -813
4998 -813 616 112 -174 157 -1323 -735 1563 184 -1838 -401 1244 -409 -767 -282 -837 101 949
5015 949 -1036 -1227 1427 478 -1467 -121 70 -392 472 -15 -1678 151 1531 -929 -1402 590 321
5032 321 -539 58 -744 -541 1168 229 -1707 -173 1575 26 -533 144 -38 163 973 -860 -1354 925
5050 925 986 -945 -310 786 43 90 361 -1102 263 1615 -310 -1568 961 930 -765 -118 312 -258
5068 -258 662 944 -1386 -327 1891 102 -1164 461 384 196 1076 -138 -1081 1144 1607 -1051 -546
5085 -546 1096 423 -71 511 102 -34 1046 214 -1267 729 1446 -99 -262 571 -2 232 804 -959
5103 -959 -694 1523 308 -1603 177 1359 -377 97 -56 -796 459 1072 -1218 -1297 1041 515 -907
5120 -907 -299 -72 -998 663 -250 -1492 341 1052 -839 -1285 402 127 -557 133 -558 -853 1083 379
5138 379 -1851 -274 1308 -275 -649 -64 -544 22 787 -703 -1355 606 968 -1055 -485 531 -379
5155 -379 69 240 -1205 -335 1289 -432 -1343 647 1063 -471 -273 -62 -347 1008 616 -1227 -414 1584
5173 1584 -199 -1141 -45 380 -42 368 -136 -1086 755 1294 -766 -709 1011 509 -204 278 -289 -143
5191 -143 1349 324 -1141 841 1593 -221 -138 445 197 660 553 -749 -391 1597 529 -1231 97
5208 97 706 39 168 -32 -932 965 1515 -389 -1060 1055 885 -808 58 -67 -490 866 9 -1640
5226 -1640 97 1341 -340 -909 598 81 -96 618 -785 -928 1343 455 -1443 -342 987 421 -251
5243 -251 -10 -776 8 1330 -645 -1222 929 1181 -952 -711 -6 -398 523 432 -1124 -401 1203 -440
5261 -440 -1501 28 723 -394 -64 -366 -1065 696 746 -1575 -817 1148 -4 -880 -110 -264 -395 553
5279 553 -453 -1652 542 1018 -858 -952 252 -23 -297 -33 -782 -418 1186 -153 -1576 570 1131
5296 1131 -407 -466 179 -442 323 596 -822 -555 1552 572 -1192 151 842 -143 568 231 -756 662
5314 662 1500 -532 -881 962 826 -325 569 200 -187 1276 482 -1299 219 1450 -467 -492 672
5331 672 315 89 549 -366 -551 1241 621 -1045 -44 1338 44 -75 -1 -860 210 1332 -407 -1202
5349 -1202 969 1083 -808 -100 289 -150 621 469 -878 -393 1225 -139 -1160 20 314 -519 -178
5366 -178 -136 -1091 829 540 -1341 -876 1071 50 -920 -116 64 -34 924 -590 -1367 772 1019 -866
5384 -866 -750 572 -52 -428 -70 -900 -591 1108 310 -1404 25 660 -551 -480 11 -610 392 953
5402 953 -969 -817 1037 237 -1544 -299 350 -239 360 -43 -1244 277 1151 -560 -1146 707 794 -255
5420 -255 166 -500 -620 1429 173 -1494 -209 1374 -66 -227 330 220 299 572 -606 -582 1395 960
5438 960 -902 62 1304 223 54 3 -833 558 1764 -536 -1048 1068 1142 -802 -22 125 -203 993
5456 993 477 -1119 -141 1730 67 -813 579 469 -111 671 -19 -759 1062 887 -1089 -533 1221 518
5474 518 -707 485 -418 -201 785 -319 -1515 709 967 -579 -644 192 225 339 308 -873 -577 1495
5492 1495 314 -1386 104 821 -524 -279 180 -647 9 643 -1386 -930 1121 702 -1330 -679 27
5509 27 61 575 -113 -1638 343 1354 -814 -1035 436 280 -429 405 -397 -674 825 400 -1374 -66
5527 -66 936 26 -379 110 -106 -61 709 -620 -1106 1369 440 -1041 -145 866 -197 232 315 -895 116
5546 116 1454 -341 -1320 699 801 -156 35 66 -585 555 544 -1197 48 1353 -199 -971 360 -76
5564 -76 -25 436 -421 -630 841 615 -1059 -458 950 45 -265 581 -479 6 1580 139 -965 882
5582 882 1080 -413 -240 372 224 334 627 -636 -435 1233 190 -992 603 846 -417 175 491 -650
5600 -650 723 811 -854 -465 1317 358 -808 16 251 96 646 -258 -1225 544 1228 -762 -967 816
5618 816 137 -161 135 -578 -722 771 -1 -1432 123 624 -705 -773 -108 -307 119 922 -915 -1017 965
5637 965 700 -1412 -493 381 -525 67 -15 -1127 -23 1095 -864 -1365 729 416 -378 -64 -390 -586
5655 -586 697 229 -1113 -378 1628 -56 -788 334 -83 47 490 -473 -1031 982 851 -1219 -321 1346
5673 1346 164 -303 -36 -570 -13 1453 100 -1196 967 901 -530 -272 334 88 803 696 -972 -347
5691 -347 1720 362 -868 192 746 157 444 279 -775 809 1196 -455 -664 1149 539 -575 374
5708 374 53 41 1154 190 -1307 699 1397 -565 -562 499 -57 -146 494 -792 -528 863 556 -990 -99
5727 -99 458 -77 14 289 -584 185 1037 -579 -1003 652 483 -834 -8 95 35 341 15 -1041 -195 1091
5747 1091 -527 -1237 597 128 -259 492 -305 -465 614 611 -976 -432 854 -269 -582 402 -630 -212
5765 -212 604 -460 -1002 512 476 -1068 -617 809 -196 -378 197 -557 -318 1158 -444 -1270 110 581
5783 581 -820 -3 303 -355 194 810 -1163 -618 1266 -3 -648 97 282 -338 314 9 -646 483
5801 483 1074 -814 -349 980 103 -627 46 -55 -60 977 -49 -999 231 1122 -310 -655 454 157
5819 157 425 297 -745 -417 1386 638 -1022 84 706 -128 -227 355 -55 492 925 -651 -693 928 629
5838 629 -407 -126 287 -153 672 -72 -998 250 1094 -365 -960 648 479 -80 -158 65 -594 749 522
5857 522 -1153 -392 994 -78 -504 173 -354 -216 750 -363 -943 678 710 -750 -418 409 -109 -16 -108
5876 -108 -653 59 1163 -577 -1317 402 650 -394 -261 -430 -537 474 655 -1336 -741 739 -264
5893 -264 -1057 -215 49 -301 292 -185 -847 563 946 -1153 -996 788 70 -384 -298 -452 -315 938 -140
5912 -140 -1220 268 962 -402 -294 34 -210 -110 783 -882 -935 1153 703 -905 -424 690 -111 -46
5930 -46 231 -613 380 1193 -667 -823 923 613 -319 97 293 -256 1002 556 -1252 308 1511 281
5948 281 -834 438 635 157 838 -566 -394 1202 703 -852 -167 960 366 -92 193 -353 -29 779
5966 779 -265 -1333 767 999 -514 -82 512 -48 -29 266 -1020 -340 1066 -165 -1151 240 735 -285
5984 -285 -136 -78 -317 710 425 -1096 -678 816 134 -704 74 -232 -428 602 -342 -1356 272 722
6002 722 -887 -904 455 270 -229 435 -552 -662 912 -215 -1186 192 759 -311 -613 24 -253 9
6020 9 694 -726 -905 704 120 -829 -438 154 -166 238 296 -898 22 1280 -527 -1019 971 406 -600
6039 -600 13 345 -407 457 520 -758 -38 1054 -385 -680 602 160 -84 527 -737 -655 1104 890 -1060
6058 -1060 -221 906 282 -265 57 -58 267 642 -255 -705 554 940 -583 -19 429 -89 350 712 -632
6077 -632 147 1196 22 -928 690 839 -48 249 51 -376 684 1215 -1011 -554 1425 705 -568 -91
6095 -91 301 -89 900 -211 -993 453 916 -496 -557 553 313 -178 -82 -461 -324 1404 298 -1049 85
6114 85 799 -593 -477 -99 -352 322 615 -1013 -753 743 85 -1122 -103 86 -328 248 168 -1210 -18
6133 -18 871 -811 -931 622 537 -292 22 -385 -489 588 87 -1284 -390 1274 -362 -781 192 -74 279
6152 279 566 -454 -1210 814 849 -995 -543 226 -19 65 -64 -954 65 1253 -301 -865 556 699
6170 699 -209 -137 56 -232 532 598 -731 -107 1148 76 -848 511 305 108 447 -11 -591 580 1190
6189 1190 -686 -799 1104 469 -132 100 -192 -273 788 87 -901 623 1059 -147 5 474 -164 193
6207 193 590 -403 -299 1085 605 -886 493 987 -117 -53 156 -290 427 787 -398 -815 1050 355
6225 355 -561 -39 205 -228 450 119 -924 -76 781 -377 -979 270 272 -229 55 -211 -557 656 106
6244 106 -1002 -24 888 -262 -692 80 -200 -193 512 -502 -819 778 764 -1059 -533 224 -137 -84 32 -827
6264 -827 -34 913 -633 -1254 215 325 -966 81 117 -143 326 183 -922 -295 736 -80 -615 27
6282 27 124 -59 628 -617 -897 677 581 -964 -452 595 314 -76 10 -379 1 1046 13 -738 733
6301 733 1078 -532 -515 367 73 77 650 -506 -355 1479 53 -968 202 687 229 110 150 -71 659
6320 659 1117 -514 -559 948 323 -566 -92 222 -24 1006 304 -1022 464 1176 -432 -309 224 220 -180
6339 -180 346 -250 -567 894 275 -1076 -131 701 -156 -126 -115 -117 105 793 -672 -520 821 253 -833 -143
6359 -143 74 111 149 88 -619 41 881 -22 -881 378 737 19 152 -208 -405 625 207 -655 -450 1074
6379 1074 89 -752 263 153 -188 313 -322 -479 558 619 -584 -347 450 38 -334 -178 -620 -219 1166
6398 1166 -179 -1095 278 576 -315 -315 -111 -194 327 490 -681 -623 1005 22 -1040 242 392 -464 70
6417 70 -124 -586 519 728 -676 -420 1087 476 -232 131 244 -240 509 16 -665 153 962 -179 -181 281
6437 281 32 409 644 -208 -379 749 468 -709 -68 777 7 -187 473 -177 379 832 -385 -518 803
6456 803 936 -637 -266 661 -60 359 193 -564 101 1117 -101 -607 559 179 -201 243 -217 -128 547
6475 547 464 -655 -284 705 46 -592 -4 353 97 407 -540 -809 301 500 -660 -450 371 279 -147 90
6495 90 -594 -25 688 41 -1287 -66 292 -301 -467 -162 -535 -64 707 -898 -707 714 -18 -868 -169
6514 -169 238 -92 24 -196 -567 336 769 -708 -739 510 370 -546 16 -277 -136 645 -258 -1061 -163 1140
6534 1140 -21 -265 147 -144 452 146 -267 -302 1008 128 -905 -158 543 -49 -281 -52 -389 300 847
6553 847 -466 -593 719 453 -459 -136 544 89 421 80 -488 255 1135 -265 -644 248 731 -35 388
6572 388 -273 -486 634 620 -426 -269 1013 229 -352 53 -111 180 637 19 -716 540 657 -534 -267
6591 -267 446 120 88 34 -389 -147 901 38 -878 110 600 53 -54 -122 -592 469 568 -803 -544 814
6611 814 253 -659 -16 -99 10 197 -133 -589 143 840 -493 -670 544 -133 -251 176 -632 -263 495 149
6631 149 -898 -66 727 -324 -699 174 57 -101 262 -603 -623 728 337 -787 9 565 163 27 200
6650 200 -307 402 997 -550 -948 740 547 -521 -176 18 -65 768 321 -611 -263 767 -60 -499 100
6669 100 234 90 336 -205 -484 755 559 -707 -146 765 195 -73 34 -196 248 970 -191 -655 563
6688 563 792 -168 -630 812 272 382 211 -517 -183 1010 315 -683 482 658 60 56 -20 -209 399 833
6708 833 -614 -471 840 569 -369 283 241 121 547 77 -553 62 666 -444 -318 367 197 -223 347
6727 347 -316 -198 628 -24 -1003 -126 874 -155 -282 68 10 213 544 -500 -487 631 427 -635 -101
6746 -101 112 -192 -209 -231 -726 107 760 -410 -910 397 261 -349 -300 -160 -178 596 312 -978 -202 728
6766 728 129 -684 -358 168 3 100 -65 -693 350 350 -652 -365 240 -199 -296 38 -281 116 452 -353 -938
6787 -938 215 769 -460 -658 238 -50 182 91 -717 -205 1179 474 -900 119 192 -228 222 -61 -446
6806 -446 422 535 -364 -149 778 626 -174 144 -191 4 589 378 -632 86 971 -266 -374 523 319
6825 319 99 162 -317 -155 1261 758 -774 -85 922 55 -3 218 12 356 608 -436 -689 906 314
6844 314 -572 12 62 -108 230 166 -543 133 1108 -619 -808 449 247 -419 -79 -57 -466 557 77 -801
6864 -801 -174 1219 -34 -807 402 175 -76 450 -324 -974 605 513 -427 -148 572 227 -89 -254 -525
6883 -525 -112 555 -80 -844 145 558 -583 -404 126 -359 234 156 -890 -362 704 17 -640 -92 71
6902 71 -196 133 -172 -599 465 754 -542 -319 483 91 -329 176 -209 -297 370 -125 -955 242 1187 -713
6922 -713 -469 367 50 96 340 -410 -157 724 493 -601 182 627 -151 112 237 -214 338 721 -602 -680
6942 -680 1055 364 -483 -45 3 116 524 38 -534 45 951 -287 -488 502 260 -235 -65 -251 -272 740
6962 740 279 -725 -282 799 107 -351 162 65 -48 463 -1 -870 499 590 -590 -107 225 -137 344
6981 344 -226 -510 -37 760 -257 -794 295 475 -415 -179 26 -186 345 309 -803 -215 600 37 -866
7000 -866 -41 305 -86 146 1 -626 424 642 -895 -615 469 222 -339 -221 -316 -80 469 110 -759
7019 -759 65 614 -442 -477 183 255 -112 412 -714 -362 887 215 -723 236 763 -114 -284 -110 -544 269
7039 269 894 -500 -742 702 499 -380 -113 -225 13 643 300 -633 201 744 -107 -573 339 189 -410
7058 -410 195 -23 -296 703 603 -902 -173 949 159 -186 84 -298 89 547 -122 -652 413 818 -388
7077 -388 -256 326 -293 181 339 -573 39 678 -144 -1009 426 277 -505 -8 63 -465 214 753 -473 354
7097 354 348 165 -631 128 249 197 596 -147 -636 594 539 -741 -451 213 -121 -128 53 -298 -289 783 -195 -783
7119 -783 263 321 -621 -254 39 -10 -116 30 -668 -532 960 -26 -831 -417 322 248 293 25 -747 -205 772
7140 772 -389 -805 571 372 -638 -55 76 -131 230 11 -779 387 822 -386 -456 438 8 -71 223
7159 223 -274 -420 578 451 -592 -25 702 137 -62 66 -261 106 636 -363 -703 772 448 -16 -394
7178 -394 398 -24 74 268 -466 34 836 338 -723 375 709 -193 146 -278 -456 397 870 -946 -324
7197 -324 821 269 -204 141 29 110 386 -92 -519 335 1096 35 -156 341 254 108 502 -293 -41 724
7217 724 -10 -595 156 295 112 -470 -86 -106 245 464 -382 -423 799 168 -532 -79 562 35 312 -118
7237 -118 -555 122 667 -472 -813 473 -78 -296 -405 -277 -220 508 -89 -918 -144 546 -290 -360 176 112
7257 112 -349 204 -417 -479 403 215 -522 -134 402 -104 -140 231 -390 -168 779 -483 -823 390 478 -600
7277 -600 -35 -118 168 27 187 -527 -164 728 -130 -738 92 211 -179 32 -152 -447 510 408 -454 -188
7297 -188 696 58 51 146 -81 65 341 68 -600 -39 952 -140 -399 384 230 0 219 58 -413 684
7317 684 301 -803 312 744 85 36 26 -354 184 703 -459 -122 693 568 -513 -14 242 229 377 -68
7337 -68 -528 255 660 -161 -641 307 302 -163 439 -278 -442 393 -1 -826 -56 916 -116 -567 569 94
7357 94 -41 80 -80 -570 628 507 -752 -281 360 -51 -121 -214 -556 -240 499 -43 -681 -68 342 -469
7377 -469 -189 -151 -336 -132 -80 -741 -440 405 -23 -670 -249 111 -9 -16 -235 -357 227 141 -566 -299 473 -259
7399 -259 -238 174 -21 -29 489 -447 -641 37 523 -521 -203 27 -309 124 301 -322 -302 466 -38 -587 36
7420 36 306 -319 -153 302 -377 279 403 -110 -495 758 617 -485 -28 412 12 189 192 -651 218 875
7440 875 22 -336 274 475 113 209 -338 -11 693 303 -456 -311 452 -59 88 391 -45 -52 346 -237 -505
7461 -505 509 391 -390 -462 120 -84 106 -205 -562 218 578 -210 -730 256 553 -75 42 -190 -519 445
7481 445 448 -674 -541 423 150 -501 158 25 -167 255 -387 -445 606 484 -541 -596 84 14 -367 -181 -326
7502 -326 139 656 -66 -811 263 764 -189 -183 177 -83 107 307 -351 -544 619 -95 -753 -44 282 -231
7522 -231 212 -38 -552 5 326 -273 -817 553 264 -109 94 -110 -420 644 60 -566 -75 633 -108
7541 -108 -342 116 191 0 322 -28 -395 409 417 -280 21 654 -135 -24 242 -391 208 533 -335 -460 542
7562 542 335 -429 -84 285 -59 353 68 -690 -57 653 149 -528 191 370 -221 -57 -283 -231 294 308 -613
7583 -613 -208 576 458 -323 222 82 65 122 -87 -580 446 627 -667 -157 364 -14 -109 -107 -177 -126 511 3
7605 3 -968 -25 466 -173 -86 115 57 -139 525 -417 -491 626 165 -559 -8 380 -207 -86 -38 -408 -119 134
7627 134 -594 -361 420 -36 -440 -9 157 -205 312 -38 -582 145 645 -335 -615 216 -49 126 -33 -398
7647 -398 -375 447 228 -426 -193 267 -66 -89 276 -236 -31 521 -141 -562 240 270 -351 -191 46 -107 172
7668 172 -74 -466 -16 594 -269 -507 250 370 198 170 -281 -337 779 502 -547 -378 754 91 -68 146
7688 146 -24 -187 508 38 -441 181 760 -273 -115 337 211 162 151 -259 158 757 156 -388 311 551
7708 551 172 -87 202 -292 272 417 -708 -257 707 376 -385 -218 123 63 231 -109 -405 261 686 -163
7728 -163 -714 350 -77 -116 308 -345 7 317 -201 -795 -291 768 -131 -577 294 -87 -61 32 -428 -395 337
7749 337 423 -457 -68 93 -154 5 -45 -228 -28 393 -367 -589 196 273 -346 -303 -28 170 426 48 -542
7770 -542 -36 794 -168 -595 -105 101 -23 214 48 -591 384 446 -559 -472 341 61 -41 24 -293 -46 248
7791 248 -109 -832 172 328 -279 -214 364 -125 -173 216 -189 -193 233 48 -620 141 442 -86 103 -109 -222
7812 -222 272 562 -398 -442 689 39 -220 -38 303 -401 274 146 -273 355 634 -380 -322 642 114 7
7832 7 135 -183 -167 722 67 -782 18 583 -169 15 357 -423 104 367 -383 -316 594 256 -529 -312 225
7853 225 -134 -30 29 -364 -37 415 -523 -583 315 467 -431 -188 68 -373 168 6 -810 -116 583 -272 -598
7874 -598 113 12 219 74 -213 -538 153 217 -553 -90 438 188 -199 78 -254 -25 332 -71 -226 223
7894 223 485 -191 -180 155 -165 331 -111 -192 -181 605 -95 -822 338 275 233 -174 -35 -372 184 665 10
7915 10 -477 222 147 -243 -107 225 163 371 71 -600 342 705 -356 -475 354 114 -132 36 -403 155 578
7936 578 137 -367 -240 584 123 -276 -31 83 205 398 113 -198 584 584 -260 -92 126 -23 222 334 -370
7957 -370 165 593 -168 -388 72 302 -97 -143 -114 -354 331 363 -485 -230 461 83 -205 69 -4 94 402 -336
7979 -336 -567 328 179 -462 -219 298 164 -225 -87 -443 -80 388 -211 -488 243 428 -239 -339 -173 -366
7999 -366 47 293 -729 -167 430 -196 -526 -231 223 -51 -237 -290 -346 212 207 -565 -559 141 117 -101 185 161
8021 161 132 312 -233 -522 93 244 -296 -328 228 -53 -12 -219 -122 44 191 -100 -371 297 285 -171 -69 90
8043 90 -181 257 322 -220 -254 438 411 -281 -247 48 142 389 -41 -343 280 612 -277 -633 150 -60 142 -7
8065 -7 203 111 338 319 -502 -106 459 8 -200 36 128 -114 227 -235 -527 334 328 -108 -464 408 87 -58
8087 -58 -107 -248 -76 634 31 -716 20 508 -143 -66 -88 -65 136 216 -382 -428 288 146 -461 -156 190 -118
8109 -118 338 -114 -427 133 259 -324 -323 143 353 -111 -327 -370 -336 185 152 -463 -146 481 -225 -292 133 -318
8131 -318 41 190 -230 -349 352 155 -477 13 -113 -211 91 -58 -280 209 283 -193 -639 129 426 -396 -25
8152 -25 11 103 -85 240 -292 -52 754 -92 -467 260 27 75 66 -129 -386 501 19 -751 -68 361 155 -138
8174 -138 75 -367 339 183 16 -287 522 260 -284 -299 202 -58 108 345 -229 -10 276
8191B76
$$ Imaginary data points
##PAGE= N=2
##DATA TABLE= (X++(I..I)), XYDATA
0 0 0 0 0 0 0 0 8 -8 8 -8 16 -16 24 -24 32 -40 48 -56 65 -77 90 -105 122 -139 162 -185 211 -239 271 -305
30 -305 345 -387 435 -485 543 -605 674 -747 827 -917 1015 -1126 1245 -1380 1528 -1695 1884
47 1884 -2098 2346 -2633 2972 -3378 3880 -4510 5337 -6471 8129 -10799 15813 -28556 131284
61 131284 214177 9683 52496 71727 58982 44970 41649 33089 130797 144664 35273 4044
73 4044 74751 54657 31925 50710 31010 30253 87003 27580 -58929 8019 66808 -17050 -42673
86 -42673 20437 36918 31553 14200 -54822 -44507 39013 -215 -83493 -25606 37207 9080
98 9080 1498 -14800 -69360 -30969 31525 -24083 -50571 31105 41630 -16704 -24082 -31627 -39224
111 -39224 10139 11802 -31118 27127 76426 -12117 -55178 8013 10096 -14721 16332 11607 -2130
124 -2130 51804 44311 -38673 -25337 31971 15178 10185 27014 0 17481 63995 5335 -46341
137 -46341 21052 41023 -14319 11920 54582 20913 13864 25755 -13211 -8967 33154 1826
149 1826 -6857 61479 55936 -6271 1212 3510 -23739 18671 45708 -7639 7006 68857 23951
162 23951 -35817 -9646 3358 -234 30973 18317 -9577 32280 33012 -38090 -25495 27536 -4615
175 -4615 -18828 24690 11981 -8757 20923 -3057 -46131 -1648 23857 -22763 -17314 18497
187 18497 5581 6661 8090 -43721 -37071 29949 5028 -39042 17618 45638 -8203 -19632 -9779
200 -9779 -29237 -2696 28503 -5365 83 50799 17799 -33142 -9356 2622 -2546 35596 29563
213 29563 -13649 26993 59424 -12638 -39931 21657 34388 15871 26126 13475 10401 47351
225 47351 19752 -36102 5419 48667 7570 465 31259 13408 10930 30667 -14798 -38581
237 -38581 25534 35696 -16672 -2806 28168 8126 -2376 -14801 -44180 -8210 38692 -7367
249 -7367 -31382 25354 21467 -36381 -31529 -15343 -20628 11851 19395 -25889 -11871 29343 -12905
262 -12905 -50906 -17251 2417 7300 23566 -9478 -34016 22082 32119 -42664 -41109 23019
274 23019 20582 326 7612 -6545 -1392 29929 -3277 -42685 3701 32791 -256 3998 20704
287 20704 -267 5673 13308 -32429 -25366 44092 32198 -18642 6869 30661 1616 -9548 -15578
300 -15578 -19555 29794 53771 -5878 -19647 30222 16774 -19741 -1775 4934 5224 42855 32523
313 32523 -21138 -1326 36867 650 -17167 15206 20476 19786 29532 -614 -7920 38684 22278
326 22278 -34313 -2774 46055 20794 4340 15460 2156 9854 30098 -10603 -33254 22016
338 22016 43026 9399 6764 6438 -9310 10003 11545 -29589 -8465 46588 18235 -19464 7332
351 7332 7665 -22405 -11126 -745 -4730 21855 19447 -28047 -18033 18684 -10247 -33434 -5730
364 -5730 -892 594 22289 -9092 -49005 -6930 22351 -22328 -33692 -1505 1471 3279 6719
377 6719 -26017 -27942 10326 -7455 -37469 1503 21147 -9929 -2754 11615 -15514 -13768 5425
390 5425 -17727 -12747 36231 25950 -12528 -1474 7420 -3473 10167 6112 -13307 24495 53194
403 53194 2932 -19013 17776 14340 -3527 18295 19095 5909 27471 24177 -8992 6627 25524
416 25524 -3573 -2879 27187 17010 8356 21356 -1791 -13367 25470 18470 -28059 -5391 36487
429 36487 19324 2083 1658 -13702 -2017 19216 -10322 -21608 24363 28578 -6147 358 3350
442 3350 -20622 -3538 15194 -7733 2368 33053 3758 -24163 3741 9042 -10830 -629
454 -629 4178 3147 28582 17273 -33123 -15599 31270 7434 -18121 5306 10928 7684 20984
467 20984 -2361 -28780 6852 26346 -8451 -9691 16242 9971 8707 11801 -16158 -12604 24876
480 24876 3445 -26972 14292 38944 2451 -10658 -586 -5008 7403 14902 -14465 -5082 40356
493 40356 22557 -18611 -8481 2137 -278 18925 12305 -15643 12750 39526 -5173 -27849
505 -27849 8525 16187 1639 7472 2546 1706 23739 6206 -29958 -1396 29302 -2823 -14649
518 -14649 9899 7182 5304 13212 -16657 -30600 13994 19992 -20042 -13035 14471 7846 966
531 966 -9742 -32653 -9511 25966 -5376 -28087 12235 19589 -15656 -15921 -8357 -14828 6819
544 6819 15767 -14230 -6860 24227 1356 -22196 -2332 4119 3193 19555 5279 -14290 19506
557 19506 29672 -15277 -14326 25980 19308 3486 14360 9429 10827 28972 7625 -16307 15750
570 15750 32417 3699 5394 23160 11467 13640 19487 -11847 -13130 29787 22620 -11483 5177
583 5177 21635 3094 -2820 -6432 -17165 6888 23989 -8841 -14645 17004 2444 -25693 -9672
596 -9672 -2666 -11144 6668 5535 -21841 -7674 13419 -15806 -26549 -21 1784 -4199 3579
609 3579 -12015 -17140 13514 4991 -32267 -10976 19060 -2650 -10542 6174 -2753 -5492 7551
622 7551 -11002 -21046 10961 11868 -14030 -889 11570 -6997 -6222 -3074 -21646 -4240 26137
635 26137 -3077 -26456 5807 12887 -15600 -15967 -9664 -9536 12342 11090 -22568 -14359 13794 -6707
649 -6707 -20823 617 -467 -7569 10426 2183 -18592 3597 12501 -18131 -12246 17875 7879
662 7879 -4175 4593 -144 4701 19510 -6499 -25140 15945 33079 -1571 -6203 11730 5520
675 5520 7367 11737 -12135 -8563 28492 20260 -8539 3049 9697 -3571 3310 3263 -10077 11538
689 11538 25008 -10497 -16071 17637 7057 -19797 -5509 6726 3027 11154 -2442 -24280 874
702 874 20143 -10927 -21191 3298 3692 1928 9620 -12153 -20037 13581 12080 -22637 -10114 15595
716 15595 1788 -4141 4196 -5170 -1881 9147 -11782 -14317 20868 16237 -15950 -3851 11958
729 11958 -2145 -958 463 -15532 3327 30562 1712 -25570 -1135 10846 -864 125 -6916
742 -6916 -10616 16759 16153 -22387 -16528 13367 -958 -14880 2574 1392 -6625 5360 -3072 -17849
756 -17849 2942 7779 -19130 -11746 11827 1578 -5510 -1461 -14267 -6571 18613 -3336 -29456
769 -29456 2481 23619 -1280 -9749 -1982 -6456 4628 11275 -11557 -8881 20555 9460 -12800
782 -12800 2273 5940 -6270 5635 7511 -8239 8332 20967 -10008 -17223 14103 11557 -6741
795 -6741 -1078 138 2876 18706 2358 -24990 -741 22403 -2976 -12777 5742 1962 1131 11443
809 11443 -5661 -16274 9540 11075 -13014 -2598 12779 544 -700 3887 -8251 735 15675
822 15675 -7195 -13973 20051 18947 -12219 -6569 8045 3062 8527 7541 -10317 2977 24523
835 24523 2497 -15021 4378 8716 1886 10277 1686 -9950 12900 17092 -14857 -10735 15694
848 15694 4724 -8712 2526 1471 -1085 8635 -5408 -17736 7152 11747 -15758 -10437 8297
861 8297 -1785 -4847 1602 -13925 -12462 12106 -121 -22374 -2007 10742 -6906 -8965 -5709
874 -5709 -11189 2172 7912 -16792 -13255 15232 1528 -20877 -4109 5060 -5420 1543 -53
887 -53 -13773 2843 14133 -11112 -16255 7312 5779 -3656 1673 -5105 -5159 15437 5314 -20592
901 -20592 -1069 19961 -1258 -10198 5779 3944 2317 8263 -5976 -9351 15230 10528 -11889
914 -11889 532 13100 704 1090 5065 -8249 1855 20030 -1470 -14553 10779 14156 -5931
927 -5931 -2937 3616 371 9665 6609 -12437 651 19514 -2592 -14703 7190 9076 -1829
940 -1829 4763 -278 -9334 10799 14495 -13174 -9908 13652 6786 -2670 1521 -4628 963 16632
954 16632 -778 -17349 7295 16571 -6887 -4764 9720 834 -811 6440 -5582 -4160 14405
967 14405 2093 -13940 4375 11241 -4009 -2417 -186 -7523 7026 13046 -14844 -15727 14113
980 14113 7611 -13675 -5957 641 -2641 5120 -1513 -16554 -453 11290 -10071 -12430 5775
993 5775 -1254 -8263 1885 -4847 -10022 7776 2265 -19184 -4015 14162 -2897 -11299 -1565 -1974
1007 -1974 3072 7854 -11994 -14922 13158 10916 -13890 -5716 6640 -1970 1639 4922 -9883 -4224
1021 -4224 13381 -1098 -12323 5043 5877 -7122 94 1725 -5052 5741 3883 -16049 -2741
1034 -2741 17960 -2740 -17765 955 6375 -1236 1491 -6645 -12202 8960 12177 -13143 -10858
1047 -10858 7423 887 -1830 3160 -8113 -6176 13979 3013 -15179 2855 12273 -6359 -4884
1060 -4884 7850 1751 1960 5997 -5599 -494 17152 1947 -14148 5867 14632 654 2053
1073 2053 2789 -6258 7214 17065 -6119 -11088 11456 10085 -3584 574 -426 -2993 9143 2978
1087 2978 -13264 2238 12956 -8757 -11033 8033 1274 -9170 -953 -4392 -6902 7751 338
1100 338 -19800 -6109 9033 -4805 -10047 -4705 -8901 644 10406 -12058 -21093 5681 8062 -13338
1114 -13338 -7915 2444 -3980 -107 2326 -10961 -4487 8943 -5731 -11355 7893 5260 -8823
1127 -8823 -868 559 -6504 5834 6112 -14600 -5199 16662 2173 -13559 -2011 1812 958 5819
1141 5819 -6295 -14112 7978 11550 -12223 -9676 6408 -2171 -5112 3452 -5898 -6253 9687 -287
1155 -287 -15391 451 7709 -6995 -5686 2444 -1301 4201 5882 -12398 -7236 16183 4534 -13474
1169 -13474 2317 11542 1178 3057 1944 -6887 5730 15547 -2942 -5268 12500 7879 -1768
1182 -1768 5715 2089 -1622 12351 7370 -10133 5194 18307 -2512 -8881 7549 5950 625
1195 625 4098 -4105 -3314 14120 5646 -15665 -3128 9933 -2227 -3188 2876 -5809 -152 11715
1209 11715 -6510 -16716 4990 8473 -7620 -3215 3101 -1683 2931 1212 -13094 -1696 14763
1222 14763 -2699 -11754 7586 7320 -5411 572 298 -6211 7361 9948 -9121 -3930 12839 2457
1236 2457 -6695 1569 -554 -165 10088 -1866 -12054 8572 12759 -11393 -9888 6589 614 -3556
1250 -3556 1301 -6204 -3924 9924 -3133 -17734 -1545 6379 -6132 -3142 289 -8827 -782 5446
1264 5446 -13947 -13734 9279 3869 -12170 -1739 3035 -4915 -1303 -3318 -10936 4042 11531 -9274
1278 -9274 -8787 10137 3082 -7192 1673 -520 -3576 10956 6805 -10948 665 14430 -451
1291 -451 -5750 3707 685 3242 10719 -1583 -5295 13581 7076 -12735 -131 12229 196 -567
1305 -567 6444 -1327 1345 9405 -5649 -11457 9435 10428 -4309 -294 1658 -3776 5800 4499 -13470
1320 -13470 -3378 16225 2245 -10184 3579 4244 -4469 2091 -82 -5391 6434 7608 -8550
1333 -8550 -1199 11406 -2498 -7903 3885 766 -741 9433 -20 -10716 7818 11970 -9958
1346 -9958 -9437 5452 3685 3473 3895 -8508 -4057 11938 -1617 -15657 2280 8632 -4477 -664
1360 -664 2126 -8663 -3145 3954 -9610 -7897 9762 1160 -11551 -2017 17 -5852 -489 -4958
1374 -4958 -12487 5045 12473 -12055 -14928 5290 2344 -7266 -2663 -5081 -5242 8856 4094 -12506
1388 -12506 -2221 7335 -5853 -6130 3225 -2465 468 9335 -4000 -8657 8995 3973 -14164 -1879
1402 -1879 12617 3348 -756 -381 -5904 3308 10556 -7669 -11632 11383 11657 -3361 -1056 -1322 -5636
1417 -5636 6890 7922 -9927 -2768 14760 3324 -7782 1876 1234 -1998 4518 -718 -5122 10606
1431 10606 9245 -10727 -2859 12406 -605 -7714 2293 1418 3207 12370 -870 -12237 4598
1444 4598 11011 -4638 -4184 4399 2063 7503 7675 -10371 -7177 12642 3455 -10287 3981 9899
1458 9899 -1703 -79 981 -6398 1818 7035 -6466 -3684 12098 2731 -9041 -438 -738 -3640
1472 -3640 6277 994 -12487 2320 13534 -5102 -11748 1248 -159 -3321 1565 -5335 -5546 8522
1486 8522 3080 -12832 -2836 4055 -8138 -5299 5083 -2758 -2602 5266 -6430 -11960 3997 2274
1500 2274 -10551 -1882 6372 -680 -604 -2775 -12797 -1492 11110 -4803 -9952 7266 5687 -7201
1514 -7201 -1955 -1014 -6286 3895 6494 -6854 -1281 9273 -1979 -6766 3026 -1002 -3642 5586
1528 5586 -107 -6261 8613 8618 -11184 -5858 8316 -76 -4713 3093 -86 991 8059 -3456 -11400
1543 -11400 3365 5765 -6448 -48 7028 -1246 326 3814 -9033 -6100 10225 2225 -8662
1556 -8662 4164 8287 -2700 -2084 -1536 -4952 6528 9068 -7171 -3243 13052 3489 -8089 1432
1570 1432 2503 -925 7260 4188 -6087 5269 12151 -3786 -6502 5109 2964 966 5745 -1317
1584 -1317 -653 12414 2504 -14084 -808 10781 -783 -2628 4690 507 1248 4288 -8561 -9927
1598 -9927 7556 5439 -6920 -215 3327 -4170 -1154 -1725 -11729 -804 11867 -4307 -11865 4054
1612 4054 4195 -7192 -5226 -4163 -3921 6619 2790 -12394 -3055 9940 -2973 -9677 -658 -1792
1626 -1792 -1728 7147 -1060 -9035 5424 7873 -9254 -7428 4197 1220 1041 4239 -2850 -555 7710
1641 7710 -5213 -12794 4989 9824 -3593 -1581 3964 -1877 525 1771 -9821 -4602 12070 4904
1655 4904 -7313 -710 1867 -2410 1841 -2198 -8892 5179 12213 -5309 -6547 7369 2476 -5934
1669 -5934 662 655 -515 7666 3002 -6544 4562 9398 -4735 -5434 5255 3306 4259 8735 -2117
1684 -2117 -4263 10655 6043 -10098 -1658 10161 4923 3994 3998 -3850 613 7832 -3441 -5591 9303
1699 9303 7101 -3596 2717 3571 -5016 -114 2405 -6233 845 10879 -1656 -8845 2621 2472
1713 2472 -3410 -1533 -4646 -5367 8298 5985 -11213 -5409 7059 -1707 -7292 -304 -2445 -1716 7391
1728 7391 544 -8683 751 2636 -7857 -2710 5154 -506 1033 4151 -5478 -4389 5791 -3094
1742 -3094 -10589 5225 10124 -2246 -3417 -1021 -5072 591 3079 -7681 -3830 9413 1740 -7398
1756 -7398 -635 -1657 -6586 1723 689 -8231 376 6507 -6141 -6678 3578 -2062 -7597 -1022 -1775
1771 -1775 -1636 5347 -1112 -10656 1130 6144 -7821 -7064 4268 1983 1335 4943 -4572 -7130 5265
1786 5265 2905 -6768 1401 8031 1666 2275 2608 -5313 -500 7257 -2331 -2729 11637 6907 -6304
1801 -6304 -418 4725 -944 1402 2169 -3692 4775 11284 -2625 -7575 3495 3815 -1880 1715 -1806
1816 -1806 -3551 8967 6801 -9281 -4723 6967 -605 -5270 1182 1243 1600 5415 -3338 -8307 4192
1831 4192 4232 -8205 -1606 8401 2177 -532 507 -7328 -2749 8929 -52 -8143 4645 9628
1845 9628 -671 -3459 -3350 -3916 5067 6226 -6840 -3150 10824 2559 -8536 -992 1623 -2134
1859 -2134 2088 -522 -6177 4089 7691 -6540 -8497 2679 650 -3561 -773 -3921 -1432 8841
1873 8841 -779 -14890 -3343 7080 -2945 -6033 527 -212 1096 1674 -9293 -9833 5323 3731
1887 3731 -6118 -409 4328 -1891 -897 -1965 -9110 -292 10320 -1211 -7331 4983 5611 -3642 -2951
1902 -2951 -1763 -1775 6457 4139 -6505 534 10135 -399 -6160 1590 1121 -786 5334 681 -4659
1917 -4659 6301 7402 -6350 -4727 4567 1614 1011 3695 -1188 1193 8121 -2298 -10103 3378
1931 3378 7869 -1724 959 5040 -1133 270 2859 -5844 -3533 8589 3768 -2918 3739 3183 -3054
1946 -3054 1192 911 -4552 4137 8674 -3402 -2773 8088 2292 -5765 669 1650 -423 4924 2246
1961 2246 -4233 3800 6768 -5102 -4649 3333 -790 -1158 5366 36 -4224 4086 154 -9293 -1216
1976 -1216 5707 -1572 -1890 2732 -1849 -2150 -245 -7522 -5103 7714 2767 -7504 -267 3163 -4515
1991 -4515 -2996 -1434 -6323 -201 6845 -2503 -6834 2260 542 -5815 -1251 -1478 -3198 3725 2380
2006 2380 -7180 -24 7359 -5068 -9158 2158 2669 -1575 1523 -1359 -2632 5802 1673 -10462
2020 -10462 -3725 7042 2263 412 1837 -3307 -829 5869 -3875 -9315 4954 9031 -1790 -1650
2034 -1650 2233 -1685 -340 559 -4871 1467 10120 776 -6629 3211 4420 -3312 -780 509 -1671
2049 -1671 6328 7343 -6467 -5162 7568 3768 -4424 -1846 -71 2449 7996 548 -6905 3467
2063 3467 7799 -4680 -4885 4802 3308 1469 4424 -1374 -2510 5210 481 -7246 2569 9430 1479
2078 1479 -604 592 -2648 2595 4973 -6315 -5211 10444 7882 -5615 -3292 1054 -246 2989
2092 2989 702 -5799 1665 8500 -1763 -5973 1811 679 -3108 1005 -1125 -3550 5097 3325 -8052
2107 -8052 -3192 5510 -2463 -7192 -292 1475 1603 2975 -5587 -8113 3637 3141 -8366 -4376 4680
2122 4680 1004 412 213 -7462 -4896 5192 -460 -6870 2602 5108 -2062 -1762 -1436 -4146 1586 3182
2138 3182 -5217 -896 8623 522 -7882 267 2605 -1555 891 -428 -3892 4196 6495 -4639 -5134
2153 -5134 3361 807 -1845 1446 -1936 -1073 6992 1738 -7969 -513 4608 -3475 -2497 4482 1787
2168 1787 543 2186 -3660 -3881 4641 992 -5432 3423 7193 -442 -788 108 -4039 1547 7561 -1769
2184 -1769 -3587 6997 5276 -3024 -733 945 -297 4349 2941 -3673 2675 7753 -2068 -4109 4219
2199 4219 1889 -1994 2672 1603 -1315 4796 3103 -6404 -2045 5069 -1042 -2535 2180 295 867
2214 867 3503 -4417 -7933 3079 3734 -5907 -1450 4769 -599 -2487 -924 -5187 -2273 4436 -1706
2229 -1706 -5326 3146 2752 -5012 -2388 -1005 -3766 1693 2969 -6010 -2829 6588 -86 -7388 -918
2244 -918 1781 -1158 975 -1435 -4078 3802 3679 -6589 -4303 4403 -163 -3270 1481 -398 -1011
2259 -1011 3545 -1954 -8883 173 4881 -2536 -2753 2157 255 -196 -461 -7386 -4450 6528 1741
2274 1741 -6534 489 4452 -2769 -2865 -913 -3216 1700 4974 -3241 -4008 5391 2234 -4603 -1073 740
2290 740 344 4443 1063 -5720 2829 8979 -1610 -5841 3061 4061 1479 2685 -350 -635 6613
2305 6613 3530 -6085 -735 6774 1807 451 3407 20 1028 4104 -3063 -5889 5805 6976 -2937
2320 -2937 -1621 3468 907 292 -1290 -5470 1272 8917 -340 -6559 1812 3844 -2284 -1105 -1014 -3349
2336 -3349 3866 4985 -5092 -3838 4937 1065 -4148 -359 295 217 4116 -715 -5085 3380 5390
2351 5390 -5811 -4843 4095 2459 -243 1069 -1987 -1295 4832 -680 -7547 198 5736 171 -928
2366 -928 -180 -3544 -26 3276 -4793 -4972 5362 3044 -5242 -1378 955 -2851 -1562 -903 -3974 1102
2382 1102 4303 -4330 -5231 3451 1021 -4577 -689 -796 -1972 3920 1789 -6537 -1613 5350 -1060
2397 -1060 -4320 500 867 871 3986 -1038 -4066 3715 2171 -4965 479 6090 171 -330 2962 -883
2413 -883 -847 3303 -1355 -2718 6084 5473 -2386 -766 1884 -296 2216 2092 -3732 513 8024 779
2429 779 -5275 1690 3149 -1500 769 1171 -1448 3036 3540 -3500 -1159 5096 -533 -3656 2024 1552
2445 1552 183 3607 -264 -4759 3190 5218 -4778 -3681 4437 3260 610 1017 -3072 -1087 5083
2460 5083 -14 -5721 2384 5774 -1406 -1131 1100 -2401 140 3338 -2615 -2612 5716 1880 -5171 -1123
2476 -1123 2145 -1065 -68 -1273 -4002 2564 5282 -5414 -6630 3781 1805 -3653 -1924 -1366 -1392
2491 -1392 3456 481 -7409 -2225 4206 -2218 -4441 862 -455 -276 1916 -3954 -5897 3168 2194
2506 2194 -6413 -1952 5286 362 -2720 -1178 -3222 33 4183 -2439 -5040 4160 4214 -3456 -1984
2521 -1984 162 -1364 2793 2656 -4481 -1358 6716 319 -5381 466 2509 -216 897 -758 -2366
2536 -2366 4410 4084 -5178 -2603 5247 932 -2930 1377 1232 383 4495 -180 -6060 1866 5595 -1707
2552 -1707 -2087 2997 1553 1451 1956 -4003 -2223 6536 1940 -5052 1749 5436 -608 -1148 737 -1460
2568 -1460 1928 4615 -2295 -2467 5342 2390 -4176 -217 1597 -142 3350 1430 -4464 1649 6773
2583 6773 -2322 -5015 2726 2288 -1064 796 -758 -1361 3993 1191 -6334 -627 4738 -1416 -2495
2598 -2495 1748 -392 -581 2380 -3296 -5803 3084 3204 -4720 -2177 2303 -655 -742 -828 -4637 -694
2614 -694 4985 -2232 -5662 2264 2258 -4227 -1726 413 -2313 850 1595 -4918 -2053 4391 -1191 -5571
2630 -5571 -253 869 -1125 1294 -1506 -4269 3129 3849 -5535 -4102 3735 916 -2162 731 -802
2645 -802 -1371 3085 -1197 -5375 1760 4208 -2711 -1007 2814 -525 -141 1888 -3427 -1867 6199 1613
2661 1613 -5413 353 4208 -656 -941 -213 -2102 2874 4614 -3645 -3061 4961 2252 -3515 718 1508
2677 1508 -834 3010 2001 -3694 1070 5294 -1769 -3109 2948 2075 -220 1733 -670 -886 5374
2692 5374 1494 -6200 287 6827 528 -1798 1692 196 893 3466 -2192 -4155 4423 4004 -2971
2707 -2971 -642 2190 -1105 601 1372 -3495 -161 5573 -1588 -5740 2543 3037 -3040 -1687 284
2722 284 -1027 2058 599 -5969 -1605 4941 -1187 -5459 9 327 -843 2142 -2030 -5364 1960
2737 1960 3599 -4737 -3714 2805 351 -1624 382 -2263 -1146 3311 -1729 -5697 2450 4419 -3517
2752 -3517 -2730 1850 -486 175 1308 -4148 -2212 5508 1272 -5659 -810 2256 -164 409 -418 -3923
2768 -3923 2076 4950 -3662 -4283 3955 1447 -3426 566 517 -939 2178 382 -4560 1262 4749 -2547
2784 -2547 -3278 2826 1598 186 1828 -2141 -2475 5166 3227 -5596 -659 5670 1198 -952 439
2799 439 -1005 1640 4797 -1441 -3143 4679 3798 -2331 -133 3017 -224 1930 2549 -2641 650 6310
2815 6310 -469 -4125 2910 3946 -662 520 -148 -1261 4396 3044 -5576 -1714 5423 327 -3172
2830 -3172 858 382 -631 2598 -611 -4417 2044 3569 -3872 -2056 2720 -91 -943 670 -2919
2845 -2919 -1215 4504 -536 -5905 1645 4473 -2598 -2756 635 -764 1179 2028 -4165 -2856 4362
2860 4362 1046 -4676 -154 1181 -1419 792 104 -4231 1020 3993 -3508 -4453 2709 1134 -2866
2875 -2866 -239 -672 -1317 2339 -788 -5974 525 4382 -2823 -4004 1531 -227 -1003 1299 -2676 -3472
2891 -3472 3288 2066 -4925 -1430 3206 -566 -784 179 -2357 683 3965 -2686 -4262 4178 2927
2906 2927 -3786 -629 1835 -206 1545 1245 -3396 314 5218 -705 -3439 2095 2339 -526 1588
2921 1588 -116 -2046 3939 3700 -4432 -1390 5565 1354 -2391 1612 971 767 2889 -760 -3142 3635
2937 3635 4110 -3476 -1420 2896 290 210 1435 -2410 -1030 5074 571 -5200 987 3894 -852 -930
2953 -930 387 -1108 2089 2537 -3925 -2169 4835 1046 -4439 595 1886 -830 851 -256 -3635
2968 -3635 1421 4174 -3066 -3807 2292 1343 -1554 -49 -1703 -1570 3687 468 -5837 -44 4367 -1730
2984 -1730 -3442 809 -553 -539 1383 -2734 -3198 2887 722 -5158 -1000 2126 -1269 -1115 -109 -3128
3000 -3128 -96 3791 -3033 -5427 2228 2767 -2879 -1675 171 -947 2117 563 -4513 -646 4583
3015 4583 -1273 -3843 1661 988 -1412 1339 -472 -2836 2628 2827 -3873 -1541 3883 615 -1787
3030 -1787 107 -905 853 4159 -1356 -4410 3256 4229 -2764 -1517 2264 404 827 2092 -2050
3045 -2050 -1060 4388 797 -3652 1487 2940 -657 390 1155 -1624 1972 3304 -3178 -1982 5141
3060 5141 2133 -3330 397 1943 434 1985 -138 -3270 2149 4658 -2080 -2331 2500 1002 -759
3075 -759 1531 -1195 -1775 4052 1876 -4195 85 3796 -1061 -2043 1178 -127 644 2340 -2607 -2650
3091 -2650 3992 1709 -4684 -896 2787 -239 36 277 -3447 -76 3949 -2098 -4654 1550 1973 -1825
3107 -1825 -910 -969 -2204 1807 1108 -4908 -1039 4159 -1283 -4203 886 594 -1670 396 -1388 -2857
3123 -2857 2420 2223 -4340 -2155 2676 -688 -1813 73 -2011 -476 3725 -1033 -4857 1059 3328
3138 3328 -2509 -1979 1369 -479 321 1053 -2838 -1499 3785 -546 -3839 1408 2495 -1317 54 368
3154 368 -2149 2051 3296 -3365 -2503 4164 2115 -2470 -151 497 421 2900 65 -3852 2153 4791
3170 4791 -1743 -2480 2133 882 -505 1686 -519 -765 3922 1735 -3896 151 3617 -259 -1053 1276
3186 1276 -14 1922 3262 -2619 -3099 4304 3080 -2939 -446 2581 394 898 1019 -2578 386 4639
3202 4639 -1207 -3190 2596 2216 -1151 391 -311 -1593 2574 2023 -3969 -799 4835 41 -3402 183
3218 183 278 -164 1705 -1827 -3030 3028 3098 -4369 -2505 2034 -355 -1065 649 -1851 -1119 3356 -1129
3235 -1129 -4872 507 2487 -1820 -1778 541 -1241 838 878 -4333 -1934 4147 235 -4525 309 1791
3251 1791 -1124 -342 -668 -3142 1451 2988 -2920 -2881 2652 876 -1953 -138 -1308 -1129 2881 514
3267 514 -4030 1226 4117 -1933 -2957 1355 805 -177 1450 -1686 -1296 3748 1245 -3913 -227 2816
3283 2816 -247 83 1029 -1895 512 3430 -1737 -2777 3055 3016 -2009 -47 1312 -230 1609 790
3299 790 -2661 651 4529 -1046 -2519 2667 2287 -984 699 -209 -1463 3305 3030 -2728 -247 4474
3315 4474 491 -1768 702 70 298 3457 -624 -2690 2717 2884 -3286 -1548 2521 121 -584 1270
3331 1270 -1361 -297 3087 -1038 -3911 1570 2819 -1617 -906 199 -1586 1126 1458 -3791 -2135
3346 -2135 3717 672 -3608 -234 1167 -748 176 -1162 -2948 1238 2480 -3132 -2243 2504 -113
3361 -113 -2869 -465 -916 -1041 2279 -245 -4357 522 3269 -2177 -3583 460 507 765 1358 -2713 -2308
3378 -2308 2938 352 -4665 -213 2643 -569 -974 -109 -2109 216 2068 -2738 -3063 2786 1917 -2667
3394 -2667 -723 535 -611 1498 -179 -4144 641 4760 -1244 -3791 1465 1908 -587 244 -1293
3409 -1293 -1248 3378 2337 -3371 -811 3426 -60 -1406 811 -130 815 3663 -630 -2881 2617 3171
3425 3171 -2501 -1348 2690 1349 1040 677 -2362 267 4344 -66 -3688 1968 3208 -341 380 -45
3441 -45 -1423 1941 2968 -2913 -1947 3905 1591 -2175 177 692 -334 1496 -821 -3054 2278 3636
3457 3636 -2582 -2373 2073 540 -1843 148 -908 -547 3283 707 -4042 -206 2916 -1161 -1752 252
3473 252 -608 1031 1986 -2834 -3325 2945 1474 -3478 -533 2230 -490 -190 -573 -2824 178 2371
3489 2371 -2224 -3056 2212 1424 -1830 -572 -607 -1800 1445 536 -4067 -640 3871 -359 -3434 54
3505 54 6 -962 516 -1435 -1824 2469 1682 -3905 -1031 2076 -944 -1286 1080 -468 341 2613 -1323
3522 -1323 -3226 1860 2541 -1952 -762 1399 126 1276 1002 -2791 -432 4184 223 -2810 1627
3537 1627 2539 -614 275 252 -1047 1586 2312 -2097 -773 3870 886 -1419 698 413 -158 2065 486
3554 486 -2426 2486 4039 -2115 -2404 2221 718 -92 1100 -723 -6 3168 552 -3278 897 3182
3570 3182 -714 -690 1553 -396 419 2163 -1814 -2137 3418 1766 -2225 -156 1832 -169 255 -316
3586 -316 -2235 1412 3071 -2118 -2546 2396 1601 -2245 -531 -400 -1181 1584 638 -3245 -210 2736
3602 2736 -932 -2534 117 -305 -717 1046 -1208 -2076 2487 1323 -4275 -1544 2399 -405 -1033 -27
3618 -27 -1001 112 1730 -2252 -3852 1540 2004 -1789 -1010 357 -1037 658 134 -3270 -882 3601
3634 3601 -123 -3293 704 1781 -849 -666 -1150 -1380 2104 2001 -2791 -1203 3491 716 -2376 -99
3650 -99 -200 19 2409 -107 -2868 1639 3471 -1609 -2578 1153 1413 543 1188 -1507 -173 3265 166
3667 166 -3176 735 3420 -251 -509 887 -505 896 2051 -2222 -1692 3516 2111 -1765 -577 1239
3683 1239 43 1524 345 -3087 1305 4123 -795 -2757 1614 1577 -731 -261 -816 -529 2638 1656
3699 1656 -2715 118 2961 -440 -2201 370 80 365 2617 -1003 -2769 2010 1835 -2950 -1444 1692
3715 1692 707 264 119 -2217 -193 2498 -756 -3117 1067 1997 -1509 -780 -270 -1468 632 1120 -2874
3732 -2874 -1135 2669 196 -2577 -166 121 -775 485 -1299 -2301 1420 2499 -2346 -1945 1588 -150
3748 -150 -1985 -88 -575 -883 1996 165 -2768 255 1550 -1713 -1382 884 -412 -236 1268 -1938
3764 -1938 -1681 2231 238 -3007 565 2541 -556 -512 258 -1177 649 1807 -1775 -1447 2936 1410
3780 1410 -1864 460 651 -892 774 544 -2033 810 3236 -900 -1605 1543 754 -996 616 -434
3796 -434 -281 2607 1048 -3012 53 3033 -726 -1517 1179 825 801 1688 -587 -2332 2202 1846 -1926
3813 -1926 153 2385 270 161 495 -1900 368 2936 -874 -2368 2281 2308 -1356 -635 539 -252
3829 -252 1109 782 -2645 -233 3515 56 -2603 231 483 -216 411 -758 -2014 2066 2609 -2716
3845 -2716 -2120 1483 332 -1367 -221 -736 364 2257 -1119 -3814 744 2312 -2009 -1556 868 -218
3861 -218 275 434 -2728 -1889 2487 770 -3468 -579 1486 -386 -357 -1095 -2074 823 2283 -2294 -2686
3878 -2686 2359 1455 -1943 -766 -219 -772 1207 -106 -2676 379 3034 -833 -2780 277 423 -184
3894 -184 933 -1114 -1415 3170 1548 -3389 -1105 2230 460 -547 554 -214 736 2048 -1156 -2655
3910 -2655 2066 2275 -1486 8 1583 -6 791 1004 -2152 -366 3502 -16 -2171 1125 1960 -55
3926 -55 12 78 -1055 2069 1964 -2142 -858 3605 676 -1822 743 367 -443 1936 74 -1515 1597
3943 1597 2532 -1713 -1375 1542 466 284 877 -809 -208 2296 -424 -3516 746 2583 -1049 -773
3959 -773 810 -873 -130 1074 -1908 -1704 2184 887 -2312 78 1033 -1196 244 -37 -2216 223
3975 223 2438 -1673 -2025 2155 490 -1765 -540 -486 -850 1338 164 -2814 420 2502 -1749 -2330
3991 -2330 730 -184 -202 1300 -972 -2075 1533 908 -3025 -702 1941 40 -399 102 -1121 -117
4007 -117 1631 -1710 -2416 2046 1813 -1721 -563 973 -723 253 202 -2153 -277 2769 -240 -2456
4023 -2456 848 1185 -886 168 -417 -1613 1732 1635 -2448 -1011 2695 -55 -1921 528 249 177 1823
4040 1823 -119 -1727 1679 2141 -1908 -1096 2223 645 558 858 -961 -349 3050 86 -2465 1036
4056 1036 3200 -194 -274 499 -509 1091 1628 -1888 -814 3400 994 -2070 562 1551 -293 512
4072 512 147 -1750 1115 2816 -1541 -1833 2097 881 -1289 -93 -628 -210 2101 636 -3234 -205
4088 -205 2644 -1257 -1893 434 263 94 694 -1580 -2004 1823 654 -2947 -707 1871 -363 -708 -350
4105 -350 -2152 -178 1857 -1867 -3036 1737 1847 -1766 -1446 333 -717 666 235 -2642 -635 2713
4121 2713 -724 -2846 575 663 -885 138 -922 -1832 1477 1974 -2744 -1640 2104 -49 -1561 41
4137 41 -51 310 1912 -883 -3177 1148 2399 -1660 -1125 1537 271 227 745 -1531 -768 2461 543
4154 543 -2406 520 1934 -175 -219 -124 -1305 1099 2248 -2042 -1483 2617 1256 -1839 165 683 -77
4171 -77 1270 193 -1872 1272 2790 -708 -1528 1240 662 -415 1151 -257 -721 2387 926 -2697
4187 -2697 -98 2371 -414 -781 1082 -36 286 1235 -1157 -1516 2087 1533 -1816 79 1792 -248
4203 -248 119 582 -1600 -277 2381 -606 -1816 1087 1435 -1027 -157 -113 -966 1003 733 -2089 -346
4220 -346 2598 -947 -2191 731 300 -1058 257 -550 -1544 1387 1332 -2334 -1543 1464 -841 -1300 619
4237 619 -897 -468 1475 -795 -3193 740 1362 -1787 -925 1257 -376 -595 157 -1755 -646 1868
4253 1868 -342 -2477 592 1162 -1354 -465 65 -1399 1067 1859 -2062 -1435 2287 620 -1932 -296
4269 -296 86 -435 1187 -150 -1795 984 1948 -1544 -1794 1432 705 -563 744 -412 -533 2227 528
4286 528 -2584 315 2661 -67 -642 523 225 1011 1654 -1871 -1802 2784 1875 -1774 -407 1443 90
4303 90 272 -22 -1530 536 2494 -706 -2061 1690 1255 -786 -137 98 -594 1800 968 -2467 38
4320 38 2838 -221 -1808 296 840 84 960 -746 -1768 1714 1473 -2443 -1268 1721 267 -508 203
4337 203 -1030 -730 1949 -341 -2863 1087 2056 -1182 -782 577 -616 298 947 -2193 -929 2415
4353 2415 -102 -2542 218 846 -873 23 -384 -1902 588 1723 -1769 -1912 1371 170 -1494 -440
4369 -440 -556 -502 1258 131 -2469 221 1892 -1435 -2023 874 31 -531 843 -1093 -1328 1269 234
4386 234 -2478 -86 1947 -503 -584 210 -1107 47 1565 -1229 -1845 1776 1189 -1527 -505 811
4402 811 -346 675 213 -1566 418 2283 -539 -1534 1372 1022 -663 591 22 -626 1886 1250 -1703
4419 -1703 44 2430 51 -1153 738 495 365 1672 -255 -1523 1534 1644 -1740 -480 2039 175
4435 175 123 786 -749 -387 2053 172 -2176 1018 1861 -709 -534 165 -559 765 814 -1833 -937 2246
4453 2246 178 -2008 380 750 -642 272 -284 -875 726 1604 -2068 -1375 1508 155 -1319 255
4469 255 -236 -583 1286 -204 -2395 345 1806 -1299 -1635 734 150 -276 272 -1269 -1105 1627 363
4486 363 -2544 340 1397 -611 -488 350 -1283 46 1520 -1326 -1719 1402 858 -1932 -602 351
4502 351 -489 508 167 -1889 115 2458 -773 -2085 946 633 -820 41 -442 -986 1256 957 -2068
4519 -2068 -552 1740 -276 -1079 457 -80 130 1525 -833 -1989 1622 1628 -1580 -732 1417 485 46
4536 46 -32 -1108 -113 2357 -240 -1954 708 1495 -708 -145 488 -625 966 1395 -1222 -584 2261
4553 2261 590 -1590 254 966 -72 798 63 -1186 1307 2237 -1114 -1023 1852 693 -728 367
4569 367 -58 -69 1832 146 -1781 404 2239 -308 -569 477 -148 461 848 -1317 -1085 1946 971
4586 971 -2043 -265 1118 -451 -359 -103 -1472 70 1582 -1346 -1742 1331 665 -1258 -395 -418 -915
4603 -915 858 -7 -2376 -616 1980 -903 -1896 190 44 -450 344 -906 -1489 1186 321 -2302 -662
4620 -662 1501 -249 -982 353 -344 -262 1167 -637 -2137 990 1678 -1418 -811 975 -275 139 369
4637 369 -1247 -406 1896 1 -2152 422 1237 -840 -153 378 -1073 710 1547 -1432 -807 2035 535
4654 535 -1252 341 50 -357 1204 -176 -1479 1228 2161 -1260 -1240 1685 544 -201 689 -475 -245
4671 -245 1616 610 -1927 526 1937 -128 -557 665 -198 402 1523 -1039 -1261 2310 774 -1759
4687 -1759 40 1299 -9 -118 421 -964 728 1808 -1138 -1740 1602 1039 -1081 -33 265 -537
4703 -537 1012 431 -2111 -217 1950 -517 -1468 496 116 -130 665 -871 -1232 1431 908 -2362 -538
4720 -538 1673 -34 -788 -189 -814 -112 1290 -795 -1898 979 1038 -1297 -648 214 -574 2 402 -1804
4738 -1804 -549 2225 -377 -2112 388 1088 -590 -33 -165 -1311 865 672 -1785 -1050 1582 35
4754 35 -1554 69 107 -539 1074 -273 -1924 707 1681 -1647 -1431 959 178 -337 -72 -800 -418 1677
4772 1677 93 -1949 365 1806 -690 -324 470 -245 487 1652 -1084 -1123 1749 826 -1466 -78 680
4789 680 151 806 233 -1043 583 1887 -1071 -1308 1537 986 -670 314 78 -39 1321 556 -1668
4806 -1668 192 1808 -97 -1104 677 155 523 1178 -748 -1071 1411 1283 -1521 -683 1509 246
4822 246 77 356 -674 236 1616 -719 -1817 862 771 -1077 -332 274 -111 558 616 -1368 -532 1719
4840 1719 -370 -1846 -157 582 -521 231 -687 -1133 932 960 -1930 -1265 1599 -151 -1418 175 -345
4857 -345 -517 997 -480 -1857 386 1335 -1382 -1235 381 -166 -7 136 -1318 -694 1204 -451 -2106
4874 -2106 -42 1152 -463 -644 -50 -883 492 1273 -1399 -1200 1536 445 -1694 111 635 -53 575
4891 575 51 -1641 585 1709 -788 -1204 1166 857 -436 205 7 -263 1528 886 -1666 65 1617
4908 1617 -143 -888 887 250 19 1185 -430 -946 1576 1158 -1324 -278 1484 170 145 479 -687
4925 -687 355 1717 -565 -1434 1287 1347 -947 -429 461 -65 736 805 -1387 -398 2056 233 -1364 154
4943 154 715 -464 450 -410 -1142 971 1032 -1607 -989 1278 227 -700 154 -354 -239 1051 -404 -1621
4961 -1621 558 1097 -1208 -1097 515 -113 79 334 -1335 -513 1542 98 -2016 -96 901 -289 -424
4978 -424 -276 -932 169 1246 -1096 -1142 1250 327 -1126 -306 8 -465 458 -317 -1740 204 1311 -610
4996 -610 -1102 857 132 -314 -107 -667 -602 1531 482 -1964 -86 1451 -460 -908 -73 41 215 870
5014 870 -878 -1026 1130 948 -1181 -353 725 99 406 225 -764 -65 1688 -466 -1413 810 1256 -375
5032 -375 -134 187 -276 882 771 -1347 33 1793 292 -1122 484 839 169 910 -122 -859 1166
5049 1166 1661 -980 -682 1343 305 -38 365 -234 94 1397 223 -1642 830 1601 -567 -524 566
5066 566 120 652 625 -952 -257 1873 703 -1584 -63 923 -36 212 -200 -1047 718 1351 -1176 -971
5084 -971 1336 592 -1013 -125 132 -329 783 -518 -1361 15 1203 -819 -1255 293 22 -38 46 -831
5102 -831 -798 1027 305 -1784 -748 975 -293 -679 -90 -712 95 1191 -716 -1490 845 556 -1525
5119 -1525 -636 573 -32 30 273 -1130 -49 1398 -447 -1422 417 814 -467 -39 -240 -705 681
5136 681 856 -1579 -284 1956 123 -873 290 138 -54 722 -233 -831 1171 1407 -1032 -617 907
5153 907 172 150 318 -277 -88 1609 -71 -1726 592 1343 -419 -475 715 36 663 623 -1013 -428 2114
5172 2114 537 -1029 347 561 -135 577 342 -604 788 1305 -770 -1107 1057 710 -308 88 243
5189 243 -69 1093 141 -1154 717 1518 -690 -1304 460 171 -275 373 -436 -838 1180 402 -1637 -165
5207 -165 873 -110 -260 -124 -664 117 1082 -803 -1615 873 824 -1034 -436 -136 -303 178 -114 -1422 21
5226 21 1495 -574 -1403 312 404 -422 -72 -509 -830 932 805 -1418 -360 1402 86 -872 -318 -279
5244 -279 -125 951 -512 -1414 642 923 -763 -952 732 -144 173 239 -1016 -520 1026 152 -1775 -12
5262 -12 923 -462 -408 -111 -430 546 763 -1125 -570 1658 438 -976 9 637 24 373 112 -1008 658
5281 658 1552 -786 -970 958 489 -421 303 -168 -660 1404 573 -1169 347 1698 -4 -765 574
5298 574 475 232 810 -537 -814 1461 870 -1234 -109 961 32 -19 116 -848 173 1412 -343 -1415
5316 -1415 916 1003 -396 -86 210 -126 791 332 -1324 -10 1490 -406 -1105 466 435 -687 586
5333 586 -134 -720 932 741 -1388 -763 1182 -9 -777 -7 -300 64 1109 -402 -1633 663 931
5350 931 -918 -756 557 50 -22 277 -1137 -936 881 -159 -1867 239 659 -652 -587 -180 -858 257
5368 257 840 -1415 -1086 1202 180 -1363 -20 23 56 472 -479 -1430 836 1350 -830 -1316 689 55
5386 55 -746 45 -458 -230 1260 473 -1663 264 1102 -259 -673 649 480 340 810 -923 -880 1339
5404 1339 796 -1061 -256 1311 -32 -83 24 -519 521 1467 -374 -985 1038 955 -444 78 169 -310
5422 -310 906 541 -1540 -264 1603 49 -731 499 434 31 412 -217 -303 1079 820 -1374 -252 1193
5440 1193 246 -397 148 -463 84 1148 -536 -1717 610 1050 -689 -694 437 -185 -3 485 -1469 -56
5458 -56 1357 124 -1711 294 400 -536 -45 -394 -647 419 799 -1553 -721 976 325 -1036 -361 -130
5476 -130 -208 347 -639 -1565 432 1245 -871 -1196 329 165 -432 40 -490 -533 1028 225 -1678 -255 1029
5495 1029 -403 -523 347 -383 243 831 -1052 -805 957 461 -1084 -356 536 48 244 25 -1095 459
5513 459 1462 -603 -1029 632 589 -307 100 -348 -388 878 809 -941 73 1561 39 -428 213 159 172
5532 172 713 -143 -761 1135 755 -1084 -159 1169 260 -23 369 -179 112 1171 -212 -1343 323 1161
5550 1161 -574 -181 398 -47 511 700 -1122 -297 1439 346 -972 261 656 -128 276 -182 -588 587
5568 587 1054 -879 -552 1361 178 -616 -130 6 -367 800 143 -1246 396 1491 -595 -735 545
5585 545 13 57 428 -485 -466 1358 -106 -1425 231 880 -209 -374 320 -789 49 791 -779 -1048
5603 -1048 1221 153 -1526 -381 374 -111 -24 279 -1201 36 1045 -761 -1279 482 387 -881 -465
5620 -465 -284 -830 923 230 -1515 -418 1100 -482 -1178 119 51 195 630 -380 -799 1179 439 -1142
5638 -1142 -414 841 143 13 59 -753 148 1332 -366 -1188 649 735 -475 -186 451 -249 520 781 -901
5657 -901 -296 1441 522 -858 434 859 53 604 -301 -611 1036 1131 -1246 -867 1396 450 -501 109
5675 109 36 -167 1105 210 -1435 900 1424 -487 -620 764 5 381 801 -781 -632 1561 115 -1407
5693 -1407 35 892 -148 302 157 -623 244 891 -702 -1028 745 460 -762 -120 37 -248 455 -89
5711 -89 -1267 -265 1144 -603 -898 159 239 -353 -147 -812 -833 872 364 -1349 -477 1044 -339 -635
5729 -635 157 -270 -90 860 -465 -1137 720 795 -811 -632 417 -69 61 47 -886 46 1174 -469 -1336
5748 -1336 420 643 -432 -417 -65 -431 472 593 -1133 -845 1156 31 -690 154 53 12 200 -256 -1124
5767 -1124 488 789 -753 -496 583 105 -648 278 -104 -220 730 -141 -1201 327 858 -366 -281 660
5785 660 -39 364 737 -751 -633 1264 486 -1124 486 881 -130 252 325 -500 342 975 -427 -573
5803 -573 1104 441 -462 -21 316 -181 430 229 -985 92 1160 -473 -870 392 147 -15 383 -332
5821 -332 -566 955 401 -1357 -106 1112 -357 -576 -60 -201 145 502 -717 -991 995 642 -892
5838 -892 -384 687 -285 48 224 -1001 -63 1385 -486 -1348 762 742 -435 1 -25 -540 490 463 -939
5857 -939 -714 1028 139 -1022 55 -252 -207 437 -262 -1297 471 726 -1097 -658 298 130 -496 29
5875 29 -462 -388 998 -417 -1548 323 829 -265 -379 217 -413 303 459 -769 -659 1075 600 -1033
5893 -1033 150 577 -117 89 315 -984 324 1055 -466 -839 1245 637 -507 -89 137 -259 582 112
5911 112 -1066 268 1503 -293 -707 381 169 0 651 -506 -579 1066 1062 -943 -301 1210 113 -94
5929 -94 455 86 432 1188 -514 -964 617 780 -510 -411 320 -199 510 363 -1016 -111 1244 58 -994
5948 -994 445 696 -266 -227 -375 -625 682 784 -881 -578 971 219 -633 88 148 -400 378 -336 -1129
5967 -1129 127 599 -879 -649 183 30 -227 190 -873 -595 671 -139 -1402 63 610 -595 -456
5984 -456 -25 -526 39 875 -1037 -750 820 221 -1282 -321 117 -249 347 -207 -1203 53 675 -642
6002 -642 -632 785 546 -454 105 -195 -391 766 368 -1085 211 1204 -310 -683 212 -24 33 759 -368
6021 -368 -411 964 652 -788 -108 676 219 72 158 -383 330 1021 -304 -785 611 744 -540 -103 577
6040 577 11 409 499 -716 -43 1193 30 -927 331 577 -9 740 -56 -764 503 697 -929 -350
6058 -350 959 163 -436 220 -74 -29 822 -30 -1128 619 540 -563 -314 813 62 143 345 -720 -416
6077 -416 1184 -15 -1174 297 972 -305 -16 -168 -333 477 559 -806 -855 926 474 -916 -52 47
6095 47 -224 195 -186 -1212 79 1228 -690 -959 431 148 -487 -103 -550 -581 752 106 -1350 -175
6113 -175 937 -233 -980 -33 45 121 532 -906 -882 920 758 -802 -446 462 -5 95 217 -871 -38
6132 -38 1099 -572 -1089 643 738 -420 -237 85 -266 661 315 -831 33 1416 20 -981 165 614
6150 614 -145 390 -207 -591 813 1273 -824 -303 1111 187 -47 175 -279 6 1270 -267 -1103 514
6168 514 1162 -369 -555 628 357 207 385 -377 -473 938 303 -922 650 696 29 14 -28 -529 706
6187 706 783 -504 -820 1008 378 -788 -317 92 -235 657 3 -1094 182 795 -495 -537 434 -55 -278
6206 -278 290 -121 -525 840 201 -1164 -352 769 -435 -211 402 -173 214 531 -913 -841 555 694
6224 694 -1185 -272 178 -422 -127 48 -977 -8 784 -677 -484 553 317 -584 -208 -266 -519 624 84
6243 84 -995 -101 1151 -275 -972 151 141 -73 118 -106 -711 729 322 -830 -578 620 -78 -249
6261 -249 291 -229 -42 1030 -296 -1098 794 946 -564 -458 275 -275 168 418 -799 -218 1062 234
6279 234 -597 157 628 -173 24 55 -63 986 723 -774 -595 1297 479 -508 12 247 -40 811 538
6298 538 -890 450 1072 -419 -591 397 163 185 499 -246 -174 795 366 -1173 -259 798 3 -286 137
6317 137 -329 271 495 -968 -737 847 500 -1070 -459 581 -152 627 -391 -1082 -101 1270 -530 -1287
6335 -1287 134 172 -604 -209 -263 -600 356 352 -1213 -320 955 -167 -910 154 92 -232 361 -275 -604 693
6355 693 605 -805 -356 430 153 -119 306 -809 -162 925 -193 -990 178 787 -516 -494 -69 -144 135
6374 135 307 -655 -634 860 -1 -919 -17 374 -219 -117 -53 -597 388 711 -911 -734 605 354 -446 94
6394 94 -327 81 807 22 -986 494 992 -350 -291 280 267 334 162 -350 -434 773 227 -800 84 916
6414 916 159 71 148 -202 316 910 -741 -690 855 764 -360 -481 158 35 136 32 -933 305 1382 -212
6434 -212 -506 290 376 -100 289 -69 -249 490 455 -692 -168 803 85 -261 -19 -43 141 470 -437 -654 459
6455 459 751 -469 -309 427 462 -22 13 -523 -170 1043 -317 -962 -257 405 -282 -98 37 -274 268 370
6475 370 -957 -624 705 -69 -996 -155 -310 -215 -90 -263 -802 287 440 -749 -880 250 239 -207 -243
6494 -243 -177 -279 926 231 -1121 241 659 -626 -415 154 -352 131 255 -320 -747 685 146 -1048
6512 -1048 -153 716 50 -73 22 -191 618 1089 -630 -731 778 762 -400 -35 305 29 578 251 -936
6531 -936 143 1473 -101 -473 183 321 32 369 25 -347 873 263 -799 -176 812 -121 -187 15 12
6550 12 507 812 -369 -769 590 618 -750 -627 965 -97 204 365 -706 -222 982 -1 -905 126
6568 126 705 -292 -203 44 -363 310 409 -697 -435 1007 -73 -721 -228 61 99 527 -16 -570 574 933
6588 933 -874 -461 521 35 -182 1 -349 -218 641 145 -787 -51 562 -605 -250 -219 -529 224 193 -677
6608 -677 -690 838 178 -986 -162 349 -73 -45 -35 -498 317 735 -589 -480 378 480 -331 -166 -155 -235 485
6629 485 188 -824 -45 669 -7 -564 243 395 150 263 -203 -360 446 601 -607 -131 745 342 -159
6648 -159 398 -237 222 747 -152 -602 381 944 -338 -289 160 109 396 352 -480 -122 904 97 -687 480
6668 480 487 223 249 -60 -373 102 932 -400 -363 372 318 -289 -201 177 -228 567 330 -762 392 626 -350
6689 -350 -667 615 228 187 68 -248 -291 589 33 -760 -211 542 134 -258 259 -172 322 485 -571 -840
6709 -840 528 60 -402 -149 294 -244 73 -121 -724 288 481 -704 -617 447 157 -543 -94 -52 -345
6728 -345 453 172 -1112 -257 803 -144 -884 -288 -33 -188 284 -271 -882 405 455 -622 -476 306 172
6747 172 17 127 -147 70 577 -511 -741 421 657 -546 -92 247 -33 545 202 -918 -63 974
6765 974 232 -632 284 259 79 212 109 -368 43 878 -510 -138 772 339 -326 212 193 77 266 7
6785 7 -802 376 1083 -54 -443 241 20 79 397 -264 253 1071 55 -1053 -8 843 -76 -45 -77 -136
6805 -136 497 727 -378 -821 819 432 -370 37 123 -25 229 -171 -902 247 903 -437 -493 451 425 -152
6825 -152 70 -266 -404 761 488 -1010 -99 656 97 -516 -96 -163 304 273 -449 -688 777 411 -760
6844 -760 -602 157 142 -274 -89 -629 79 577 -510 -623 227 600 -490 -398 207 -270 190 314 -907 -366
6864 -366 888 97 -628 -52 161 -403 223 -85 -491 654 740 -786 -556 793 425 -391 287 -484 -182
6883 -182 541 -53 -739 185 664 -212 -265 237 227 106 407 -388 -104 1139 569 -649 -92 780 146 117
6903 117 165 -243 429 671 -271 -333 949 385 -458 227 415 239 740 23 -554 343 958 -389 -549 568
6923 568 543 -116 194 -307 33 914 443 -718 -150 552 -89 -436 -100 -10 51 605 -294 -683 621 597 -667
6944 -667 -334 450 -157 72 163 -756 97 675 -483 -803 378 314 -337 -203 -135 -161 417 357 -823 -216 641
6965 641 136 -572 6 -54 -264 -106 -285 -670 508 321 -721 -509 543 58 -540 -62 -163 50 455
6984 455 -359 -792 271 395 -507 -326 57 -202 268 308 -366 -545 824 187 -1109 -254 271 -367 -62
7003 -62 -128 -453 326 534 -589 -589 658 210 -633 192 -287 35 326 285 -442 342 870 -100 -421 427 109
7024 109 139 241 -152 -110 521 588 -900 -140 799 -165 -249 -135 62 292 744 -16 -326 526 619 -514 -204
7045 -204 265 85 180 276 -685 -309 636 182 -410 339 565 -86 -75 48 -16 729 327 -759 -425 717 -28
7066 -28 -336 -69 -132 266 354 -232 -867 550 901 -798 -380 133 216 2 179 -292 -253 602 -181 -1021 243
7087 243 632 -416 -40 -76 -218 -5 379 -640 -460 367 138 -864 -606 126 32 96 -8 -540 195 841
7107 841 -456 -764 529 -40 -572 -114 -76 -396 254 217 -545 22 410 -325 -547 247 160 -34 -73 -477 -334
7128 -334 790 384 -797 -94 510 -247 -259 -30 -186 290 666 -560 -295 773 521 -311 -36 64 58 668
7148 668 226 -479 197 814 -383 -479 432 625 -241 68 188 -502 209 377 -501 6 741 139 -470 146
7168 146 30 -36 774 11 -598 606 633 -513 -94 319 77 -115 355 -402 -21 852 -351 -884 160
7187 160 373 -195 -403 -107 -104 406 95 -728 -166 734 292 -501 -226 272 9 228 -183 -285 247 697 -144
7208 -144 -362 310 347 -106 -202 -179 -431 699 -26 -827 -29 390 -192 -633 -208 143 -34 206 -749 -307 678
7229 678 366 -799 -440 205 -202 -56 -15 -323 84 579 -485 -769 405 525 -410 -373 343 -366 367 277
7249 277 -707 -193 729 -32 -558 362 324 -57 -125 -223 -476 291 263 -659 -384 843 393 -278 103 -31 170
7270 170 632 204 -408 375 644 -454 -141 371 315 226 241 -272 150 717 93 -636 -3 367 -166 -121 116
7291 116 -237 243 595 -444 -700 656 251 -353 46 171 -77 298 -99 -828 311 712 -195 -278 364
7310 364 268 -280 -81 -221 -172 645 238 -447 23 621 -63 -215 157 -42 22 392 -441 -488 551 455 -707
7331 -707 -161 611 -175 29 209 -763 -54 656 -354 -668 29 185 -103 -19 -16 -355 186 307 -620 -122 537
7352 537 -40 -492 -123 -133 -146 -81 -117 -507 -228 564 -562 -424 351 135 84 25 39 -5 738 118 -849 334
7374 334 918 -67 -134 107 -70 275 358 -490 -270 299 210 -542 124 240 -152 -86 232 13 304 488 -594
7395 -594 -375 763 316 -495 52 216 -305 336 27 -716 358 926 -147 -489 340 316 126 449 -51
7414 -51 -257 452 417 -659 53 557 -110 -216 199 -124 99 536 -78 -580 492 863 -366 -144 401 -29
7434 -29 304 -84 -322 242 490 -443 -911 246 501 -172 399 -240 -356 413 304 -920 -359 705 88
7453 88 -499 67 302 58 187 -457 -395 32 333 -838 -421 587 -84 -124 115 -439 -161 454 54 -1049
7473 -1049 48 655 -513 -216 -23 -87 92 120 -581 -200 784 90 -765 4 328 -194 -6 -253 -524 318
7493 318 420 -628 -734 529 319 -610 6 -226 -269 457 -1 -681 -78 772 -216 -337 197 26 306 96
7513 96 -331 -119 583 -36 -339 -59 576 195 123 379 -203 133 575 -308 -322 777 603 -524 -108 270
7533 270 -23 435 251 -579 -125 853 -89 -553 260 584 -154 382 37 -719 539 284 -543 -239 642 170
7553 170 -165 150 -189 118 627 -94 -387 526 426 -380 -181 441 110 -200 210 -359 -204 604 -199 -669
7573 -669 218 518 -227 86 -102 -199 -39 473 -630 -401 564 -25 -730 -96 153 -56 349 -238 -356 336
7593 336 316 -688 -582 569 0 -222 22 -181 -26 267 -21 -489 -188 801 -109 -820 72 38 -80 399
7613 399 -417 -780 717 280 -468 56 447 -101 -309 -136 -293 269 9 -533 -545 216 251 -419 -104 14
7633 14 294 -6 60 -726 36 631 -45 -423 131 178 203 226 -235 -209 639 386 -483 -179 532 -212 -426 147
7655 147 -23 75 669 -209 -818 436 622 -350 -77 174 -241 219 30 -81 241 507 0 -408 268 329
7675 329 -233 -146 -32 -134 202 392 -270 80 850 426 -595 -281 75 -180 421 -71 -668 187 713 -655
7695 -655 -473 300 237 -554 -48 49 163 600 -182 -638 38 388 -194 -240 59 -222 -15 193 -452 -422 733
7716 733 146 -875 -98 306 -343 -13 -230 -396 156 97 -390 -645 317 59 -127 -67 -96 -245 211 201 -688
7737 -688 -15 417 -18 -448 -162 222 -285 254 -128 -193 26 578 -264 -94 325 -265 73 58 -39 80 518
7758 518 -363 -592 102 338 -160 -155 179 177 330 198 -110 153 372 -47 -766 -217 288 -136 -13 12 -356 283
7780 283 698 -584 -62 604 24 -196 -265 156 47 221 201 -328 283 867 -250 -509 272 97 126 2
7800 2 -348 128 412 68 -477 -27 344 -146 -26 264 -229 420 384 -485 -273 606 30 -573 -198 122 -269
7821 -269 338 181 -468 -32 673 -119 -620 54 220 -62 -249 53 -146 390 31 -776 -144 615 -159 -322
7841 -322 18 85 59 83 -267 -350 513 222 -624 -304 305 -122 -240 -20 94 119 24 -275 -276 216 37 -611 -318
7864 -318 128 -195 194 -175 -508 -114 459 104 -611 -198 581 -37 -6 -204 -459 107 151 -331 -158 483 65
7885 65 -193 415 -102 178 209 56 -488 174 749 -505 -251 134 252 -133 241 -172 -50 599 163 -498
7905 -498 99 578 32 -35 8 -69 117 332 -356 -273 696 -8 -319 111 127 113 20 6 -456 186 781 -472
7927 -472 -558 390 427 -285 -127 -62 7 336 233 -676 22 398 -65 -210 -49 0 44 -1 3 -212 204 145 -379
7950 -379 -162 478 -171 -231 -185 -449 75 212 134 -501 29 382 -93 -101 -123 -168 92 104 -621 -333 253 101 -632
7973 -632 111 225 2 -317 -484 -30 177 70 -748 -475 50 -62 -348 245 -167 -432 331 40 -624 85
7993 85 175 38 -215 176 -39 -4 73 -354 -168 429 203 -429 172 478 -31 -89 -91 -226 -138 363 -679 -353
8015 -353 212 297 -154 273 67 -178 653 -146 -288 59 329 99 -442 -114 240 118 -21 121 -159 343
8035 343 76 -363 181 407 24 -296 93 -166 232 419 -453 -669 626 204 -160 51 338 66 -188 15
8055 15 -379 -61 446 -24 -567 319 435 -42 -35 -106 -77 108 74 -393 -462 502 241 -383 240 234 -275 171 -221
8078 -221 -408 471 475 -416 -362 83 101 -429 11 -287 -103 538 -175 -251 -20 358 -214 -170 -93 227 406 293
8100 293 -276 -185 330 185 -726 124 224 -3 -65 -36 -526 82 155 -277 -544 255 526 -272 32 48 -123 120
8122 120 45 -501 60 383 -188 -289 190 -116 -73 19 -295 -150 425 274 -205 -389 501 79 -297 -30 306
8143 306 89 316 -288 -315 500 241 -206 2 332 261 121 58 -198 -25 707 -156 -392 573 53 -74 -43
8164 -43 -40 -33 239 609 -638 -361 411 160 -377 376 171 129 245 -122 -478 75 603 -245 -184 196 -36 85
8186 85 76 71 -171 645 0
8191@
##END NTUPLES=NMR FID
##END=
