##TITLE=1H_CG-1124-8
 CDCl3, 8 sc, 
 11.11.2019
##JCAMPDX= 6.0         $$ Bruker NMR JCAMP-DX V2.0
##DATA TYPE= NMR FID
##DATA CLASS= NTUPLES
##ORIGIN= UXNMR, Bruker Analytische Messtechnik GmbH
##OWNER= root
$$ XWIN-NMR		Version 3.5
$$ Mon Nov 11 14:08:08 2019 Russian Standard Time (UT+4h)  she@DPX200
##.OBSERVE FREQUENCY= 200.1315
##.OBSERVE NUCLEUS= ^1H
##.DELAY= (6, 6)
##.ACQUISITION MODE= SIMULTANEOUS
##.ACQUISITION SCHEME= undefined
##.AVERAGES= 8
##.DIGITISER RES= 18
##SPECTROMETER/DATA SYSTEM= spect
##.PULSE SEQUENCE= zg30
##.SOLVENT NAME= CDCl3
##.SHIFT REFERENCE= (INTERNAL, CDCl3, 0, 15.7039)
##AUDIT TRAIL= $$ (NUMBER, WHEN, WHO, WHERE, WHAT)
$$ ##TITLE= Audit trail, XWIN-NMR		Version 3.5
$$ ##JCAMPDX= 5.01
$$ ##ORIGIN= Bruker BioSpin GmbH
$$ ##OWNER= she
$$ F:/spectra/data/she/nmr/H-F/1/audita.txt
$$ ##AUDIT TRAIL=  $$ (NUMBER, WHEN, WHO, WHERE, WHAT)
(   1,<2019-11-11 14:07:11.28 +0400>,<she>,<DPX200>,
      <created by zg, POWCHK disabled, PULCHK disabled
       configuration hash MD5:
       00 E9 B6 7A A2 85 ED C7 34 08 36 98 17 FE 4E 26
       data hash MD5: 16K
       E7 29 9D 8F 9F 8B 4A E7 02 B7 FB C5 7B 81 55 59>)
$$ ##END=
$$ 
$$ hash MD5
$$ 2E C5 10 04 98 54 DA 1C C2 A0 47 B6 DB 4E 12 59
##$RELAX= 
##$RELAX= 
##$RELAX= 
##$RELAX= 
##$RELAX= 
##$RELAX= 
$$ Bruker specific parameters
$$ --------------------------
##$DU= <F:/spectra>
##$EXPNO= 1
##$NAME= <H-F>
##$PROCNO= 1
##$TYPE= <nmr>
##$USER= <she>
##$AMP= (0..31)
100 100 100 100 100 100 100 100 100 100 100 100 100 100 100 100 100 100 
100 100 100 100 100 100 100 100 100 100 100 100 100 100 
##$AQSEQ= 0
##$AQ_mod= 1
##$AUNM= <au_zg>
##$AUTOPOS= <>
##$BF1= 200.13
##$BF2= 200.13
##$BF3= 200.13
##$BF4= 200.13
##$BF5= 200.13
##$BF6= 200.13
##$BF7= 200.13
##$BF8= 200.13
##$BYTORDA= 1
##$CFDGTYP= 0
##$CFRGTYP= 5
##$CHEMSTR= <none>
##$CNST= (0..31)
1 1 145 1 1 1 1 1 1 1 1 1 1 1 1 1 1 1 1 1 1 1 1 1 1 1 1 1 1 1 1 1 
##$CPDPRG= <>
##$CPDPRG1= <>
##$CPDPRG2= <>
##$CPDPRG3= <>
##$CPDPRG4= <mlev>
##$CPDPRG5= <mlev>
##$CPDPRG6= <mlev>
##$CPDPRG7= <mlev>
##$CPDPRG8= <mlev>
##$CPDPRGB= <>
##$CPDPRGT= <>
##$D= (0..31)
0 1.2 0 0 0 0 0 0 0 0.06 0 0.03 0 0 0 0 0.0002 0 0 0 0 0 0 0 0 0 0 0 0 
0 0 0 
##$DATE= 1573466830
##$DBL= (0..7)
120 120 120 120 120 120 120 120 
##$DBP= (0..7)
150 150 150 150 150 150 150 150 
##$DBP07= 0
##$DBPNAM0= <>
##$DBPNAM1= <>
##$DBPNAM2= <>
##$DBPNAM3= <>
##$DBPNAM4= <>
##$DBPNAM5= <>
##$DBPNAM6= <>
##$DBPNAM7= <>
##$DBPOAL= (0..7)
0.5 0.5 0.5 0.5 0.5 0.5 0.5 0.5 
##$DBPOFFS= (0..7)
0 0 0 0 0 0 0 0 
##$DE= 6
##$DECBNUC= <off>
##$DECIM= 24
##$DECNUC= <off>
##$DECSTAT= 4
##$DIGMOD= 1
##$DIGTYP= 9
##$DL= (0..7)
0 120 120 120 120 120 120 120 
##$DP= (0..7)
150 150 150 150 150 150 150 150 
##$DP07= 0
##$DPNAME0= <>
##$DPNAME1= <>
##$DPNAME2= <>
##$DPNAME3= <>
##$DPNAME4= <>
##$DPNAME5= <>
##$DPNAME6= <>
##$DPNAME7= <>
##$DPOAL= (0..7)
0.5 0.5 0.5 0.5 0.5 0.5 0.5 0.5 
##$DPOFFS= (0..7)
0 0 0 0 0 0 0 0 
##$DQDMODE= 0
##$DR= 18
##$DS= 0
##$DSLIST= <SSSSSSSSSSSSSSS>
$$ [...]
##$SUBNAM2= <"">
##$SUBNAM3= <"">
##$SUBNAM4= <"">
##$SUBNAM5= <"">
##$SUBNAM6= <"">
##$SUBNAM7= <"">
##$SUBNAM8= <"">
##$SUBNAM9= <"">
##$SW= 24.0689530833862
##$SWIBOX= (0..15)
0 0 2 0 0 0 0 0 0 0 0 0 0 0 0 0 
##$SW_h= 4816.95568400771
##$TD= 16384
##$TD0= 1
##$TE= 0
##$TE2= 300
##$TE3= 300
##$TEG= 300
##$TL= (0..7)
0 120 120 120 120 120 120 120 
##$TP= (0..7)
150 150 150 150 150 150 150 150 
##$TP07= 0
##$TPNAME0= <>
##$TPNAME1= <>
##$TPNAME2= <>
##$TPNAME3= <>
##$TPNAME4= <>
##$TPNAME5= <>
##$TPNAME6= <>
##$TPNAME7= <>
##$TPOAL= (0..7)
0.5 0.5 0.5 0.5 0.5 0.5 0.5 0.5 
##$TPOFFS= (0..7)
0 0 0 0 0 0 0 0 
##$TUNHIN= 0
##$TUNHOUT= 0
##$TUNXOUT= 0
##$USERA1= <user>
##$USERA2= <user>
##$USERA3= <user>
##$USERA4= <user>
##$USERA5= <user>
##$V9= 5
##$VALIST= <valist>
##$VCLIST= <CCCCCCCCCCCCCCC>
##$VD= 0
##$VDLIST= <DDDDDDDDDDDDDDD>
##$VPLIST= <PPPPPPPPPPPPPPP>
##$VTLIST= <TTTTTTTTTTTTTTT>
##$WBST= 1024
##$WBSW= 4
##$XGAIN= (0..3)
0 0 0 0 
##$XL= 0
##$YL= 0
##$YMAX_a= 77995
##$YMIN_a= -67232
##$ZGOPTNS= <>
##$ZL1= 120
##$ZL2= 120
##$ZL3= 120
##$ZL4= 120
##$ABSF1= 10
##$ABSF2= 0
##$ABSG= 5
##$ABSL= 3
##$ALPHA= 0
##$AQORDER= 0
##$ASSFAC= 0
##$ASSFACI= 0
##$ASSFACX= 0
##$ASSWID= 0
##$AUNMP= <proc_1d>
##$AZFE= 0.1
##$AZFW= 0.1
##$BCFW= 1
##$BC_mod= 2
##$BYTORDP= 1
##$COROFFS= 0
##$CY= 11.3945322036743
##$DATMOD= 1
##$DC= 2
##$DFILT= <>
##$DTYPP= 0
##$F1P= 19.5091578491511
##$F2P= -0.509923556040331
##$FCOR= 0.5
##$FTSIZE= 0
##$FT_mod= 4
##$GAMMA= 1
##$GB= 0.15
##$INTBC= 1
##$INTSCL= 1
##$ISEN= 128
##$LB= 0.24
##$LEV0= 0
##$LPBIN= 0
##$MAXI= 10000
##$MC2= 0
##$MEAN= 0
##$ME_mod= 0
##$MI= 1.114404
##$NCOEF= 0
##$NC_proc= 0
##$NLEV= 6
##$NOISF1= 3.799351
##$NOISF2= 2.8
##$NSP= 1
##$NTH_PI= 0
##$NZP= 0
##$OFFSET= 15.70392
##$PC= 1
##$PHC0= -9454.166
##$PHC1= 14.80088
##$PH_mod= 1
##$PKNL= yes
##$PPARMOD= 0
##$PSCAL= 0
##$PSIGN= 0
##$REVERSE= no
##$SF= 200.130013532006
##$SI= 16384
##$SIGF1= 3
##$SIGF2= 2
##$SINO= 400
##$SIOLD= 16384
##$SREGLST= <1H.CDCl3>
##$SSB= 0
##$STSI= 0
##$STSR= 0
##$SW_p= 3612.71676300578
##$SYMM= 0
##$S_DEV= 0
##$TDeff= 0
##$TDoff= 0
##$TI= <>
##$TILT= no
##$TM1= 0
##$TM2= 0
##$TOPLEV= 0
##$USERP1= <user>
##$USERP2= <user>
##$USERP3= <user>
##$USERP4= <user>
##$USERP5= <user>
##$WDW= 1
##$XDIM= 8192
##$YMAX_p= 0
##$YMIN_p= 0
$$ End of Bruker specific parameters
$$ ---------------------------------
##NTUPLES= NMR FID
##VAR_NAME=  TIME,          FID/REAL,        FID/IMAG
##SYMBOL=    X,             R,               I
##VAR_TYPE=  INDEPENDENT,   DEPENDENT,       DEPENDENT
##VAR_FORM=  AFFN,          ASDF,            ASDF
##VAR_DIM=   8192,          8192,            8192
##UNITS=     SECONDS,       ARBITRARY UNITS, ARBITRARY UNITS
##FACTOR=    0.0002076,     1,               1
##FIRST=     0,             0,               0
##LAST=      1.7004516,     0,               0
##MIN=       0,             -67232,          0
##MAX=       1.7004516,     77995,           0
$$ Real data points
##PAGE= N=1
##DATA TABLE= (X++(R..R)), XYDATA
0 0 0 0 0 0 0 0 0 0 0 0 0 0 0 0 0 0 0 0 0 0 0 2 -5 7 -7 8 -8 8 -9 11 -13 15 -16 19 -20 23 -26 28 -32 35 -39 43 -49 52
44 52 -59 65 -71 78 -87 99 -108 121 -135 150 -170 190 -212 224 -195 -97 5130 52585 40485 3840
64 3840 2520 -18408 -33631 -19607 -19581 -6722 50575 55116 -8863 -36302 -25725 -28012 -6331 24078
78 24078 15822 19063 36385 -8518 -60459 -35878 3099 14366 34217 29313 -9739 -14087 -8618
91 -8618 -41837 -38867 19245 40630 23420 8659 -26996 -51201 -19058 -1553 -19101 7009 42560
104 42560 12863 -30496 -44252 -50915 -24167 22461 14018 -11442 6540 -232 -50505 -58440 -29091
117 -29091 -8883 20734 28794 -19336 -44970 -23946 -33770 -51037 -16080 16378 13836 7772 -23847
130 -23847 -67232 -48650 -7807 -12458 -9753 18545 7237 -23322 -33322 -52294 -50551 5534 32633
143 32633 1059 -10074 -6141 -31393 -40982 -25166 -19172 8199 44984 15633 -36833 -32630 -18139
156 -18139 -24007 -4531 16750 13846 22473 15585 -37242 -52847 -6670 16658 14041 24745 17157
169 17157 -4886 -4874 -18603 -40881 -3548 47637 35493 8517 2377 -16704 -24394 -3292 -769
182 -769 2820 41188 44673 -5092 -27885 -20132 -17117 6545 30927 16484 11023 24882 -5795
195 -5795 -44927 -24500 8573 19609 33135 22599 -14003 -15645 -4225 -27054 -24746 21208 35844
208 35844 18691 4262 -24906 -41312 -9247 8209 -7420 10089 34760 7280 -25109 -30725
220 -30725 -33528 -11757 28134 20804 -5723 4074 70 -34220 -34630 -10684 2398 25440 31751
233 31751 -10582 -34312 -13785 -14531 -24285 2605 22512 16288 13041 -11174 -47505 -30107 9655
246 9655 7851 4941 21064 9123 -13222 -17585 -31248 -29251 18197 39700 8755 -5633 -3180
259 -3180 -20798 -24212 -7918 -4073 14183 41279 14811 -29709 -25732 -11060 -11744 5964 20697
272 20697 11155 14111 10357 -30212 -41741 -2511 17891 14912 20495 8244 -13036 -8890 -13500
285 -13500 -30325 -2352 37495 25767 1956 -5238 -21846 -23426 1322 3190 -400 27690 30665
298 30665 -10208 -27747 -18900 -13711 8341 28252 10977 1634 14111 -7283 -35985 -16259 11195
311 11195 18396 28440 17673 -15929 -15955 -410 -14617 -12044 23230 31746 15557 4868 -18145
324 -18145 -30571 -533 18254 4866 14697 30383 7032 -16126 -16462 -18116 -186 34411 27866
337 27866 548 4700 3209 -19581 -15585 4111 11838 28834 33285 -3945 -24973 -5282 -1259
350 -1259 -6404 14130 25778 15893 13894 -3074 -32286 -16911 18240 17102 11692 20633 7662
363 7662 -9396 -7673 -15905 -15424 22176 38245 10083 -3240 -1585 -14630 -12759 4615 5072 14214
377 14214 34514 13437 -22712 -17834 -3822 -2486 14313 23969 9232 9404 10082 -19832 -27882 5677
391 5677 21865 17908 21330 7822 -12027 -4601 -2436 -15092 5662 35779 24243 4207 -1629
404 -1629 -15513 -14160 10778 13236 5941 24838 26115 -6286 -18343 -8567 -4030 14749 31308
417 31308 13299 1416 11357 -2580 -22074 -4940 15883 18803 26288 16524 -12992 -12556 4294
430 4294 -4056 -2759 22759 25650 10749 4407 -13048 -23222 3474 20818 8050 11774 21485
443 21485 1831 -13420 -9415 -11269 1727 30149 23406 -2525 -659 52 -15282 -8426 7786
456 7786 9906 20949 24889 -5979 -23208 -4571 1138 -1757 14900 20104 7913 7204 -2659 -25411
470 -25411 -11981 18273 16202 9786 14914 1762 -10868 -4121 -7977 -9318 19232 31109 6297
483 6297 -5128 -3078 -12672 -7589 9329 6741 9246 24049 8007 -20165 -14212 -1993 -545 13312
497 13312 19146 2600 1052 4207 -16441 -21978 4534 15537 10161 12382 -158 -17774 -8950
510 -8950 -3484 -13543 551 21489 9821 -6312 -9321 -20558 -18798 4067 5718 -4352 7688
523 7688 7299 -18052 -24123 -14231 -12560 1622 15272 -1796 -14717 -6326 -14946 -28094 -11912 2204
537 2204 717 6324 -541 -25814 -25057 -8245 -13138 -12020 6762 4826 -8481 -10081 -21457 -30069
551 -30069 -7693 7566 -3769 -2982 3082 -13050 -21761 -14043 -15405 -7654 14944 8982 -12856 -10916
565 -10916 -8824 -19044 -10332 3480 1223 7383 11698 -11353 -23760 -7059 -1544 -3454 10525
578 10525 11743 -1322 -95 -3774 -20132 -9385 14499 12258 5645 9414 -1941 -11567 -1757 -2169
592 -2169 -4819 15621 23586 3353 -4749 -1879 -9299 -3502 12624 8741 6739 17771 5837 -14957
606 -14957 -8009 2425 2296 13779 17948 1544 -798 4763 -9816 -12716 8536 14558 8250 11200
620 11200 1425 -14031 -4776 3184 -5227 4089 18818 7568 -4165 -3193 -11824 -10977 8964 10300
634 10300 -521 7549 7491 -11835 -12984 -3324 -4342 5364 17149 2316 -9200 -1241 -6014 -14753
648 -14753 -564 8563 3744 8381 4551 -15669 -14141 1357 -2125 -1965 11782 7373 -4400 -2741
662 -2741 -9134 -16674 922 12922 2258 1714 5651 -7622 -12459 -2715 -4915 -1647 15335 10082
676 10082 -8311 -5939 -3464 -11367 -2851 8108 2173 4463 9266 -8028 -17090 -3012 807 -1898
690 -1898 8848 7978 -5427 -2909 -2657 -15226 -7501 10498 5760 109 4213 -5929 -13893 -3092
704 -3092 -2195 -7129 6972 12207 -4595 -8747 -4729 -12050 -6940 7591 2240 -2913 6304 -1838 -16695
719 -16695 -9003 -1081 -3796 4973 8781 -5957 -8043 -1140 -10663 -12422 4490 6174 -421 3809
733 3809 -2700 -15615 -6667 1668 -5450 273 11183 451 -7287 -3266 -9275 -9812 6556 7628
747 7628 -2675 3219 3509 -10444 -8598 1015 -2403 3199 13123 1618 -8200 -39 -2536 -8556 3262
762 3262 9004 1988 5860 5382 -9700 -7920 5227 1523 727 11572 6185 -4015 1361 -1506 -8832
777 -8832 4204 12973 3245 3028 6973 -4239 -6128 4097 1154 631 13535 9282 -4965 -943
791 -943 1959 -5496 2412 11331 3694 3586 9103 -2878 -9195 3179 5026 976 10086 8869 -3408
806 -3408 217 3379 -6567 -1312 12221 6320 1520 6814 -1025 -7642 2756 4462 -1651 7713 11625
821 11625 -1746 -2824 2533 -4593 -1513 10576 5072 -734 7198 2231 -8562 -710 5054 -349
835 -349 6138 10315 -2098 -3682 3835 -3251 -4744 7978 7054 23 5418 2052 -8532 -1281 6267
850 6267 -1273 2111 10233 724 -4436 2108 -2771 -5216 7316 7500 -2013 3116 4090 -6969 -3523
865 -3523 4660 -911 1313 9967 793 -6444 1474 -247 -5993 3660 7029 -1461 2281 4418 -7156
880 -7156 -5686 5104 459 -1388 7615 2482 -6261 663 1 -7190 1992 7966 -1193 -751 4161
895 4161 -4874 -6028 3687 45 -2791 6997 3766 -6882 -1397 1483 -5959 35 7091 -1038 -1888
910 -1888 4655 -3221 -7622 2631 2070 -2933 4484 4192 -5838 -1747 2404 -5861 -2436 7183 498
925 498 -2880 3824 -2038 -7636 1704 2696 -4315 2592 5526 -4828 -3755 2415 -4537 -3449 6402
940 6402 1038 -4672 3137 67 -7884 -491 3539 -3643 806 5416 -4490 -4816 2756 -3038 -5388
955 -5388 4601 1651 -4797 1829 835 -7986 -1635 4069 -3954 -1733 5225 -2750 -5692 2024 -2045
970 -2045 -6122 3328 2769 -5594 10 2081 -6749 -3216 3852 -3350 -3047 4859 -1793 -6741 1436 -226
986 -226 -6338 1227 3261 -5064 -1047 3192 -5690 -4476 3973 -1843 -4409 3953 42 -6406 947
1001 947 1293 -6212 -13 4524 -3779 -2482 3806 -3243 -4585 4170 -227 -4680 3599 2158 -5599
1016 -5599 496 3571 -4509 -484 5577 -2475 -2544 5030 -695 -4639 4243 2422 -3859 3112 4051 -4185
1032 -4185 870 5525 -2697 -712 6483 9 -2592 5662 2012 -3502 4543 4560 -3383 2655 6210
1047 6210 -1904 680 6884 -299 -1032 6901 1975 -2421 5895 4493 -2285 4232 6267 -1686 1924
1062 1924 7085 -284 143 7779 1998 -1501 6128 3432 -2358 5007 5803 -1727 3270 6992 -1391
1077 -1391 -229 6722 874 -918 7010 2774 -2609 4773 3879 -3255 2854 6177 -1450 1143 6247
1092 6247 -2049 -2431 5309 621 -2972 5120 3290 -4048 1691 3084 -4688 133 5294 -2186 -1749
1107 -1749 4639 -1870 -5175 2651 202 -4726 2787 2723 -5670 -1382 2050 -5687 -3456 3970 -2400
1122 -2400 -3915 2782 -2483 -8060 451 153 -6199 165 2553 -6074 -3782 883 -6512 -5730 2778
1137 2778 -1713 -5671 928 -1997 -8504 -1998 86 -6408 -1506 2970 -5903 -5881 386 -5440 -6717
1152 -6717 2010 -761 -5922 546 -832 -8959 -3703 939 -5166 -2333 3257 -4254 -6216 220 -4094
1167 -4094 -7374 1739 1728 -5225 -181 359 -7602 -4038 1820 -3833 -2609 4748 -1318 -6220 194 -1908
1183 -1908 -6152 1842 3424 -3717 398 3156 -5570 -4466 3230 -902 -1416 6081 1214 -4980 1327
1198 1327 638 -5215 1854 6379 -751 1012 4587 -3524 -3555 4858 1528 -1235 6981 4738 -3178 1107
1214 1107 2524 -3478 2408 8145 1198 767 6117 -509 -3699 4299 3497 127 7448 6587 -2659 755
1230 755 4274 -2263 833 8318 3283 1136 6164 264 -4654 3663 4896 -137 5252 7061 -1587
1245 -1587 -435 3512 -2667 -725 8331 4131 -873 4329 909 -5223 1045 3808 -998 3948 7328
1260 7328 -2109 -3812 1848 -2374 -2783 5906 3383 -1988 3142 661 -7595 -2124 3521 -1357 1373
1275 1373 5457 -2433 -5199 799 -3315 -5920 3879 4344 -2850 278 -112 -7939 -3683 2651 -2703
1290 -2703 -1079 5827 -1070 -7137 -1836 -2986 -5894 2647 3953 -3482 -660 1268 -7369 -6441 1526
1305 1526 -1000 -1088 5152 -817 -7336 -1605 -1329 -6814 547 5386 -1007 -972 829 -6860 -6538 2563
1321 2563 351 -2399 4566 2243 -5760 -2774 -1546 -5802 1034 7188 -496 -2330 2123 -3898 -6734
1336 -6734 752 1077 -987 5554 3483 -6251 -3710 639 -4254 -1086 6257 1479 -937 2859 -3699
1351 -3699 -8371 1047 3776 -917 3462 4396 -4021 -3477 228 -4989 -1779 7654 3514 -2447 1403
1366 1403 -1727 -6983 -104 3024 -1175 3705 6692 -3400 -5938 -179 -2670 -1674 6261 3606 -1931
1381 -1931 2326 -120 -8276 -2472 4307 1026 2629 5450 -2781 -5228 650 -2609 -4350 5418 6603
1396 6603 -765 21 -575 -7371 -2288 4620 -45 885 7057 309 -6270 -1863 -1814 -2903 5636 6435
1412 6435 -1752 -24 1882 -5856 -5005 3010 2048 2376 6912 18 -6953 -859 390 -4193 2440 7383
1428 7383 1301 406 993 -6537 -5248 5030 3130 117 5692 3222 -4785 -2019 -919 -4049 3482
1443 3482 9719 1339 -1719 2073 -2941 -5246 2383 3212 1552 7522 4651 -6178 -3731 1610 -1592
1458 -1592 1546 7867 3096 356 3162 -3300 -7592 2680 6550 2116 4508 4696 -3320 -2651 1070
1473 1070 -3214 441 9940 5941 -1289 943 -1571 -5155 1830 4960 790 5264 7640 -2606 -5947
1488 -5947 112 -665 1134 7935 4780 -1219 2643 372 -7482 -1912 5942 3503 4443 5414 -2917 -5274
1504 -5274 1158 -964 -2896 6191 7573 125 -209 -1693 -7005 -1046 5924 1199 1279 6552 122 -6628
1520 -6628 -2710 -2002 -1651 6757 6689 -2416 -1508 934 -6123 -5113 3013 2575 2785 6011 -1540 -8654 -2036
1537 -2036 570 -3285 2394 6707 735 -883 -782 -7767 -5942 5171 4048 -252 3520 999 -6105
1552 -6105 -3528 -2156 -4288 3448 8865 191 -4233 -966 -4323 -5775 1530 2140 526 5901 2340
1567 2340 -8535 -6523 -151 -1730 904 5816 656 -2190 365 -5655 -9397 664 5561 1097
1581 1097 1991 990 -6412 -4879 -975 -4589 -1335 7951 3665 -4142 -3299 -5102 -6943 745 3424
1596 3424 -1275 2434 4560 -5529 -8962 -2900 -1870 446 6370 2001 -4392 -769 -2156 -9111 -3449
1611 -3449 4448 2749 2712 2481 -6032 -7485 -219 -1660 -3373 4814 6213 -1211 -2397 -3943 -7891 -886
1627 -886 6373 1467 301 4651 -911 -6998 -3411 -1836 -697 7584 7039 -2892 -2482 494 -4505 -3568
1643 -3568 3773 3780 4140 6439 -1636 -8304 -1550 2720 -358 4032 7160 1706 54 -156 -6494 -3621
1659 -3621 7315 6756 1738 3971 1482 -4441 -1692 -66 -1519 5907 11059 1715 -3615 -525 -2437
1674 -2437 -2370 4453 4619 2573 6950 3359 -7106 -4999 2092 2043 4354 7452 1659 -1210 1799 -3647
1690 -3647 -6888 3055 8298 3505 3364 1074 -5475 -2970 1593 -1805 828 9124 5106 -3131 -2931
1705 -2931 -4017 -4633 3251 5619 191 2748 4646 -4409 -7757 -1730 288 2786 7582 2146 -4541
1720 -4541 -1165 -1442 -7021 -2257 5169 3625 3076 1704 -6773 -7500 674 116 -2031 4397 5327 -1899
1736 -1899 -3478 -5094 -8104 -562 6610 1328 -1177 2086 -2587 -7645 -4023 -2657 -926 6760 5044
1751 5044 -5392 -5805 -2262 -5538 -4177 2220 2115 1771 3142 -4680 -11073 -3763 1350 -1243 1908
1766 1908 3624 -1983 -3282 -3233 -8713 -5824 5257 4612 -849 -339 -2643 -7220 -3752 -1728 -3379 3285
1782 3285 7744 -1037 -6954 -4073 -4409 -3540 3034 2454 -248 3671 556 -9118 -6936 373 1382 3433
1798 3433 5251 -1187 -3620 -335 -4213 -6929 2436 7526 3212 1569 -1143 -6412 -3206 2394 -811
1813 -811 1135 8255 4594 -3143 -3546 -3792 -3045 4854 6820 876 2399 4278 -3327 -5919 -272 1910
1829 1910 4900 8947 2707 -4033 -190 757 -3791 393 7176 5465 4682 2687 -5329 -5468 3252 3603
1845 3603 1034 5958 6279 -131 -1239 -2707 -4984 2538 9504 4332 386 2816 -712 -4660 -795
1860 -795 744 2068 8924 6713 -3662 -4455 -145 -2078 -195 5083 3821 3116 4238 -2977 -8623
1875 -8623 -1360 4192 2171 3882 4391 -1419 -2054 -1318 -5896 -2998 7056 6645 195 45 -2324 -5593
1891 -5593 -1437 586 -1329 4137 8046 -634 -6601 -3738 -3136 -1306 4549 3190 -336 2899 297
1906 297 -8123 -6251 1284 2303 3935 4512 -2085 -4548 -703 -3322 -5591 2516 6725 2645 694
1921 694 -2298 -7410 -3336 2805 -26 556 6308 2831 -4184 -4457 -4545 -2893 4885 5986 -342 -108
1937 -108 1794 -4166 -6237 -904 1447 3931 7012 722 -6080 -2509 -245 -3616 307 5528 3647
1952 3647 2495 500 -6764 -6356 2389 3388 678 3755 3516 -2071 -2882 -3529 -5320 1956 8591 3146
1968 3146 -1479 259 -2150 -4883 -776 574 1454 7087 5037 -4708 -5511 -1051 -1657 188 4414 2505
1984 2505 1335 2811 -3438 -8565 -1602 4213 2590 3277 2608 -2810 -2753 -1499 -5231 -2594 6638 5873
2000 5873 -295 -1383 -3609 -5617 -672 1616 -966 3339 6176 -1572 -6711 -4031 -2969 -350 4979
2015 4979 2893 -1570 1427 -529 -7526 -5316 1660 2637 3661 3409 -3243 -5456 -815 -2430 -4527
2030 -4527 2394 5863 1754 -280 -3128 -7436 -2805 3314 643 236 4484 1172 -4507 -4213 -3962 -2305
2046 -2305 5080 5867 -941 -1452 629 -4083 -5055 110 1761 3499 6120 -67 -6710 -2914 171 -1872
2062 -1872 1197 5092 2560 1491 81 -6151 -5529 3160 4462 1525 3454 2252 -2392 -2202 -2108 -3594
2078 -3594 2850 8720 3309 -1592 -318 -2140 -3372 1020 2257 1991 6590 4740 -4107 -4791 -295
2093 -295 16 2006 5551 2564 900 2629 -2162 -6714 -179 5265 3652 3791 2730 -2644 -2002 431
2109 431 -2713 -639 6974 6270 224 -866 -2647 -3937 1176 3740 810 3562 5912 -810 -5423
2124 -5423 -2566 -1150 1320 6050 3331 -1306 857 216 -5381 -3176 2909 3349 4026 3748 -3151 -5297
2140 -5297 -215 -532 -2436 2846 5464 1296 -453 -3047 -6621 -1967 4319 1377 167 3435 281
2155 281 -4568 -3665 -3186 -2060 4830 5457 -1634 -2557 -611 -4108 -4339 435 1209 2304 4604 -1111 -7340
2172 -7340 -3549 -82 -1688 723 3526 566 -536 -1255 -6631 -5847 2307 3413 340 1125 -146 -4337
2188 -4337 -3207 -2313 -3986 1201 6371 1100 -3691 -2448 -3764 -3885 553 1170 40 3807 2145 -5868
2204 -5868 -5970 -1385 -799 1291 3700 173 -1862 311 -3434 -6787 -878 4035 2135 2072 310 -4386
2220 -4386 -3433 -98 -2553 -1390 5127 3918 -1414 -2260 -3476 -4426 1046 3591 -10 1626 3937 -1811
2236 -1811 -5223 -2115 -940 1356 5657 2745 -2543 -302 6 -4483 -2099 3164 2985 3536 3011 -3018
2252 -3018 -4745 470 591 -784 3491 4921 884 -114 -1881 -4974 -404 5463 2805 842 3271
2267 3271 397 -3393 -1600 -1042 -263 5500 5774 -637 -1833 131 -2142 -1584 2856 2607 3019 5019
2283 5019 -164 -5250 -1633 2143 728 2637 4603 935 47 456 -3771 -3094 4039 4926 1672 2285
2299 2285 448 -2976 -972 500 -1234 2567 6822 2079 -2155 -1021 -1922 -1624 2850 2753 662 3674
2315 3674 2572 -4120 -3996 464 925 2520 4521 563 -1700 641 -1700 -4554 768 4487 2370
2330 2370 2028 352 -4169 -2724 990 -1088 -474 4651 3129 -1865 -1967 -2816 -3621 1482 3738 -83
2346 -83 771 2437 -2264 -4974 -1485 -898 931 4737 1554 -3266 -1561 -779 -4001 -1696 2344 1636
2362 1636 1505 1472 -3958 -5331 -301 295 -1309 1834 2578 -1365 -1864 -2578 -5097 -1333 3974 1554 -1051
2379 -1051 985 -1650 -4386 -1756 -1038 -1274 3509 3840 -2446 -3452 -1302 -2889 -2027 1676 1133 431
2395 431 2490 -1484 -6069 -2374 1016 -254 1455 2591 -1155 -1557 -527 -3839 -3425 2870 3412 131
2411 131 739 -922 -4022 -1252 333 -1465 1433 4974 395 -2983 -1412 -2166 -1835 2540 2279 -177
2427 -177 2283 1628 -3807 -3145 556 452 2165 4041 118 -2219 464 -1008 -3364 1288 4015 1635
2443 1635 1726 572 -3393 -1993 2148 288 226 4354 2637 -1481 -1007 -1554 -2466 2401 4406 782 698
2460 698 2009 -1632 -2994 185 724 1402 4752 2126 -2603 -824 369 -2076 182 3536 1631 1457
2476 1457 1984 -2681 -3625 1111 1711 11 2490 2625 -1196 -661 -845 -3306 -230 4328 1595 -588
2492 -588 1265 -1080 -3129 -197 366 -718 3134 3664 -2019 -2704 -129 -1737 -744 2656 1163 -187
2508 -187 2041 -794 -4625 -1112 1580 -23 1787 2510 -1393 -1685 329 -2600 -2444 2784 2674 -121
2524 -121 617 -827 -3581 -483 1317 -1045 972 3838 -139 -2827 -963 -1651 -1575 2581 2169 -756
2540 -756 1237 914 -3548 -2417 1227 353 1351 3153 -473 -2593 496 -496 -2495 1392 3250 495
2556 495 846 294 -3395 -1800 2081 525 -30 3162 1486 -1948 -609 -918 -2024 1936 3821 -144
2572 -144 -282 1722 -1666 -2484 961 696 466 3685 1135 -2910 -831 524 -1753 283 2896 788
2588 788 394 1547 -2167 -3203 1251 1537 -427 1873 1693 -1953 -999 11 -2586 -203 3888 1219
2604 1219 -1110 732 -1332 -2987 432 603 -874 2008 2432 -2405 -2570 -120 -1652 -865 2460 558
2620 558 -1297 887 -882 -4148 -815 1337 -538 871 1501 -2272 -2089 340 -2237 -2403 2043 1543
2636 1543 -1395 -2 -944 -3557 -840 1314 -1325 44 2356 -1243 -2886 -739 -1584 -1709 1991 1419
2652 1419 -1822 32 333 -3204 -1905 1256 -394 117 2261 -1085 -2981 77 -519 -2139 1066 2299
2668 2299 -389 57 315 -2997 -1515 2050 469 -568 2291 617 -2097 -316 -371 -1732 1601 3037
2684 3037 -436 -263 1446 -1533 -1671 1670 743 138 3114 1266 -2300 8 1070 -764 1113 3258
2700 3258 400 194 1879 -834 -1827 2104 2140 24 2274 2088 -1340 153 1368 -1133 666 4061
2716 4061 1370 -385 1429 13 -1620 1681 1841 -35 2234 2743 -1166 -938 1429 -151 246 3077
2732 3077 1265 -539 1716 613 -2279 639 2265 229 1254 2271 -1186 -1239 1730 -452 -1242 2592
2748 2592 1670 -969 743 42 -2362 361 2162 -734 70 2465 -867 -1930 433 -552 -1485 2104
2764 2104 1337 -1770 205 619 -2494 -1080 1326 -609 -336 1889 -1173 -2687 294 -212 -2149 692
2780 692 1284 -1595 -583 270 -2760 -1831 1550 -545 -1530 1194 -421 -2616 -423 -422 -2387 407 2003
2797 2003 -1745 -1323 399 -1994 -2036 1121 -231 -1289 1339 -61 -3031 -879 564 -2099 -370 1599
2813 1599 -1216 -1374 804 -1628 -2566 769 468 -1463 721 503 -2471 -609 698 -1810 -561 2040
2829 2040 -484 -1640 824 -795 -2135 988 987 -1312 779 1471 -1873 -1251 1023 -1027 -584 2153
2845 2153 92 -1575 1103 37 -2249 536 1704 -798 592 1554 -1387 -1055 1550 -412 -1100 2222
2861 2222 993 -1519 621 496 -1786 475 1955 -652 140 2128 -499 -1132 1361 232 -985 1920
2877 1920 1409 -1383 554 1283 -1414 -141 2109 -30 -187 2225 -174 -1726 1305 978 -1250 1308
2893 1308 1864 -1123 359 1442 -1319 -443 2195 390 -805 1818 370 -1601 1153 1030 -1167 916
2909 916 2117 -1171 -399 1817 -689 -843 1762 325 -892 1654 974 -1810 467 1474 -1033 325
2925 325 2091 -717 -901 1745 -524 -1452 1731 802 -1228 1226 1009 -1720 135 1632 -1138 -375
2941 -375 2108 -279 -1270 1343 -7 -1587 1330 1268 -1461 691 1670 -1513 -558 1523 -828 -868 1623
2958 1623 -216 -1718 1253 210 -1894 369 1274 -1123 -66 1456 -1377 -1021 1467 -494 -1429 1279
2974 1279 382 -1672 571 555 -1754 -66 1309 -1443 -725 1503 -877 -1440 1062 -173 -1710 1074
2990 1074 584 -2120 221 1003 -1594 -522 1150 -1199 -1145 1280 -623 -1866 963 293 -1787 336
3006 336 745 -1647 5 1175 -1563 -934 1436 -735 -1576 1054 -262 -1726 816 471 -1832 60
3022 60 1304 -1624 -724 1442 -927 -1086 1107 -319 -1870 1214 627 -1694 302 1072 -1412 -385
3038 -385 1123 -1017 -922 1503 -506 -1654 1304 499 -1585 684 984 -1471 278 1717 -1211 -755
3054 -755 1422 -653 -1115 1492 1 -1215 1164 773 -1823 532 1578 -1031 -190 1685 -594 -847
3070 -847 1556 -176 -1191 1567 833 -1422 520 1076 -1401 62 1783 -977 -373 1929 -244 -1600
3086 -1600 1040 470 -1297 1149 1239 -1248 555 1549 -1451 -629 1873 -278 -859 1604 108 -1577
3102 -1577 839 660 -1316 751 1992 -1093 -385 1222 -1111 -851 1764 -38 -1000 1501 637 -1545
3118 -1545 311 794 -1279 225 1695 -883 -694 1317 -645 -1400 1141 416 -1127 1153 621 -1837
3134 -1837 -14 1174 -903 -196 1782 -380 -895 1269 -363 -1712 1275 949 -1332 629 1072 -1370
3150 -1370 -454 1285 -881 -591 2071 205 -1019 1229 462 -1687 601 1195 -789 698 1705 -1223
3166 -1223 -881 1461 -254 -696 1875 790 -1114 1034 497 -1745 352 2005 -475 81 1912 -826
3182 -826 -998 1308 -169 -978 1840 1174 -1250 280 943 -1457 123 1862 -495 -337 2031 -297
3198 -297 -1584 920 222 -972 1452 1342 -1214 82 1154 -1522 -598 1709 -91 -363 1411 -84
3214 -84 -1878 585 491 -1367 687 1670 -1018 -697 776 -1508 -1182 1517 140 -1219 1191 237 -1940
3231 -1940 -378 447 -1435 372 1672 -1110 -1353 727 -1292 -1851 868 27 -1271 619 58 -2492
3247 -2492 -771 451 -1432 -576 1480 -835 -1442 288 -1323 -2247 919 566 -1449 361 533 -1950
3263 -1950 -1180 465 -1386 -655 1644 -380 -1695 208 -577 -2140 304 996 -1074 279 996 -1813
3279 -1813 -1598 780 -545 -707 1591 422 -1446 307 52 -1922 105 1557 -427 97 1319 -1079
3295 -1079 -1283 876 -122 -881 1835 1532 -1072 126 422 -1246 438 2010 -48 118 2007 -364
3311 -364 -1501 833 695 -182 1629 1780 -881 461 1186 -1061 -317 2210 779 158 1871 158 -1386
3328 -1386 702 1139 -581 1317 2268 -457 -89 1021 -892 -71 2390 1036 -400 1652 772 -1237
3344 -1237 330 1221 -205 1179 2522 -314 -753 1062 -346 -871 1654 1307 -147 1279 556 -1933
3360 -1933 -65 1473 -539 236 2137 -38 -919 734 -725 -1447 1416 1542 -731 486 707 -1743
3376 -1743 -914 752 -758 -107 2031 9 -1657 16 -430 -1845 665 1007 -856 231 989 -2073
3392 -2073 -1760 609 -370 -691 1391 44 -1785 28 -521 -2357 -172 1424 -576 -489 430 -1813 -1946
3409 -1946 638 -521 -1236 1298 722 -2057 -863 -445 -2048 -236 1416 -628 -766 982 -1158 -2548
3425 -2548 123 -45 -957 1058 573 -1826 -527 117 -1815 -1092 1629 351 -403 842 -929 -2339
3441 -2339 353 712 -993 684 1621 -995 -910 215 -1498 -475 1968 504 -755 884 206 -1947
3457 -1947 -365 713 -543 1127 2007 -1017 -1259 789 -505 -919 1468 974 -224 1116 316 -2260
3473 -2260 -277 1515 -221 525 1920 -189 -909 454 -647 -1316 1547 1788 -615 327 398 -1709 -618
3490 -618 842 -431 409 2229 123 -1811 62 -165 -939 1118 1535 -237 490 958 -1683 -1408 1137
3507 1137 371 -49 1650 253 -1586 176 12 -1614 451 2285 59 85 518 -1386 -1436 1143 348
3524 348 -582 1945 1052 -1427 -676 -152 -1374 602 1985 -11 -317 1177 -908 -2000 417 798 -77
3541 -77 1460 1025 -1647 -481 637 -1189 -436 1811 402 -319 786 -865 -1953 719 897 -580
3557 -580 986 1630 -761 -848 75 -1294 -139 2428 781 -880 831 8 -1777 -217 662 -136 1063
3574 1063 1964 -1001 -1413 705 -554 -737 1690 1025 -193 1083 -6 -2279 -345 1549 99 411
3590 411 1614 -552 -1150 214 -667 -1261 1747 1953 -584 42 231 -1652 -474 1086 -271 178 2144
3607 2144 -29 -1774 -189 -106 -881 1210 1415 -648 339 676 -1987 -1478 989 428 43 1410 -40
3624 -40 -1559 92 -30 -1607 648 2029 116 -363 350 -1762 -1351 1137 280 -552 1412 869 -1815
3641 -1815 -761 -536 -1323 402 1881 -369 -872 728 -1154 -1992 273 637 -123 1380 719 -2173 -899
3658 -899 236 -1198 -181 1685 401 -537 464 -1096 -1996 518 1142 -500 797 1041 -1150 -1077 -15
3675 -15 -1261 -116 2192 802 -1205 242 -289 -1778 191 937 -202 1247 1632 -1141 -1886 305
3691 305 -375 -284 1461 878 -522 482 -76 -2230 -283 1676 404 380 1387 -714 -1178 309 -750
3708 -750 -1015 1517 1674 -662 -202 192 -1636 -252 1287 7 240 2102 -83 -1964 -187 55 -499
3725 -499 1350 1349 -713 138 703 -1901 -1348 1324 656 287 1385 -49 -1805 -7 358 -1282 792
3742 792 2171 137 -217 61 -1650 -1047 1330 475 -556 1443 807 -1488 -739 -39 -870 996 2224
3759 2224 -183 -729 702 -696 -1625 793 976 243 1647 794 -1957 -890 891 -451 143 2112
3775 2112 528 -305 664 -1023 -1678 1068 1618 19 977 1245 -936 -772 317 -634 22 2593 879
3792 879 -816 179 -165 -1197 459 1135 -92 1229 1646 -1194 -1691 538 -76 -242 1771 807 -693
3809 -693 315 -196 -1993 -376 1531 315 266 927 -1064 -1359 332 -425 -958 1348 1301 -782 -519 -576
3827 -576 -1672 -531 1326 -13 -213 1363 -613 -2267 -511 -352 -727 1326 1195 -1377 -402 328 -1722
3844 -1722 -1451 837 412 90 971 -621 -2232 -233 252 -1247 525 1336 -418 -682 -108 -1905 -1232
3861 -1232 1336 563 -735 764 62 -1816 -818 -254 -1030 699 1720 -606 -1367 157 -1060 -1638 517
3878 517 570 -353 1037 174 -2471 -1245 419 -852 -95 1363 135 -891 -19 -1289 -2049 789 1368
3895 1368 -347 403 562 -1606 -856 363 -877 -50 2058 628 -1418 -252 -494 -1408 276 1061 -396
3912 -396 720 1146 -1398 -1614 220 -15 23 1557 588 -939 157 -75 -2065 -118 1721 506 401
3929 401 861 -1073 -1376 576 -157 -600 1651 1651 -755 -437 -52 -1068 344 1761 376 88 1786 -23
3947 -23 -1565 210 465 273 1827 1616 -798 -34 998 -1074 -656 1739 1135 603 1295 -234 -1476
3964 -1476 697 1093 -375 956 1981 85 -8 240 -1058 -436 2008 980 -305 1012 360 -1194
3980 -1194 -147 435 -255 1125 2155 -423 -1102 629 -450 -1000 1148 782 -63 1041 160 -2223 -1086
3997 -1086 1001 -372 1 1469 -325 -980 47 -1211 -1917 667 1413 -458 120 34 -1680 -1073 313
4014 313 -796 -174 1657 218 -1705 -609 -773 -1444 545 889 -668 372 991 -1675 -1689 468 -78
4031 -78 -242 1191 108 -1406 -61 -161 -1886 -120 1476 14 22 380 -1171 -1482 789 45 -668 1282
4049 1282 1224 -991 -474 -245 -1147 282 1841 152 -193 1109 -330 -1734 7 566 -103 1551 1216
4066 1216 -1347 -490 642 -838 -434 1580 731 177 1137 -555 -1807 405 1210 -375 933 1566 -415
4083 -415 -475 423 -1186 -398 1979 921 -350 845 270 -1258 -252 621 -333 881 1888 -674 -1039
4100 -1039 416 -311 -714 1225 827 -54 1010 50 -2058 -481 1073 162 293 1416 -244 -821 385
4117 385 -638 -1319 1150 1613 -175 -105 99 -1462 -837 952 -248 -84 1981 275 -1479 -330 -388
4134 -388 -942 886 1106 -671 169 887 -1425 -1387 594 233 163 1461 217 -1411 153 17 -1259 298
4152 298 1863 133 42 477 -1135 -1178 975 412 -341 1136 992 -1077 -402 -25 -1111 362 1792 -122
4170 -122 -533 917 -452 -1388 255 523 6 1359 1016 -1306 -594 601 -782 -408 1523 455 -92
4187 -92 902 -440 -1675 519 1196 -409 745 1281 -641 -476 393 -970 -323 1811 951 -789 794
4204 794 -30 -1300 133 876 -328 819 1793 -606 -1212 460 -181 -515 1115 709 -456 725 355
4221 355 -1597 -466 1260 49 234 1216 -502 -1120 571 -473 -1131 915 1385 -493 -94 114 -1249
4238 -1249 -665 902 -427 -125 1495 119 -1419 -350 -151 -849 815 1028 -883 -177 679 -1342 -1373
4255 -1373 536 81 -246 1149 -278 -1687 -51 56 -1409 53 1324 -214 -393 288 -1263 -1275 712
4272 712 219 -657 757 389 -1407 -483 -149 -1051 271 1461 -209 -803 589 -653 -1375 202 436
4289 436 -560 1028 570 -1466 -716 560 -695 -356 1173 202 -426 699 -627 -1507 374 824 -471
4306 -471 302 761 -933 -762 266 -750 -449 1511 632 -1021 298 -120 -1236 78 587 -594 312
4323 312 1381 -857 -1369 402 -327 -662 1132 532 -818 335 138 -1772 -293 1037 -221 -79 1043
4340 1043 -607 -1058 496 -343 -911 939 1205 -729 -380 192 -1213 -363 1033 -291 -312 1394 118
4357 118 -1429 -87 20 -615 1031 1045 -789 -200 698 -936 -1026 1127 414 -59 1141 168 -1320 254
4375 254 672 -776 460 1560 -74 36 601 -794 -603 1123 764 -233 1006 425 -1031 -83 474
4392 474 -798 733 1592 -168 -546 711 -412 -1003 663 511 -205 1022 710 -1295 -659 575 -567
4409 -567 -139 1086 148 -536 655 -696 -1399 562 851 -513 338 774 -1044 -467 642 -573 -375
4426 -375 1175 341 -982 110 -175 -1156 146 733 -572 281 1111 -937 -998 291 -79 -423 1046 276
4444 276 -960 354 136 -1373 -369 1145 -106 55 733 -527 -976 840 -108 -790 895 896 -640
4461 -640 -123 257 -986 -154 1116 -129 -406 1295 25 -1306 151 129 -511 891 1098 -623 -278
4478 -278 840 -668 -616 1136 190 -316 1005 -5 -1373 176 474 -749 274 997 -415 -326 513
4495 513 -915 -766 1119 496 -611 594 308 -1065 -149 245 -853 321 1238 -753 -1126 381 -464
4512 -464 -958 687 331 -873 689 415 -1431 -735 564 -464 -165 971 -117 -863 506 -208 -1177
4529 -1177 547 964 -625 378 831 -964 -439 672 -450 -401 1330 496 -866 361 163 -809 284
4546 284 1113 -190 495 1172 -568 -853 683 173 -246 1218 495 -666 402 523 -890 335 1460
4563 1460 146 234 982 -566 -745 1133 415 -505 1131 1006 -505 -21 716 -789 178 1320 244
4580 244 -283 1228 125 -880 487 319 -532 822 925 -683 -211 683 -630 -560 1013 106 -236 910
4598 910 8 -896 406 576 -625 291 806 -576 -447 531 -520 -635 1033 350 -620 440 228 -1000
4616 -1000 -97 402 -821 20 1041 -529 -1226 405 -355 -953 690 277 -556 321 536 -1234 -317 505
4634 505 -552 -516 852 -389 -1007 351 -235 -1063 450 606 -626 9 496 -1082 -621 769 -523
4651 -523 -503 964 -39 -1205 183 -47 -926 34 884 -542 104 840 -666 -866 701 -102 -493 1135
4669 1135 241 -942 192 382 -1074 104 1025 -228 -194 703 -543 -854 773 281 -675 602 604 -690
4687 -690 -133 302 -597 -241 1133 -154 -328 700 -129 -992 509 283 -725 672 768 -829 -260 725
4705 725 -367 -525 893 146 -485 853 56 -1107 179 548 -706 31 963 -418 -306 682 -449
4722 -449 -535 972 324 -512 353 106 -674 -72 350 -771 45 923 -604 -663 361 -164 -922 542 346
4741 346 -800 241 632 -1039 -379 742 -179 -361 773 -433 -1004 476 -57 -817 343 690 -713
4758 -713 -50 413 -826 -485 606 -418 -681 796 -188 -941 258 35 -908 265 549 -679 -129 755
4776 755 -691 -745 638 -38 -368 680 358 -972 159 542 -805 -146 934 -253 -115 732 -365
4793 -365 -863 792 393 -597 703 598 -591 147 606 -608 -149 871 -88 -411 741 154 -618 579
4811 579 333 -383 499 626 -576 -74 803 -343 -207 954 -32 -335 884 222 -923 401 671 -469
4829 -469 204 820 -405 -360 734 -320 -456 886 409 -446 559 330 -698 293 716 -483 81 986
4847 986 -490 -469 633 -149 -646 548 177 -514 292 767 -712 -221 601 -577 -273 765 -124 -728
4865 -728 805 153 -896 276 498 -816 -64 510 -724 -360 690 -374 -686 472 -322 -821 293
4882 293 249 -860 215 458 -646 -365 601 -452 -431 602 -111 -655 455 -20 -811 195 403 -968
4900 -968 -247 652 -569 -301 763 -366 -875 591 147 -665 475 266 -734 41 430 -728 -84 720
4918 720 -405 -605 761 48 -844 533 318 -679 161 729 -703 -341 741 -448 -271 608 -125 -597
4936 -597 677 108 -672 326 727 -654 3 780 -431 -119 999 -326 -405 635 309 -577 410 455 -518
4955 -518 225 669 -510 -89 807 -95 -455 665 125 -500 467 355 -791 380 653 -515 2 800
4973 800 -159 -146 675 -102 -589 603 121 -849 312 495 -555 -173 626 -455 -324 793 -289 -441
4991 -441 560 151 -775 259 327 -733 315 510 -678 -268 783 -105 -375 674 4 -392 567 374
5009 374 -728 407 652 -582 -210 782 -246 -76 586 -216 -425 648 -19 -776 410 217 -589 133
5027 133 601 -614 -198 707 -432 -490 620 205 -602 488 394 -545 342 647 -699 -38 675 -238 -289
5046 -289 715 -41 -503 552 202 -611 401 375 -661 139 576 -460 -227 849 -94 -525 415 41
5064 41 -737 300 486 -812 239 609 -604 -299 632 -231 -562 715 -34 -622 418 234 -786 312
5082 312 416 -552 -194 508 -378 -418 487 -239 -701 513 165 -684 47 215 -646 -103 672 -424 -128 614
5102 614 -280 -595 548 95 -636 428 334 -804 20 626 -638 -43 740 -217 -368 605 -151 -515 562
5121 562 158 -691 253 535 -719 2 391 -455 -244 700 -115 -410 463 54 -683 181 328 -375 44 343
5141 343 -646 -224 495 -215 -656 606 8 -519 451 173 -677 251 483 -740 -251 669 -278 -714 439
5160 439 -401 -565 477 164 -615 174 319 -660 9 652 -267 -31 761 -243 -496 455 160 -554 362
5179 362 434 -417 117 702 -498 -142 712 -44 -226 686 258 -642 323 82 -477 377 572 -375 -25 484
5199 484 -432 -235 663 -129 -287 941 393 -518 165 475 -525 306 690 -149 -14 728 -203 -622 438
5218 438 79 -414 544 436 -713 179 589 -388 -136 808 -253 -372 523 -150 -617 435 415 -582 314
5237 314 389 -592 -394 405 -412 -135 585 -222 -432 424 -47 -735 228 437 -596 193 439 -584 -279 628
5257 628 -187 -479 527 67 -458 210 111 -830 44 517 -577 -134 707 -401 -408 410 -336 -531 620 408
5277 408 -717 51 193 -837 -242 519 -200 -177 769 -149 -686 390 35 -652 447 403 -403 129 385
5296 385 -482 -295 691 -112 -268 550 74 -715 374 90 -538 309 801 -502 -248 440 -351 -231 648
5315 648 -74 -358 709 81 -758 -104 417 -629 81 654 -323 -190 703 -199 -626 667 266 -242 566
5334 566 418 -630 52 347 -384 -49 826 -36 -297 680 -131 -677 387 423 -414 363 557 -694 -308
5353 -308 415 -317 -145 705 92 -470 485 163 -899 342 413 -411 240 621 -693 -410 428 -228 -348
5372 -348 707 17 -577 276 -111 -1000 50 744 -333 -225 460 -356 -644 114 -113 -725 400 332 -565
5391 -565 -113 92 -754 -82 581 -465 -331 518 -248 -809 243 32 -557 430 402 -649 -6 357 -729
5410 -729 -308 539 51 -348 440 9 -632 300 252 -599 364 683 -381 -108 509 -542 -326 656 155 -242
5430 -242 715 320 -818 172 543 -473 232 873 -145 -87 720 -237 -604 744 465 -140 554 476 -539
5449 -539 51 740 -245 302 968 267 -177 481 -82 -419 502 486 -275 329 442 -616 -255 332 -268 -22
5469 -22 767 -125 -348 536 -99 -918 191 441 -458 200 506 -631 -480 329 -307 -471 432 125 -630 130
5489 130 78 -973 79 555 -323 -268 385 -402 -793 122 -361 -539 673 193 -632 -156 17 -685 -89 524
5509 524 -504 -212 309 -409 -844 171 129 -497 186 408 -527 -190 319 -546 -82 729 9 -303 661 72
5529 72 -565 334 255 -528 536 605 -297 -250 401 -296 -446 754 109 -125 616 191 -680 87 560 -124 207
5550 207 868 -232 -184 655 -314 -434 804 482 -276 511 217 -677 5 578 -427 27 804 -265 -623
5569 -623 390 -399 -637 536 261 -568 286 238 -675 -219 132 -294 73 819 -375 -725 212 105 -505
5588 -505 365 393 -124 202 436 -799 -437 518 -263 -284 629 -42 -522 -62 1 -672 -2 781 -362 -250
5608 -250 457 -398 -413 376 43 -407 793 186 -588 120 200 -480 74 754 -114 -48 600 -277 -626 478
5628 478 200 -188 539 530 -592 -3 357 -481 -185 717 -6 -316 618 -94 -711 335 437 -446 354 631
5648 631 -502 -123 416 -208 -345 720 116 -419 492 366 -889 -141 367 -358 166 476 -334 -289 434
5667 434 -315 -684 611 214 -519 59 -10 -834 16 492 -243 -5 508 -180 -581 254 -348 -494 454 369
5687 369 -377 148 421 -854 -215 442 -132 -88 800 41 -585 489 -76 -507 374 591 -115 220 493 -756
5707 -756 -272 604 13 -33 690 144 -529 298 26 -580 263 896 -57 -48 465 -444 -472 586 64 -200 544
5728 544 261 -499 -73 422 -529 32 581 -278 -357 547 -401 -626 511 84 -304 443 379 -591 -191 252
5748 252 -454 -33 843 157 -192 378 -215 -865 250 237 -338 236 568 -371 -341 138 -571 -381 599 264
5768 264 -516 389 -131 -1069 -52 531 -371 191 565 -496 -429 327 -380 -571 643 254 -243 193 26
5787 26 -859 73 626 -459 -175 601 -236 -523 320 -171 -508 452 641 -358 139 207 -596 -155 570 -233
5807 -233 274 882 -159 -481 308 106 -496 304 552 -514 95 659 -680 -480 684 169 -118 738 328
5826 328 -650 381 299 -461 330 736 -203 -58 383 -435 -365 428 118 -352 694 304 -1013 97 237
5845 237 -464 110 723 -325 -286 524 -445 -585 394 319 -155 311 378 -564 -2 275 -446 -295 790 3
5865 3 -344 240 -242 -717 324 394 -335 231 629 -526 -299 389 -459 -127 732 46 -456 154 212 -850
5885 -850 125 394 -342 149 171 -747 -514 429 -149 -362 613 281 -420 231 -168 -885 -185 592 -381 -133
5905 -133 492 -396 -726 157 -300 -481 492 292 -538 167 165 -500 -298 346 -261 69 637 -198 -670 368
5925 368 70 -416 343 433 -531 398 534 -386 -391 563 275 -121 558 92 -376 93 326 -287 341 549 -133
5946 -133 -150 298 -487 -342 753 343 -281 648 437 -508 194 512 -466 314 785 -147 -233 259 -114 -515
5966 -515 399 333 -274 573 229 -634 -40 504 -290 -18 839 -14 -426 25 -191 -737 385 467 -479 113
5986 113 392 -642 -448 301 -236 -132 683 11 -591 233 -65 -845 121 289 -496 150 338 -644 -682 340
6006 340 -247 -490 408 246 -562 5 -21 -714 -140 488 -443 -327 381 -233 -504 239 -332 -307 511 403 -456
6027 -456 13 353 -460 -214 637 -117 -97 589 -147 -478 49 95 -301 451 444 -162 -28 569 -633 -62 593
6048 593 177 -89 502 39 -497 271 117 -315 241 737 -285 8 372 -452 -344 718 240 -301 648
6067 648 314 -475 113 405 -293 136 738 -123 -280 549 -397 -670 357 283 -250 125 233 -681 19 289
6087 289 -415 -29 642 -167 -389 332 -175 -731 322 386 -261 101 526 -300 -321 192 -418 -215 747 42
6107 42 -470 231 4 -592 46 335 -296 118 277 -496 -420 446 -274 -434 382 286 -484 201 67 -591 205
6128 205 584 -191 5 457 -225 -467 472 73 -449 521 289 -308 -52 311 -477 -14 573 -188 -11 648
6148 648 33 -543 275 275 -389 360 334 -361 13 238 -250 -260 659 -6 -358 445 -82 -578 155 311 -609
6169 -609 308 790 -450 -321 345 -379 -478 601 93 -425 292 385 -634 5 280 -372 37 742 -232 -492
6189 -492 233 -143 -514 391 374 -459 137 175 -579 -122 246 -393 -247 574 -234 -220 275 9 -577 367 331
6210 331 -543 216 384 -336 -371 427 -134 -71 454 68 -489 260 119 -313 275 480 -414 80 568 -432
6230 -432 -330 378 23 -216 379 159 -411 53 197 -764 -47 569 -295 -206 507 -240 -675 377 13 -323
6250 -323 413 377 -521 79 221 -646 219 392 -168 -174 273 -72 -632 242 118 -253 222 203 -480 -13 230
6271 230 -535 -106 574 70 -231 242 -247 -599 232 214 -488 376 473 -269 -299 252 -456 -368 816 150 -414
6292 -414 174 160 -465 80 457 -270 187 487 -67 -320 469 -99 -484 526 293 -118 434 326 -581 -74
6312 -74 450 -147 -186 705 -1 -361 317 -174 -490 342 480 -155 58 316 -362 -186 435 -204 67 596 72
6333 72 -370 123 60 -351 465 323 -188 -29 434 -331 -254 603 29 -39 390 156 -530 61 189 -491 -96
6354 -96 658 -55 -165 458 -203 -292 447 -111 -377 312 241 -445 -89 98 -415 -54 438 -166 -160 297 -90 -438
6376 -438 132 203 -249 419 288 -519 -75 282 -345 -327 451 41 -276 443 -186 -650 185 298 -389 -102 540
6397 540 -194 -302 219 -190 -216 412 116 -369 84 68 -475 -234 90 -112 0 445 -345 -426 372 -49 -241
6418 -241 396 309 -497 213 184 -459 1 677 -171 -24 694 -153 -324 149 -93 -372 464 189 -216 -33 264
6439 264 -219 -333 370 -31 0 537 58 -469 143 165 -121 146 403 -46 -31 510 -361 -173 405 91 -227
6460 -227 480 93 -444 271 -21 -361 15 438 -251 -173 87 -165 -504 301 2 -220 202 140 -478 -114 126
6481 126 -418 -34 306 -261 -281 353 -200 -535 282 255 -434 199 371 -484 -121 294 -382 -343 202 -60 -256
6502 -256 329 -52 -339 47 35 -345 37 359 -298 -218 342 -394 -290 402 50 -460 -14 117 -600 83 187
6523 187 -486 -185 428 -350 -506 257 2 -406 227 212 -200 6 304 -437 -28 364 66 -12 585 -72 -436
6544 -436 147 171 -268 381 675 -283 80 138 -243 -97 482 -95 -153 437 77 -304 225 169 -357 420 534
6565 534 -359 46 438 -67 -139 237 73 -174 433 110 -352 270 252 -435 -248 527 -246 -211 430 -150 -185
6586 -185 290 104 -433 327 260 -333 -96 324 -250 84 321 -228 -368 348 -89 -580 283 69 -214 267
6606 267 283 -555 -129 214 -171 -241 374 -34 -265 299 -99 -559 173 199 -375 98 328 -258 -247 325 -257
6627 -257 -324 428 118 -481 107 33 -542 -33 310 -320 12 394 -404 -475 229 3 -83 274 186 -378 186 132
6649 132 -736 22 295 -326 -245 358 -226 -470 294 9 -374 338 263 -465 -107 128 -361 -285 425 -163 -284
6670 -284 363 -19 -560 69 167 -227 239 382 -433 15 376 -264 -268 385 142 -133 378 13 -450 237 146
6691 146 -332 63 393 -133 -165 421 -117 -85 382 172 -643 309 65 -344 -82 407 -159 -2 478 -81 -455
6712 -455 505 -17 -400 321 333 -274 221 129 -454 -31 499 -134 -256 469 45 -233 378 136 -438 284 421
6733 421 -301 -46 444 -260 -259 133 22 -302 406 -66 -316 288 305 -348 213 319 -226 -67 524 -140 -370
6754 -370 275 -10 -99 90 110 -313 249 125 -428 -131 316 -21 -222 270 -51 -144 339 -26 -307 181 382
6775 382 -272 -169 274 -480 -129 349 -98 -316 253 -139 -399 252 195 -474 -121 185 -242 34 488 -134
6795 -134 -204 561 -1 -113 336 59 -413 127 307 -265 -36 587 -219 -299 424 -149 -365 344 117 -486 239
6816 239 105 -245 138 239 -275 -140 343 -169 -203 464 45 -327 114 116 -293 220 158 -318 -62 384 -304
6837 -304 -367 255 -23 -291 156 67 -285 219 341 -448 57 424 -249 -46 471 -218 -72 391 -30 -206 -10
6858 -10 394 -500 158 134 -209 46 486 -110 -265 428 -87 -277 271 -3 -476 -27 141 -470 -128 336 -40
6879 -40 -348 365 -41 -334 374 41 -622 25 257 -348 -40 300 -560 -177 312 -272 -61 269 -32 -364
6899 -364 202 112 -179 179 216 -367 -155 325 -245 -293 411 128 -226 294 75 -198 162 421 -251 101 371
6920 371 -300 -84 323 -133 -363 271 232 -283 196 194 -247 77 514 -184 35 248 -202 -99 357 217 -324
6941 -324 189 53 -229 236 253 -352 87 624 -199 -11 341 19 -221 330 247 -258 211 265 -305 292 317
6962 317 -154 -23 598 -91 -297 311 90 -255 217 230 -394 183 477 -324 -29 177 -216 -113 235 -182
6982 -182 -307 166 170 -387 188 223 -388 141 348 -296 -106 400 -112 -297 262 -62 -419 159 210 -326 26
7003 26 322 -188 -176 250 -221 -327 265 18 -406 212 167 -433 270 389 -140 -41 279 -161 -290 375 -82
7024 -82 -425 433 289 -271 187 121 -253 103 217 -115 -30 319 -63 -247 410 64 -631 326 153 -273 -1
7045 -1 353 -402 -99 164 -194 -352 308 284 -135 254 -2 -308 143 317 -273 -203 424 -90 -288 401 -60
7066 -60 -5 343 138 -394 77 215 -486 46 260 -218 -118 364 -254 -359 152 -7 -385 209 217 -242 75
7087 75 231 -204 -249 477 -340 -204 460 -188 -309 98 92 -419 142 -78 -455 68 269 -424 -192 329 -148
7108 -148 -150 369 36 -461 207 187 -523 -45 271 -433 -168 424 -216 -100 341 -203 -284 172 139 -391 -63 300
7130 300 -420 -246 328 -218 -185 271 -96 -195 193 89 -346 65 186 -303 -157 331 -234 -74 617 -90 -264
7151 -264 224 -63 -337 270 313 -427 130 369 -189 22 311 -119 -199 357 79 -92 95 184 -350 214 459
7172 459 -295 129 477 -221 49 466 19 -288 471 227 -331 131 304 -288 57 429 -43 -144 420 -47
7192 -47 -253 408 56 -252 349 420 -434 334 277 -147 158 444 129 -210 391 -83 -325 380 170 -299 35
7213 35 492 -313 -43 370 -263 -134 354 -67 -329 309 147 -494 177 -33 -332 180 283 -390 -181 342
7233 342 -260 -232 253 -14 -296 -107 241 -373 81 234 -483 -10 244 -345 -514 62 -48 -153 72 130 -443
7254 -443 134 108 -440 -59 273 -233 -77 297 -99 -463 73 -151 -283 186 160 -379 -228 8 -515 -129 373
7275 373 -126 -425 467 -50 -459 65 9 -428 -118 242 -397 -2 243 -233 -332 453 -128 -269 505 122 -592
7296 -592 151 109 -452 201 481 -63 -30 344 -131 -241 473 60 -312 355 441 -333 247 220 -120 -6 562
7317 562 -191 -224 508 -139 -309 383 225 -357 268 349 -444 85 292 -219 81 468 -68 -306 264 19 -399
7338 -399 295 217 -281 145 500 -188 109 395 17 -248 334 80 -219 267 174 -421 311 292 -108 -17 435
7359 435 -131 -136 370 -91 -225 541 362 -552 -97 308 -303 65 390 -113 37 432 -138 -374 252 46 -297
7380 -297 136 239 -347 63 226 -416 -149 464 49 -317 307 -89 -359 90 -3 -529 -19 324 -335 40
7400 40 119 -341 -210 288 9 -254 518 128 -704 -72 244 -211 100 219 -62 -241 496 -70 -326 479 154
7421 154 -237 111 104 -299 22 253 -132 91 444 -276 -235 238 -70 -347 149 230 -175 142 437 -345 -137
7442 -137 241 -177 -185 344 -42 -324 350 -65 -194 16 298 -132 54 278 -371 -113 401 -288 -393 325 8
7463 8 -249 149 -63 -426 4 158 -404 65 388 -34 -284 334 68 -271 192 36 -367 210 171 -375 45
7484 45 143 -279 -228 571 -106 -368 179 4 -326 131 178 -337 88 192 -253 -116 502 -256 -246 347 -68 -462
7506 -462 55 -63 -443 149 223 -270 -218 334 -236 -413 167 -251 -357 184 109 -406 126 106 -271 -52 156
7527 156 -323 -184 139 -199 -313 177 2 -181 340 216 -293 87 228 -355 32 187 6 -292 236 -40
7547 -40 -352 310 -40 -281 174 203 -350 -169 270 -202 -37 434 -86 -73 201 27 -355 301 446 -140 106
7568 106 312 -255 -168 368 -162 -343 276 90 -426 117 70 -327 28 307 -147 -8 456 -73 -145 288 -180
7589 -180 -220 286 124 -208 82 334 -445 10 378 2 63 328 -178 -366 361 -25 -460 297 380 -186 47
7610 47 202 -245 -71 502 -141 -127 397 153 -490 135 154 -397 156 233 -88 159 192 -201 -219 216 47 -356
7632 -356 102 -45 -371 -19 129 -269 87 246 -279 -195 271 -155 -376 289 194 13 172 5 -242 119 361
7653 361 -146 188 471 -32 -275 256 19 -356 164 59 -284 34 225 -219 -175 179 -127 -152 313 -225 -301
7674 -301 244 -54 -218 273 420 -314 114 222 -356 -209 215 -83 -106 229 40 -334 64 121 -419 95 277
7695 277 -311 62 232 -352 -373 150 -73 -213 310 228 -347 129 134 -184 -46 332 2 -37 256 -23 -444 188
7717 188 163 -206 -13 299 -299 80 126 -681 -212 265 -198 -118 255 86 -436 65 -128 -353 298 294 -448 -279
7739 -279 276 -358 -294 239 -39 -148 232 66 -372 -69 303 -243 73 451 -270 -121 146 -52 -288 418
7759 418 192 -198 238 -4 -510 58 248 -182 -27 529 -91 -217 227 -120 -238 174 98 -271 123 276
7779 276 -215 -107 398 -105 115 363 -53 -211 229 -146 -263 173 279 -160 6 383 -186 -108 334 209
7799 209 -420 344 66 -347 67 258 -400 351 326 19 105 391 -89 -92 450 -8 -14 392 114 -253 -73 273
7821 273 -348 -19 490 -195 256 348 -282 -381 54 209 -84 300 83 -197 -118 192 -285 -42 413 22 -219
7842 -219 97 -67 -496 -35 125 -357 126 346 -307 11 240 -300 -199 233 58 -176 20 -73 -422 205
7862 205 92 -239 -26 192 -174 -28 120 -267 -356 30 190 -323 106 87 -174 -76 248 -382 -10 391 16
7883 16 -284 80 -187 -244 76 154 -76 105 201 -193 -156 212 -157 -100 426 -135 -269 123 142 -338 58 296
7905 296 -162 65 73 -200 -173 240 -33 -15 300 -38 -231 -168 50 -162 -63 458 -148 -117 25 -290 -205 376 94
7928 94 -266 186 138 -340 -67 264 25 38 279 -70 41 54 29 -299 122 325 -206 313 168 -241 -7 78
7950 78 -342 -127 496 -51 -206 82 -26 -135 141 27 -196 90 188 -291 -126 218 -257 -229 162 -39 -336
7971 -336 114 111 -423 -92 366 -257 -117 220 -110 -183 343 -112 -431 327 175 -461 181 47 -365 -124 219
7992 219 -163 -45 372 -97 -367 146 88 -345 241 351 -346 16 239 -324 -126 147 -47 -130 337 -66 -445
8013 -445 220 186 -231 43 153 -210 14 355 -230 -358 399 -97 -83 293 195 -409 100 61 -425 77 354
8034 354 59 -58 310 -235 -237 305 7 -209 262 242 -241 -61 228 -33 118 306 -268 77 376 -126 -128 224
8056 224 110 -171 111 277 -111 73 157 -192 -206 418 89 50 308 4 -119 269 251 -244 191 421 -146
8077 -146 -29 209 -120 -149 328 -32 -284 124 11 -437 117 320 -351 -16 340 -214 -211 169 -161 -210 340
8098 340 59 -257 51 306 -401 -176 279 -200 -75 207 -125 -317 229 -162 -281 315 231 -294 43 212
8118 212 -258 41 394 -97 -257 151 -111 -383 166 193 -222 80 220 -336 75 48 -281 -407 305 -89 -267
8139 -267 164 -2 -426 8 -29 -618 25 237 -170 -125 205 -383 -179 255 -114 -325 231 39 -336 -22 98
8160 98 -418 -107 520 -143 -96 215 -43 -306 231 156 -246 110 193 -337 126 295 -37 -19 422 37 -152 76
8182 76 117 -318 214 179 -117 208 300 -213 -185
8191a85
$$ Imaginary data points
##PAGE= N=2
##DATA TABLE= (X++(I..I)), XYDATA
0 0 0 0 0 0 0 0 0 0 0 -8 8 -8 8 -8 16 -16 16 -24 24 -32 35 -41 49 -56 65 -73 83 -97 108 -122 139 -155 172
33 172 -195 216 -243 269 -297 332 -367 407 -451 499 -551 611 -678 754 -840 938 -1055 1188
51 1188 -1351 1552 -1802 2131 -2581 3241 -4301 6281 -11308 52336 77995 -2917 7430 2053
65 2053 1566 21843 41082 40048 71282 58351 -11005 -34542 6912 22809 36550 56831 40374
78 40374 17916 24664 -6555 -42338 -2184 52415 47918 37044 22589 -16382 -22174 1300 -9730
91 -9730 -5111 46757 55003 8989 -16610 -31842 -38221 1382 30049 7601 11514 34086 -2739
104 -2739 -49608 -40826 -18129 8520 41384 23404 -19584 -12607 -8182 -44708 -40802 7601 26382
117 26382 26804 16925 -30263 -53493 -17620 -5092 -18526 10642 37256 13000 -12927 -32357 -53153
130 -53153 -23110 28299 21155 2297 16906 3079 -32923 -32656 -22547 -10487 34128 49589 264
143 264 -25639 -11571 -20927 -24629 4178 17378 24441 38126 2914 -49406 -33028 5209 4950
156 4950 13252 29815 14629 1724 -5006 -38872 -40670 16630 42018 17494 9272 1145 -22756
169 -22756 -20365 -13063 -19771 12016 52280 23388 -22861 -24810 -23328 -22547 4395 14747 7083 23611
183 23611 18621 -33564 -49413 -17228 715 14272 28455 6088 -15111 -5457 -21141 -47197
195 -47197 -15039 28135 25037 13290 -2335 -34330 -32550 -5488 -11943 -11250 27569 32735 -5508
208 -5508 -25096 -33627 -33996 2893 26130 4278 3302 20020 -9072 -41506 -28262 -8471 10631
221 10631 36753 20942 -18313 -14319 -5379 -27539 -21158 14872 24579 23167 16506 -22882 -42076
234 -42076 -8181 7850 -3090 15028 30048 8315 -8656 -20925 -38215 -12880 32173 25423
246 25423 2570 8368 -1405 -25639 -21309 -12701 -5111 30333 40457 -4277 -28259 -14240 -16596
259 -16596 -16148 6946 13752 14472 23018 -5394 -46705 -30876 3110 4735 10453 18936 818 -10748
273 -10748 -10766 -34066 -35501 11278 31397 9254 -1262 -10478 -29293 -21299 -9008 -15755 4839
286 4839 35392 11463 -26387 -27251 -24691 -19596 7186 13000 -1219 9976 8892 -30891 -42507
299 -42507 -13301 2475 12925 22652 -531 -20636 -8489 -15736 -35163 -8804 24467 18720 7845
312 7845 -5199 -32360 -28079 33 -3065 -5844 21914 22941 -8849 -22158 -26862 -26402 5759 26806
326 26806 5012 -1342 10031 -11718 -33350 -18858 -4032 9103 30130 15872 -20809 -18786
338 -18786 -7179 -19955 -12899 13866 16744 13887 9012 -23336 -38672 -7331 9398 209 11267
351 11267 18579 -1211 -12258 -17472 -30452 -10342 27637 21007 -1437 685 -7211 -23278 -14036
364 -14036 -5645 -2769 23220 30795 -7133 -26472 -12476 -11764 -8425 12083 13246 7726 15536 -4311
378 -4311 -35975 -21526 7995 9639 13581 17735 -2175 -11220 -5034 -20342 -21987 15401 30375
391 30375 10025 864 -7662 -23169 -11769 3254 -3892 8148 30950 10817 -19404 -18475 -15359
404 -15359 -9291 15306 18418 1034 7287 8117 -21556 -28255 -3537 8195 15225 22197 659 -18001
418 -18001 -6017 -7155 -20450 14 23420 15833 6792 -2707 -25076 -20042 6989 5681 426
431 426 18621 17381 -7506 -14513 -15995 -16150 10755 28281 7844 -892 7645 -7230 -20622 -5651
445 -5651 4814 12103 29244 16943 -14915 -12552 1170 -6300 751 20782 18806 14275 12481 -11977
459 -11977 -23932 4309 19740 11179 18467 21134 2561 -2905 -2053 -11899 3495 34123 27285 6396
473 6396 7418 1169 -9423 2658 10857 9062 27021 32670 1454 -13340 -115 1727 5974 23207
487 23207 19957 10768 17106 4535 -19289 -6633 17085 17034 18963 20449 1340 -5623 3657 -5862
501 -5862 -8036 19852 28946 11109 4046 -2637 -15076 -3271 11704 3965 9646 25167 8405
514 8405 -13794 -10414 -7434 -3035 17506 19146 835 3666 5986 -15321 -17753 2906 9503 12986
528 12986 18793 189 -16857 -4930 -2275 -11555 4527 20222 9984 3621 -1669 -19815 -15506
541 -15506 8886 8543 1851 14197 10362 -9344 -10525 -9067 -10992 9544 23675 5294 -3675 2882
555 2882 -7874 -15412 -529 5424 6686 19562 10441 -15718 -12952 -328 -5398 805 15226 8902
569 8902 3188 4364 -13019 -22059 656 12329 4023 8442 8305 -8519 -10191 -5808 -13696 -3731
583 -3731 19164 12067 -5483 -4427 -9403 -17004 -4297 2855 -2044 8598 12862 -11173 -21322 -9210
597 -9210 -8195 -4338 10091 4963 -6199 -722 -7358 -24635 -13625 4782 2823 3907 5030 -11774
611 -11774 -17035 -5706 -10860 -13344 7433 12598 -3129 -6252 -9775 -20141 -8893 5801 -1697
624 -1697 -244 11412 -1466 -17088 -10714 -8086 -6277 10970 12186 -4654 -2603 1407 -13282 -12927
638 -12927 4630 6490 7257 13650 -510 -14613 -3083 1630 -5124 6669 17292 6627 2592
651 2592 1851 -11886 -8608 12363 11535 4380 13199 9063 -5938 -3266 69 -3373 11198 22485
665 22485 6918 -1176 4848 -2957 -7056 6646 9668 7056 16475 10310 -10000 -6814 4478 463
679 463 5128 15992 7740 1355 5341 -5979 -13245 4674 12913 4448 8112 7430 -7381 -6602 626
694 626 -6434 -1151 16226 9140 -4892 -1859 -5419 -12103 273 6295 -1463 5328 9092 -8760
708 -8760 -14669 -3493 -4427 -2643 9813 3963 -7404 -1180 -4052 -17103 -7390 6159 1301 1654
722 1654 4351 -9793 -14333 -2766 -5674 -9004 6233 8018 -5477 -5637 -6575 -15561 -6806 5881
736 5881 -1675 -2657 5953 -4284 -15142 -7178 -5243 -6838 6104 7092 -7584 -6194 -1839 -12483
750 -12483 -11003 2896 1279 -666 5754 -4564 -15734 -5653 -1106 -7557 1306 8167 -2961 -5065
764 -5065 -2243 -12668 -11083 5391 3326 -3657 3827 132 -11908 -6575 -2056 -7419 1914 11014
778 11014 -1769 -7779 -766 -7161 -9576 2766 3256 -1969 5983 3213 -12442 -7873 1640 -3521
792 -3521 213 9573 615 -5166 1287 -5372 -11267 2748 8155 -119 3469 4252 -8140 -6197 2664
807 2664 -3668 -1374 11479 5157 -5069 -78 -2007 -8083 2505 7916 -495 3502 7969 -5060
821 -5060 -8018 2332 -136 -386 10250 5398 -4809 1651 1390 -8252 -596 9104 2570 2807 6940
836 6940 -3888 -7289 3463 1060 -3005 8150 8036 -3068 -178 1228 -7444 -1175 9343 1729
850 1729 -371 7411 -593 -8052 586 1211 -2833 6864 8076 -4020 -2188 2996 -5747 -3954 7217
865 7217 2719 -559 6523 -241 -9306 -128 3647 -3417 3219 8307 -2188 -2489 2758 -5493 -5466 7159
881 7159 4396 -2420 4751 2171 -7668 -1284 3449 -3519 2206 9355 -814 -4289 2852 -2131 -5150
896 -5150 5601 4703 -1983 4787 4212 -6907 -2445 5036 -1307 848 8886 865 -3791 3893 -244
911 -244 -5825 4544 7260 -1135 3119 5230 -4708 -2418 5742 -550 -684 9099 3673 -3983 2812
926 2812 1730 -4842 3639 7705 -964 2093 6978 -2804 -3593 5291 1303 -1116 7860 4098 -4295
941 -4295 2657 3734 -4780 1226 7907 140 534 6369 -1687 -4721 4876 1926 -3212 5772 5372 -3995
957 -3995 692 3499 -4827 -695 7276 -269 -2430 5352 -406 -5887 2483 2063 -4325 3305 4988
972 4988 -4883 -1966 3318 -4197 -3511 5190 -526 -4113 3843 -315 -7473 483 2468 -5159 -379
987 -379 4081 -4942 -4119 2442 -4306 -5794 3508 -97 -6111 1228 355 -7718 -1745 2018 -5976 -2795
1003 -2795 3781 -4357 -6094 1645 -3075 -7052 1699 33 -7070 -273 1376 -7342 -3225 2508 -4910
1018 -4910 -4369 3068 -3323 -6723 1564 -1265 -7456 653 1676 -6466 -1382 2311 -5870 -3597 3492
1033 3492 -3609 -5067 3420 -936 -6333 1856 1174 -6080 384 3432 -5012 -1860 4184 -3265 -3473
1048 -3473 4376 -827 -4766 3755 1270 -5332 2119 4092 -4059 52 4979 -2889 -1676 5568 -441
1063 -441 -2626 5463 2021 -3960 3419 3921 -3153 2543 6100 -2223 164 6424 -860 -2017 6466
1078 6466 2385 -2021 5550 4054 -3126 2884 5569 -1881 1744 7778 181 -554 6653 970 -2071
1093 -2071 6429 4553 -1769 5207 6039 -2571 1637 6410 -839 1345 8141 1712 -1214 6129 2372
1108 2372 -2894 5092 5642 -1234 4067 6301 -2466 84 6503 -116 -423 7558 2908 -2201 4675
1123 4675 2539 -4139 3388 6386 -1384 2040 6358 -2043 -2265 4859 -181 -2099 6357 3369 -3581
1138 -3581 2224 2448 -4672 530 5138 -1569 -140 5216 -2457 -5119 2774 60 -3910 4075 3113
1153 3113 -4600 -7 1631 -6213 -2521 4561 -1480 -2551 3629 -2142 -6683 729 -524 -5375 2067
1168 2067 3683 -5064 -2827 882 -6145 -4412 3671 -1289 -4014 2942 -1334 -8333 -1463 -34 -5344
1183 -5344 566 3801 -4876 -3954 1111 -5677 -6185 2957 5 -3955 1973 -788 -8206 -2426 1037
1198 1037 -5254 -671 5001 -2767 -4716 373 -4443 -6472 3010 1919 -4077 1776 1535 -7356 -3733
1213 -3733 1342 -3794 -705 5679 -1631 -5243 1264 -2156 -6644 1694 3488 -2313 1692 2685 -6419
1228 -6419 -4413 3142 -1973 -1991 5842 1218 -4315 837 -1297 -6560 1818 5531 -1367 580 3898
1243 3898 -4087 -4528 2395 -1052 -1460 6933 3473 -4515 93 773 -5224 475 6235 60 1322 5238
1259 5238 -2904 -5721 2506 1645 -1106 6156 4754 -3123 316 1988 -4930 -250 7661 2569 512
1274 512 5013 -1034 -4989 2634 2390 -1484 6130 7458 -2001 -1250 1992 -3281 -532 7756 2993 282
1290 282 6175 1150 -6045 459 3723 -175 5335 7440 -1573 -1461 3444 -2858 -2879 6690 5065 601
1306 601 4558 875 -6311 163 4322 -1207 2726 7987 219 -3203 1081 -3261 -3674 5906 4909 -1191
1322 -1191 2694 2058 -6193 -3388 2253 -1177 1849 7634 -680 -5640 54 -2171 -5691 2419 4615
1337 4615 -1100 1840 1345 -7940 -5847 2381 -1208 -1361 5380 610 -5509 -1427 -3539 -7865 1315
1352 1315 5794 -1771 -1323 1017 -6465 -6549 212 -2218 -2044 6090 1551 -7337 -3589 -2072 -6461 -475
1368 -475 4419 -1273 -631 2293 -6165 -9162 -202 667 -1701 4165 2116 -6113 -2663 -1458 -7517 -2265
1384 -2265 6366 1639 -1342 1130 -4636 -7767 370 685 -2713 4302 5522 -4236 -4882 -1465 -5212
1399 -5212 -1300 6371 1601 -1859 3165 -1511 -8531 -2320 2027 -234 4729 5504 -4044 -4325 804
1414 804 -4101 -3974 5362 4592 4 2507 -1836 -8414 -1267 4020 -936 2224 6943 -494 -4301 -998
1430 -998 -4421 -3584 6760 5663 -1738 1460 1099 -6589 -3392 2029 -154 3492 8229 -923 -6765
1445 -6765 -536 -1641 -4298 3429 5607 419 2334 821 -8408 -5388 3724 1431 698 5936 869
1460 869 -5083 -1223 -3059 -6030 3361 8055 458 -826 462 -5758 -5026 1773 -179 298 7608 2826
1476 2826 -6934 -4142 -1400 -4032 1994 6094 90 71 2844 -5443 -8857 700 3025 1146 5299
1491 5299 2034 -5680 -2351 -206 -5919 -720 8142 3782 -448 875 -4706 -6609 1907 2662 -1138
1506 -1138 5314 6398 -3304 -4835 -1583 -3619 1113 8470 3101 -1300 3406 -648 -7269 -1062 3836
1521 3836 2699 6923 6346 -4014 -4009 1946 -1710 -1362 7264 6701 2031 3106 -1692 -7513 838 6843
1537 6843 2095 3988 7671 761 -3168 -30 -2527 -776 9468 8284 -262 1552 1772 -4360 -1458
1552 -1458 4126 2337 5714 9424 32 -6296 -173 741 -1052 5702 6836 1667 3175 1322 -7391
1567 -7391 -4273 5635 4320 2816 5835 731 -4269 -683 -1953 -4714 4608 9513 1442 -1470 -649
1582 -649 -5566 -4111 2945 934 804 7343 2355 -7500 -5338 -1849 -2858 3360 6141 -934 -1300 1483
1598 1483 -6213 -9091 86 3483 1573 4353 -113 -7616 -3646 -853 -5996 -1187 7125 2819 -2016
1613 -2016 -2158 -7132 -7848 1603 2482 -1981 2989 3818 -5189 -7166 -3996 -4807 652 7345 842 -4149
1629 -4149 -191 -3268 -8937 -2937 2023 1033 4752 3166 -7324 -7503 -593 -2662 -2848 4594 3918 -575
1645 -575 -255 -5226 -9954 -1260 5339 664 945 3826 -2440 -5795 -2641 -4515 -2020 7804 6410 -2836
1661 -2836 -2393 -1750 -5929 -2503 2698 1026 4136 7114 -2458 -8793 -2372 138 -616 5101 5316 -103
1677 -103 1441 -80 -8300 -4339 5789 5356 2995 4682 -758 -4781 -141 -836 -3202 5679 10345
1692 10345 2263 -1409 -898 -4542 -1633 5455 3137 2308 7960 3750 -5854 -3743 304 740 6436
1707 6436 8440 828 125 3253 -3419 -5855 3154 6792 5186 6526 1390 -5733 -1376 2380 -1715
1722 -1715 2150 9121 5381 209 -332 -5063 -4618 5105 5982 1243 4439 5045 -3207 -4893 -1615 -1460
1738 -1460 3972 9766 2697 -3484 83 -1460 -5846 -513 4068 3114 5902 3249 -6912 -6891 549
1753 549 -330 -453 5130 4051 -629 -592 -4964 -8993 -385 6593 1816 653 2134 -3709 -5679 -2670
1769 -2670 -4236 -1664 7494 5617 -4002 -4226 -3140 -6086 -2023 2274 89 2606 5140 -4339 -10237
1784 -10237 -4036 -433 -495 3979 2739 -2612 -1184 -2145 -9119 -5596 4553 4332 1253 1310 -4138 -6798
1800 -6798 -1703 -1995 -4281 3449 7535 -253 -4687 -4455 -6459 -2774 4252 1300 -488 4361 392
1815 392 -8101 -6154 -1624 -389 4950 5743 -2189 -3513 113 -5057 -6781 1395 4725 2955 3646 -1749
1831 -1749 -8571 -3382 1351 -2060 522 6715 2646 -2195 -2868 -6698 -5361 4563 5421 -257 1609
1846 1609 2286 -4632 -5554 -2368 -1988 3566 8630 1437 -5265 -1713 -2247 -4819 -29 3725 2823 5061
1862 5061 2383 -7450 -7060 1000 1342 895 5235 3160 -1092 -483 -4358 -7607 1112 8226 3448 1100
1878 1100 1492 -3282 -4397 -482 -1574 287 8507 6491 -2964 -3826 -2057 -3525 791 4685 1851
1893 1851 3216 5531 -2777 -8187 -1915 2169 2531 5834 3970 -1889 -306 -311 -6263 -3004 6573 6137
1909 6137 3001 2142 -3287 -5450 422 1032 -1304 5131 7990 807 -3269 -3107 -4607 -151 6596 3413
1925 3413 429 4164 1017 -6175 -4094 268 1846 6430 6224 -2018 -3280 692 -2969 -4257 2734
1940 2734 5466 3743 3616 -1682 -7790 -2486 3031 124 1650 6053 2380 -1941 -2612 -5641 -4077
1955 -4077 5443 6488 219 925 1308 -4184 -4150 -1084 -824 3970 8497 1080 -5828 -2488 -1574 -3368
1971 -3368 959 3675 2055 4023 1624 -7308 -6637 1368 2496 1760 4382 1630 -2261 -985 -3711
1986 -3711 -6632 1469 7320 3034 11 -493 -4318 -4257 104 -1159 -100 7268 4896 -3929 -4919 -2804
2002 -2804 -3030 1353 4488 1029 1298 3503 -3471 -7958 -2052 1878 2653 5199 2429 -3873 -1698 -699
2018 -699 -5301 -2509 5465 5316 1805 592 -4462 -5899 449 1641 -1001 3621 6193 -341 -4396
2033 -4396 -3826 -4624 -22 6319 2910 -1121 2145 -244 -6166 -3939 410 1389 5404 4986 -3442 -4714
2049 -4714 -534 -2511 -3339 2836 4536 2459 2275 -2800 -7953 -2655 3108 752 1365 4470 521 -2877
2065 -2877 -2635 -5199 -3590 5162 5911 -375 -902 -641 -4426 -3623 -333 -732 3159 6899 -46 -6482
2081 -6482 -3373 -1536 -2463 1964 3361 909 2314 536 -7083 -6447 1463 2622 1884 3430 105 -3301
2097 -3301 -1375 -2994 -5490 1440 6904 2562 -588 -1160 -4698 -3596 1182 -21 66 5904 3928 -4073
2113 -4073 -4718 -2561 -2091 2499 5268 810 412 2701 -2921 -6543 -880 2869 3238 5282 2047 -3881
2129 -3881 -1815 410 -3219 -799 5936 5075 1717 521 -3997 -4924 1784 3373 672 3826 5354
2144 5354 -340 -3351 -2267 -2901 1621 7497 3847 -521 1668 332 -4120 -1665 2018 2689 6219
2159 6219 5543 -2458 -3969 529 -294 -995 4095 4931 2590 2684 -1441 -6221 -912 4853 2589 2541 4139
2176 4139 522 -2058 -983 -3118 -1682 6125 6589 63 -828 -540 -3459 -1719 1534 522 3050 6557
2192 6557 89 -5894 -2660 -872 -769 2757 3472 326 1217 489 -6271 -5294 2094 2888 1813 2817
2208 2817 -962 -4064 -1543 -2260 -4405 1421 5957 1444 -1681 -2282 -5177 -3763 1382 55 -598 3606
2224 3606 1917 -5081 -5273 -2947 -2635 1600 3816 -1019 -1911 333 -3986 -6869 -1559 1352 1487 3061
2240 3061 -230 -5945 -3838 -879 -3687 -1858 3677 2273 -1076 -1668 -5335 -6116 522 2271 -1062
2255 -1062 1293 2169 -2836 -4511 -3187 -3580 100 5400 1662 -3103 -884 -1881 -4895 -2008 1094 908
2271 908 3597 3311 -4044 -5401 -625 -760 -777 3226 3049 189 737 -2209 -6285 -975 4300 2212 1427
2288 1427 2688 -997 -2810 -681 -2102 -1095 5250 5667 -272 -1034 -494 -2836 -362 2928 1226 2870
2304 2870 5511 362 -4554 -1468 545 578 4059 4162 393 1382 1180 -3805 -2789 3516 4195 2828
2320 2828 3766 -211 -2925 398 579 -1841 2798 6489 2161 -423 -603 -3002 -1333 3789 2419 886
2336 886 4511 2676 -3141 -2449 -365 -403 3555 5338 249 -960 1478 -1739 -3858 1014 3072 2508
2352 2508 3789 835 -4446 -2140 1135 -1249 56 4277 2374 -547 -424 -3550 -4241 1900 3510
2367 3510 89 1235 2107 -2371 -3193 -1310 -2112 772 5069 1746 -2850 -1086 -1299 -3656 -839 1594
2383 1594 802 2170 2370 -4014 -5087 -209 -227 -526 2607 1839 -954 -117 -2043 -5406 -1172 3763 1142
2400 1142 404 1305 -2196 -3435 -692 -1875 -1683 3822 3599 -1656 -2021 -1513 -3421 -722 2566 25
2416 25 787 3204 -1107 -5249 -1829 -181 -214 2793 2508 -1567 -813 91 -3966 -2823 2707 2512 1213
2433 1213 1710 -1426 -3888 -647 210 -2187 1755 4287 414 -1617 -1160 -3264 -1778 3137 1678 -655
2449 -655 2351 817 -3765 -2552 -292 -725 2652 4119 -760 -2290 259 -1865 -3022 1045 2284
2464 2284 935 2520 245 -4432 -2244 1304 -840 216 3489 1095 -1131 -311 -2856 -3467 2055
2479 2055 3286 -159 829 1285 -2603 -2553 -323 -1296 617 4597 1150 -2944 -806 -880 -2525 410 2213
2496 2213 172 1675 2045 -3201 -3773 367 338 -128 2607 1477 -1389 -75 -1064 -4028 -203 3736
2512 3736 1106 431 1322 -2121 -2726 627 -586 -777 3509 3100 -1653 -1392 -697 -2488 -17 3194 505
2529 505 475 2731 -842 -3828 -587 724 140 2877 2523 -1664 -774 707 -2562 -1596 3196 2235 915
2546 915 1861 -988 -3467 368 1248 -1046 1769 3804 -194 -1370 -73 -2002 -971 3507 1949 -441
2562 -441 1858 987 -2850 -1138 901 -137 2033 3981 -738 -1799 980 -1127 -2018 1982 2421 503
2578 503 2042 675 -3433 -1217 2100 -104 476 3204 567 -1199 444 -1610 -2529 2281 3032 -240
2594 -240 535 1097 -2395 -1682 927 -768 532 3975 1099 -2311 -334 -432 -2258 990 2511 -251
2610 -251 932 1760 -2493 -2981 871 379 -134 2768 773 -1969 80 -485 -2941 -28 3286 295
2626 295 -283 999 -1999 -2687 1017 -126 -1090 2581 1986 -2137 -1347 -253 -2459 -85 2646 -25
2642 -25 -632 1671 -1247 -3455 -343 535 -770 1807 1503 -2478 -1338 423 -2333 -1515 2129 758
2658 758 -512 946 -1284 -3361 -46 859 -1417 658 2127 -1205 -1711 -35 -2134 -1449 2548 1011
2674 1011 -1547 817 80 -3212 -1163 642 -961 838 2593 -1575 -2590 288 -1074 -1968 1274
2689 1274 1344 -883 646 82 -3410 -1415 1400 -559 -209 2162 -406 -2056 258 -1167 -2460 1659
2705 1659 2139 -984 67 711 -2442 -1467 1061 -733 -275 2892 281 -2731 -126 -6 -1812 936
2721 936 2057 -790 425 1580 -2075 -2134 1419 662 -279 2160 579 -2135 147 477 -1929 560
2737 560 2960 208 -197 1482 -1499 -1695 1700 822 -817 2297 1936 -1688 -199 764 -1251 705
2753 705 3215 280 -271 2130 -228 -2016 1157 1589 -186 2313 2164 -1487 -360 1642 -904 -291
2769 -291 3140 1328 -281 1932 -43 -1847 1454 1904 -493 1240 2488 -643 -630 1494 -650 -425
2785 -425 3069 1284 -794 1386 771 -1760 497 1747 -357 1106 2715 -665 -1358 1604 -62 -891
2801 -891 1999 1469 -877 1123 918 -2293 -514 2066 -468 -159 2122 -735 -1481 888 -397 -2034
2817 -2034 1416 1707 -1242 -330 662 -1986 -903 1385 -785 -963 1953 -248 -2507 191 -258 -2181
2833 -2181 521 1190 -1738 -694 1038 -2182 -2250 1034 -267 -1499 1172 -96 -2976 -198 -3 -2733
2849 -2733 -276 1622 -1266 -1289 377 -1825 -2300 800 -362 -2117 651 471 -2710 -904 103 -2270
2865 -2270 -708 1521 -1196 -1883 823 -1139 -2571 406 185 -1674 643 753 -2333 -1227 998 -1508
2881 -1508 -1284 1640 -363 -1589 960 -363 -2217 641 1010 -1521 176 1526 -1387 -866 1182 -968
2897 -968 -941 2212 635 -1359 917 638 -1685 298 1425 -937 388 2049 -729 -1147 1670 50
2913 50 -842 1784 1220 -1236 1151 1336 -1522 312 2282 -179 -56 2458 17 -934 1773 713 -1033
2930 -1033 1819 1685 -1193 533 1579 -884 -77 2185 -132 -587 2048 494 -1230 1415 1130 -956
2946 -956 1183 1910 -1058 250 1943 -635 -836 1883 281 -801 1535 744 -1304 1063 1423 -1421
2962 -1421 406 1927 -827 -631 1676 -562 -1269 1841 336 -1459 1221 987 -1706 484 1211 -1420
2978 -1420 -379 1806 -937 -1251 1602 -178 -1549 787 601 -1664 505 1032 -1825 -600 1693 -1323
2994 -1323 -1073 1495 -612 -1483 1231 -6 -1839 718 903 -1749 -298 1221 -1286 -645 1384 -888
3010 -888 -1422 1466 75 -1877 712 717 -1538 248 1105 -1680 -441 1576 -958 -985 1478 -202 -1463
3027 -1463 1081 336 -1628 513 1045 -1345 -48 1509 -1145 -848 1446 -472 -1145 1593 545 -1489
3043 -1489 870 1028 -1401 171 1391 -1162 -372 1921 -668 -1205 1384 148 -1403 1211 884 -1504
3059 -1504 329 1149 -1339 -182 1996 -650 -869 1382 -332 -1455 1394 502 -1525 833 1215 -1643
3075 -1643 -124 1246 -1063 -550 1601 -449 -1195 1272 58 -1780 579 975 -1265 122 1181 -1401
3091 -1401 -864 1209 -978 -1123 1552 17 -1473 640 41 -1922 325 968 -1594 -133 1512 -1113
3107 -1113 -1306 1103 -676 -1492 1197 328 -1795 669 565 -2126 -484 1023 -1256 -640 1309 -938
3123 -938 -1592 932 -305 -1783 892 830 -1523 167 672 -2035 -637 1308 -830 -846 1623 -259 -1714
3140 -1714 602 142 -1534 981 1397 -1250 -148 1316 -1414 -837 1364 -233 -827 1577 419 -1851
3156 -1851 580 815 -1411 372 1763 -788 -141 1591 -978 -1144 1712 817 -754 1514 940 -1350
3172 -1350 451 1283 -1221 474 2549 -108 -561 1712 -248 -1252 1401 1072 -671 1469 1738 -1104
3188 -1104 -214 1369 -474 86 2222 67 -762 1637 310 -1568 1376 1514 -674 979 1677 -1169
3204 -1169 -459 1363 -680 -691 2016 813 -763 966 303 -1601 624 1516 -683 471 1846 -700
3220 -700 -1114 1015 -244 -799 1778 656 -1342 673 841 -1722 -362 1570 -373 145 1605 -659
3236 -659 -1751 781 -331 -1656 1068 1052 -1104 -39 456 -1756 -597 1511 -502 -718 1377 -274
3252 -274 -1925 193 32 -1692 742 1539 -1368 -373 741 -1620 -1167 962 -290 -791 1485 -104
3268 -104 -2434 -108 161 -1637 219 1348 -705 -562 735 -1686 -1878 1130 293 -892 994 348
3284 348 -1926 -527 212 -1742 -136 1945 -554 -1297 516 -1048 -1911 788 405 -1095 860 798 -2078
3301 -2078 -1271 583 -1220 -170 1806 -254 -1204 758 -676 -2094 443 1064 -711 551 966 -1649
3317 -1649 -990 903 -1040 -715 1982 750 -1102 543 -304 -2076 486 1387 -703 429 1456 -938
3333 -938 -1315 812 -531 -394 1951 869 -1347 260 553 -1859 -305 1666 -244 198 1617 -772
3349 -772 -1777 1022 170 -887 1474 1684 -618 256 452 -1803 -259 1894 182 -13 1628 57
3365 57 -1485 427 207 -924 1595 2026 -569 -214 917 -1089 -489 1589 396 63 2042 273 -1914
3382 -1914 177 1033 -449 974 2136 -427 -302 1080 -1062 -1363 1800 1187 -220 1593 565 -1606
3398 -1606 45 974 -915 738 2461 7 -929 599 -720 -1052 1480 1134 -309 1283 1247 -1670
3414 -1670 -864 893 -651 404 2146 81 -963 920 -313 -1825 721 1564 -61 765 941 -1669
3430 -1669 -1004 954 -605 -506 2022 792 -1091 25 -487 -1825 521 1531 -760 254 1247 -1291
3446 -1291 -1712 257 -511 -481 1782 550 -1698 -257 -6 -1694 -565 1286 -212 107 862 -1624 -2320
3463 -2320 429 -34 -1065 1013 845 -1298 -763 -386 -2300 -697 1690 -2 -847 804 -1043 -2129
3479 -2129 -117 -170 -1014 1147 1435 -1394 -1350 15 -1628 -991 1238 26 -372 1066 -730 -2780 -651
3496 -651 348 -881 643 1228 -1008 -710 332 -1503 -1631 1551 1033 -624 648 -170 -2024 -446 517
3513 517 -918 485 2190 -221 -1317 72 -900 -1096 1600 1115 -528 1139 817 -1692 -875 861
3529 861 -174 561 2122 61 -1320 709 -370 -1612 970 1792 111 855 737 -1702 -852 1365
3545 1365 129 82 1966 808 -995 -60 -342 -1309 1003 2184 -290 360 1250 -1027 -1440 527 31
3562 31 -11 2487 821 -1497 64 285 -1504 163 1501 412 543 1147 -1583 -1918 694 546 -419
3579 -419 1317 998 -1019 -363 -204 -1806 -87 2079 547 -472 598 -738 -1990 263 313 -816
3595 -816 1544 1837 -1143 -1058 -17 -1171 -584 1468 414 -314 1202 -443 -2297 -248 824 -307
3611 -307 927 1339 -1248 -968 381 -1453 -1349 1721 1187 -412 462 -253 -2141 -223 856 -787 443
3628 443 2149 -439 -1380 -84 -964 -793 1838 946 -705 832 557 -1730 -877 710 -122 741 1967
3645 1967 -348 -1648 265 -363 -1370 972 1842 53 638 430 -1916 -875 1404 322 47 1932
3661 1932 748 -1111 -167 -491 -1301 1176 2164 -197 -15 918 -1152 -1170 743 79 242 2327 641
3678 641 -1670 -308 121 -1121 334 1895 209 338 983 -1385 -1925 937 926 -213 1238 813 -1243
3695 -1243 -489 -92 -1691 -182 2013 502 -630 416 -834 -1797 298 246 -661 1240 1326 -1706 -1444
3712 -1444 -230 -1060 -212 1621 -143 -753 789 -662 -2549 -578 836 -331 782 779 -1381 -1272 189
3729 189 -1339 -1401 1431 1133 -730 101 -880 -2321 -331 810 -716 303 1466 -763 -1804 -313
3745 -313 -1134 -851 1852 1117 -1028 215 255 -1869 -1091 844 143 622 1678 -774 -1857 297 -101
3762 -101 -1209 982 1637 27 326 264 -1991 -600 1582 274 -40 1670 280 -1293 74 -368 -1046
3779 -1046 1579 2267 -154 -13 698 -939 -1049 958 369 355 2213 718 -1629 -361 530 -595 714
3796 714 1993 253 93 1067 -1180 -1589 1356 1173 71 1393 946 -1095 -185 600 -1065 366 2415
3813 2415 1065 -243 487 -675 -1253 842 1087 -172 1419 1684 -1213 -1044 357 -386 317 1956 523
3830 523 -458 912 -210 -1942 133 1278 314 1317 1235 -1118 -851 893 -596 -394 1751 1326 -245
3847 -245 57 -528 -1755 177 1472 -297 543 1589 -447 -1295 -122 -696 -540 1753 1061 -1154 104
3864 104 124 -1988 -652 992 -42 489 1365 -1113 -2024 139 -170 -1111 770 1120 -441 114 -373 -2275
3882 -2275 -899 1258 -94 -410 889 -323 -1667 -522 -737 -1486 845 1818 -836 -1100 -38 -1558
3898 -1558 -1253 492 -16 -376 1342 -124 -2286 -1000 109 -916 480 1233 -654 -450 450 -1466
3914 -1466 -1945 780 828 -388 692 48 -1793 -468 109 -1358 -153 2147 123 -981 4 -1139
3930 -1139 -1254 841 603 -617 1109 1236 -1552 -1089 256 -259 392 1908 246 -739 616 -343 -1647
3947 -1647 337 1398 190 1076 886 -1537 -1132 906 -498 -392 1618 1122 -536 123 -499 -1672 416
3964 416 1504 -154 218 1241 -741 -1334 171 -423 -271 1787 1257 -1297 -197 190 -1480 -492 1086
3981 1086 26 566 1385 -775 -2149 274 188 -567 982 1012 -432 -3 3 -1837 -746 1671 565 -69
3999 -69 814 -378 -1502 34 153 -955 1305 1821 -596 -706 281 -1076 -749 1139 368 -61 1409
4016 1409 304 -2039 -461 574 -164 784 1530 -506 -301 723 -1028 -1257 1241 1162 -105 917 58
4033 58 -1495 -84 592 -973 433 2101 482 -670 95 -866 -983 1153 966 -550 938 1160 -1417
4050 -1417 -1247 404 -178 441 1859 58 -1041 462 -387 -1377 392 1350 -83 562 822 -1648 -1141
4067 -1141 838 -305 -503 1473 789 -898 -116 -716 -1859 253 1425 -434 -33 786 -955 -1491 -41
4084 -41 -528 -470 1682 669 -1491 -609 -260 -1415 -388 989 -268 34 1003 -1174 -1945 215 512 -792
4102 -792 789 844 -1005 -330 49 -1783 -619 1594 385 -552 707 -539 -1447 192 -48 -972 992
4119 992 1781 -1013 -877 111 -1007 -576 1342 167 -404 1100 119 -1716 -388 561 -307 797 1318
4136 1318 -749 -522 663 -971 -1477 1143 1039 -124 652 211 -1605 -187 904 -680 384 1939
4152 1939 100 -775 217 -732 -759 1262 976 -526 734 831 -1137 -942 663 -120 443 1840 224 -1266
4170 -1266 582 41 -1188 654 1440 26 691 820 -1411 -764 1214 227 -301 1631 586 -746 -118
4187 -118 -289 -1298 750 1728 -56 -237 799 -802 -998 635 -10 -213 1794 840 -1480 -301 69
4204 69 -1231 122 1227 -69 146 1233 -884 -1753 476 504 -501 968 1000 -1010 -158 123 -1194
4221 -1194 -364 1630 251 -376 596 -285 -1516 493 413 -644 905 1372 -792 -838 170 -599 -545 1369
4239 1369 359 -428 1292 61 -1597 -90 681 -247 813 1355 -756 -742 836 -572 -1051 1309 1052
4256 1052 -34 515 117 -1317 154 1053 -479 414 1616 70 -747 359 -491 -466 1356 1144 -442
4273 -442 493 636 -906 -590 843 -93 688 1761 -190 -1004 489 242 -980 730 1374 -92 586
4290 586 735 -1372 -714 985 206 -325 1361 232 -951 100 -130 -1238 502 1527 -575 -262 706
4307 706 -924 -916 574 -147 -372 1253 353 -1624 -438 105 -1152 -5 1040 -252 -320 902 -1136
4324 -1136 -1834 360 237 -745 638 421 -1395 -462 85 -1473 -540 1633 25 -493 344 -766 -1436
4341 -1436 485 324 -762 669 1102 -1090 -1196 219 -834 -500 1211 31 -733 801 -189 -1677
4357 -1677 -256 697 -427 572 969 -1085 -950 578 -802 -906 1087 663 -670 304 -85 -1633 -183
4374 -183 1041 -621 82 1126 -402 -1012 88 -396 -1011 1086 684 -828 216 390 -1513 -406 760
4391 760 -324 12 1227 -463 -1404 289 104 -1035 646 1026 -385 285 384 -1374 -637 990 21
4408 21 -380 1385 259 -1090 186 77 -963 604 1625 -288 -119 643 -670 -587 937 111 -380
4425 -380 1444 716 -1323 -55 481 -702 401 1481 -202 -99 847 -434 -1011 714 862 -166 919
4442 919 698 -923 113 602 -678 18 1709 401 -458 868 -265 -855 736 684 -721 746 1000
4459 1000 -761 -572 552 -565 -83 1400 110 -682 486 36 -1401 42 606 -490 644 1052
4475 1052 -1118 -936 705 -420 -818 763 421 -844 274 -267 -1449 0 937 -616 -356 688
4491 688 -672 -1178 -9 -672 -885 926 543 -1208 -187 29 -1340 -519 618 -502 -322 958 -636
4508 -636 -1426 46 -78 -957 258 692 -630 -160 325 -1267 -603 1140 20 -494 744 -56 -1074
4525 -1074 243 182 -1038 547 1180 -731 -462 712 -524 -776 694 127 -541 1087 698 -1253 42
4542 42 569 -711 367 1078 -157 -213 739 -327 -814 843 647 -354 789 572 -938 44 794 -580
4560 -580 137 1544 257 -408 533 -199 -924 639 501 -470 478 882 -1002 -380 579 -296 -157 1220
4578 1220 -9 -764 487 2 -1089 97 940 -214 154 641 -899 -688 639 -216 -531 818 557
4595 557 -730 341 184 -1081 53 997 -458 -197 644 -432 -693 529 -183 -663 1177 655 -959
4612 -959 115 588 -771 -218 860 -244 -157 818 -456 -1182 608 544 -637 684 639 -583 197 378
4630 378 -869 -454 968 168 -395 897 159 -876 372 437 -745 481 1067 -481 -426 528 -415 -442
4648 -442 923 281 -433 840 300 -1009 209 618 -411 480 1229 -261 -98 731 -268 -639 793 526
4666 526 -408 527 433 -1037 -1 683 -631 -67 1115 -69 -566 595 -298 -917 695 634 -617 690
4684 690 837 -778 -222 723 -398 -342 1021 105 -659 511 148 -868 390 614 -304 112 827 -764
4702 -764 -635 655 -302 -475 993 259 -650 275 218 -1184 61 1033 -374 -86 806 -345 -756 599
4720 599 -276 -927 707 446 -1167 -118 383 -832 -417 673 -370 -432 979 -454 -876 389 65
4737 65 -602 359 515 -824 -178 607 -901 -528 723 -114 -560 421 -256 -1031 470 352 -672 270 888
4756 888 -676 -446 571 -333 -482 909 25 -691 605 225 -958 164 552 -358 122 908 -597 -472
4774 -472 678 -366 -609 808 511 -584 428 295 -801 -70 845 -698 -74 850 -184 -618 514
4791 514 -197 -784 415 645 -555 58 683 -638 -194 587 -174 -264 981 -155 -711 532 221 -638
4809 -638 386 743 -445 148 548 -672 -555 656 13 -336 693 82 -740 476 191 -902 -33 930
4827 930 -315 -353 742 -499 -449 743 29 -873 568 369 -834 70 477 -627 -243 821 -401 -416
4845 -416 862 -169 -782 318 228 -625 378 442 -643 -20 565 -504 -365 863 -55 -529 587 133
4863 133 -895 301 270 -715 -26 641 -527 -295 610 -311 -324 729 6 -701 677 237 -783 85 570
4882 570 -468 -54 879 -292 -388 817 -55 -563 527 355 -545 387 196 -749 239 741 -247 -241 866
4901 866 -26 -584 601 144 -815 489 544 -643 303 741 -541 -72 674 -82 -126 800 -77 -837 482
4920 482 208 -519 279 590 -488 51 560 -546 -379 698 -80 -567 670 90 -760 443 462 -828
4938 -828 64 746 -655 -555 579 -240 -647 780 -65 -766 418 289 -766 79 276 -761 -324 498
4956 498 -500 -419 590 -256 -748 450 106 -992 180 248 -846 -142 696 -652 -424 507 -258 -500 424
4975 424 -34 -820 261 265 -899 60 387 -682 -315 611 -477 -501 483 -10 -668 581 300 -741 -8
4994 -8 448 -611 -43 734 -577 -353 797 72 -638 383 314 -667 380 478 -646 54 883 -496 -170
5013 -170 804 84 -178 673 158 -503 615 565 -515 267 765 -210 37 959 -67 -238 644 7 -481
5032 -481 642 262 -801 357 597 -414 65 885 -367 -126 875 -11 -580 530 60 -457 520 628
5050 628 -740 94 713 -202 -203 628 -235 -390 703 59 -642 409 525 -600 243 356 -441 -265 565
5069 565 -377 -202 659 -13 -519 460 126 -681 295 357 -674 108 693 -567 -479 471 -142 -530 459 183
5089 183 -646 510 220 -763 -108 548 -504 -201 744 -363 -486 496 -120 -671 405 342 -694 -60 382
5108 382 -840 -208 602 -317 -278 543 -91 -675 305 103 -690 87 370 -616 -137 660 -665 -343 473 -210
5128 -210 -429 452 -158 -772 191 221 -751 -37 448 -566 -345 634 -555 -549 516 -75 -666 519 252 -808
5148 -808 198 249 -625 -19 744 -415 -347 525 -57 -673 437 321 -342 522 479 -681 33 713 -385
5167 -385 -70 526 -28 -204 740 179 -853 450 491 -629 144 534 -478 -90 631 -239 -394 784 299
5186 299 -627 531 387 -572 246 611 -369 72 539 -455 -367 585 -308 -590 574 278 -354 334 177 -697
5206 -697 -60 464 -354 -30 690 -333 -498 477 -63 -575 502 397 -556 124 340 -588 -266 610 -495
5225 -495 -286 624 8 -735 297 93 -963 295 268 -680 79 410 -579 -449 502 -181 -290 511 109
5244 109 -613 74 148 -890 -53 511 -299 -107 441 -500 -655 575 83 -511 421 415 -645 27 262 -469
5264 -469 75 936 -170 -28 460 -202 -505 398 196 -443 534 485 -528 -94 602 -435 -334 577 -6
5283 -6 -259 722 51 -684 420 435 -365 377 529 -497 -213 567 -582 -242 897 157 -486 464 71 -717
5303 -717 148 710 -405 130 985 -376 -362 389 -16 -445 808 208 -487 375 241 -753 -47 796 -274
5322 -274 193 560 -281 -402 442 -73 -295 657 487 -493 57 294 -656 -92 674 -166 -130 722 55 -695
5342 -695 323 -67 -647 380 355 -545 -26 507 -557 -473 533 2 -96 529 86 -818 283 188 -744 73
5362 73 554 -382 -382 308 -649 -883 341 -125 -477 470 165 -752 -27 409 -689 -124 433 -318 -457 347
5382 347 -207 -750 200 165 -452 271 398 -743 -210 272 -493 -98 838 -96 -437 551 -178 -718 384 466
5402 466 -389 366 489 -488 -275 509 -87 -255 998 236 -305 355 276 -548 395 493 -370 196 779 -243
5422 -243 -350 502 157 -347 839 349 -478 676 204 -678 -28 578 -118 -186 667 -168 -538 479 100
5441 100 -238 571 268 -302 144 443 -552 -9 699 -258 -375 651 27 -646 308 -81 -652 549 323
5460 323 -572 -51 161 -685 -534 374 -212 -354 533 93 -996 4 -6 -743 168 602 -496 -182 387
5479 387 -632 -697 581 226 -567 372 29 -765 -261 257 -400 -74 673 -343 -377 469 -296 -452 457 372
5499 372 -253 356 308 -717 -125 536 -262 -3 916 -54 -443 393 62 -547 569 547 -194 237 509 -508
5519 -508 -179 665 -16 -185 761 388 -332 337 181 -616 425 759 -253 223 670 -280 -555 249 -141
5538 -141 -326 587 282 -559 111 205 -751 -126 615 -116 -117 676 -309 -731 243 -94 -509 599 360 -517 -55
5559 -55 239 -747 -288 563 -279 -188 492 -232 -875 96 -45 -588 429 768 -574 -214 191 -645 -604 529
5579 529 -248 -249 672 -1 -711 119 80 -394 208 545 -239 -59 384 -469 -537 599 422 -293 318 74 -524
5600 -524 -76 307 -624 123 641 -76 -309 185 -228 -652 593 463 -227 426 510 -777 50 546 -374 49
5620 49 803 38 -425 461 -148 -663 428 671 -248 122 413 -593 -159 327 -281 -228 668 39 -531 284
5640 284 -41 -761 272 593 -426 60 503 -573 -661 380 17 -239 784 -41 -875 111 256 -995
5658 -995 107 657 -86 -94 623 -432 -736 407 88 -516 749 391 -481 21 301 -671 -85 691 -15
5677 -15 -113 575 -101 -702 316 228 -356 590 674 -385 -55 395 -281 -210 684 -20 -130 698 40 -358 84
5698 84 431 -453 409 715 -282 -205 438 -293 -405 677 295 -337 234 141 -614 -191 77 -379 66 918 -198
5719 -198 -369 370 -9 -440 580 162 -479 246 425 -736 -320 421 -524 1 720 -210 -693 374 -208
5738 -208 -716 221 521 -527 -8 245 -795 -378 411 -309 -308 676 -13 -745 33 -177 -470 -31 440 -310
5758 -310 -6 508 -610 -636 344 -17 -134 592 171 -594 178 307 -580 151 782 -168 81 634 -256 -525
5778 -525 441 105 -431 517 424 -591 -43 236 -577 137 1002 30 -118 553 -239 -545 499 266 -433 605
5798 605 401 -478 -180 350 -385 -313 671 95 -219 649 31 -793 199 424 -374 175 726 -385 -191 282
5818 282 -507 -557 781 515 -349 353 239 -642 -32 336 -415 65 754 -108 -573 359 -242 -637 503 319
5838 319 -490 261 163 -797 -214 313 -184 -100 657 -146 -544 301 -143 -724 369 513 -330 -75 34 -627
5858 -627 -370 481 -230 -253 721 67 -815 178 72 -660 442 502 -406 19 514 -672 -530 362 18 -311
5878 -311 575 258 -868 -62 130 -517 45 578 -163 -222 311 -422 -604 343 154 -462 471 348 -481 -69
5898 -69 72 -577 -11 744 -39 -254 539 -32 -370 332 258 -316 545 547 -603 -90 440 -424 0 918 56
5919 56 -157 620 -109 -665 256 468 -234 281 775 -280 -220 309 -327 -225 863 209 -194 432 219 -526
5939 -526 266 491 -138 58 734 29 -523 200 -55 -352 562 365 -348 94 357 -661 12 319 -164 5
5959 5 408 -188 -643 244 -68 -556 293 493 -219 -41 76 -792 -359 618 -108 -348 576 -15 -675 104 -220
5980 -220 -542 261 455 -471 -195 306 -413 -508 381 -210 -169 689 1 -720 -70 191 -392 -29 583 -276 -250
6001 -250 433 -582 -509 656 183 -340 469 573 -421 170 204 -393 42 900 -116 -305 371 26 -536 393
6021 393 262 -257 510 384 -474 54 422 -84 -52 778 108 -199 488 45 -737 208 557 -113 221 364
6041 364 -272 -264 395 -373 -165 529 263 -224 299 69 -424 149 415 -281 65 641 -428 -441 179 -291 -446
6062 -446 187 299 -533 23 151 -714 -231 228 10 -234 341 -257 -667 205 -84 -562 245 385 -534 -50
6082 -50 65 -640 -229 403 -74 -428 452 66 -704 170 -203 -464 280 351 -359 -156 369 -535 -593 481 5
6103 5 -319 521 267 -736 81 347 -376 -93 658 -117 -269 445 -307 -409 334 338 -305 369 356 -524 96
6124 96 265 -499 -3 677 -53 -314 436 -32 -472 323 434 -387 314 382 -571 -290 352 -182 -68 681 -111
6145 -111 -320 271 -25 -677 258 461 -331 300 377 -381 -340 231 124 -175 729 123 -287 18 183 -765 -63
6166 -63 362 -137 45 305 -341 -469 177 -186 -440 425 242 -543 79 378 -404 -121 425 -134 171 326
6186 326 -53 -569 199 206 -565 165 603 -228 27 191 -281 7 515 32 -327 607 80 -503 253 103 -289
6207 -289 380 445 -342 -182 271 -399 -431 437 -5 -347 528 26 -870 -96 276 -546 156 264 -174 -52 263
6228 263 -427 -631 493 125 -310 114 340 -520 -96 16 -407 -157 398 -239 -364 308 -143 -665 166 145
6248 145 -342 122 331 -664 -291 118 -131 -97 564 -12 -424 101 -126 -605 89 532 -251 26 472 -512
6268 -512 -151 380 -57 -224 574 45 -473 78 99 -454 266 501 -209 -48 723 -83 -452 355 -127 -408
6288 -408 527 236 -409 166 185 -373 5 678 -14 19 567 -311 -510 234 198 -380 422 323 -413 -21 367
6309 367 -500 -152 601 81 -408 328 72 -588 254 266 -163 187 545 -320 -315 479 -188 -143 378 -29 -243
6330 -243 359 67 -717 5 352 -294 -8 346 -196 -282 361 -400 -450 204 80 -400 3 110 -473 -166 242
6351 242 -474 146 583 -238 -630 250 -266 -368 335 257 -505 115 289 -502 -236 308 -215 -65 508 -190
6371 -190 -461 180 173 -558 209 466 -124 142 369 -478 -232 390 -147 -350 498 134 -351 19 80 -613 217
6392 217 606 -149 -115 405 -344 -529 295 -69 -192 413 101 -542 -37 336 -454 -102 436 -187 105 516
6412 516 -61 -442 409 308 -349 194 324 -372 -145 293 -327 -178 703 -3 -168 364 128 -293 382 163
6432 163 -115 113 597 -321 -227 371 -241 -381 417 73 -201 560 119 -588 -82 289 -172 -29 428 -232
6452 -232 -240 380 -122 -346 309 214 -440 391 119 -428 -39 341 -202 -104 500 18 -405 178 -38 -337 403
6473 403 415 -460 92 125 -368 -216 232 -39 -165 95 -123 -253 168 37 -467 139 507 -452 25 234 -472
6494 -472 -84 222 -100 -220 495 38 -331 58 63 -369 115 451 -276 -180 432 -206 -391 350 61 -262 535
6515 535 100 -436 41 185 -369 -74 384 -186 -179 501 -264 -312 379 139 -494 327 155 -184 48 340 -297
6536 -297 -101 596 -45 -311 311 95 -247 209 105 -156 25 369 -345 -212 443 -22 -194 369 -47 -427
6556 -427 287 121 -459 97 383 -165 -65 201 -379 -271 250 -244 -417 424 49 -64 168 124 -612 -77
6576 -77 301 -453 -178 272 -135 -298 225 40 -375 257 112 -466 45 358 -167 -242 489 -213 -127 468 -218
6597 -218 -654 97 118 -185 142 196 -478 -19 440 -205 -199 296 -188 -263 252 227 -365 118 248 -322 254 654
6619 654 -225 -313 374 -48 -360 270 174 -226 284 104 -332 75 303 -38 117 409 -153 -182 141 -244 -331
6640 -331 327 217 -127 -27 332 -118 215 297 -468 -26 428 52 -192 129 240 -417 415 167 -374 105
6660 105 351 -201 -163 282 -106 3 410 -2 -369 261 192 -251 132 345 -134 84 502 -358 -357 238 -76
6681 -76 -223 171 279 -337 -40 -25 -500 -21 296 -339 -201 293 -77 -452 283 -111 -139 217 147 -447 1
6702 1 355 -446 -195 137 -136 -141 468 -7 -388 338 121 -375 -102 338 -192 6 162 -480 -318 410 -198
6723 -198 -349 256 73 -380 110 17 -477 -64 305 -299 93 382 -150 -306 369 -138 -285 274 121 -502
6743 -502 159 212 -261 -108 235 -147 -374 172 -26 -490 80 219 -296 192 393 -276 59 437 -151 -26
6763 -26 312 56 -200 197 46 -512 197 344 -395 219 494 -182 -97 331 -105 -266 391 -46 -367 370 67
6784 67 -372 161 406 -60 -26 272 -202 -251 367 -107 -432 371 136 -349 176 291 -575 205 413 84 -15
6805 -15 525 -118 -152 286 134 -383 205 149 -393 96 229 -219 -186 368 -120 -193 180 -72 -63 300 -37 -540
6827 -540 99 317 -422 -54 446 -133 -43 314 -87 -373 151 -86 -63 274 84 -440 117 285 -356 -132 225
6848 225 -189 -240 369 -276 -352 308 198 -463 327 200 -363 52 280 -157 -223 486 -101 -537 181 169 -391
6869 -391 -5 247 -411 26 356 -439 -466 397 -86 -278 192 -147 -139 265 159 -161 4 322 -384 -307 227
6890 227 -74 -183 379 155 -170 271 291 -361 240 34 -184 205 288 -60 -91 327 -26 -227 335 41 -249
6911 -249 297 136 -264 -86 327 -155 -96 390 -3 -140 421 151 -380 240 207 -235 60 271 -277 -196 403
6932 403 -101 70 413 -52 -254 171 217 -433 -6 131 -226 -20 173 -222 -208 360 -146 -313 95 117 -407
6953 -407 259 88 -461 13 285 -304 -228 638 -94 -264 341 175 -331 132 314 -576 -59 453 -318 -68
6973 -68 216 -480 -223 543 71 -386 171 209 -353 120 167 -432 -153 353 -290 -166 284 -252 -420 191 111
6994 111 -496 441 233 -459 -101 298 -219 -41 203 -120 -314 387 -46 -219 345 204 -331 107 89 -409
7014 -409 78 464 -217 -91 357 1 -268 93 219 -450 256 296 -241 178 420 -117 38 314 -156 6
7034 6 298 96 -235 259 262 -219 305 488 -235 -26 337 -91 29 391 89 -358 380 257 -451 187 258 -323
7056 -323 125 337 -248 -124 543 -15 95 296 154 -73 331 252 -433 197 306 -284 -159 269 -144 -209 370
7077 370 -73 -314 294 193 -302 43 131 -412 -251 471 34 -210 397 -94 -429 291 16 -487 62 80 -339
7098 -339 -1 164 -398 -336 332 -119 -209 259 -187 -232 -22 210 -578 325 367 -360 -207 238 -220 -381 302
7119 302 -126 -268 127 107 -371 51 161 -318 33 354 -145 -285 502 -44 -354 257 26 -343 165 93 -323
7140 -323 -231 178 -338 -36 379 -198 -254 286 190 -380 82 193 -433 258 226 -287 -68 189 -250 -362 457
7161 457 -46 -430 197 34 -434 169 194 -267 -63 414 -283 -139 275 -51 -116 327 297 -333 229 320 -295
7182 -295 127 423 -236 63 527 -87 -77 455 -50 -355 130 248 -105 339 220 -316 -25 297 -173 -188 305
7203 305 -58 -546 318 148 -353 215 162 -210 91 408 -338 -197 426 96 -236 88 63 -352 107 138 -395
7224 -395 52 314 -266 -132 278 -236 -409 379 6 -378 438 48 -308 11 339 -305 37 413 -181 -233
7244 -233 344 -78 -426 210 160 -370 418 286 -289 -148 373 -244 -72 313 -123 -161 541 -52 -377 105 29
7265 29 -347 203 266 -229 -77 301 -226 -148 443 187 -407 272 142 -330 59 395 -178 -4 586 -220 -145
7286 -145 463 -23 -268 254 87 -299 265 172 -552 28 358 -261 -186 196 -221 -295 405 -27 -392 316 -44
7307 -44 -353 -1 308 -436 -162 28 -325 -378 409 -75 -540 256 51 -451 59 146 -454 -38 226 -483 -258
7328 -258 441 -82 -124 204 15 -650 259 109 -506 -5 370 -180 -98 265 -275 -242 364 51 -439 89 208
7349 208 -311 -93 186 -326 174 306 -101 -118 501 -47 -289 115 93 -252 243 229 -195 -15 340 -288 -285 403
7371 403 33 -182 346 -70 -358 205 132 -394 54 348 -260 -77 396 -170 -280 379 88 -196 278 75
7391 75 -313 160 391 -229 53 463 -159 -165 312 -97 -195 305 263 -128 299 278 -390 -88 459 -147 -141 503 -182
7414 -182 -139 159 61 -243 188 215 -532 51 266 -142 23 98 -16 -109 383 124 -180 240 78 -247 180 329
7436 329 -323 -137 357 -295 -193 152 -114 -197 321 213 -475 115 208 -400 78 491 -331 -49 348 -116 -210
7457 -210 392 -65 -245 454 128 -259 -34 151 -447 -49 308 -118 -208 357 -163 -327 -16 63 -154 104 322
7478 322 -421 -201 175 -300 -223 370 138 -378 214 84 -411 62 266 -372 58 285 -376 -89 163 -65
7498 -65 -251 410 9 -355 398 -19 -346 70 356 -220 222 471 -351 -124 343 61 -242 323 101 -270
7518 -270 284 -164 -258 96 509 126 -123 644 -26 -390 158 -36 -247 394 359 -432 104 289 -207 -100 300
7539 300 -159 -54 521 -189 -326 124 188 -270 21 376 -300 -28 -32 -127 -213 216 27 -230 347 -147 -275 -136
7561 -136 189 -299 117 263 -139 -88 167 -353 -286 370 41 -231 312 10 -244 -85 156 -643 16 300 -100
7582 -100 -38 210 -57 -458 190 190 -78 208 373 -304 -60 172 -483 -169 424 -62 -235 175 -15 -357 148
7603 148 434 -268 156 324 -489 17 243 -235 -235 536 -93 -331 334 -101 -309 76 171 -136 -89 352 -208
7624 -208 -99 452 -234 -180 258 175 -191 204 198 -218 71 467 -32 25 449 -121 -162 203 90 -215 335 119
7646 119 -283 229 295 -287 84 336 -114 -17 454 87 -446 312 162 -81 283 225 -7 161 334 -321 -27
7667 -27 585 81 -140 381 134 -414 212 86 -256 264 517 -5 -151 352 -427 -281 412 104 -130 367
7687 367 -6 -386 180 -82 -306 17 272 -148 -147 262 35 -443 378 127 -119 112 234 -287 28 147 -184
7708 -184 -130 375 -269 -322 247 -170 -250 309 218 -270 198 97 -260 -267 165 -144 -309 403 -181 -482 5 -107
7730 -107 -328 -191 340 -325 -105 88 -214 -372 206 11 -389 214 103 -464 105 135 -428 -53 334 -242
7750 -242 -5 193 -243 -249 202 -230 -395 288 233 -469 33 234 -298 -71 163 -202 -141 236 30 -420 -68
7771 -68 -116 -84 203 177 -219 -21 160 -403 -247 289 170 -142 263 -31 -437 -53 -36 -427 241 236 -104 62
7793 62 184 -45 23 234 183 -358 358 404 -301 118 68 -269 200 372 17 -87 224 75 -197 213 277 -244
7815 -244 433 253 -273 -54 312 -221 -195 487 -76 -241 253 52 -382 278 370 -257 63 275 -169 -53 267
7836 267 -162 -144 254 84 -242 305 24 -286 107 163 -192 156 364 -219 -273 86 32 -305 226 115 -362
7857 -362 197 298 -136 73 250 -162 -38 289 -116 -298 153 70 -373 124 212 -215 -114 363 -111 23 322
7878 322 -142 -180 335 139 -502 361 237 -147 174 139 -191 -9 -61 -299 -237 329 -64 -185 247 -37 -216
7899 -216 83 153 -126 -97 335 -157 -252 122 -22 -394 345 174 -151 173 69 -266 -70 145 -244 89 308
7920 308 -111 -86 266 42 -227 40 190 -185 93 91 -428 -60 458 -219 -171 252 -89 -235 173 -166 -315
7941 -315 92 404 -225 12 68 -176 23 235 -149 -110 332 -126 -414 -46 60 -260 -120 78 -431 -265 103
7962 103 -281 -287 132 66 -157 238 176 -248 68 176 -193 -20 171 -191 -154 270 -131 -271 302 53 -194 249
7984 249 254 -128 -169 91 -117 21 498 -67 -123 276 -119 -344 179 276 -182 152 289 -268 -122 257 -177 -105
8006 -105 287 -38 -176 224 -119 -233 111 354 -254 101 282 -122 -141 204 -206 -277 380 -11 -122 239 69
8027 69 -254 -130 94 -213 89 332 36 -91 340 -211 -77 461 329 -248 248 161 -463 -17 99 -304 -180
8048 -180 437 70 -223 170 -56 -461 57 272 -124 39 205 -150 -188 246 -152 -244 81 87 -235 190 112 -188
8070 -188 2 203 -6 39 302 -261 -342 366 -108 -175 227 6 -471 112 159 -323 77 349 108 -251 233
8091 233 -183 -344 227 69 -200 199 83 -337 -140 109 -179 -77 578 -30 -55 399 155 -142 -150 32 -250
8112 -250 21 422 -469 -358 334 -74 -197 362 96 -193 127 151 -294 -35 322 -376 136 297 -50 -211
8132 -211 65 -176 -161 210 -66 -131 -79 220 -248 23 209 -223 -37 352 -174 -199 246 34 -386 109 222
8153 222 -217 83 215 -336 9 369 -43 -33 264 -71 -206 38 206 -285 230 359 -327 55 37 -294 -34
8174 -34 193 -171 -215 279 -37 -397 -112 -32 -315 -102 263 -164 -206 200 -263 -131 285
8191B85
##END NTUPLES=NMR FID
##END=
