##TITLE=1H_CG-1124-6
 CDCl3, 8 sc, 
 11.11.2019
##JCAMPDX= 6.0         $$ Bruker NMR JCAMP-DX V2.0
##DATA TYPE= NMR FID
##DATA CLASS= NTUPLES
##ORIGIN= UXNMR, Bruker Analytische Messtechnik GmbH
##OWNER= root
$$ XWIN-NMR		Version 3.5
$$ Mon Nov 11 14:02:14 2019 Russian Standard Time (UT+4h)  she@DPX200
##.OBSERVE FREQUENCY= 200.1315
##.OBSERVE NUCLEUS= ^1H
##.DELAY= (6, 6)
##.ACQUISITION MODE= SIMULTANEOUS
##.ACQUISITION SCHEME= undefined
##.AVERAGES= 8
##.DIGITISER RES= 18
##SPECTROMETER/DATA SYSTEM= spect
##.PULSE SEQUENCE= zg30
##.SOLVENT NAME= CDCl3
##.SHIFT REFERENCE= (INTERNAL, CDCl3, 0, 15.7039)
##AUDIT TRAIL= $$ (NUMBER, WHEN, WHO, WHERE, WHAT)
$$ ##TITLE= Audit trail, XWIN-NMR		Version 3.5
$$ ##JCAMPDX= 5.01
$$ ##ORIGIN= Bruker BioSpin GmbH
$$ ##OWNER= she
$$ F:/spectra/data/she/nmr/H-F/1/audita.txt
$$ ##AUDIT TRAIL=  $$ (NUMBER, WHEN, WHO, WHERE, WHAT)
(   1,<2019-11-11 14:01:03.25 +0400>,<she>,<DPX200>,
      <created by zg, POWCHK disabled, PULCHK disabled
       configuration hash MD5:
       00 E9 B6 7A A2 85 ED C7 34 08 36 98 17 FE 4E 26
       data hash MD5: 16K
       88 F9 72 E2 88 1E 78 1E A1 1F EF 6E 8C 4F 0D 03>)
$$ ##END=
$$ 
$$ hash MD5
$$ 87 3F DA 01 25 4E DE EB 9D DB 9E 1E 06 AD 2D 27
##$RELAX= 
##$RELAX= 
##$RELAX= 
##$RELAX= 
##$RELAX= 
##$RELAX= 
$$ Bruker specific parameters
$$ --------------------------
##$DU= <F:/spectra>
##$EXPNO= 1
##$NAME= <H-F>
##$PROCNO= 1
##$TYPE= <nmr>
##$USER= <she>
##$AMP= (0..31)
100 100 100 100 100 100 100 100 100 100 100 100 100 100 100 100 100 100 
100 100 100 100 100 100 100 100 100 100 100 100 100 100 
##$AQSEQ= 0
##$AQ_mod= 1
##$AUNM= <au_zg>
##$AUTOPOS= <>
##$BF1= 200.13
##$BF2= 200.13
##$BF3= 200.13
##$BF4= 200.13
##$BF5= 200.13
##$BF6= 200.13
##$BF7= 200.13
##$BF8= 200.13
##$BYTORDA= 1
##$CFDGTYP= 0
##$CFRGTYP= 5
##$CHEMSTR= <none>
##$CNST= (0..31)
1 1 145 1 1 1 1 1 1 1 1 1 1 1 1 1 1 1 1 1 1 1 1 1 1 1 1 1 1 1 1 1 
##$CPDPRG= <>
##$CPDPRG1= <>
##$CPDPRG2= <>
##$CPDPRG3= <>
##$CPDPRG4= <mlev>
##$CPDPRG5= <mlev>
##$CPDPRG6= <mlev>
##$CPDPRG7= <mlev>
##$CPDPRG8= <mlev>
##$CPDPRGB= <>
##$CPDPRGT= <>
##$D= (0..31)
0 1.2 0 0 0 0 0 0 0 0.06 0 0.03 0 0 0 0 0.0002 0 0 0 0 0 0 0 0 0 0 0 0 
0 0 0 
##$DATE= 1573466462
##$DBL= (0..7)
120 120 120 120 120 120 120 120 
##$DBP= (0..7)
150 150 150 150 150 150 150 150 
##$DBP07= 0
##$DBPNAM0= <>
##$DBPNAM1= <>
##$DBPNAM2= <>
##$DBPNAM3= <>
##$DBPNAM4= <>
##$DBPNAM5= <>
##$DBPNAM6= <>
##$DBPNAM7= <>
##$DBPOAL= (0..7)
0.5 0.5 0.5 0.5 0.5 0.5 0.5 0.5 
##$DBPOFFS= (0..7)
0 0 0 0 0 0 0 0 
##$DE= 6
##$DECBNUC= <off>
##$DECIM= 24
##$DECNUC= <off>
##$DECSTAT= 4
##$DIGMOD= 1
##$DIGTYP= 9
##$DL= (0..7)
0 120 120 120 120 120 120 120 
##$DP= (0..7)
150 150 150 150 150 150 150 150 
##$DP07= 0
##$DPNAME0= <>
##$DPNAME1= <>
##$DPNAME2= <>
##$DPNAME3= <>
##$DPNAME4= <>
##$DPNAME5= <>
##$DPNAME6= <>
##$DPNAME7= <>
##$DPOAL= (0..7)
0.5 0.5 0.5 0.5 0.5 0.5 0.5 0.5 
##$DPOFFS= (0..7)
0 0 0 0 0 0 0 0 
##$DQDMODE= 0
##$DR= 18
##$DS= 0
##$DSLIST= <SSSSSSSSSSSSSSS>
$$ [...]
##$SUBNAM2= <"">
##$SUBNAM3= <"">
##$SUBNAM4= <"">
##$SUBNAM5= <"">
##$SUBNAM6= <"">
##$SUBNAM7= <"">
##$SUBNAM8= <"">
##$SUBNAM9= <"">
##$SW= 24.0689530833862
##$SWIBOX= (0..15)
0 0 2 0 0 0 0 0 0 0 0 0 0 0 0 0 
##$SW_h= 4816.95568400771
##$TD= 16384
##$TD0= 1
##$TE= 0
##$TE2= 300
##$TE3= 300
##$TEG= 300
##$TL= (0..7)
0 120 120 120 120 120 120 120 
##$TP= (0..7)
150 150 150 150 150 150 150 150 
##$TP07= 0
##$TPNAME0= <>
##$TPNAME1= <>
##$TPNAME2= <>
##$TPNAME3= <>
##$TPNAME4= <>
##$TPNAME5= <>
##$TPNAME6= <>
##$TPNAME7= <>
##$TPOAL= (0..7)
0.5 0.5 0.5 0.5 0.5 0.5 0.5 0.5 
##$TPOFFS= (0..7)
0 0 0 0 0 0 0 0 
##$TUNHIN= 0
##$TUNHOUT= 0
##$TUNXOUT= 0
##$USERA1= <user>
##$USERA2= <user>
##$USERA3= <user>
##$USERA4= <user>
##$USERA5= <user>
##$V9= 5
##$VALIST= <valist>
##$VCLIST= <CCCCCCCCCCCCCCC>
##$VD= 0
##$VDLIST= <DDDDDDDDDDDDDDD>
##$VPLIST= <PPPPPPPPPPPPPPP>
##$VTLIST= <TTTTTTTTTTTTTTT>
##$WBST= 1024
##$WBSW= 4
##$XGAIN= (0..3)
0 0 0 0 
##$XL= 0
##$YL= 0
##$YMAX_a= 282514
##$YMIN_a= -56053
##$ZGOPTNS= <>
##$ZL1= 120
##$ZL2= 120
##$ZL3= 120
##$ZL4= 120
##$ABSF1= 10
##$ABSF2= 0
##$ABSG= 5
##$ABSL= 3
##$ALPHA= 0
##$AQORDER= 0
##$ASSFAC= 0
##$ASSFACI= 0
##$ASSFACX= 0
##$ASSWID= 0
##$AUNMP= <proc_1d>
##$AZFE= 0.1
##$AZFW= 0.1
##$BCFW= 1
##$BC_mod= 2
##$BYTORDP= 1
##$COROFFS= 0
##$CY= 11.3945322036743
##$DATMOD= 1
##$DC= 2
##$DFILT= <>
##$DTYPP= 0
##$F1P= 19.5091578491511
##$F2P= -0.509923556040331
##$FCOR= 0.5
##$FTSIZE= 0
##$FT_mod= 4
##$GAMMA= 1
##$GB= 0.15
##$INTBC= 1
##$INTSCL= 1
##$ISEN= 128
##$LB= 0.24
##$LEV0= 0
##$LPBIN= 0
##$MAXI= 10000
##$MC2= 0
##$MEAN= 0
##$ME_mod= 0
##$MI= 1.114404
##$NCOEF= 0
##$NC_proc= 0
##$NLEV= 6
##$NOISF1= 3.799351
##$NOISF2= 2.8
##$NSP= 1
##$NTH_PI= 0
##$NZP= 0
##$OFFSET= 15.70392
##$PC= 1
##$PHC0= -9452.866
##$PHC1= 13.00088
##$PH_mod= 1
##$PKNL= yes
##$PPARMOD= 0
##$PSCAL= 0
##$PSIGN= 0
##$REVERSE= no
##$SF= 200.130013532006
##$SI= 16384
##$SIGF1= 3
##$SIGF2= 2
##$SINO= 400
##$SIOLD= 16384
##$SREGLST= <1H.CDCl3>
##$SSB= 0
##$STSI= 0
##$STSR= 0
##$SW_p= 3612.71676300578
##$SYMM= 0
##$S_DEV= 0
##$TDeff= 0
##$TDoff= 0
##$TI= <>
##$TILT= no
##$TM1= 0
##$TM2= 0
##$TOPLEV= 0
##$USERP1= <user>
##$USERP2= <user>
##$USERP3= <user>
##$USERP4= <user>
##$USERP5= <user>
##$WDW= 1
##$XDIM= 8192
##$YMAX_p= 0
##$YMIN_p= 0
$$ End of Bruker specific parameters
$$ ---------------------------------
##NTUPLES= NMR FID
##VAR_NAME=  TIME,          FID/REAL,        FID/IMAG
##SYMBOL=    X,             R,               I
##VAR_TYPE=  INDEPENDENT,   DEPENDENT,       DEPENDENT
##VAR_FORM=  AFFN,          ASDF,            ASDF
##VAR_DIM=   8192,          8192,            8192
##UNITS=     SECONDS,       ARBITRARY UNITS, ARBITRARY UNITS
##FACTOR=    0.0002076,     1,               1
##FIRST=     0,             0,               0
##LAST=      1.7004516,     0,               0
##MIN=       0,             -56053,          0
##MAX=       1.7004516,     282514,          0
$$ Real data points
##PAGE= N=1
##DATA TABLE= (X++(R..R)), XYDATA
0@%%%%%%%%%%%%%%%Pj5J6j6J6j6K1k9L2l5M1m8N5o2P0p9R0j02J15j29J44j61J80
38I5j98K20k46K71l01L33l66M04m48M98n54O15o87P73q70R85j126J300j517J790
58I71k104K201L856J13111L266r9327j3569J3223j5839k5214K728L8907N9368
71H1578O674m5740l0143M762J6877J9973j4261k7823L3852N0720l9649n5896L2334
84C3258M6694j8570l4494j2729Q089K6351J680l3467L67K6394j7463l2198L131
97b957Q441J0732K7004j0193m9015p453K4969p492j5630J5003K5442R741k7223
110A369m8819j057M0435l028k0506L1391K1599l4710j9627O543j5659K424M0828
123A183O658l1765m145J6637k8j4299j1546J3728K9298j1385l7851J3341L2913
$$ plain form
0 0 0 0 0 0 0 0 0 0 0 0 0 0 0 0 0 7 -8 8 -8 8 -8 13 -16 16 -19 22 -26 29 -33 37 -42 48 -54 61 -68 76 -85 95
38 95 -103 117 -129 142 -159 174 -192 212 -236 262 -292 323 -364 409 -461 524 -602 698 -819 971
58 971 -1133 1068 4924 118035 121301 21974 8405 21628 5789 -19425 -16697 22210 81578
71 81578 88252 42512 12369 17131 34008 53981 39720 11897 45749 96469 56820 924 33258
84 33258 79952 61382 26888 14159 22248 48599 50279 16812 17179 43573 26110 -6088 -2957
97 -2957 5484 16216 43220 33027 -15988 -23441 1528 -5964 -21594 -6591 18851 28592 1369
110 1369 -47450 -48507 -8072 -11100 -31606 -215 21384 -13326 -32953 -26410 -42069 -39645 1183
123 1183 7841 -23924 -28069 -11432 -11460 -25759 -37305 -23577 5721 -5664 -43515 -30174 2739
136B739j5517j5845J7452n826j8228J7357J2025j4198Q162J7139j5439k1066n496
149c6741M006K4069K1269j6182j1054J5723j3914l2237J2463K9739N563P110N554
162A5368j9633j5997Q72l388Q555K0285m26j924J0243j9141k5432K4003K2309
175A5694k3741m917K6576n809k3331N881J1390r42l26n541n522O100m91k068J7029
190I982K29k5489L354J6038k1632r323L9415J4065k8430r264M867r296O2J2239
204c183P843J3882O348k1273j5877K861m226Q394L0104J496k0560R267P090k5509
218c343p404K2842J1843R16o75j1580j064J2429r183q794K0927N048k1685L863
232A4140J4602j1750q16J7695r393j9076N611O317m084M567M216k21N99j6866
$$ plain form
136 2739 -12778 -28623 -11171 -16997 -35225 -17868 -5843 -20041 -11879 5260 -10179 -31245 -36741
149 -36741 -32735 -8666 12603 -3579 -14633 1090 -12824 -45061 -32598 -2859 2704 9814 15368
162 15368 -4265 -20262 -19390 -22778 -14223 6062 5636 3712 13955 -5186 -30618 -6615 15694
175 15694 -8047 -12964 13612 7803 -15528 -9647 1743 801 475 -5066 -10588 -4488 -4979 -7047 9982
190 9982 10211 -15278 -11924 4114 -17518 -26841 12574 26639 -1791 -11055 -6188 -15484 -15422 -3183
204 -3183 4660 18542 24890 3617 -12260 -9399 -13625 -5231 24873 26369 5809 15076 22166 -3343
218 -3343 -10747 12095 23938 24854 24179 12599 11535 23964 14781 5987 26914 31962 10277 14140
232 14140 28742 16992 16176 33871 24478 5402 11013 17330 13246 17813 22029 21808 22407 5541
246E541j9282J7195J8482j4487J446K1990j6568l2506L953J0038l450J2503J3900
259A8755j0154j0120m182j0964r37P591J044J2058J1889k1967k0376J7745O840
272b778j9040N142J7566p178p195N415m099M9R427o257q645N480l299l857J7564
287a705N127j7006M113Q846j9957p832K3359J0267n602K506m765j2679j626k87
301a7241M012K1750P359j5902NL972k1786n992K7397R380p783R326L62k1027l924
316a0092J1104J615M348O490j901K957M05j5439J266K1786n064j6891J2557R172
330B2313j5267K294J5983m687o826L020o237l872J0023M104J197P184r438j5186
344D605O813K459j1782J3676K3041j2583j8727M187k456r253O562R791M867N270
$$ plain form
246 5541 -13741 3454 21936 7449 8895 30885 14317 -18189 -14236 -4198 -7648 4855 18755
259 18755 8601 -1519 -5701 -16665 -17602 -10011 -8967 3091 14980 -6987 -27363 -9618 -2778
272 -2778 -21818 -16676 890 -6288 -13483 -8068 -12167 -12118 -2691 -8948 -17593 -12113 -15412 -19269 -1705
287 -1705 3422 -13584 -9471 -625 -20582 -28414 -5055 5212 -390 2116 -2649 -15328 -16954 -17241
301 -17241 -13229 8521 15880 -22 -17 3955 -17831 -23823 3574 12954 5171 14497 14859 -6168 -10092
316 -10092 1012 2627 6975 13465 11564 14521 14926 -513 753 22539 17475 584 13141 22313
330 22313 7046 9340 25323 20636 13810 16830 10593 6721 16744 20848 22045 29229 19791 4605
344 4605 11418 13877 2095 15771 38812 26229 7502 11689 9233 -20 6542 16333 21200 26470
358B6470j1062j9648L109P336p746O527J5228r355q839Q813r357j8111J2879J6135
372A2379r705q356K649J391M020k033j1949N116J2168j3863j1479J6060O538r171
386f235O801J148j9619k531J4950k081k411J2680L729p393p633j2148Q20K0379
400D56L549j0066R799N757k1784p741J3444J337O47J4819p4j2680j169j605n294
415a0605O866O255j898O608K40j6127K020J6620p760j1613J3278N533j1922J502
429a003P493k389K478J653j0449k205O135j150O061J1967q472r270R558m739j7988
444a2320J1170K1949l393p206K340o870o297M641Q25M049J3018j097r725N75o424
459E235j0180J4805J4899j2764m263J3908n224j4705M024N689n32N387j039p859
$$ plain form
358 26470 15408 -4240 -1131 6205 -1541 4986 20214 10859 2020 10833 1476 -16635 -3756 12379
372 12379 2674 -5682 -3033 -1642 2378 345 -11604 -6488 5680 -8183 -19662 -3602 2936 -6235
386 -6235 566 1714 -17905 -20436 -5486 -7567 -9978 2702 6431 -962 -8595 -20743 -19923 456
400 456 4005 -6061 3738 9495 -12289 -20030 -6586 -5249 -4602 10217 10143 -2537 -3706 -5311 -10605
415 -10605 -3739 2516 618 7226 7466 -8661 -6641 9979 2219 -9394 3884 9417 -2505 -1003
429 -1003 6490 4101 6579 8232 -2217 -4422 1713 563 6624 18591 10119 849 10407 5668 -12320
444 -12320 -1150 20799 17406 10200 12540 5670 -627 4014 4839 8888 21906 20809 11084 11659 5235
459 5235 -4945 9860 24759 11995 7732 21640 16416 1711 5735 11424 10892 16279 15240 7381
473G381M256L011p698L354M884j1156j048J2418o007q137J5157O638j6656o131
487B66M439j501K646M667j886M719L107j5289q736J1508J806k942J2634J744j6319
502H63j385N721j1116k079J6324N077o910m903n574j86N624o560n365J5916O019
517A1466j8409m769Q994n152k165Q435o663q602R510M415r003N0M549j614j18
532i076o867j0262J1455J6226j0119q870J0808j141j4142K519P565J339Q588M359
546B382j2095n111M016k622K694R218o33J721Q595j0506j5250J2463J3124q713
560g17K46J2037k654q071k54q49L409Q439l381n395P326R03p085N643K617r514
576B700M229R271j2583p206J6206O107j0604k612N08k228K365m50l664R873P049
$$ plain form
473 7381 11637 14648 6950 10304 15188 4032 2984 15402 9395 1258 16415 23053 6397 266
487 266 4705 3204 5850 10517 8631 13350 16457 1168 -7568 3940 5746 2804 15438 17182 863
502 863 -522 5199 -5917 -7996 8328 13405 6495 1592 -3982 -4168 1456 -5104 -10469 5447 11466
517 11466 -6943 -11712 -2718 -7870 -10035 -1600 -8263 -16865 -7355 -2940 -11943 -11893 -7344 -8958 -9076
532 -9076 -15943 -26205 -14750 1476 -8643 -17513 -6705 -7846 -21988 -19469 -11904 -10565 -1977 2382
546 2382 -9713 -14824 -10808 -13430 -10736 -1518 -2151 -430 8165 -2341 -17591 -5128 7996 -717
560 -717 -471 11566 8912 841 587 -262 3147 11586 8205 2810 10136 11039 3954 9597 12214 2700
576 2700 6929 16200 3617 -3589 12617 18724 8120 5508 6016 3788 6153 5703 2039 11912 18961
591A8961j2322o477M238m578n37J2810l68r267O395K979j3232l509Q862L858L344
606A1157J16r485j116P287p384o119J2540L784j0102L187M818r927j449Q637l619
621B325n602L787p42j687M163k307k825N647m989j1896P494R084r181J50J1749
636E170o963j2620L894K135l976N896N336k872r3k883q436L797O202m614L470
651f557J0040q430j0281P956K747p134N685P582n059p22K726n095j49O292k431
666b830n4O085n918o358J1464M381j1019J083P884n827l530O122J19N84N258m216
682C228o400K378j957j730J0274K881q513M502N719j3825n540J3941M140o154
696B944L505J569n499Q3k1j997O700N345n223P25K627q099l97J0979k537o616
$$ plain form
591 18961 6639 162 4400 -178 -715 12095 11727 2460 8855 11834 -1398 -4907 3955 7813 11157
606 11157 11273 1788 672 7959 575 -5544 6996 10780 678 3865 8683 -1244 -2693 5944 2325
621 2325 -3277 510 -232 -1919 2244 -63 -2888 2759 -2230 -14126 -6632 2452 -6729 -6579 5170
636 5170 -1793 -14413 -10519 -8384 -12360 -6464 -1128 -4000 -4093 -6976 -15412 -11615 -5413 -10027 -6557
651 -6557 3483 -4947 -15228 -7272 -4525 -11659 -5974 1608 -3451 -4173 -1447 -6542 -6691 -399 -2830
666 -2830 -2884 3201 -2717 -9075 2389 6770 -4249 -3166 4718 -1109 -4639 1483 1602 2186 7444 3228
682 3228 -3172 -794 -2751 -4481 5793 8674 161 4663 10382 -3443 -8983 4958 9098 2944
696 2944 6449 8018 2519 2602 2581 584 7284 12629 7406 8131 10758 2659 2262 13241 10704 4088
712D088R436K805j1187R03P501l154j351L315l088Q21M751o042k254R224j552
727A4216j0217L102K938n682L803P096o433m040M681l964n882L751J531J125N092
742A1117n630r967N630L360r838K412J1634m395p194M264k421o699N043M216l658
757b126M77O12l300K153J03o116M032P701p811m273R258j689q816O388M793q834
773g448j584N730j619K62L686l586j083L572n493m646P554J577m276N683J545
788a26j0125k23P591l811k503P459P45l085N92m173k632Q846J209p279N270O129
804C884q611k491Q126k132l065P710J334o671K270L028k444J599J274k470M028
819E369K205p294L071R742o152o672R112J502r726K775P464l253k10L103m607
$$ plain form
712 4088 13524 16329 5142 6045 13546 10392 9041 12356 9268 10089 14840 8798 6544 15768 14216
727 14216 3999 7101 10039 4357 8160 15256 8823 4783 9464 5500 -382 3369 4900 6025 11117
742 11117 5487 -4480 1150 4510 -5328 -2916 8718 4323 -2871 1393 -1028 -7727 -2684 1532 -2126
757 -2126 -1649 -1037 -4337 -2184 -2081 -8197 -4165 3536 -4275 -8548 710 -979 -9795 -3407 1386 -7448
773 -7448 -9032 -3302 -4921 -4659 -973 -4559 -5642 -2070 -7563 -12209 -4655 -3078 -7354 -1671 -126
788 -126 -10251 -10474 -2883 -6694 -9197 -1738 -993 -4078 -3486 -7659 -10291 -1445 -236 -7515 -2245 3884
804 3884 -4727 -7218 908 -1224 -4289 3421 4755 -1916 354 3382 938 2537 3811 1341 5369
819 5369 7574 280 3351 13093 6941 269 9381 10883 1157 3932 11396 8143 7933 11036 6429
834F429j993L939j852q8N286k215l480M589k818q529O321O975p510k166O811k772
850F927m702K766j310j230N843j890o413L862J716o930K366N287o749j157P476
865E862l140o090N339J698m956P00J240k987J985R62m530L864L876r001k263R472
881B031k920p019P083L527q033K80L686n094n90N371j398j647J854k787o07L865
897b398l972l670R041J517j0293J604O961n095k593N783j749k726M515q67m165
912h107L948J043l719L544J421o903K872O693n606k482P379j657n856M282L012
927a36l118K175J151k799L026O68o260K712P737m719l270P871j326o614N367L482
943E947o148J735O025l701k823K662m80Q44K773m346j98P801k811p666O107M523
$$ plain form
834 6429 4436 8375 6523 6435 11721 9506 6026 10615 7797 -732 5589 12564 5054 2888 9699 6927
850 6927 2225 4991 3681 2451 8294 6404 -9 3853 5569 -1361 1005 6292 -457 -1614 5862
865 5862 2722 -3368 1971 3669 -1287 -587 653 -2334 -349 613 -3917 -53 3823 -5178 -7441 2031
881 2031 -889 -7908 -825 2702 -5331 -5051 -1365 -6459 -7049 -1678 -3076 -4723 -2869 -5656 -6263 -2398
897 -2398 -6370 -10040 -999 518 -9775 -8171 -1210 -6305 -8898 -3115 -4864 -7590 -3075 -3942 -8107
912 -8107 -4159 -3116 -6835 -3291 -1870 -8773 -5901 792 -4814 -7296 83 -1574 -7430 -3148 -136
927 -136 -3254 -1079 72 -2727 299 967 -5293 -2581 5156 437 -2833 5038 3712 -2902 2465 5947
943 5947 -201 1534 7559 3858 1035 3697 3217 4061 6834 2488 2290 10091 7280 -386 5721 10244
959A0244p047O36N432m930k305O264j085m117L137L81k740K872p10l957M452K349
975H876p025O43N848n201l812O935N03n842K484J522l340J680M38m134L126L113
991E814o470j181O092l698l979O088p48o483M058L988o908j438M955j495j726
1006c131M72l205J061M645n052m059O652M77p183L098L865o836m9O028m050m164
1022a1431N207J29l855K251K95k116L284k96m495M435L593p261n82P882k726m713
1038a0399N051J167l946L547J574l915K484L401l793P36L972l819J88N633l732
1053a851m369Q082J942p282J939N448l177m05K081k294P28L703l168j644N093
1068D826j930l363N499J93o958L963N731n959k081O527j965m174K789Q53k001
$$ plain form
959 10244 3197 3833 9265 4335 2030 8294 7209 3092 6229 6610 3870 6742 6032 2075 6527 8876
975 8876 1851 2494 8342 3141 -671 6264 6767 925 3409 4931 1591 3271 3709 -425 2701 5814
991 5814 -656 -1837 4255 557 -3422 2666 1918 -4565 -507 3481 -3427 -4865 90 -1405 -3131
1006 -3131 -2659 -5864 -4803 -158 -5210 -9269 -2617 -2140 -9323 -6225 -2360 -9196 -9245 -3217 -7267 -11431
1022 -11431 -6224 -6095 -9950 -7699 -7404 -9520 -6236 -6532 -11027 -6592 -2999 -10260 -10842 -2960 -5686 -10399
1038 -10399 -5348 -4181 -8127 -4580 -3006 -6921 -4437 -1036 -4829 -4093 -121 -3940 -3752 1881 -1851
1053 -1851 -6220 1862 3804 -3478 -1539 3909 732 327 2408 114 842 4545 1377 -267 4826
1068 4826 2896 -467 5032 5225 -1733 2230 7961 2002 -79 6448 4483 309 3098 3951 1950
1083A950K576l09k653L912Q9n772L197N195n492j624O814k285n027M559R23m675
1099A378K908K719l759M41J996k771J259L041n540j029O877k748o513M967K914
1114F140n389L45K429l765r0L778k961j563K887l143k305M427k110m829N815K320
1130A986p521Q71N076n130k715N944k68l538K181n57k234K452j047k977M980K334
1146a63o271P40N457m145k503N894j186m742M771J438m947J188L711j878L18R02
1162a416l652J938N149m419l029O340o66n803L140K662l969J970M159l942j700
1177c238L049k219p21M417j281j550M342j784o003M338L895n472J639O357k766
1192C003l206L498l72j970L156n5j997L836P7m314L195L409m573Q86N413m494
$$ plain form
1083 1950 4526 4217 1564 5476 5565 -207 2990 8185 2693 1069 7883 5598 571 5130 6053 1378
1099 1378 4286 7005 3246 3687 5683 2912 4171 7212 1672 643 7520 4772 -1741 3226 6140
1114 6140 751 1096 3525 -240 -330 3448 487 -1076 1811 -1332 -3637 790 -1320 -6149 -334 1986
1130 1986 -5535 -4664 412 -4718 -7433 -1489 -1757 -5295 -3114 -3671 -5905 -3453 -4500 -7477 -2497 -163
1146 -163 -6434 -5694 -237 -4382 -6885 -991 -2177 -6919 -2148 -710 -5657 -4469 -758 -2636 -2318 -1416
1162 -1416 -5068 -3130 2019 -2400 -5429 911 245 -5558 -2418 244 -3725 -1755 2404 -1538 -3238
1177 -3238 -189 -2408 -3129 1288 7 -1543 2799 1015 -4988 -650 3245 -2227 -588 5769 3003
1192 3003 -203 3295 2923 953 4109 4054 2057 5893 5970 1656 4851 8260 3687 4573 9986 5492
1208E492k918P084L2n900K721L138l641k33J380j960K441K649m931q77M286l763
1224E000l110N749L1n256L040J869o643o85M557k129p21L231k019k399K101l063
1240d47k794N547K36n890L009L817o099j753N017j456k625L298j111k808L036
1255a023j04l221K865M56m545K370K601n335O58P295l426o342M286J686m221J773
1271d227K345k286O90Q59m542L94L792k433M17M911l447m495M307n4n544L924
1287e389N426m320j171L442k439j569K870q20k99M401j884l721M462J857n314
1302d468J810M984l796j182M268j712j504N289k04l553J663L86j870L238J392
1317D741m044K657M372o738l051O743Q80l216L466J042m544L96J010k776J713
$$ plain form
1208 5492 2574 9658 9690 3790 6511 9649 6008 5775 7155 5195 7636 10285 5354 4477 8763 5000
1224 5000 1890 7639 7670 2414 5454 7323 680 -5 4552 2423 1702 4933 2914 515 2616 -447
1240 -447 -3241 2306 2542 -3348 -339 3478 -2621 -4374 643 -813 -3438 -140 -1251 -4059 -1023
1255 -1023 -1127 -4348 -1483 -1027 -5572 -3202 -601 -5936 -5278 2017 -1409 -7751 -3465 -1779 -6000 -4227
1271 -4227 -1882 -4168 -3478 -2619 -7161 -6767 -2975 -5408 -4991 -80 -3527 -8022 -3715 -3769 -9313 -5389
1287 -5389 37 -4283 -5454 -2012 -4451 -6020 -3150 -3970 -4269 132 -1752 -5473 -1011 846 -4468
1302 -4468 -2658 2326 -1470 -2652 1616 -96 -1600 3689 3485 -68 1595 1981 111 3349 4741
1317 4741 697 3354 7726 988 -2063 4680 5560 2344 5810 6852 2308 2704 3714 938 2651
1332B651L732k111J04J420m580j342N586j819l496N561J903o796pM108l192r75
1348G47L464j528j145K453j752j788M396r96m484K577J634m617K134M304m091
1363A308j635M438k588m660L200J942j245K383j144m655K325J539n565R56O503
1378C102k634l573L498k472m838L733K463l136J125K293l254j034O46l022K122
1393d981L962m082k352N843q40n772L630L204m753j73L358k741p55M271m48j873
1409d502J767j991k057L693M05k191M535K109o671o87M718k500j169N576M13k854
1425a406J673j289l578L492K774j766K503K197n502o03M172l196k030O430J729
1440E600m609J272J351k895J616J807k722J145K722l144o28M348k466k294N335
$$ plain form
1332 2651 6383 4272 4376 5796 1216 -126 5460 3641 145 5706 7609 813 806 4914 1722 747
1348 747 4211 2683 1538 3991 2239 451 4847 3851 -633 1944 3578 -1039 1095 5399 1308
1363 1308 -327 4111 1523 -3137 63 2005 760 3143 1999 -2656 -331 1208 -4357 -3401 3102
1378 3102 468 -3105 393 -2079 -6917 -3184 -721 -3857 -2732 -439 -3693 -4727 -4081 -7103 -4981
1393 -4981 -1019 -5101 -7453 -1610 -2450 -8222 -4592 -1388 -6141 -6314 -2956 -5697 -6452 -2181 -2629 -4502
1409 -4502 -2735 -4726 -6783 -3090 -2685 -4876 -341 1768 -4903 -5590 -872 -3372 -4541 1035 1448 -1406
1425 -1406 267 -1022 -4600 -1108 1666 -100 2403 4600 -902 -1505 2667 -529 -2559 3871 5600
1440 5600 991 2263 3614 719 2335 4142 1420 2565 5287 2143 1515 5863 3397 1103 6438
1455F438j238o651L353N380l223p42K982k232j923J409j790l24M930r8k768J177
1471D680j391m313L576L775m477J045N157m226n557K796R57j734L126N48k803
1486A159J692L9n124R76M177k761r73L432k967k888M294K7m828J987K600l513
1502b671n58J987j081J543J348n446j502N107j816m429N121L200m330j33M66m479
1518g673O75N724r77k543K257o22j986K00k144J7P201J436p399Q28M245m001k038
1535f800M655K87j094L433j592m807K875K988k448M54J233j717K400K166m676
1550b643m8O046j388n977K323K686j331K226J342k987J404J398m736n43N343J3
1566C128o73K981k742m343L634J564m447K740N993k283l751M56r47P37L017j641
$$ plain form
1455 6438 5200 -1451 1902 7282 4059 3317 6299 4067 2144 3553 1763 1439 6369 6271 3503 4680
1471 4680 3289 -1024 2552 6327 1850 2895 8052 3826 -1731 1065 2022 288 3414 3962 1159
1486 1159 2851 2890 -2234 -1258 2919 158 -815 2617 -350 -3238 1056 1083 -3745 -1758 842 -2671
1502 -2671 -3229 -1242 -2323 -780 568 -4878 -6380 -1273 -3089 -7518 -2397 803 -3527 -3660 -3194 -7673
1518 -7673 -6998 -1274 -2251 -4794 -2537 -3159 -5145 -4945 -7089 -7072 129 1565 -5834 -5006 -761 -4762 -6800
1535 -6800 -2145 -1858 -2952 481 -1111 -5918 -3043 -55 -2503 -2049 -816 -2533 -133 2033 -2643
1550 -2643 -2691 3355 1967 -4010 -1687 999 -332 1894 3236 249 1653 3051 -1685 -2228 3115 3128
1566 3128 2455 5436 2694 -1649 1985 3549 -898 1842 7835 5552 1801 2257 1310 2047 5064 3423
1582C423p37M307r57n287J856K077k855K672L278m397j737M879p68m522K144J851
1598E227k017M87n43j959L615K172m635j374L160l089j918M391k43k650L327m9
1614C902n971m42L142q97R11K414k968j146J867m177k244N527J667l892J843J247
1630G83m923n38K906j440J94L625j438k472J265j082j113L465r27l719L638K694
1646I18n129k57N263j674l471K417r11j887L187J590k189J157K97l507K53J385
1662b558j855L092N286m182m522L232L67l719K317L231j110J222N81m515p89L712
1678b10l34L34L199j729k193K916r75m444L758M726l316j170K597r79j29J808
1694C859j295q56L389j476l032L375J854k615K017J328n152q99M890j012j854
$$ plain form
1582 3423 2686 6993 6036 749 2605 4682 1827 4499 7777 3380 1643 6522 5754 1232 3376 5227
1598 5227 3210 3697 3154 1195 4810 6982 2347 973 4133 1044 -874 3517 3274 624 3951 3902
1614 3902 -2069 -2511 631 -266 645 3059 91 -1055 812 -3365 -5609 -82 1585 -2307 -464 783
1630 783 -4140 -4678 -1772 -3212 -3018 607 -831 -3303 -2038 -3120 -4233 -768 -1695 -5414 -1776 918
1646 918 -4211 -4468 795 -879 -4350 -1933 -2844 -4731 -1544 46 -2143 -986 -689 -4196 -3943 -2558
1662 -2558 -4413 -1321 3965 -217 -4739 -1507 -1140 -4859 -2542 689 -421 801 1382 -3133 -3922 -210
1678 -210 -544 -210 2989 1260 -933 1983 1008 -3436 322 5048 1732 562 3159 2180 2051 3859
1694 3859 2564 1708 5097 3621 589 3964 5818 3203 5220 6548 1396 497 5387 4375 2521
1709B521M009J059l718j159o29j358L029J391k306J642J961n342k496L926m88
1724B042j148L774j17n013R67J649l225q8L401p91m8O26l391o22M061j827l199
1741b949L290J532m127P27K735k420k13K016k986j894K939J46l43K675j098l421
1757c391J447k49m190K030N388k254j714K428k694l518K322J502o89K118L12l123
1773d275K51K20l184K065M179k344j327L231k170l707L314K393k979J142K315
1788h76k547q66K202q81O72K239k864j037L911j56k774L829K025m132m53J731
1804B3k144O08M834J5j819J241j685k844K077R76m69L930J508n396p24L121k693
1821E59j623M499J434j778M42j459k479K261J944j958J178J558k710j12K039l269
$$ plain form
1709 2521 6530 7589 3871 2712 2083 725 3754 5145 2839 4481 6442 1100 -1396 2530 2042
1724 2042 894 4668 4551 -462 505 2154 -1071 -1159 2242 1451 1403 2029 -1362 -1984 2077 250 -2949
1741 -2949 341 1873 -2254 -1527 1208 -1212 -1425 591 -2395 -4289 -1350 -1204 -1547 1128 30 -3391
1757 -3391 -1944 -2193 -6383 -4353 1035 -1219 -2933 -505 -3199 -6717 -4395 -2893 -3582 -1464 -1152 -4275
1773 -4275 -4024 -3804 -6988 -4923 -744 -3088 -4415 -1184 -3354 -7061 -3747 -1354 -4333 -3191 -876
1788 -876 -3423 -4289 -2087 -2968 -2296 -57 -2921 -3958 -47 -203 -2977 852 2877 -1255 -1708 23
1804 23 -2121 -1513 3321 3336 1517 2758 1073 -1771 306 1282 813 4743 6251 855 131 3252 559
1821 559 -1064 3435 4869 3091 3533 2074 -405 1856 3800 1842 3020 4578 1868 1756 3795 526
1837E26p01N712o64n102J801L320j866p41Q66j725M63J345l108mM403j84k150
1854B191R26k071l020L173K129l424J249M260k954m396M97j4Q09L009j033k150
1870h19K349p16m976J115K900j370L27K185l352k202L111m10k991K228J880j750
1886b491L1o73j718K587J922m401j045M020q21k638L076J403k467R76ml617P88
1903e072L983j9l46J109j846r28R99k687n23O432J892m533L8J501k767k79K760
1920b86p58L82L391j663l539R73J074m45K509J75k930K081K208m279q18M816j89
1937B702k435J134j40j003K713N57k778J152J461k440KK140q05J194L240l421
1953C273m541L102J931k670J381L087o10n72j259l280P65L518p93r75K625q85
$$ plain form
1837 526 -175 5537 4873 -229 1572 4892 3026 2285 3151 1426 1889 3234 126 122 4525 4341 2191
1854 2191 3117 1046 -1974 1199 3328 -96 1153 5413 2459 -1937 -1440 -1454 -645 2364 1331 -819
1870 -819 1530 814 -4162 -3047 -147 -1517 -1190 995 -2357 -4559 -1448 -1858 -4849 -2621 -741 -2491
1886 -2491 -2460 -3133 -4851 -2264 -342 -4743 -5788 -1768 -2589 -5227 -2151 -748 -3215 -2239 -2243 -5860 -5072
1903 -5072 -1089 -1108 -1454 -345 -2191 -3119 -2120 -4807 -5330 1102 2994 -1539 -1501 0 -2767 -3046 -286
1920 -286 -1044 -662 2729 1066 -2473 -1500 -426 -871 1638 1813 -1117 964 3172 -1107 -1925 2891 2702
1937 2702 267 1401 1261 258 2971 3528 750 1902 3363 923 925 3065 2260 3454 6694 3273
1953 3273 -1268 1834 3765 1095 2476 5563 4953 4381 3122 -158 607 4125 3332 2357 4982 4097
1969D097k789R68l28k569L214L878m148l121L195n2j646K24m55L27K515j783l829
1986b302K170K529k547n15J043k274M94L033k075k745L491O92l850j085P34J053
2002b154K674L51l669K37K609l519l175L516K292o48J325j369l638J479J780k003
2018c912j27L139p1p45o63k623O28M368j184m120L021K857l662j136K616k11L72
2035a453J396k362j649L260R78j752O31k9j110J914n54k826K907N090l090l986
2051b635J936P33j581J499J035M9K632j50m953m69K806R1R83J792j817n95K854
2068D210k221m020L090L829j594j005J60o69J177R21k308P8L539j221l127J851
2084B690K46j083K167M97l709O5L660j538k229K161J120j005q34k070n95L586
$$ plain form
1969 4097 1308 2276 1948 -621 2593 6471 2323 -798 2397 2345 699 923 468 795 3310 1527 -2302
1986 -2302 -132 2397 -150 -665 378 -1896 -1402 1631 -444 -3189 302 994 -2856 -3941 -3207 -2154
2002 -2154 520 871 -2798 -2561 48 -3471 -6646 -3130 -838 -1486 -161 -1530 -5168 -3689 -1909 -3912
2018 -3912 -4039 -900 -971 -1716 -2379 -5002 -4374 -6 -1190 -5310 -2289 568 -3094 -4230 -1614 -1825 -1453
2035 -1453 -57 -2419 -4068 -808 170 -1582 -951 -980 -2090 -176 -730 -3556 -649 4441 1351 -2635
2051 -2635 -699 34 -1547 -48 987 1036 3668 3518 -1435 -1904 902 993 1976 3768 1951 1356 4210
2068 4210 1989 -2031 1059 4888 3294 2289 2449 1780 2957 3878 1570 1648 5187 3966 839 2690
2084 2690 2936 1853 4020 4517 808 873 4533 2995 766 2927 4047 3042 2208 138 -457 3129
2100C129O62k652R85J498l658j224K073q77O5L842q44l889M74P00k233M55J328
2117a66j88J412O40m126p96L568r84j952J920M36k260R34Q99k612Q21K473j682
2134a663j339R94o94N12K244j970k182K600L96l658J270L410j061r83R69j922
2150c077j344K114J53l65K141K62j930K64j255k390K998L532k394p84L045j503
2166e33k881J416J325q03J638P48k131L46J212j429O95J904j439j58K347j500
2182G57k046L824J079l334K5J903j284M44J425r35L63J952k380j906K386M64j029
2199A708K279P57l085L7J414k697l53L685O08j309J26j387j160J552m82j221K841
2216C313J120l127n86J740k361m55L280r01k330J893N57j959K72J054j336J95
$$ plain form
2100 3129 3791 1139 2124 3622 -36 -1260 813 -64 1 3843 2999 -890 -416 284 -1949 -1494 -166
2117 -166 -354 1058 1698 -2428 -3224 344 -640 -2592 -672 -236 -2496 -1562 -663 -3275 -2454 19 -1663
2134 -1663 -3002 -2008 -2702 -2190 54 -1916 -4098 -1498 -1102 -4760 -3490 -80 -1141 -2124 -1155 -3077
2150 -3077 -4421 -2307 -2154 -2519 -378 -116 -2046 -1782 -3037 -5427 -2429 1103 -1291 -2075 970 -533
2166 -533 -3414 -1998 -673 -1476 162 910 -1221 -875 337 -1092 -397 1507 68 -90 2257 757
2182 757 -1289 2535 3614 280 305 2208 924 1368 2793 1858 2221 4173 1793 -113 2273 2737 1708
2199 1708 3987 4744 1659 1696 3110 413 60 3745 4353 3044 3170 1783 623 2175 1693 472 3313
2216 3313 4433 1306 720 2460 99 -356 2924 2023 -307 1586 2143 184 456 1510 174 369
2232C69M98j982O94K379k009j009K416j023l055J849J270j748J082J626k605j236
2248b484J024j131j48K646m34j027J304j503k900J882J493k046Q93K702j970k263
2264c962Q80l90m33J766j41j096J726l29k495J519J577k217K64K369j866j554
2280d382L078N19k251J240J133k035l6J206l81J624J121k814m8K103j662r68L528
2297I75O47j883R02L35k828O52K624q49L02J912j151j486O66j113l02L380M30
2314C213k636J323J500k640q67K435m78o30K015j281j372J890K23j517J285K67
2330B730j830J188J232k453L59L554k014k382J509Q53j557R76Q77p30N41l15k615
2347g7O14K071j099j26J752j430k228J625j21k595K290K632k388j199R08j108
$$ plain form
2232 369 867 -1115 -421 1958 -51 -1060 1356 333 -2722 -873 397 -1351 -269 1357 -1248 -2484
2248 -2484 -1460 -2591 -2739 -93 -527 -1554 -250 -1753 -4653 -2771 -1278 -3324 -2431 271 -1699 -3962
2264 -3962 -3082 -3472 -3905 -2139 -2280 -3376 -1650 -1979 -4474 -2955 -1378 -3595 -3331 -962 -2828 -4382
2280 -4382 -1304 -785 -3036 -1796 -663 -2698 -2734 -1528 -1909 -285 836 -1978 -2026 77 -1585 -2553 975
2297 975 1622 -261 641 976 -1852 -1200 1424 575 877 2789 1638 152 818 -295 -597 2783 3213
2314 3213 577 1900 3400 760 -107 2328 1850 1220 3235 1954 582 2472 2695 1178 2463 2730
2330 2730 900 2088 3320 867 1226 4780 2766 384 1893 2746 1189 2165 3042 2312 2853 2538 -77
2347 -77 537 2608 1509 1383 3135 1705 -523 1102 981 -1614 676 3308 920 -279 629 -479
2363d79m66P05p83J62K247j374k637J779P02j995P09J019k264MK453j319j682
2380c219K142P6j622K60l03q37K443O21k535O94K011k820j079K470L20q93J634
2397f37m79k330P17R04j009J098J431j075L72P25k709n19L589l63k220K319Q60
2414F74k525J60J530j073J40J928j168p96J590n82n44J686p09j482K108O18k885
2431a330J425K842j515j266J292o21j120J966K06r10J925j4j951M55P82j473J330
2448B023K481k188j165K275q76k460J590J436n91P48k43j974O57J192j841Q2K336
2465C482j238j076J636j057k153K017J626k944j86J753n41o35O13p52j60J103
2481A488j715j423K431K40j853J104O34k543K40J712j737q05L131Kk543K15k88
$$ plain form
2363 -479 -945 -240 -1023 -861 1386 12 -2625 -846 -144 -2139 -1430 -411 -2675 -2671 -218 -1537 -3219
2380 -3219 -1077 -1001 -2623 -2363 -2666 -3503 -1060 -439 -2974 -2280 -269 -3089 -4168 -1698 -1378 -2271 -637
2397 -637 -1116 -3446 -2729 -1825 -2834 -1736 -305 -1380 -1008 -283 -2992 -3511 78 -285 -2505 -186 674
2414 674 -1851 -1691 -161 -1234 -1094 834 -334 -1130 460 -122 -666 1020 311 -1171 937 1555 -1330
2431 -1330 95 2937 1422 156 1448 827 -293 1673 1879 969 2894 2880 929 1384 2166 693 2023
2448 2023 4504 2316 1151 3426 2550 90 1680 3116 2525 3273 3030 1056 1713 2905 1064 1146 3482
2465 3482 2244 1168 2804 1747 -406 1611 3237 293 107 1860 1319 684 1297 545 385 1488
2481 1488 -227 -1650 781 1021 -832 272 906 -1637 -1397 315 -1422 -2227 904 906 -1637 -1422 -1710
2498a710m79J343P3j774J926J292k998r87K106o11p05K010p06j762J635K72k450
2515c525O46J864j020K11L65j790J030K362k087j975K506P47k634Q19J569r93
2531a905O61R79j847o85K024k81o08J606l52p72J472q12k590K327K668k188o41
2548i44K436j037j501J295k4l83K147l1j734P48N83j643J287J143j629M46K369
2565C528j884j773K609M03j741P91N93r69M18O41j366O30J826k161q91K017o19
2582B052j287K224J98k287Q32J264k096l55J686j35n21P78j637n05J956r45j466
2599b44K086Q23k795J99J482k078k13K182o15j342J364l13j382O76J08j087J117
2616c2N10k390P81J557j860o27K269j042j903J790L11j627P45J075j646K29N77
$$ plain form
2498 -1710 -2189 -846 -773 -2547 -621 671 -2327 -3314 -1208 -1819 -2524 -514 -1220 -2982 -1347 -1075 -3525
2515 -3525 -2879 -1015 -2035 -1824 -1459 -3249 -2219 143 -1944 -3919 -1413 -666 -3300 -2481 -912 -1905
2531 -1905 -1244 -265 -2112 -2797 -773 -1054 -1662 -56 -408 -1180 292 -520 -3110 -783 1885 -303 -944
2548 -944 1492 455 -1046 249 225 -158 1989 1958 224 972 1555 -88 1199 2342 713 1159 3528
2565 3528 1644 -129 2480 2883 1142 1933 2526 1557 1975 2616 1250 1880 3706 1545 654 2671 2052
2582 2052 765 2989 3187 900 1732 2996 900 545 2231 2096 1575 2353 716 211 2167 1222 -244
2599 -244 1842 2665 -130 69 1551 -527 -740 1442 827 -515 849 536 -846 -170 -62 -1149 -32
2616 -32 478 -1912 -1131 426 -1434 -2061 208 -834 -2737 -947 -636 -2263 -1518 -443 -2089 -1860 -1283
2633a283j745N60J827j287n89J845q96k037J635Q83j780Q54J639j876o58J647
2649a261j024k01J505n70o26J710p82k065K117R53k100N57K397j694r07J785l84
2666e90q97J539Q9j163J069L39j212J252P25k016Q89K098k317j032L124M8j813
2683A32J188P22j656O28Q08r55M96J284j360l02J478j142q52K294k57j982J856
2700B380P28k437J07J785j018j13J296j201j91R91q01j147K094O1k270J090J246
2717B600k098j19K150j564j076J653k64j537J108N55j165Q73l99j610J146J011
2733A264k339Q4K676j748j810J920j41j588J151P78j916P14O66j557k01J159q90
2750a778r7J499j312j354K092j8k388J574J212j874o0J275j169k34J350q26o32
$$ plain form
2633 -1283 -3028 -2468 -641 -1928 -2517 -672 -1568 -3605 -1970 -1087 -2867 -2013 -374 -2250 -2908 -1261
2649 -1261 -2285 -2486 -981 -1551 -2177 -467 -1249 -3314 -1197 -244 -2344 -1787 610 -1084 -1991 -206 -590
2666 -590 -1487 52 141 -1022 47 386 -826 426 1151 -865 24 2122 -195 -1227 1897 1945 132
2683 132 1320 2042 386 1014 1822 867 1363 2647 1287 985 2463 1321 469 2763 2506 524 2380
2700 2380 3108 671 778 2563 1545 1432 2728 1527 1336 2327 1526 379 2473 2534 264 1354 2600
2717 2600 502 383 2533 969 -107 1546 1282 -255 853 1408 243 1116 717 -893 253 1264
2733 1264 -1075 -991 1685 -63 -1873 47 -94 -1682 -531 247 -1669 -955 -289 -1846 -2047 -888 -1778
2750 -1778 -1875 -376 -1688 -3042 -950 -968 -3356 -1782 -570 -2444 -2504 -1229 -2398 -2632 -1282 -2108 -2740
2767b740J592o98j247J912L35j945R22J366k011O2K291j119j201J949j19j204
2783a855R77o9p65J566M10j783Q98J670k032n19K428p78j354K078J95j982J161
2800B46J039j410L03J278r42K23R76j375j55K179r82j744K321L28k179J067J508
2817B681j586QJ532j230m81J513o07r65J446l02j333J491L37j928J187J521j789
2834A495q68K190p69j545J390k83n09R81k8j791J018R82k085N73J552j717p22
2851a36J868o76j882J583O74k086M62Q87j112J39O23j263K34J236j610q29J913
2868B5m68k020J693O82k090N13J323j470k20J489o66r77J185n43q70J317l08j340
2886b745J493P56k418M77K010j416p87J813l34j053R55J45j226J186L94j369J023
$$ plain form
2767 -2740 -1148 -1846 -3093 -1181 -846 -2791 -1869 -503 -2514 -2452 -161 -1280 -2481 -532 -651 -1855
2783 -1855 -878 -947 -1712 -146 264 -1519 -621 1049 -983 -1502 926 148 -1206 872 1067 -915 246
2800 246 1285 -125 178 1456 514 737 1713 338 183 2362 1380 -364 1957 2285 106 1173 2681
2817 2681 1095 1103 2635 1405 924 2437 1830 865 2311 2009 676 2167 2504 576 1763 3284 1495
2834 1495 627 2817 2048 503 1893 1610 1101 2082 2054 263 1281 2263 178 751 2303 586 -136
2851 -136 1732 1056 -826 757 1431 -655 -193 694 -418 -279 344 -919 -685 551 -1059 -1888 25
2868 25 -443 -2463 -770 -88 -2178 -1665 -342 -1812 -2032 -543 -1209 -2186 -1001 -1544 -2414 -1097 -1405 -2745
2886 -2745 -1252 -496 -2914 -2437 -427 -1843 -2630 -817 -1151 -2204 -1249 -1104 -2330 -1144 -750 -2119 -1096
2903a096J014j752J14J899j434p97K149l06j735J228J018j397O67O98r34L56R15
2920F07r67m6J630j123r01K078j62j863J497J140k057O20J686j428l36J655n29
2937A501o91J134m23j004J648r5j595J299J222k100J72J726j118n77J339n61j203
2954F74J484j8j383R59M54j376N32R22j566j3K080j531j275J724L6j669Q14O14
2972A462j240J73Q86j385K28J071j436k92J614j000j069J575m96j655J144J278
2988H58k172K4J535j043p23J061m08n73J096r17q53J406R5j904Q50J238j539j67
3006b136J695j150r85J702l40j221J022M11j305P06L27j137R29J093j822m75K340
3023c46p08j529J655L53j490R03N35j369R71J245j350j03J369j047j89J579p07
$$ plain form
2903 -1096 -82 -1834 -1720 179 -1255 -2052 97 -209 -1944 -716 302 -1095 -428 270 -664 -308 607
2920 607 -360 -406 1224 101 -800 1278 1116 -747 750 1890 -167 453 2139 711 375 2030 1501
2937 1501 810 1944 1521 517 2165 2070 475 1774 2996 896 1068 2794 1676 1099 2438 1877 674
2954 674 2158 2140 757 1716 2170 794 1326 2248 682 669 2749 1218 -57 1667 1703 34 848 1462
2972 1462 222 395 1281 -104 124 1195 -241 -533 1081 81 -988 587 91 -1564 -420 858
2988 858 -1314 -1290 245 -798 -1521 -460 -868 -1441 -345 -1262 -2115 -709 -614 -2518 -1668 -430 -1969 -2136
3006 -2136 -441 -1591 -2576 -874 -1214 -2435 -1413 -1002 -2307 -1601 -1274 -2411 -1482 -389 -2211 -2686 -346
3023 -346 -1054 -2583 -928 -575 -2065 -1162 -627 -1996 -1025 220 -1130 -1233 136 -911 -1100 479 -228
3040b28j120K014N53k457P99J373j034k78J401n57j86J146o64o02J726n22j359
3057EJ444M56j685P89J415j761l78K267p02j439J433J90q50P56rj322J055Q29
3075B493j872O73J534j244r61J833q54j325J541J66j421P77Q75j540J58P76r95
3092F14j8J274j089q30J652n79j796J527O71j994J48J525j446m23J249m59p76
3109g50J058m83j166J348n6j593J048P75k088M09J619j435q02J758k79j526J069
3126a094Lj156Q12M45j029Q72M35j570m6J764j202p38J892l95j404J254L86j592
3144b363N60J551j408L6J075j092m6J303o49j177K246j84j702R30J277j566L24
3161h85J353j121k41J334n96n24J429k47r02J237j62j521J226J190j759M02J729
$$ plain form
3040 -228 -1348 666 1219 -1238 -439 934 -100 -378 1023 466 280 1426 762 160 1886 1364 5
3057 5 1449 1905 220 1009 2424 663 285 2552 1850 411 1844 2034 1184 1940 1931 609 1664 2493
3075 2493 621 1294 2828 1584 623 2456 1602 277 1818 1984 563 1340 2215 675 833 1609 614
3092 614 596 1870 781 -49 1603 1024 -772 755 1426 -568 -420 1105 -341 -764 485 26 -750
3109 -750 308 -175 -1341 7 -49 -1642 -594 181 -1907 -1498 121 -1314 -2116 -358 -637 -2163 -1094
3126 -1094 -1091 -2247 -1435 -990 -2019 -1147 -712 -2282 -2328 -564 -1766 -2504 -612 -1007 -2411 -1157 -771 -2363
3144 -2363 -1803 -252 -1660 -1624 -549 -1641 -1687 -384 -1033 -2210 36 -148 -1850 -920 357 -1209 -885
3161 -885 468 -653 -894 440 -156 -680 749 502 -400 837 675 -846 380 1570 -189 213 1942
3178A942j023j301J435K72r13J135o6p11O60M40j475O40J182j454J35J601j184
3195A315j113J775K1j283P36J090j705K54R67j111L11J011j205m78J394o47j280
3212E2J614L49j890R04O95j496n3J259p31m50R64r30q13J043m07r32J590J97j964
3231i99P11J184k018k20J742n28r96P58o5j126Q71j3j133J013N59j399K69J121
3249b69j480l30J788j060j244J511M07j705O34R66p42q4N50j261M22J198q50o88
3267b237J645p59j043J351K88j329Q30J394j401l72J375p26n94J240n6m59J068
3284B15n25j233J395N75j480N33J773j085o45J302o37q52J398J88j054Q33K33
3301I34p69O19Q24j448P15J305j778n46K095j78j594J363M87j322J85Q84r59N10
$$ plain form
3178 1942 919 -382 1053 1325 412 1547 1481 770 1430 1870 395 1035 2217 763 898 2499 1315
3195 1315 202 1977 1998 715 1451 2541 836 1090 2057 946 1257 2268 1063 585 1979 1332 52
3212 52 1666 2015 125 1029 1724 228 175 1434 703 253 1217 287 -526 517 110 -822 768 965 -999
3231 -999 -288 896 -1122 -1342 400 -128 -1124 -366 -431 -1557 -686 -699 -1832 -819 -260 -1659 -1390 -269
3249 -269 -1749 -2079 -291 -1351 -2595 -1084 -677 -2382 -1748 -782 -1524 -1608 -1058 -2319 -1897 -699 -1549 -2237
3267 -2237 -592 -1351 -2394 -1043 -755 -2084 -1254 140 -1261 -1633 -258 -984 -1578 -338 -394 -853 215
3284 215 -310 -1543 -148 427 -1053 -520 1253 168 -477 825 188 -664 734 922 -132 701 934
3301 934 165 784 1608 160 875 2180 402 -144 1951 1773 179 1542 2029 707 892 1776 817 1327
3319A327J245j093o63R78p60l57J557l56j282J294O08k242J56J653q86l07J087
3336A959p12m88O72o55r59J351J1j267R56O17j612L84J140j335o36J486k83j554
3354i25Q17L83p80N37K3j391Q10O59j450J78J700j152j199J369l73j347J105Q73
3372a63j465M92N66j090m5N34n60K31J340j111j022J202N7j373J091Q17j138L9
3390a598J160j014n57J415l55n45P17m10l68J056o3j271J228P65j509j68J637
3407A20m58p25J138J88j307J194l7j092J085P39q73M78P45j640J38J601n88r29
3425b23J723L67j799N13N06q63P23R83j051R6R22q27n56J087l40o35J516k7j912
3444B03J046J258j622j62J234l46p16Q35o09m37J398l69j467P33N98j397O12R24
$$ plain form
3319 1327 2572 1479 816 1794 1034 677 2234 1878 596 1890 2498 256 412 2065 1179 872 1959
3336 1959 1247 759 1431 776 -183 1168 1179 -88 868 1485 -127 257 1397 62 -574 912 629 -925
3354 -925 -108 275 -505 32 55 -1336 -526 133 -1317 -1139 561 -591 -1790 -421 -794 -2141 -1036 -163
3372 -163 -1628 -1136 -570 -1660 -1705 -1171 -1731 -1500 -160 -1271 -2293 -1091 -1034 -2407 -1316 -499 -1637 -1598
3390 -1598 -438 -1452 -2009 -594 -949 -1494 -777 -1187 -1555 -499 -562 -1833 -605 160 -1349 -1517 120
3407 120 -338 -1063 75 263 -1044 150 113 -979 106 845 -28 450 1195 -445 -307 1294 706 -223
3425 -223 1500 1867 68 581 1087 224 947 1930 879 975 1897 1070 514 1601 1261 626 2142 2115 203
3444 203 1249 2507 885 723 1957 1611 895 1730 1121 684 2082 1713 246 979 1577 180 792 1716
3462A716j297M8J636j322j287J220L92p14L59j81q27Q47q5j642N49J894j109q62
3480f65R83n80j042J234K8j448R30J060j370l92N49j75M8N43j360j02J730q72
3498i01j390J181R31j565K57O36j184L52J410r40o98J007pj016O02j61j79J442
3516b23J03k089N42J247q28n16J249L9n04P84p06j076J302R26j144L56P41p78
3534e75O6O43j091k8K129m09j463Q53Q52r35J56O73q44L62R27j218p4J615l95
3553A244o05P45l73j251J645M96j551N40J614j099r76P58j98L5R10k00q74J092
3571A952l61j085N36O73q16M93J105j635n47J271j97j199R63O91j003K47j34j116
3589a62R30O45j253k15J251p83o86J155l51j082O38L24j313K02J014n20rO54j353
$$ plain form
3462 1716 419 467 2103 781 -506 714 1106 392 751 570 -257 590 505 -1137 -588 1306 197 -665
3480 -665 318 -262 -1304 -70 -42 -1490 -560 500 -870 -1262 -713 -888 -840 -297 -1657 -1759 -29 -901
3498 -901 -2291 -1110 -179 -1744 -1487 -851 -2035 -1683 -273 -1213 -1911 -904 -911 -1927 -1325 -1486 -1665 -223
3516 -223 -120 -2209 -1667 -420 -1248 -1764 -515 -476 -980 -196 -902 -1978 -676 250 -894 -538 203 -575
3534 -575 -509 134 -957 -985 1144 735 -728 125 977 42 198 871 27 389 1316 98 24 1639 1244
3553 1244 639 1384 1011 -240 1405 1901 350 890 2504 1405 429 1187 989 1024 1934 1734 860 1952
3571 1952 1591 506 1042 1715 899 1392 2497 862 315 1586 1389 190 1153 1844 841 1088 954 -162
3589 -162 768 1413 160 -55 1196 413 -273 882 531 -551 87 411 -902 -700 314 -206 -215 439 -914
3608i14J34R08j091q46J876K57j586M25O61j476J05R99m61n48J140m27r84P00
3626a128l14k24R40k1j299R66N78j447o7J425n19o59J227m83r13J059M40j052
3644a491N03N01r62M43Q16q59K00J197j231p53J341L48j080O03R22o06R6M01j292
3663i03K12J321l13l81R57l48j027J101J79j159J024J462j585m15J058l79o81
3680A23R71kl20R75m71r85R33N03j155N55J032j249l73J444p16q19J242K11j522
3699C77P35K00m68L79M74j043K41P73j300k19J333l16r95J238n0j399L14Q12j168
3718h2K62J165j011l35N18p08o11J327k0j374J323L5j694L74J247j054k78J100
3736A84o97n25N66l54n05R47m6j349Q84N60j307M26J198j283l94J058n90r36J090
$$ plain form
3608 -914 -780 128 -963 -1809 67 324 -1262 -837 -176 -1652 -1547 -548 -1009 -1557 -417 -844 -1828 -1128
3626 -1128 -1442 -1666 -726 -747 -2046 -1080 -502 -1949 -2016 -591 -1110 -1769 -542 -1025 -1938 -879 -439 -1491
3644 -1491 -988 -487 -1449 -1006 -190 -1049 -849 348 -883 -1636 -295 53 -1027 -424 498 -108 -12 389 -903
3663 -903 -691 630 317 -64 893 545 -482 619 798 -361 663 2125 540 125 1183 804 123
3680 123 1094 1092 772 1747 1276 291 1224 1727 572 1127 2159 910 537 1981 1265 446 1688 1899 377
3699 377 1112 1312 844 1223 1697 654 895 1668 368 149 1482 1166 171 1409 1359 -40 274 1086 -82
3718 -82 180 1345 334 -1 517 -191 -802 525 505 -869 454 489 -1205 -831 416 -638 -916 184
3736 184 -513 -1038 -472 -826 -1331 -384 -430 -1779 -895 -335 -1642 -1216 -18 -1301 -1695 -637 -1227 -2163 -1073
3755a073N90p01K72J5q72L99N31p93J84J337p42r37J104l10j018J466M30j234
3773a352P48P88j012n75J101m01J89R30o37n54J312m58j121J399M41q78j59J098
3791H59p73j23J143m36o34P74j38o91J064K68r51R11K95j326J76J162o27o22J460
3810A791J3r65J49j1o51Q94O42r05L01N75r20l41J050o89k81J558m96j644P09
3829G79Q71j184j5R04m74j08N69q59m00J250m06j169R37J05j179Q65L90j329K74
3848a79J234j092q74Q90k9j85N73o66n63Q57q3j549M86J406r42j37P45r53p96
3867a857J203Oj099R01M23p89O1j31n67Q35P14j226l36J437m48j027J095J52r58
3886a611O88L38j291M06J350n81o42O52k01j30Q67q65k30J460K78j627J73Q41
$$ plain form
3755 -1073 -483 -1184 -912 -897 -1769 -1370 -839 -1632 -1448 -111 -853 -1790 -686 -996 -2014 -548 -118 -1352
3773 -1352 -604 184 -828 -1403 -302 -703 -514 416 -221 -775 537 79 -1042 357 798 -80 -239 859
3791 859 86 -37 1106 670 36 810 672 -19 1045 1313 362 1273 1568 242 418 1580 953 331 1791
3810 1791 1804 839 988 977 326 1220 1862 957 1258 1833 913 572 1622 933 652 2210 1714 70 779
3829 779 1650 466 451 1355 881 773 1342 483 83 1333 927 -242 695 800 -379 486 876 -453 -179
3848 -179 1055 -37 -911 -21 -50 -235 338 -328 -891 -34 -117 -1666 -1180 226 -716 -853 -108 -1061 -1857
3867 -1857 -654 -648 -1747 -846 -423 -1212 -1151 -1282 -1849 -1014 -300 -1526 -1862 -425 -873 -1900 -805 -653 -1611
3886 -1611 -923 -585 -1876 -1470 -120 -701 -1343 -691 -892 -1022 -155 -1020 -1250 210 488 -1139 -966 -125
3904a25o58O0J241o81J21P35o60r91R53O03n75P46j9j155P70R19j402L4J457m5
3924A328r34M74q6l76P44Q7r48M70J121r82m60R57n49r3J225q84j297J798L48
3943A943j507M45R52p65j66L01p46K87J135n65q46R21k03r98M77K68j088J049
3961H94R52j693n92J243k54p09O04L7l33N65l75j589J025R49j254m3R85q39j72
3980e99Q27p69o84J190J63j287L46M53m30M26r3r69K84J008j131n75J451K30j050
3999a209L89j4j032O88P58r65K2J111q32m01L73m24R7J528o00j300J162O35j380
4018a394j26J218m53m1Q03q39n28J088J20p95O24K57p83P03K76r33L81J425r96
4037Gp63J205J0o29N85L52p09O72K69r94K78R08k84k83R25p16o32J058j28j076
$$ plain form
3904 -125 -783 -723 518 -163 -42 693 33 -958 -5 598 23 769 750 -405 365 1284 -118 -84 1373 1328
3924 1328 394 868 782 406 1150 1237 289 759 1880 898 438 1395 846 753 1978 1094 -203 1595 1943
3943 1943 436 881 1833 1068 902 1203 457 744 1879 1314 468 1389 1186 188 665 933 -155 894
3961 894 1846 153 -439 804 550 -159 445 482 149 714 339 -1250 -225 724 -530 -573 412 -427 -599
3980 -599 228 -541 -1225 -35 128 -1159 -813 -360 -790 -364 -457 -1426 -1142 -134 -1265 -1840 -389 -159 -1209
3999 -1209 -820 -834 -1866 -1178 -420 -1385 -1363 -252 -1084 -1485 -1112 -1536 -1439 89 -511 -1811 -649 -14 -1394
4018 -1394 -1520 -302 -755 -796 7 -832 -1360 -272 -152 -947 -323 -66 -849 -146 130 -803 -422 1003 7
4037 7 -756 449 459 -170 415 767 58 730 999 5 283 1191 907 624 1549 833 201 1259 1131 55
4057E5J136R62j018l12P80q83j5P71n74l81J339n43j007R68Q4q70O20M40j109
4076D43j14J259q28q69J119J23p34M36k19n57P51M16j608P12N18r78k09R15n60
4095A6m53J040k52j481P48N32q46M29M55p23L77K98j632k0J537l52j030Q21L20
4114b16j162N29M35q87R3J073r27k03L60l13m6P54l52o95J076J69j378M72R41
4133b77p72m61J005n75m74J081j32n38P24J47q10K94L59p12P23P55j042l10J123
4152A08n36p59J115L73n10N09L72j257M90O15o44J0J130n70m48R39m06r12J247
4171H66L35r28L11P73q56l7Q39n40k26J071p82o92J087q8p87R16L63j217K31Q04
4191A443p66l17J052k80p52P27j80n31P31J45q15O79L49j327J20Q36p62k54J199
$$ plain form
4057 55 1191 2153 1135 823 1603 720 705 1476 902 521 1860 1317 310 1278 1362 492 1112 1552 443
4076 443 329 1588 760 -109 1010 1133 399 835 616 59 810 1226 -382 330 848 -130 -339 576 16
4095 16 -437 603 351 -1130 -382 150 -696 -267 188 -535 -158 140 -1492 -1512 25 -327 -1357 -536 -216
4114 -216 -1378 -849 -414 -1301 -1208 -135 -1062 -1265 -905 -1218 -1264 -510 -862 -1557 -481 -312 -1690 -1218 -277
4133 -277 -1049 -1510 -505 -1080 -1554 -473 -605 -1143 -419 -272 -1082 -788 -429 -1141 -418 337 -705 -1015 108
4152 108 -428 -1187 -72 301 -209 300 672 -585 -95 520 -124 -114 1016 446 -2 937 531 -381 866
4171 866 1201 273 584 1357 501 464 1303 763 537 1608 826 134 1221 1133 346 1262 1625 408 639 1443
4191 1443 677 360 1412 1132 380 1107 927 396 1127 1272 457 1136 1485 158 278 1114 352 98 1297
4210A297n53p90P15J88j070K98N83q79J00P54r04p7R62p45o78J021k83q91P12
4229b40K48r73K84P15q30n2K74n39p2R92n29p23Q44J9j326J032N81r02O7Q63r86
4250a253m47J072k56m40R47k12p97N55Jp90Q20P56j090J68P97o24m90R87k35o14
4270a145J014K59j072M67N70o88L60M59p35q8J120q48k96J115N5r42M43O35j034
4289c51M20P95o08j30J001o83l94O90k85l72J044J66j141L92R53j162j25J156
4307A366l97k04L55l27n64R50j3p32O49L99q15K87M47j206K98J154o42r47J025
4326A083J00q46M87L31q76L75K93q62J19P85o48k16O07m09p11Q90q6j173Q56P60
4346H59j071l56R16q96J30P24o48m51R58l28j398R09L78j036N90N22j082q5J152
$$ plain form
4210 1297 744 -46 669 857 -213 85 668 -211 -111 643 -261 -338 624 -121 -799 222 -61 -952 -240
4229 -240 8 -965 -681 34 -796 -848 -574 -1113 -1185 -193 -722 -1445 -601 -582 -1908 -876 -295 -1197 -1130 -267 -1253
4250 -1253 -1700 -628 -884 -1324 -377 -589 -1386 -831 -830 -1620 -800 -44 -1134 -966 -169 -793 -1283 -296 -531 -1145
4270 -1145 -131 128 -944 -477 93 -595 -235 224 -511 -599 521 -327 -623 492 547 -395 48 683 -351
4289 -351 69 864 256 126 1127 444 50 740 455 83 1127 1293 152 544 1497 335 210 1366
4307 1366 969 765 1120 793 229 1179 1166 434 1083 1482 667 954 1401 195 493 1647 1005 58 1083
4326 1083 1183 337 824 1155 279 654 947 85 204 989 341 125 732 323 -388 502 416 -757 99 859
4346 859 -212 -568 348 -548 -418 306 -342 -793 165 -163 -1561 -652 -274 -1310 -720 -198 -1280 -1365 -213
4365b13o11o85Q62Qn57N64k83n71P33J87j249N39J100q34l94J058j72q55R20k45
4385f98p64O01O06p82L08M25m95R3P07p85k30J125j2j007P78K91j121N19O55o49
4405d35K49Q08n98l18O95q5n05Q67l56o75J150K20j125L52J080j071j14Q80m06
4424F13k74P39o5p88R18K10j113L73N33p94N27O72j018l24R98K5j007P26N77o55
4444H73J05Mo84L17P26p70j71R69o41p51Q79k75o54R96l9j036L44P70q30l23O33
4465D42m64j19N76n62n62R02R8j217M52P43j130L32Q33j006k12J150p05n46N16
4484d79J49o37N08J61r03N34N03j046k56J079j33o34O85j23o13M76J79q80O14
4503h16M83q13R8P47q28q0R53n57n00J067j04j033M02P18o99J85P20p01j11J060
$$ plain form
4365 -213 -824 -1509 -647 -639 -1196 -632 -915 -1486 -753 -566 -1815 -1276 -176 -1010 -1404 -346 -518 -1373 -453 -698
4385 -698 -1462 -861 -255 -1037 -729 -304 -799 -706 1 -784 -1014 111 99 -908 -130 161 -960 -441 214 -435
4405 -435 -186 622 24 -294 401 316 -189 678 322 -353 797 1017 -108 244 1324 253 139 1019 613
4424 613 339 1078 1013 225 1143 1353 240 613 1146 352 879 1551 533 209 1207 1232 225 951 1528 873
4444 873 978 982 298 615 1341 571 400 1369 728 -23 856 581 -73 923 884 -152 192 962 132 -191 442
4465 442 -22 -141 435 -127 -689 213 311 -906 -454 289 -841 -509 324 -682 -894 256 -449 -995 -479
4484 -479 -330 -967 -459 -298 -1201 -667 -164 -1210 -1466 -387 -520 -1154 -469 -592 -1205 -729 -550 -1430 -816
4503 -816 -333 -1146 -1048 -301 -1129 -1209 -256 -813 -1313 -246 -350 -1383 -981 -263 -962 -777 -57 -758 -869 191
4523A91o31k97O59j75n32Q90K1o78P29O53j112O8Q35l00o16J025k91k70Q84k92
4543G61p55M09N36n78L47O12r55O2R11p96m97J010J36q82M02M11m62K39L11p50
4563D72K96N91p92m13J060k80o54Q31r4r48O09N39r24j27P10n34j09N57o08l02
4583a20P86k44r86J116M6q30L27M93j045J83P36p70l75P41l4p93O44j2m99M31
4603b05J63r14L03P62q41l26R51l19q25N53K08q25O43M24p82m1O06n22J18N44
4623c25p45l13J066l25j026R00L56p75K85O09p46oO08l66j22R00l98n64Q36k14
4643c65q47J012L26j013M55Q89q72l37J054l09m40P07qn60K86M98n79L31M09o40
4663cJ51P49o83k42R17k08o80P28K61q15M03L82n61K30L51k40m31R05l86m15Q38
$$ plain form
4523 191 -440 -737 -78 -253 -785 105 126 -552 177 830 -282 -214 621 321 -295 730 439 169 1053 761
4543 761 6 415 951 373 720 1332 377 439 1350 554 57 1067 1203 321 723 1134 672 911 1222 472
4563 472 768 1359 567 154 1214 934 280 1111 1017 69 678 1217 293 166 876 342 233 790 182 -120
4583 -120 666 422 -564 552 598 -232 95 588 -457 -274 462 -308 -683 58 24 -769 -125 -137 -636 -205
4603 -205 -42 -956 -653 109 -732 -1058 -107 -426 -1251 -698 -490 -1315 -672 -248 -1030 -1071 -465 -987 -869 -325
4623 -325 -1070 -1383 -317 -642 -1668 -768 -412 -1187 -902 -293 -1039 -1045 -437 -803 -925 -25 -423 -987 -151 -365
4643 -365 -1212 -200 126 -887 -432 457 -415 -752 302 -7 -447 260 252 -308 -22 476 -103 228 637 -3
4663 -3 148 897 214 -28 889 681 1 729 990 175 578 960 399 629 980 740 309 1214 828 413 1251
4684A251j26p79O46K47p42k6P53n30m9M94m92j77N01j27n94N75k5o74M82K04n44
4705B68j95Q20o47l18O69k50n16O29p6r41N09L21p42M88K03n85pM07m78l47O86
4726a02k6q81O09P1n56N37K0o34N2N47o55k1P44m16m27N79K8q42P78L26q18K63
4748h24M82m73r4L80k69j55O33j88m89N89K76j098M45R65r98MJ026q30k36O48
4768b06J8m52L99J41m64N18K61o45K82N78q17J39R76n80o79J039o4p80O47M30
4788G41n87K5M63m18J40N50m44l10Q92j79p91R30o3n59L21M98p40O2N40k30k60
4809E81N01j49o17P48j32o81Q38J46j195L87Q76q87k34Q50m27k90M49l56l49M54
4829E13M7o53M39K99p41Q7N51n46m14J006l77o98O44R5r13M53K60n61J31M68n14
$$ plain form
4684 1251 1125 346 992 1239 497 471 1224 694 645 1139 647 470 971 844 250 825 800 126 608 812 268
4705 268 73 893 246 -72 597 347 -169 460 384 -557 -48 273 -469 19 222 -363 -370 37 -441 -788 -102
4726 -102 -128 -1009 -400 -329 -885 -348 -328 -962 -910 -363 -1018 -1039 -295 -711 -1138 -559 -531 -1373 -595 -269 -1087 -824
4748 -824 -342 -815 -909 -529 -798 -953 -320 -508 -997 -408 -132 -1230 -785 180 -818 -814 212 -618 -854 -206
4768 -206 -188 -640 -241 -100 -564 -46 215 -430 -148 430 -387 -248 728 148 -531 508 444 -336 311 741
4788 741 154 179 642 224 364 914 470 160 1052 873 82 1012 949 390 711 1209 469 531 1071 841 581
4809 581 1082 933 316 1064 932 251 1089 1235 40 427 1303 416 182 1032 605 315 764 408 59 513
4829 513 560 -93 346 645 -96 -9 542 -4 -418 588 211 -487 157 252 -661 -208 52 -509 -378 90 -424
4850d24k62P25m89n04Q67k52n84M16K93q24L57L94p61J04O87l94k23M14j99n08
4870a167P72q5p65M99N95p89j11P68p28r1O50k44l21P60K1o14L76K41n64L73K73
4891a51o56L44O35m04n44R53R8r34P11P3n89N21K34n43J21P31l18l79P78l93l21
4912c3P63j61o54O63M02p91L3P04l76L2N82o40j79O18j10m35M48Nn31L50L30o80
4934C40J52O94o22j48N53l00k93M65k90k86L84J55o28K52M09l64l05O07n17k27
4954C1P45j81q53N48L38p62J98L70n05J08M06o10NL63k87m95N81q5o37N50L19
4975A47r16nP78n53k10N56l39k05M58k66m69N29J70o17Q9Q05q71P4N83o00l58
4996a220Q70k47m03M50Jl69K36J79l25J75M44n97q5N43j21n96P21J27n27N76K
$$ plain form
4850 -424 -686 39 -450 -954 -87 -339 -923 -507 -214 -1038 -681 -287 -1048 -944 -257 -651 -874 -460 -659 -1167
4870 -1167 -395 -480 -1245 -746 -151 -940 -1051 -283 -1011 -1102 -452 -696 -1017 -257 -236 -850 -474 -233 -797 -424 -151
4891 -151 -807 -463 172 -232 -776 177 275 -659 52 125 -464 57 291 -252 -131 600 282 -97 681 288 -33
4912 -33 730 569 -85 578 980 189 222 926 550 582 1164 524 345 963 853 418 866 871 340 690 1020 340
4934 340 492 1186 564 416 969 669 376 841 551 265 649 804 176 428 837 473 168 775 258 31
4954 31 776 595 -258 290 628 -134 64 434 -71 37 443 -167 -162 201 -86 -581 0 -85 -722 -172 147
4975 147 -769 -774 4 -549 -759 -203 -542 -747 -289 -555 -1024 -495 -325 -942 -853 -48 -919 -845 -262 -862 -1220
4996 -1220 -350 -597 -1000 -550 -549 -918 -682 -503 -828 -653 -209 -806 -891 -348 -469 -1065 -344 -217 -744 -168 -166
5017a66m48K55N41m38rN62p52J62O16j34n52P30K19r46L75O92p10N5P23m82j79
5038A14O23j52m27N25K03n61K70J73n40L65L64m49L8N92m73l56M33q8k59M13K64
5059A072q03M81K99o86J32M02m07j89N86j54o00O83r7o95M09K64n72JO62p20J43
5080B11M03m85l82P40j59o45M79L70q49L62K60p00n1O63k79n06N94j12m52K48
5100b90L6n85M23L88p98M5O31o57j04O30k62n09P01p7n95M37J67l71K29J76p06
5121a091L05N77m67l41Q44k43m29M28Q9n61M70J92l82Q6M14m85j02O52m13k82
5141g39Q95k42p17O59L82n80J97N30m31j89O39j88j17K75O7o79N38K37o27M18
5161C28M48p86K26M86n18k54P49o6n58N62m0m50M27L71q59M50M22n65j78P63k55
$$ plain form
5017 -166 -614 -359 182 -256 -265 297 -455 -293 323 189 -363 367 586 -360 15 707 -3 52 775 293 114
5038 114 737 585 158 683 886 325 595 768 228 593 957 508 546 1138 665 309 742 654 395 808 1072
5059 1072 269 750 1049 363 495 897 490 301 887 733 133 816 719 24 433 697 125 126 788 68 211
5080 211 614 129 -253 487 328 -317 162 532 -317 45 305 -395 -446 217 -62 -568 26 -86 -538 -290
5100 -290 -254 -839 -416 -28 -826 -781 -150 -807 -911 -281 -543 -1052 -351 -428 -1023 -586 -419 -790 -561 -385 -1091
5121 -1091 -786 -209 -676 -1017 -173 -416 -845 -417 -328 -889 -419 -227 -609 -523 -109 -594 -696 -44 -457 -739
5141 -739 156 -86 -803 -144 238 -342 -145 385 -46 -235 404 216 99 374 441 -238 300 537 -90 328
5161 328 776 -10 216 702 184 -70 679 613 55 617 577 127 554 925 66 516 938 373 195 958 703
5182G03n10O64O3p92Q04j33m40K53J49l67P7M18l28l41N55l62k58K47K72q02M23
5203B95L22m30k55O53m48k37K54J63o39L72J79o06M26J53o58J96L31o66K11M64
5223H0l12o61N67n6n48M50J68l76J81O0m55J48N29p09j9O67j88m84N57j62m05
5244i68M73K64l91M3L86m87o3M85m26o1L48Jm45M66J89o89M90K90l01k75O05j84
5266b50l81O47k60j18P02n69j16N58J5m00J48P23o15k29N48j28m01P90j44l67
5286A53K42J60n92L64K76l60K95N69o51l10Q51k54m29L21K59o18K86L78o26L29
5306F43M08p27L0M62k20l60N77j60l85M79R8p05J49M52l69r2K24k67k49M49k28
5327B09k05L28K15o97J64L39n94K69M03o23k13O94j44n85M09J50l72M7J23n81
$$ plain form
5182 703 193 857 920 128 932 799 359 612 761 394 471 889 561 220 775 413 155 402 674 -128 295
5203 295 617 187 -68 585 137 -100 154 317 -322 50 229 -377 49 202 -456 -260 71 -595 -384 80
5223 80 -232 -893 -326 -382 -930 -480 -312 -688 -507 -447 -902 -754 -225 -934 -953 -286 -474 -958 -401 -563 -968
5244 -968 -495 -231 -622 -579 -193 -680 -743 -258 -684 -745 -397 -396 -841 -375 -186 -875 -385 -95 -396 -671 -66 -250
5266 -250 -631 16 -244 -362 340 -229 -345 213 228 -172 -24 699 84 -145 403 275 -126 664 520 153
5286 153 395 555 -37 327 603 243 538 1107 456 146 997 743 314 635 894 276 562 940 314 643
5306 643 1051 324 354 816 596 236 813 653 268 747 845 140 289 741 372 280 504 237 -12 437 209
5327 209 4 332 547 -150 14 353 -241 28 431 -192 -405 289 145 -440 -31 119 -253 -206 -83 -664
5347f64J81L89n05R4K71j61l57L89l7m88O28J55o94P8M65o12j9N60k75r0L86m73
5369g79k40O01J92p28L12L67l97K51Q5n70J41K85Ok53M46J91o09O00J39n73N56
5390B3J53o08O7N86m08q8M53Om98N17J25o71M74L22n23K66L25m88J04P04l53m92
5412dO77M7n55L04L36l43o3N46q54K85M21k39l00N44n4m32O09k06m79M0O27n78
5434C29Q7L99k93k74L38k30j84N81j09o42N53J67m68k64O48n53j3N97p11o9M52
5455C41J60o11M20j65j58j1J08m86K07N52n76l24N94k84j44J50K81q88O22K10
5475bo63o2N88j96k00K73l30k97O02p6p64O56J67m33K6L81n05R7O32o82j54Q06
5497a36k23m44L46J76n51M77J42o10K06M46k02k71L88m7j80L40j74m66O28L82
$$ plain form
5347 -664 -483 -94 -599 -505 -234 -395 -752 -363 -400 -888 -260 -105 -799 -721 -256 -868 -887 -327 -602 -692 -306 -779
5369 -779 -1019 -418 -226 -954 -642 -275 -672 -421 -336 -906 -765 -480 -474 -727 -281 -90 -699 -99 40 -533 23
5390 23 176 -432 -365 221 -187 -275 178 184 -314 203 328 -343 131 453 -70 196 521 33 137 841 488 -4
5412 -4 673 720 165 469 805 462 399 945 91 376 797 558 258 802 748 316 925 719 240 280 907 329
5434 329 416 815 522 248 586 356 172 753 644 2 555 722 254 -10 638 85 72 669 -42 -111 341
5455 341 501 -110 310 145 -13 -24 84 -402 -195 357 -219 -543 51 -233 -377 -227 54 -834 -212 -2
5475 -2 -665 -727 -139 -335 -535 -262 -592 -889 -287 -363 -1127 -471 -304 -737 -711 -330 -835 -738 -106 -788 -942 -136
5497 -136 -359 -803 -457 -281 -832 -355 -213 -823 -617 -171 -373 -644 -256 -303 -483 -143 -317 -783 -155 227
5517B27p85K26N73l48M1K71l82m3O74o4o35M25K59m29J53O05n27Q9M02n89j4O90
5539H19k17m99M47j2l67L94J21n65L89M70n80k55N30j90n8L79j99l71N01j69l68
5560B00M26L18n92L07R0l59l98O07o6n47M06L12n97J37j2k45K29L95o05n5P19
5581F70p86k26M77k9n24O68k28l67J55L00n94J53L60m82p4L64l42j46N53j69l15
5602e82j8L41l71j10O21l87l66P96l80m15N04n0n25N91qm17J42N03o68J87N34
5623g8n07k30N90Ko66M97L18l75K95o3l80N8O66p68J93Q31n44l14O53p6n39N26
5645H9m3k86J37K06k42J29N09l34l19N61j64k83M10J06l60K44L83n83M3M98n02
5666A99mN95j96l61M17q4l56N26R2n48K82M96q26J04M78j94l12N47j00m85K36
$$ plain form
5517 227 -558 -332 241 -107 -66 205 -177 -220 454 390 -245 180 439 10 163 768 241 330 732 143 129 819
5539 819 602 103 550 538 171 565 686 121 510 980 400 145 675 485 427 806 607 236 737 568 200
5560 200 626 944 352 659 749 390 -8 599 533 -14 392 704 107 244 232 -13 216 611 6 -49 670
5581 670 -116 -342 135 106 -418 250 22 -345 -190 110 -484 -331 29 -453 -527 -163 -505 -651 -98 -267 -582
5602 -582 -600 -259 -630 -740 -119 -506 -872 -76 -456 -871 -367 -417 -942 -351 -359 -776 -634 -131 -799 -612 -78
5623 -78 -585 -815 -225 -223 -889 -392 -74 -449 -154 -217 -597 -539 127 -641 -448 383 -161 -475 178 102 -437 89
5645 89 46 -240 -103 103 -139 -10 499 165 -154 407 243 -40 370 476 116 360 743 160 203 701 199
5666 199 195 790 594 233 650 566 210 736 828 280 562 1058 232 336 814 620 308 855 755 270 506
5687E06J99n74K32L20n28P2L20l98j72O70l48l50L21L9l61L16J5l64N4M88o14
5708a57j69L28j93k86N23j38m93M98J0m28J11L14l01J3K51l07k75N13k87k38L59
5729c52J71p11N93L6l45KL40k99k75N91l83m30P64Q8n30K79J8k55Q5M15m62J62
5751d98L27k62l11M37K18o19N67K47o45L70L03n33jL88j83r4L49O1n23N56J03
5772B57o68L29N51n13O3N39o56Q1P25o25n8L83P4l40K17K00k41L43l0n33R5N53
5794G46j64k71L16j21m12N66r5m73N14K07m86o2L57j39m41O52l69j01O25m32l80
5815C7N09m4l65O5L41m47k3K86k62k67P76k86o16N46l4n21L10L86o66K37L76m97
5837a59r2K64j43j63J58n8m63L27J05n39K26N17l27k16L20m93L8N74l76j68J92
$$ plain form
5687 506 705 131 363 683 155 227 547 149 -23 647 299 -51 270 309 -52 264 279 -85 -31 457 -157
5708 -157 -326 2 -191 -477 46 -92 -585 -87 -77 -505 -394 -80 -381 -368 -117 -424 -699 -186 -473 -711 -352
5729 -352 -181 -892 -299 -263 -608 -606 -266 -565 -840 -249 -632 -1062 -298 -210 -740 -461 -443 -698 -613 -198 -660 -498
5751 -498 -171 -433 -744 -307 -89 -708 -141 106 -539 -169 134 -399 -400 -12 -195 -289 60 121 -402 154 257
5772 257 -411 -82 469 -44 19 558 -98 -17 708 83 25 408 482 142 359 559 318 661 631 98 193 746
5794 746 582 311 627 506 94 660 565 92 606 813 327 265 622 483 42 694 325 224 849 417 37
5815 37 546 502 137 202 543 96 73 359 97 -170 606 320 -296 250 216 -305 5 391 -275 -38 338 -159
5837 -159 -251 13 -130 -293 -135 -193 -656 -329 -224 -763 -537 -20 -347 -563 -243 -736 -698 -124 -500 -668 -476
5858d76J26m76K45J80l04K09J16l75k8N34k20l28M78m6O7K31J6n27J90M30l44
5879c02k31N93l62j46L75p1l46M00K03n63K34P32p35J13J60m8r7M96j97m71N90
5900C27L4k71Q2L79n92J06M96m20O7N75l36j94Q3J1k41M58N9m80L03L51n80j61
5922E6N15p2k23M29l47l02P43R0q47K29L50l99J54K99m77K2N17k53m54M94j76
5943C48l19L79n2k89J93K89m38k11N28k06l93L73k11j87L89j60l34K56J73m81
5963c53K20J59k61o8M60m72l64O30N7p26K67J92k33k5L59n18Q8M24m40k91M76
5984d19J67n29K45J44m24M13J86n16J52K81L1l43J50k5o2N13m20j96M50J23n03
6005e82K06M36l47M6L95o53k2N68j6l98L42J98l14J22L83m87J90M69l85k86N30
$$ plain form
5858 -476 -350 -826 -581 -401 -705 -496 -380 -755 -783 -249 -469 -797 -319 -365 -298 -67 -51 -578 -388 42 -302
5879 -302 -533 60 -302 -448 -73 -144 -490 -90 113 -450 -216 516 -219 -106 54 6 -91 405 208 -263 327
5900 327 361 90 172 551 -41 65 561 141 208 783 447 253 336 347 106 564 623 143 446 797 217 56
5922 56 571 499 276 705 358 56 799 889 42 271 621 222 376 675 198 220 737 484 30 524 348
5943 348 29 408 356 67 260 549 111 -100 428 222 -171 202 -9 -196 193 33 -301 -45 128 -353
5963 -353 -133 26 -235 -303 157 -315 -679 -49 8 -718 -451 -259 -492 -517 -158 -676 -588 -164 -604 -895 -419
5984 -419 -252 -781 -536 -392 -816 -403 -217 -733 -581 -300 -269 -612 -462 -487 -549 -36 -456 -652 -202 -79 -582
6005 -582 -376 60 -287 -241 154 -499 -521 47 31 -367 -25 173 -141 -19 364 -123 67 536 151 -135 395
6026C95j16k20K43j3j2m2M30l96JM26l46j55K69Q6l91O73k00n95M56L67o43J63
6048C80L93l99R6J84r1l00K87j30l39M03P8k63K59l8k56j12L68l85k6M68m50k75
6070a48L25k01j59N68M6o00K93J61m60O2K60m16n5M53k39l11K71J03m14K88J90
6091A7m08J04K47k45k19N89l32m73M67K15o26R4K41q4n8K67l24o6K58J3k36K81
6113b78l4l49K91R3m98J81N20m31M2L28j35j84K39k65N1M36q5m08L06J84l46J62
6135a80K76k81k17O58l31j98M40j4m36K57K14m18L51K47k27N7L20l98j27K60k0
6156B33k55N91k8m70K83K72l05j20L86j59O2K14k31l00M17m2l95L50J81n34L07
6177D57K63k97r6L47k10k92L86r1l80J88J56j59j1K22n22M2L27k40j62L68j12
$$ plain form
6026 395 279 59 302 289 277 235 665 269 270 696 350 195 464 550 159 832 632 37 493 860 217 380
6048 380 773 374 470 654 563 263 550 420 81 484 562 299 558 520 264 152 520 135 109 577 127 -148
6070 -148 177 -24 -183 385 431 -169 124 285 -175 -113 147 -269 -324 129 -110 -421 -150 -47 -461 -173 17
6091 17 -391 -287 -40 -285 -504 85 -247 -720 -253 -38 -664 -570 -329 -413 -471 -204 -528 -594 -336 -323 -559 -278
6113 -278 -312 -661 -370 -277 -775 -594 -74 -505 -463 -135 -270 -454 -215 -480 -429 7 -78 -486 -180 4 -342 -180
6135 -180 96 -185 -402 256 -75 -273 167 153 -283 -26 188 -230 121 368 141 198 518 120 -7 253 233
6156 233 -22 569 541 71 354 626 321 201 587 428 490 704 473 173 590 548 153 503 684 150 457
6177 457 720 423 327 674 464 172 558 467 87 275 431 272 261 483 -39 3 330 90 -72 296 184
6198A84k69J70J45l95K30J14l44N8L14k77l28M04k22K3L37j79m48K99Pl39K8O92
6220B04n88j09L01k19k46N90l14k60M39l9l85K46J60l82J43J46l52m5O64k81j21
6241d48K45Q0m44L62N0k85j95L59j94j2L51k90r8L36K5j50J58K54n89K17K80k33
6263b21K39M8L9k90M21k08j98O03R9n96J06L80m34K12L52m33m0N38l29j83N25
6284F30k53j64J53L12n40K80J91k21L8K53k89k9L9R0k70L37L48o77L24Jl88m1
6306A24L43k22j43L57j70l41O02O7m51M7N7j36j8K57l91J04K39l10j71L27j38
6327C3l12N13j08k50M6K64l83J31M2j19k39L62l06o2M26l94k53L74K50m80K36
6348b29J76k78l01M60l52l1K73J42l24K94l3m28L21K8j40j52M86l55j41N99k23
$$ plain form
6198 184 -85 85 230 -165 65 179 -165 -107 207 -70 -398 6 -216 -193 144 -35 -483 -184 -177 -516 -488 204
6220 204 -384 -493 -192 -411 -657 -67 -381 -641 -202 -241 -626 -380 -220 -602 -459 -313 -665 -710 -46 -327 -448
6241 -448 -203 -123 -567 -205 -155 -440 -635 -276 -470 -482 -131 -421 -519 -183 -158 -308 -150 104 -485 -268 12 -221
6263 -221 18 66 105 -185 236 28 -170 433 532 -64 42 422 -12 200 552 119 79 617 288 105 630
6284 630 377 213 366 678 138 418 609 388 426 679 390 361 400 490 220 557 905 228 552 553 165 124
6306 124 467 245 102 459 289 -52 550 617 166 213 270 134 116 373 -18 86 325 15 -156 171 33
6327 33 -279 234 126 -124 -78 186 -197 -66 -24 -143 -382 -20 -326 -388 38 -356 -609 -235 15 -465 -229
6348 -229 -53 -331 -632 -172 -524 -555 -282 -140 -464 -170 -203 -631 -310 -282 -422 -574 -88 -443 -584 15 -208
6369b08q9R4P7l27J79J52j92J07K08j51j55K78j86j07O28n00m5K83Jl77K85L42
6391B97m88K77K77m01r6N66k71k32K94J56m45L37R5m05L09P5j44J3L69l59r7K27
6413C54j0n2K51Qn09M34J87m85M06J03m21r2N58l54j62M34j76p8J82j17k96J61
6435C26J56k76J8K84p6l42J82R8l08K23Q1n37K68K59m29m4L27k68j25L91m70p9
6457c41M27O1o88M22N2k34ML93m10k36M80j55m65M31ok93K85L8l07N2L06k70J5
6480d39L16k30m17O25k93l83N64J15m96L08K32l59Q5K39m03K44J97j21k54L31
6500a39O0o49M10L06k05K3L72l35M0J74K1k27K93p6j26L13j43k33J69K56k71j22
6522h9N01k98j0K48r2j26L81j37j05m5K74l14L1L91m20J66L17l50l15N75K7m47
$$ plain form
6369 -208 -297 -203 -126 -453 -274 -122 -314 -207 1 -150 -305 -27 -213 -320 308 -192 -237 46 47 -330 -45 297
6391 297 -191 86 363 -38 -134 432 161 -71 223 379 -66 271 366 -39 270 345 201 214 583 224 127 354
6413 354 344 292 543 551 42 476 663 178 584 687 266 174 732 378 216 650 474 396 578 461 165 326
6435 326 482 206 224 508 432 90 272 370 62 285 366 -171 97 356 -73 -117 210 -58 -183 208 -262 -341
6457 -341 86 147 -541 -119 -67 -301 -297 96 -314 -550 -70 -225 -690 -259 -265 -558 -273 -235 -542 -490 -184 -454 -439
6480 -439 -123 -353 -770 -145 -438 -821 -257 -142 -638 -330 -98 -457 -372 -133 -536 -292 -95 -216 -470 -139
6500 -139 -79 -728 -318 -12 -217 -194 178 -157 -117 57 78 -149 144 68 -58 255 112 -121 48 304 33 -89
6522 -89 412 114 104 352 260 134 515 378 273 228 502 188 219 610 190 356 673 323 8 583 610 163
6544A63L63J33m40pM70n45J44K72n1l41L20j84k50K55J45m26L90N6n19L32o6j29
6566H5J45L4p7j64J5Pj36J93R9l53J34K69m89J02Q6k4m09N86k69j6K6m0j06J62
6590a40p3l44J99K46j59l74M73j29j31J17J0l59L00L03n83J74R0n2J61J46l39
6611d64k5M14k09j73K47O7l54KL04k05mL02j92j35M01j5k08L19qm92M56Q0m25
6634c17J84L60k72p8K93j47n3L82o0m73J44L79k97J84J74k31m9L09k16j31M78
6655E63j76k10L13O5m03L45R0o25M89J65l90j09M64j99k61M07k66j84K49O9k47
6676A49K29J11l78m3L48k96J57J22r6l23K99k0l83K66J42l90K5L47j77k07M67
6697C49k78l60L66j38k86L22N7l31N1J97m59M06J23l74l9K91n7m01L48K35l82
$$ plain form
6544 163 526 659 219 212 682 137 281 553 502 161 481 297 47 302 447 21 411 467 -52 280 214 85
6566 85 230 264 187 23 38 45 -91 102 201 -152 -18 251 -238 -136 -50 -74 -483 103 -166 -182 -156 -196 -302 -140
6590 -140 -213 -557 -358 -112 -271 -645 -172 -301 -432 -315 -305 -664 -364 -61 -644 -470 -380 -432 -271 -125 -464
6611 -464 -489 -75 -284 -457 -210 -143 -497 -495 -191 -396 -400 -98 -290 -425 -24 -39 -247 72 64 -428 28 108 -317
6634 -317 -133 227 -45 -123 170 23 -30 352 292 -181 -37 342 45 229 403 172 123 432 216 85 563
6655 563 387 177 490 555 152 497 587 -38 451 616 226 117 581 382 121 528 262 78 327 396 149
6676 149 378 489 111 68 416 120 277 399 303 -20 279 259 -124 142 284 -106 -81 266 89 -118 349
6697 349 71 -289 77 -61 -347 -25 32 -299 -248 -51 -510 -104 19 -355 -394 -103 -160 -561 -213 22 -360
6718c60RK35k81P9L00n63J0M37k60k34L39m0l50K27K41m20P6K57k32O0L32l6k10
6741c84R5j05k31L98L7k14P3K53r0j78N18l55K5L20j93l03L31P6m7N6P5j54O7
6764G0L81l14j84N05k57j38J75qo0K44nl60N8M16k69j66O08l24k24K45J67l33
6786B27K58J28m29K18J66k05j7K32k67M7K27l76p7K01j71q7K59J39k82J71J20
6807D82l85o6K07j01j10K16l1j97K37Lk44R6J39m71K94K17j91l82L98k81k28N65
6829A67j09m48L33j27q7r6K01R8k02J14L4k57L77k26k38J53K10m33J78K02m06
6850e62J30J89j93r4L71j64j65L65J5l10J13K11k94J36L17n94L54lo6j22L20m4
6872i0k45J68K19l04j8K48k69M5N44l92j51N21k06l15O04O0o49O19ol70J72L3
$$ plain form
6718 -360 -351 -116 -397 -318 -18 -581 -571 -134 -394 -628 -289 -329 -679 -452 -211 -631 -555 -298 -530 -470 -138 -174 -384
6741 -384 -289 -394 -625 -227 -190 -404 -331 -78 -168 -346 172 -183 -158 162 -31 -334 -3 73 26 82 157 3 70
6764 70 451 137 -47 458 201 63 238 230 170 414 409 49 107 523 254 88 696 372 148 393 560 227
6786 227 485 613 184 402 568 363 346 578 311 358 585 209 132 333 162 75 334 473 191 362 482
6807 482 97 31 238 137 27 243 212 15 252 255 11 107 246 -225 69 286 95 -287 111 -170 -398 167
6829 167 58 -390 -57 -184 -271 -367 -166 -68 -270 -156 -122 -379 -2 -228 -466 -313 -103 -536 -358 -156 -562
6850 -562 -432 -243 -436 -530 -159 -323 -488 -123 -108 -418 -305 -94 -388 -252 65 -529 -175 -178 -244 -366 -46 -90
6872 -90 -335 -167 52 -252 -270 -22 -291 -246 298 -94 -245 276 70 -245 359 419 -230 389 383 13 185 218
6894B18j49k75O45j85k10N30m84pL60Q3l97J14K44l60J18L51k72k11L74j92j27
6915A68L87nl59K67k6k08J29K90n37M5K89j34m83O57j34l48M53j46l12K52K32
6936D77l19o7K62k95k15N44l27k19J04K8j58J83K8j55O8J7k31J2L80k22m90N03
6958i2J33m37J65J40l07L28J90l55k84K77k87q1M22j06j63L43j24k60K11K27l02
6979c62QK91m32J37K80l40j2K00L33n43K75q0j55P5L29l62J7M63n52P5L06R7m65
7002d17L57J24l15P7L69k74m5L81l35L68j46K8k41K66K07m94L31J62k46l1K88
7023D14l37K4L64j63k14M81p1l70K32j7j01J73J54l85n7M04j27l15M37n2l56L02
7045D20J2k72K52p7j72NM02n12n2M20l57m8J61K16k22l1P6Pk28L28l54j09M93
$$ plain form
6894 218 69 -206 439 254 44 574 90 83 443 526 129 243 487 127 245 596 324 113 487 295 168
6915 168 555 550 191 458 432 224 353 643 106 151 440 306 -177 480 346 -2 451 305 -7 245 477
6936 477 158 91 353 58 -157 387 60 -159 -55 -27 -185 -2 26 -129 -61 -44 -275 -263 117 -105 -595 -92
6958 -92 41 -396 -231 -91 -398 -70 120 -235 -519 -242 -529 -610 -188 -294 -457 -114 -238 -498 -287 -60 -362
6979 -362 -354 -63 -495 -358 -78 -418 -430 -230 103 -440 -165 -245 -400 -325 4 -358 -341 122 -430 -355 -49 48 -417
7002 -417 -60 64 -251 -174 195 -79 -124 257 -78 290 144 172 -69 197 404 -90 241 403 157 126 414
7023 414 77 101 465 302 88 569 498 128 360 343 242 415 569 184 127 531 404 89 526 474 118 420
7045 420 432 160 412 335 163 168 570 58 6 426 69 21 182 398 176 145 221 228 0 328 -26 -135 358
7068C58l91j10L77k78l73M40R9m38J93J30k46l6L47j83k55M43k28q8P2N6l90K46
7090b55P5l18K72K91n33N7K52j07l83M10N7l76J86K29m39J45L78m02L0J88p3j20
7112d36L26k5l34J02M61n42K76P4l15K05L90k65j3K97n03P4L31l8l22K11K27k29
7134d8K40K17n83K60r5J66k28K51ok02L21K7l25L85L5m25J00K37J52k38K13j72
7156B82j32L14l2l39J97J62l27L4L06l54J56J56j61j90L02q3k75L84q8l90K61
7177A83K02j88q3K70l34j2K69q8j76K06o5m58K01K36k53m9M23l45q0L47k53o5
7199a12J97j13k19L0K54m28K30l4j09P3L30m26KQ0M1l61M21rl17K28q5j92J66
7222c53M07m30o8J78j30j48K87L8j03j8L03k91O0J91l49K25J04j58r4M48k85l02
$$ plain form
7068 358 -33 -143 234 -44 -417 23 122 -316 -123 7 -239 -275 72 -111 -366 77 -151 -239 -167 -111 -501 -255
7090 -255 -180 -498 -226 65 -468 -411 -159 -266 -649 -239 -182 -558 -372 -143 -582 -437 -59 -461 -431 -243 -316 -436
7112 -436 -110 -135 -469 -367 94 -448 -172 -98 -413 -208 182 -83 -96 201 -302 -228 103 65 -257 -46 181 -48
7134 -48 192 409 -174 86 -9 157 -71 180 174 -28 293 320 -5 380 415 -10 90 327 479 241 454 282
7156 282 150 464 432 93 290 452 125 159 465 111 267 423 262 72 374 291 16 400 312 -78 183
7177 183 385 197 114 384 50 38 307 219 43 249 184 -274 -73 163 -90 -139 284 -61 -141 206 -47 -112
7199 -112 85 -28 -247 -217 37 -391 -161 -195 -304 -231 99 -327 -325 -245 -204 -565 -144 -153 -470 -242 -327 -519 -353
7222 -353 54 -376 -444 -266 -396 -544 -257 -219 -322 -340 -37 -328 -268 -77 -426 -201 -97 -255 -349 99 -186 -488
7244d88L65J56l05K75J51r8k53K51k67J01K16K0k63K24R8k61J89J95l26P2K19
7265B71k37k8K34L3j24K28k09k59L86J53k96J56K29k98Q4K28l80N0L35m11j19
7286B6M38J12m75K42K09l73P5J37m22K3M47j27j95K04j61q8J33K19p52L67L16
7307C55n90J75L47l95j02L84n6k33L09j54j61J48K2j56k77J82K7j94M92m59n1
7328c87M35k66J7p6J46k39PK93k48N4J72l62l6L43l01N0K39l7n04K81L46m38m7
7351e58M36p4l69M08r7k20K48J20k61nM14m12n4J41J74p7K64j60j01L18j77n4
7373i6K85r3k66J69j6q8K03J33j13k43L46L2l93O54k83m06L53K14l23J99p8m8
7395A42J56J69k13k99L99Jl51J74K21l85J89K36l01kL62l66O8L19k25k50M14l1
$$ plain form
7244 -488 -123 33 -272 3 154 56 -197 54 -213 -112 104 124 -139 85 183 -78 111 306 -20 52 271
7265 271 34 6 240 273 149 377 168 -91 295 448 152 308 537 239 323 551 171 221 556 145 26
7286 26 464 576 101 343 552 179 254 391 -31 -8 439 312 117 321 160 72 205 424 -328 39 355
7307 355 -235 -60 287 -108 -210 174 118 -115 194 40 -121 27 49 -107 -384 -202 -175 -369 123 -336 -387
7328 -387 48 -218 -201 -277 -131 -370 -363 -70 -318 -264 -92 -454 -490 -147 -448 -398 -159 -196 -700 -419 -73 -511 -558
7351 -558 -122 -196 -565 -157 -254 -474 -226 -106 -367 -372 42 -370 -424 -283 -109 -186 78 -82 -183 135 -42 -96
7373 -96 189 96 -170 -1 -17 -105 98 231 118 -125 221 253 -140 514 231 -175 178 392 69 268 190 142
7395 142 298 467 254 -45 354 355 4 178 399 14 203 439 138 136 498 132 200 519 294 44 458 427
7417D27k33J19N1k75R0J45l02j1K10j49P2J30n1m89L38L96m86n2K18k03qK39m67
7440b91N3J91k3k13J54L92o22J59J05Rj9K57m69p0K59qk93L75j75k50K57q9r3
7463d04P6J64J8l33L09k09j2M41j30n24M14Q6m05J98J52k42Q7L08m32j35O33k03
7485a43j77K08j1k39K15J53l85M64R5l96J7K86l95J38J75q8k09M82j35j49J94
7506A00J35j76n2L12k75j46K58Rl65O67j33l10K15J07k14K7J08k21O8L12ql84
7528C4K82k8k83L42J80m39J46K34l56O5K47k5k77K47j13j28L02M9l51J24J15l99
7550c2J70KQ4j95K35j73l01L90l8j84L6J4P9j85L18l71j56M49l43r4K98K8l90
7573c59M05q0l53K14J81l83l6L48k36r9J64N1l36M64j22k65K09j3q6J08K01k48
$$ plain form
7417 427 194 313 364 89 179 324 22 11 221 72 144 274 223 -266 72 468 -18 -70 148 -55 -63 176 -291
7440 -291 -238 -47 -70 -283 -129 263 -359 -200 -95 -86 -105 152 -317 -387 -128 -136 -429 -54 -229 -479 -222 -311 -404
7463 -404 -328 -164 -146 -479 -170 -379 -391 50 -80 -604 -190 -104 -509 -311 -159 -401 -314 -6 -438 -573 60 -143
7485 -143 -320 -112 -123 -362 -147 6 -379 85 180 -216 -199 87 -308 -170 5 -83 -292 190 55 -94 100
7506 100 235 59 7 319 44 -102 156 165 -200 467 334 24 239 346 132 159 267 46 114 426 418 34
7528 34 316 288 5 347 527 88 234 468 112 177 424 399 122 369 256 128 430 479 128 252 367 -32
7550 -32 138 140 224 29 264 91 -210 180 142 -42 -6 8 87 -98 220 -151 -307 142 -201 -295 3 31 -359
7573 -359 46 -34 -387 -173 8 -375 -411 -63 -299 -398 -234 -183 -519 -55 -177 -442 -233 -246 -332 -224 -23 -271
7595b71l08K87j6k56M67j55L9M5N0j60J67O2m64N7L03P8k32M37j96q6J31P2m56
7618d05J88L29j62j64M06l17o2M07k32oK95Nj21J7L2l16K34J77l86J13L35k37
7640A30J5K28j17j24K18J8l33K46J91j18k35K16K2j87L38k49k13K47k1p0J99O
7662D07j91k5J0m6Q6J84m57Q1K34o7j35K69Q8m87K85k4l6l76O00k85j13K26k84
7685e6m6K96O2m27J96L16l84q1K84m55o0L59k17k4J82k03J3J69j97q6J63K42k58
7708b12k56M53l35J32K59k31k04L69j54m17K82J78k62K0J82j04j25L56j49j21
7728c39K21n7q6N0J49l1r9J02j55j20M89m40L3L29j78j04R9K1J00LJ52k21N6K66
7752B40j42L6O6p9q6K98n6l47M70k11l66L41J90l94J56K79p7o5K11j33l36L48
$$ plain form
7595 -271 -579 -292 -308 -564 -97 -252 -213 -168 -118 -278 -111 -49 -513 -456 -153 -75 -307 130 -66 -152 -21 51 -405
7618 -405 -217 112 -50 -214 192 -125 -187 220 -12 -18 277 282 161 178 210 -106 128 305 -81 32 367 130
7640 130 145 373 256 132 350 368 35 281 472 354 119 335 357 170 508 259 46 293 272 202 401 407
7662 407 216 191 201 155 241 425 -32 49 283 216 81 350 438 -49 236 212 176 -200 400 115 2 228 -56
7685 -56 -102 194 256 -171 25 341 -43 -124 160 -295 -355 4 -213 -237 -55 -258 -245 -76 -273 -359 -196 46 -212
7708 -212 -468 -15 -350 -218 41 -190 -394 -25 -179 -596 -314 -136 -398 -378 -196 -300 -425 -69 -218 -339
7728 -339 -118 -175 -261 -211 -62 -93 -192 -90 -245 -365 124 -316 -283 46 -132 -236 -137 -116 -16 -13 139 -82 -26 240
7752 240 98 134 200 121 35 333 277 -70 400 189 -177 164 354 -40 116 395 318 253 464 331 -5 343
7774C43k4j55K10j85r2J43L11m08J41J83k99J77R8q0l76L21pJ9j25J31k71J27
7796A82J98l48K44k2l38J9Q8J84k71K44j40j82rM11m09M6J17O3l11K66k50l3J25
7819a26Q9j45Q4M5k58K2K0nmK38j79j63J89o3j54J24Q8p4j7K09l12O9L96k31k67
7844d25L23O8n03M14n2k25J59Q7j60N3K13j98lL39j36j05J04J97m36J79J76o4
7866Ej42J08k49J47J25Lj94L13O3l10J90K03k30K6K17k42N6J01K7m93P00j04l50
7889c0K85K15m60J77K16l38L21M4l07L9K58p5m38N35q3j23J36J63j31k85M24k55
7911B88o9Km5j17M62k25l49K99R4k73j80M33l41k2K09j67N2R3J69l53J58k5k64
7934a71J81K01l85J43K52l40l8K12j68j76J29J46l04K56l5k37J50J14j16k9j30
$$ plain form
7774 343 319 164 374 189 97 240 551 143 284 467 168 345 443 363 -13 308 301 320 195 326 55 182
7796 182 380 32 276 254 -84 -65 23 207 -64 180 40 -142 -151 260 -149 -103 14 77 -234 32 -218 -251 -126
7819 -126 -37 -182 -98 -53 -311 -289 -269 -274 -278 -40 -219 -382 -193 -256 -410 -286 -198 -272 -289 -80 -392 -323 73 -158 -425
7844 -425 -102 -34 -537 -123 -175 -400 -241 -154 -314 -261 -48 -246 -249 90 -46 -151 -47 150 -286 -107 69 5
7866 5 -137 -29 -278 -131 -6 -3 -197 116 179 -131 59 262 32 58 275 33 89 190 217 -276 424 320 -30
7889 -30 255 470 10 187 403 65 386 430 123 162 420 345 -93 442 359 236 372 535 404 119 543 288
7911 288 219 221 176 59 521 296 -53 246 340 67 -113 320 -21 -43 166 -1 51 144 313 -40 118 93 -171
7934 -171 10 211 -174 -31 221 -119 -157 55 -113 -289 -160 -14 -318 -62 -97 -334 -184 -70 -186 -215 -345
7955c45K42k11K16p4k28K47N2k45o3J92Oj03L19j45l41L17k2j29P0K00k38o4M5
7978c02j51L02J31j86j71K93Pk01L17k14r5K68o7j05J94J26m3p7m0K3O0P0J2k75
8002a24M91k34j07K40j06j65J06K06l43J92J17Ll9n2j0NK50m4k14J07K68j66r3
8025B88J09j91L7Q4k44j33K48Q5m6o8J81j07n9K14m8m63L46j39j08K66R6j88M4
8048B04k0j32J06o7l5j05J09P9k85J90k8j44J53l9l66J19K70j54J77q1j17k71
8070d37N16l35k8K15j88j07J36J81m80M26P1l40M9L50k02j53J04o0k92J97L67
8091a0l39K24L8j34j72J75q9m0J55K34n04K83J30k30J99Rj10K8K11k91K48o9j00
8114a54j3OK49l15J93J51j46Q1L7k31K46q8J01k02M95j90m49L17J4l8L34o8j74
$$ plain form
7955 -345 -103 -314 -98 -172 -400 -153 -101 -346 -409 -217 -211 -314 5 -140 -481 -164 -186 -315 -245 -45 -283 -347 -302
7978 -302 -453 -151 -20 -206 -377 -84 -77 -278 39 -175 -270 -2 -69 -174 20 146 103 26 -14 9 69 139 151 -124
8002 -124 367 133 26 266 160 -5 101 307 -36 156 273 276 237 185 175 180 430 386 172 279 547 381 288
8025 288 397 206 243 327 83 -50 198 283 237 169 350 243 184 398 350 -113 233 94 -14 252 348 160 204
8048 204 184 52 158 91 56 -49 60 139 -146 44 16 -128 25 -14 -380 -261 9 -145 32 -49 -166 -437
8070 -437 79 -256 -284 -69 -257 -364 -228 -47 -527 -101 -30 -370 -321 29 -173 -326 -222 -282 -574 -377 -10
8091 -10 -349 -125 -87 -221 -393 -218 -307 -347 -192 42 -462 -179 -49 -279 -80 -71 -181 -153 58 -233 15 -54 -154
8114 -154 -167 -161 88 -227 -34 117 -29 52 89 -142 104 16 117 -85 410 220 -229 88 102 64 398 330 156
8137A56jK54k52r4M63l03OK05j32k01L27K5k66O0J22k82O4L5N6j26J97Rk82L67
8161D07k27k21J43J41j38k2J73k82m7K21j2l42M60O5l52K20M2k95N8J95k58j5
8183h6J64o0k27J91m1m9J80l8
$$ plain form
8137 156 155 409 157 63 526 223 229 434 302 101 428 453 187 247 369 87 151 186 242 116 313 322 40 407
8161 407 180 -41 102 243 105 83 256 -26 -73 148 136 -206 254 319 -33 187 229 -66 -8 187 -71 -86
8183 -86 78 18 -209 -18 -59 -108 72 34
8191C4
$$ Imaginary data points
##PAGE= N=2
##DATA TABLE= (X++(I..I)), XYDATA
0@%%%%%%Qj6J6j6K4l2M0n0N9p3Q9j07J30j53J78k10K44k84L30l78M29m87N56o29
30c32P08p96Q94j003J118j247J390j545J714j899K104k331K580k857L166l509
46a845L896m336M837n417O100o912P900r133J0722j2862J5912k0651K9104m8808
60c1493J77429J36578k06812j270J6645P863k9206K7150K6724L6567k9693n9619
72G0863l4501K5351J6188J0307j9508k4713J6128L7311m6055n8785L0268M9256
84G2110l3246m4134j878J9371J7462l357l4734m890K5866j1876l2654J1761K2038
97A839M002P853j4339m4097k67L9835L720j6604J4980J9040p719l1392l2904J3012
111d3041N0296N367k7613J8225K0140l7304k3507K2441M917K027L2511J763l9786
$$ plain form
0 0 0 0 0 0 0 0 8 -8 8 -8 16 -16 24 -26 33 -40 49 -58 72 -81 97 -113 131 -153 177 -201 228 -259 297 -332
30 -332 376 -420 474 -529 589 -658 732 -813 901 -998 1106 -1225 1355 -1502 1664 -1845
46 -1845 2051 -2285 2552 -2865 3235 -3677 4223 -4910 5812 -7050 8862 -11789 17315 -31493
60 -31493 145936 282514 75702 74432 91077 98940 69734 96884 123608 160175 130482 70863
72 70863 36362 61713 77901 88208 68700 43987 60115 97426 51371 -7414 22854 72110
84 72110 38864 -5270 -7148 12223 29685 26328 -8406 -13296 12570 694 -31960 -20199 1839
97 1839 5841 13694 -645 -44742 -45009 -5174 -1454 -18058 -3078 15962 8243 -23149 -56053 -43041
111 -43041 7255 12622 -14991 3234 23374 -13930 -37437 -14996 -10079 -8052 24459 26222 -13564
124a3564p167K3023Q81j3606k619J5001K1756j1900l4966J2275L7009j4555k5584
137a4016J6378M745j8063J3794J7256j6293k197J4483j4770k0039Q142J5865J8207
150B3492J1264k2337k1099J2547k825k3651J7499L6355j547j1820k974j8278j3618
163a6992J1795R066O811J4939n052j5078J768j0966j8811K3189K7136k3191j3737
176i123K5331k229k6481O336J7481m386n708k695l866P234M580l932Q687J274
190A2503k3319Q17K3036j0477j0783L3103J1373l6939j4441J5960O01J452J5730
203A8616N795L34k407k1625j3527J3820R421O083K0080l821k9472M44J1522j8585
217c322n738K8103J1074j1401p318q907l132J1366m383j1476J4643O142k3382
$$ plain form
124 -13564 -20731 2292 3173 -10433 -13052 1949 23705 11805 -23161 -10886 26123 11568 -14016
137 -14016 2362 7107 -10956 2838 20094 3801 1604 16087 1317 -18722 -10580 5285 23492
150 23492 34756 12419 -8680 3867 1042 -22609 -5110 31245 29698 17878 14904 -3374 -16992
163 -16992 -5197 3869 10680 25619 20567 5489 7257 -3709 -22520 669 27805 4614 -9123
176 -9123 16208 13979 -12502 -6166 11315 6929 1221 -1474 -5340 1894 6474 2542 11229 12503
190 12503 -10816 -9999 13037 2560 -8223 24880 36253 -686 -15127 833 1434 2886 18616
203 18616 24411 24745 22338 713 -12814 1006 10427 16510 36590 32769 3297 3741 15263 -3322
217 -3322 -9060 19043 30117 18716 11398 2491 -641 10725 6342 -5134 9509 15651 -7731
230g731j916J8271q743q720J4027o171k0758P276J3172m983k08K558n907m421
244a4254r529j0519J9022K2520j5107r858J6443j2146k9655J1450K4974j195L778
257d076Q786j4647j4984J913k46L884J4098M301K884N196j8611j8158K0484J5325
271F149j7098R53K0008o338j2452P477J981k141Q337k557r468P132M502l783J2049
286A4751M854j8932j995J3228j1228o195K5425J1171j4962m933j705r331K960
299C108R045N289J2858J981k1788p050R334j0381k662K9071J0181j8116j679J195
313B0386j8035k316J7922M149k153L330m414m013N40r797QK0145l056k0657Q550
328A0589J2937j5249m026J5129n354j3359L453n53l391R966M279o007k47p821
$$ plain form
230 -7731 -9647 8624 -119 -8839 5188 -983 -21741 -14465 -1293 -6276 -6484 -3926 -9833 -14254
244 -14254 -23783 -34302 -15280 7240 -7867 -17725 -1282 -13428 -43083 -31633 -6659 -7854 -4076
257 -4076 4710 -9937 -24921 -23008 -23254 -19370 -5272 -971 1913 7109 -11502 -29660 -9176 6149
271 6149 -10949 -9996 10012 3674 -8778 -1301 680 -1461 6876 4319 -5149 1983 6485 2702 14751
286 14751 19605 673 -1322 11906 678 -5517 19908 31079 16117 11184 9479 148 3108
299 3108 12153 17442 30300 32281 10493 3443 12777 2396 -266 28805 38986 20870 19191 20386
313 20386 2351 35 17957 22106 19953 23283 18869 14856 15396 5599 5607 25752 22696 2039 10589
328 10589 23526 8277 4251 19380 14026 667 4120 3567 176 10142 14421 8414 8167 346
342C46j4307P671J0161q755O104J6888j6126k4550O852P888n491P311J1077k327
356B742m429j0811j5571O382J5559m003O80J2411r355j4814Q277n16j3271J3453
370a3266J8537j1277j2581O106M232M94r59q300L424J3243q535j1054J7258J0453
384G775j3168j65M533j4673p25K0085J565p240Q243J953j2173o133j356O139J9219
399A3879L937j5650J661O062j7586o984K0131O949n087P542j355j6197j483O337
413B156j341O463P856m817p14N52j3093J60J7401m224j4273J1717R099j2786j385
428B771J0438k383k920J697p743k181J0188J780J16P301q312j2848Q493L065j2870
443c408J0331K1754q099j6555J061k045m829P704N107O24O642l806j4030k79J442
$$ plain form
342 346 -13961 -6290 3871 -4884 1220 18108 1982 -22568 -15716 -7828 -13319 -6008 5069 2742
356 2742 -1687 -12498 -28069 -21687 -6128 -10131 -9451 2960 -6395 -21209 -12932 -13448 -26719 -13266
370 -13266 5271 -6006 -18587 -12481 -8249 -7755 -8714 -17014 -13590 -347 -8882 -19936 -2678 7775
384 7775 -5393 -5558 -1025 -15698 -16423 3662 5227 -2013 6230 8183 -3990 -10123 -11479 -5340 13879
399 13879 17816 2166 3827 9889 -7697 -14681 5450 12399 7312 14854 13499 -2698 -4181 2156
413 2156 815 7278 15134 10317 9603 10155 -2938 -2778 14623 10399 -3874 7843 16942 4156 2771
428 2771 13209 10826 7906 9603 1860 -321 9867 11647 11763 19064 10752 -2096 6397 9462 -3408
443 -3408 6923 28677 20578 4023 5084 3039 -1790 5914 11021 11645 18287 14481 451 172 1614
458A614m606J2389J3926j4578j1537J2188k449j5384N218J0873k014O46l96q091
472b201K320N513o524n79O198p998l531J2633k300j0781J0828O641j7511o731
486a4023J1250K878J45M409l092j766J181j1757o629J5177O824o543N595J394
500E043j6780k855J1361m057k821J5215L319j3844o370n07J408O596j485m704
514a0481J1835N821j8549o113J4267J85n345P370k072q743Q946P370r175j564
528f248P633r62k135j312l816J0930J5234j0894j3755J0427L697j2167L940J3404
542A3976J083J634J667j2023n372Q899K679P21P823j278n311L770p430j2576J2896
557A1158J6092j0294o578J0091k916j1771J234L273J758N097m009q306M599K406
$$ plain form
458 1614 -2992 9397 23323 8745 -2792 9396 6947 -8437 -3219 7654 5640 6286 5890 -2201
472 -2201 119 5632 -892 -1471 4727 -3271 -6802 5831 3531 -7250 3578 10219 -7292 -14023
486 -14023 -2773 105 250 4659 1567 -199 982 -10775 -17404 -2227 4597 -1946 3649 5043
500 5043 -11737 -14592 -3231 -7288 -10109 5106 8425 -5419 -11789 -12296 -10888 -4292 -5777 -10481
514 -10481 1354 7175 -11374 -17487 -3220 -3035 -8380 -1010 -3082 -11825 -2879 4491 -4684 -6248
528 -6248 1385 423 -1712 -3024 -6840 4090 19324 8430 -5325 5102 8799 -3368 572 13976
542 13976 15059 16693 18360 6337 965 9864 12543 13264 21087 19809 14498 18268 10838 -1738 11158
557 11158 27250 16956 10378 20469 17553 5782 7016 10289 12047 17144 13135 4829 9428 11834
571A1834q254J809M895q439K73R469q847q789J4488N633j5146n598M595p05J530
586a252K520k945N149M978j2843q377Q340J274j878R329K84j2731K212N093j0633
601a1480k580J2730M147l027k523p804k100Q311l010o685J0408N068j2256j149
615a1950P181p528l251R921j075p510M257K421l224K662o99m885L616j104r085
630b0253P377J2155p762m368J0940m501j3132O066Q560l057L318N235n287k993
644g702m1l915M562R344k505j082P421o748j1072Q666P803p169K693Q097n435
659B917m825M239k374j144O950o29l384M381l118o739R127N420j2007k054R885
674F645l625n425O916K149k858K506l093o798L467K938j737O821L224j0591k24
$$ plain form
571 11834 3580 5389 10284 1845 2118 11587 2740 -6049 8439 14072 -1074 -6672 -2077 -2782 -1252
586 -1252 1268 -1677 3472 8450 -4393 -12770 -4430 -3156 -5034 4295 4579 -8152 -5940 -847 -11480
601 -11480 -14060 -1330 2817 -210 -2733 -10537 -12637 -4326 -7336 -14021 -3613 1455 -10801 -11950
615 -11950 -4769 -12297 -15548 -5627 -6702 -14212 -9955 -7534 -10758 -8096 -8795 -13680 -10064 -11168 -20253
630 -20253 -12876 -721 -8483 -12851 -1911 -6412 -19544 -13478 -4918 -7975 -4657 578 -4709 -7702
644 -7702 -7743 -11658 -7096 2248 -257 -1339 6082 -666 -11738 -3072 4731 -2438 255 8352 2917
659 2917 -1908 2331 -43 -1187 5763 5134 1750 6131 3013 -3726 5401 10821 -1186 -3240 6645
674 6645 3020 -2405 4511 6660 3802 6308 3215 -3583 -116 2822 1085 7906 11130 539 315
689C15P026r506n034J5854N726j0251l4K976o015q89L442q56M175M217o847k870
705A429L632m529j454J0457j025r396N791L987j1571j604R477k715m530L264j566
720c53j629L822l692m239P228j09j1192J989O884m641M05O114o379o473N477n69
736g357m963N159M315j693J508m313q736N409P234p426k39J1809l527j0271M706
751h385K303n053M793O205m489j887K450k613N32K493l818K480P743n838o034
766i118R102J633r453M469O972p918k907Q122J46k478L220k127l197L902j642
781a274l700P700M387o011K130K827q656q83R767j193m714O854J670n932M98n0
797C420j096P423K835q487J929P193p838m810R282M87n261N801K130p634Q87M783
$$ plain form
689 315 7341 -2165 -7199 8655 14381 4130 4096 7072 1057 168 3610 2754 6929 11146 4299 1429
705 1429 5061 532 -922 9535 8510 -886 4905 8892 -2679 -4283 5194 2479 -2051 1213 -353
720 -353 -1982 1840 -1852 -6091 1137 1028 -10164 -8175 -1291 -5932 -5527 587 -5792 -12265 -6788 -7357
736 -7357 -12320 -7161 -2846 -4539 -3031 -7344 -16080 -10671 -3437 -10863 -11102 707 -2820 -13091 -8385
751 -8385 -6082 -11135 -6342 -137 -4626 -6513 -4063 -6676 -6144 -3651 -7469 -4989 2754 -3084 -9118
766 -9118 -16 1617 -7836 -3367 3605 -4313 -7220 902 1048 -1430 1790 -337 -3534 368 -1274
781 -1274 -4974 2726 7113 1102 3232 6059 -2597 -3480 6287 5094 380 7234 8904 2972 3470 3420
797 3420 2324 9747 12582 4095 6024 13217 5379 569 9851 10338 5077 10878 13008 5374 6261 11044
813A1044k878n29J860k766J294K656o382P9Q587m942r210P563L994r792P73Q561
829I912l659m399K563l652l324M508J4k482L884j408n633K888M31p340M467Q453
845E223p286n610O954j018o516L066J648k064M110k41o935K669M342o013J79O633
861h59m887l681O907p71p197M609M203n556k56L851k310O40K248l532J210M131
877a250o698l221R888K91q437N122N867q195j599O410k533j954O096l43m138J807
893b887n55j650M159j057l505P276K880r672J48R467l603m786O169K65m589L806
909A866J355m372K889L139l340J688K813n261J092P039m135m784O711N42o774
924D68L494N185l516l10K391k603Q93K026m776J051P667l846o028O129P99p572
$$ plain form
813 11044 8166 7637 9497 6731 8025 10681 4299 4378 12965 8023 -1187 6376 10370 578 1351 9912
829 9912 6253 1854 4417 765 -2559 1949 1963 -519 3365 1957 -3676 -788 -357 -7697 -3230 5223
845 5223 -2063 -7673 -719 -1737 -8253 -5187 -3539 -5603 -1493 -1734 -8669 -6000 -1658 -7671 -7492 -859
861 -859 -5746 -9427 -2520 -3291 -10488 -5879 -1676 -7232 -7488 -3637 -5947 -5307 -3059 -6591 -5381 -1250
877 -1250 -7948 -11169 -1281 -990 -9427 -4305 1562 -6633 -8232 -1822 -4355 -6309 -213 -556 -4694 -2887
893 -2887 -3442 -5092 -933 -1990 -5495 1781 4661 -5011 -4863 4604 1001 -3785 2384 2649 -1940 1866
909 1866 3221 -1151 1738 4877 1537 3225 6038 777 1869 8908 4773 -11 6700 7242 468
924 468 3962 9147 5631 5321 7712 5109 6002 8028 3252 4303 11970 8124 2096 8225 9024 1452
940A452L396N683n853r06O212l166m833L263P50j317J775k852k065N664j225q349
956b371M136O613o823k525O344l269m233N431K76o193K139K223l593J124J332
971F11m132K357L506o404j318O866l640n507O718J696p056R96L540l295J3K371
987b678l285J274L948n158k680O398j545n597N245J643o661K699N219n633k630
1002i441O240o1l494J234r70J97M099k543n048O568K342p035J950N775m912j640
1018f739P204j894m835N195K410m787J622K776k491J945J468l612K939M779n613
1033C67j997Q344r81o108M427K954m765J716K975l684M35M382l221j329M356k367
1049E504j968N262k517n333O171K676q109j40O638k594l260K916j219j098L064
$$ plain form
940 1452 4848 10531 4678 3772 9984 6818 1985 5248 5998 4681 6456 3604 1539 7203 5978 -2371
956 -2371 1765 8378 1555 -970 5374 2105 -2128 3303 3579 -2614 -475 1748 -1845 -721 611
971 611 -3521 -1164 2342 -4062 -5380 1486 -2154 -7661 -943 753 -6303 -5307 -1767 -5062 -5049 -2678
987 -2678 -5963 -4689 -741 -5899 -8579 -2181 -3726 -9323 -4078 -2435 -9096 -6397 -1178 -6811 -9441
1002 -9441 -3201 -3262 -6756 -5522 -6492 -6295 -2196 -4739 -9787 -3219 -877 -7912 -5962 -187 -5099 -6739
1018 -6739 465 -1429 -6264 -1069 1341 -3446 -1824 952 -1539 406 1874 -1738 1201 5980 367
1033 367 -1630 6714 5733 -375 4052 7006 2241 3957 6932 3248 3683 8065 4844 3515 7871 5504
1049 5504 3536 8798 6281 948 7119 9795 1686 1546 8184 5590 2330 5246 4027 2929 5993
1064E993k308l056M209k46m738L385K138o840J730O465n479l931O375j05n917
1079b325L002K309l159J087O66l251J760J551n275J300O141m505l585O075p13
1094A078o547L782K624n182O34L892l907j263L237k176r07K946l716k258O313
1109a450j102p484L772M852n746j639L938k225j344M121j418k765L064p78k867
1124i071M116K51m560M207L503o988p53O867k786l548O383J527m710J708J545
1139b309k335J772J261k553L092L557n901p79O465k554l522N814O39n176L371
1154H42L245n415o3M873j719j435J495j967M44N089k911m241N796J162o361K112
1170I46M645l966l7M624l529l118L950J21j844L904L06l351K982J53n943L397
$$ plain form
1064 5993 3685 629 4838 4592 -146 3239 5377 -1463 267 6732 1253 -2678 3697 3592 -2325
1079 -2325 677 2986 -173 914 1580 -1671 89 1640 -3635 -2335 3806 -699 -4284 1791 1078
1094 1078 -5469 -1687 937 -4245 -3611 281 -3626 -4889 -1652 -3828 -4735 -1789 -5505 -7763 -1450
1109 -1450 -2552 -10036 -6264 -1412 -7158 -8797 -4859 -7084 -8428 -4307 -5725 -8490 -5426 -6204 -9071
1124 -9071 -4955 -4704 -9264 -5057 -1554 -8542 -9295 -2428 -5214 -8762 -2379 -852 -5562 -3854 -2309
1139 -2309 -4644 -2872 -1611 -4164 -1072 2485 -3416 -4195 2270 -284 -3806 2008 2647 -2529 842
1154 842 4087 -1328 -1391 3482 1763 328 1823 -144 300 5389 2478 -1763 4033 5195 -1166 946
1170 946 5591 1625 1588 6212 2683 -435 3515 3636 1792 5696 6002 2651 5633 5786 -157 3240
1186C240N488n115r69O731k477n537L579J693k995K222J260k758J480Q72m560
1201B154J498L832m680j429N153k973m533N692J354p178J166M415l984k290K676
1216H73j514K59K032m261k671M542j025m337N156J648o228J111L183n260j362
1231g854O051r24k568K667r20k995K069q7k495M787K030o095J463M790m822k770
1247g673O035J59l903K813J068l071K432J477l054J389J980l675P29M234l931
1262b991r60O946k317p255M085M631m155M49L851k324r01J554k864J19M463r75
1278A356j455M047j859n112M148L119m679K323O193m082l436L751q13k504L368
1293D365J090j694L134o92m297L498L117m988J32N263l257l053M353j29l175L337
$$ plain form
1186 3240 8728 3613 2644 9375 6898 1361 4940 6633 3638 5860 7120 4362 5842 6714 2154
1201 2154 3652 7484 2804 1375 6528 3555 -978 4714 6068 -1110 56 4471 487 -1803 873
1216 873 -641 -382 1650 -2611 -5282 -740 -1765 -6102 -946 702 -5526 -4415 -1232 -6492 -7854
1231 -7854 -1803 -2727 -5295 -2628 -3548 -6543 -4474 -4561 -7056 -2269 -239 -6334 -4871 -81 -4903 -7673
1247 -7673 -1638 -1479 -5382 -2569 -1501 -4572 -2140 -663 -3717 -2328 -348 -4023 -3294 940 -2991
1262 -2991 -3951 2995 678 -6577 -2492 2139 -2016 -1567 2284 -40 -941 613 -2251 -2132 2331 1356
1278 1356 -99 3948 2089 -3023 1125 4244 -435 1888 8081 3999 563 4314 3501 997 4365
1293 4365 5455 3761 6895 6203 1906 5404 8521 3533 3665 8928 5671 2618 6971 6842 3667 7004
1309G004O31m701Q40K165k164J556K059m130L3L668n201m006P234J847n535J622
1325B922J724m986m63L281j946M98L336k166k571J207k818j994N595Om557L874
1341I42K726p107r81N507k044k613L590m40k857K213l37k568L044M25m780K023
1357c257L020l846L44N008l818l322M158j169m689L280L355j896j41o5l969J799
1373e208L338l738%O178k172n638L040K96m269L782M305l254l44K881k630j593
1389e026K025p24R41M166k862l385N303J023n678K624M749m119j326M786j124
1404A373j724L894L4l298J353J95j930L341J854k916K149K322o116j320O276k96
1420E191l016M421O02m613K42N99k773L055M136k701l85K009m570j994M998r21
$$ plain form
1309 7004 7635 2934 3774 5939 3775 5331 7390 3260 3293 6961 1760 -2246 4988 6835 1300 2922
1325 2922 4646 -340 -803 2478 532 1030 4366 2200 -371 836 -1982 -3976 1619 1625 -2932 942
1341 942 3668 -3439 -4420 1087 -957 -3570 20 -420 -3277 -1064 -1401 -3969 -925 -500 -5280 -3257
1357 -3257 -237 -4083 -3739 1269 -2549 -5871 -1713 -2882 -7571 -4291 -936 -2832 -2973 -3038 -7007 -5208
1373 -5208 -1870 -5608 -5608 570 -1602 -7240 -4200 -3904 -8173 -4391 -86 -3340 -3684 -803 -3433 -5026
1389 -5026 -3001 -3725 -2784 1382 -1480 -4865 438 1461 -4217 -1593 3156 -963 -2289 2497 1373
1404 1373 -351 3543 3577 279 1632 1827 -103 3238 5092 2176 4325 6647 531 -789 5487 5191
1420 5191 2175 6596 7198 2585 2827 3426 653 3708 7844 5143 4758 6767 2197 203 5201 4280
1436D280l130N046J830o116k84K443j878J33K628k368l25K774k711j768L864j211
1452C207l873L653N33o439K517O326l823l220L136j305l180K256Q2r13L331K38
1468B526m907J6M40k852K583M509l920j522M373l257n774L411L479k107J072Q98
1484a032l736L51J483l816P64N054j704k602K859j060l538L469J651m774J354
1499e277L724k592j441L289l06m21J359l480j706N738M8m298L999L891n243j762
1515d478K494j978N43O216o46l952J681O78k468R60N33M36N017O06p412n83N939
1532C586k129k671M920J468k548J624q37m444K316M005k473j011K020j136K74
1547B964K524l649j404N730q19o432K058M381j635n5J399l292n57K163k843n27
$$ plain form
1436 4280 1150 6196 8026 1910 1626 4069 2191 2324 4952 2584 2259 5033 2322 554 4418 3207
1452 3207 -666 2987 3520 -2919 -402 5924 2101 -1119 2017 712 -2468 -212 -130 -1043 2288 2526
1468 2526 -2381 -2365 -1925 -4777 -2194 2315 -1605 -3127 1246 -2011 -7785 -4374 -895 -3002 -1930 -1032
1484 -1032 -4768 -4417 -2934 -6750 -5986 -932 -2636 -5238 -2379 -3439 -6977 -3508 -1857 -6631 -5277
1499 -5277 -1553 -4145 -5586 -2297 -2603 -3024 -1665 -5145 -6851 -1113 -1065 -5363 -1364 2527 -2716 -4478
1515 -4478 -1984 -3962 -3419 2797 2151 -1801 -120 558 -1910 -950 -417 19 5036 5642 -1770 -2353 3586
1532 3586 1457 -1214 3706 5174 2626 4250 3413 -1031 1285 5290 2817 1806 3826 2690 2964
1547 2964 5488 1839 435 6165 5346 -1086 972 5353 3718 3663 5062 1770 1213 3376 533 6
1563FN479M32l351J250j555m419L170L655m054O01N589l275n599J086J527L58
1579I00K447r44k285K572n93n318J215L950k500J00L316l992l087M851K53n147
1595d262J577L043k488q56P08j527J959K269m928k124M018j058k053L905R17l829
1611d729J577O74n235m3N310k93j005K087k607j970K446j287j632N673K279n218
1627c973k5K502l738p27M518j27r32K909q37l463J604J072j155K635M69l796K249
1644h15L576m242j468N249m84m570K353J627j797K564K020k922n24J190k731J39
1660h35L147m39J116L822m002n396L978K703l386J917M175k128j430Q01l329m99
1676B15M817M11j498K184j054l332K169R95l771K743M639l646l379K948j28j701
$$ plain form
1563 6 5485 5917 2566 3816 2261 -2158 1012 4667 613 1214 6803 3528 -2071 -985 542 900
1579 900 3347 2403 118 2690 2097 -3221 -2006 1944 -556 -456 2860 -1132 -4219 632 885 -4262
1595 -4262 -2685 358 -2130 -2986 -2278 -3805 -1846 423 -4505 -6629 -2611 -3669 -5722 -1817 -900 -4729
1611 -4729 -3152 -2478 -7713 -7756 -2446 -2739 -3744 -1657 -4264 -6234 -3788 -5075 -6707 -1034 1245 -3973
1627 -3973 -3998 -1496 -5234 -5961 -1443 -1570 -2502 407 -430 -3893 -2289 -1217 -2372 263 732 -3064 -815
1644 -815 2761 -1481 -2949 2300 1816 -2754 -401 1226 -571 1993 4013 1091 567 1757 -974 -835
1660 -835 2312 1873 2989 6811 2809 -2587 1391 4094 708 2625 6800 4672 3242 4043 714 215
1676 215 5032 5443 3945 6129 5075 1743 3912 4907 1136 3879 8518 4872 1493 4441 4313 2612
1692B612J571p58j521K595m26l568K575K506l492m86J737m160j587N200K66l725
1708f61K643J058m855j349J555m72K469J603k991p10J838m130k583N376J048k520
1724b681K242L74m888L51L476k216n55L455k99k141N53j775p99M082l37l602K531
1741b229K639l830m63L891k116j534K335j578k137L458J522j688J253n23l409
1756d409J245J772l018J773N704k359m089J954o13l142L139L330j205O82K78l056
1772b014j30K006j486J216M363k151k840K668l18l488L519L485l225l02K589j651
1788B241j501K471R0q20J605j373k054L839P94l409K076K274m323j519L306p98
1804B899l52L866p58l786M77o79k039K226K367j230J372Q53n361j449M011r86
$$ plain form
1692 2612 4183 3425 1904 4499 4073 505 3080 5586 2094 1608 3345 -815 -2402 2798 3064 -661
1708 -661 1982 3040 -1815 -3164 -1609 -2081 388 1991 -1000 -1710 128 -4002 -6585 -1209 -161 -2681
1724 -2681 -439 -65 -4953 -4602 -1126 -3342 -3897 -442 -741 -2882 -2329 -4104 -4903 -821 -1158 -4760 -2229
1741 -2229 410 -3420 -3883 8 -2108 -3642 -1307 -2885 -5022 -1564 -42 -1730 -477 -1000 -4409
1756 -4409 -3164 -1392 -4410 -2637 3067 708 -3381 -1427 -2040 -5182 -2043 1287 82 764 1042 -2014
1772 -2014 -2144 -138 -1624 -408 3955 1804 -1036 1632 1314 -2174 1345 4830 1605 1303 3892 2241
1788 2241 740 3211 3301 2481 4086 2713 659 4498 5292 1883 3959 6233 1910 391 3697 2899
1804 2899 2547 6413 5655 1869 2346 1667 -372 1854 4221 2991 4363 5216 -145 -1594 2417 1431
1820A431k244L907J545l688q90q1k054K365K635k475k88J845k503j192K522j733
1836h98j568M444J81n744J027M200k151j900J498r82l59J413j633p13L744k38
1852C21l949J04n7k143K786L168l241l92L590k718m895J610K367M80J982r77k823
1869d787J354M78l523J007M530j153j296J991k153k111L198J115k803J598K483
1884g2j810j003P83n58J446K487l409j490M881J12l221K340J880k795j32J458
1900H97k411J027M643k52k176M69j316j083J488n65k47M832J568n920j374K984
1916B564j413p09L344K70j149J705j448l736J501K507o13R71K20l068R42K823
$$ plain form
1820 1431 -813 3094 4639 951 61 -20 -2074 291 2926 451 163 2008 -495 -1687 835 -898
1836 -898 -2466 1978 2159 -3585 -2558 1642 -509 -2409 -911 -1893 -2252 -839 -2472 -3185 559 321
1852 321 -3628 -3524 -3581 -5724 -2938 230 -3011 -3403 187 -2531 -7426 -5816 -3449 -2969 -987 -1964 -4787
1869 -4787 -3433 -2955 -6478 -5471 -941 -2094 -3390 -1399 -3552 -5663 -2465 -1350 -4153 -2555 -72
1884 -72 -1882 -2885 -2102 -2660 -1214 1273 -2136 -3626 1255 1367 -1854 486 2366 -429 -561 897
1900 897 -1514 -487 4156 3904 1728 2197 881 -202 1286 721 474 5306 6874 954 -420 2564
1916 2564 1151 442 3786 4056 2907 4612 3164 -572 929 3436 2823 3794 4014 946 1888 4711
$$ [...]
8191c42
##END NTUPLES=NMR FID
##END=
