##TITLE=1H_CG-1124-5
 CDCl3, 8 sc, 
 11.11.2019
##JCAMPDX= 6.0         $$ Bruker NMR JCAMP-DX V2.0
##DATA TYPE= NMR FID
##DATA CLASS= NTUPLES
##ORIGIN= UXNMR, Bruker Analytische Messtechnik GmbH
##OWNER= root
$$ XWIN-NMR		Version 3.5
$$ Mon Nov 11 15:44:01 2019 Russian Standard Time (UT+4h)  she@DPX200
##.OBSERVE FREQUENCY= 200.1315
##.OBSERVE NUCLEUS= ^1H
##.DELAY= (6, 6)
##.ACQUISITION MODE= SIMULTANEOUS
##.ACQUISITION SCHEME= undefined
##.AVERAGES= 8
##.DIGITISER RES= 18
##SPECTROMETER/DATA SYSTEM= spect
##.PULSE SEQUENCE= zg30
##.SOLVENT NAME= CDCl3
##.SHIFT REFERENCE= (INTERNAL, CDCl3, 0, 15.7039)
##AUDIT TRAIL= $$ (NUMBER, WHEN, WHO, WHERE, WHAT)
$$ ##TITLE= Audit trail, XWIN-NMR		Version 3.5
$$ ##JCAMPDX= 5.01
$$ ##ORIGIN= Bruker BioSpin GmbH
$$ ##OWNER= she
$$ F:/spectra/data/she/nmr/H-F/1/audita.txt
$$ ##AUDIT TRAIL=  $$ (NUMBER, WHEN, WHO, WHERE, WHAT)
(   1,<2019-11-11 15:43:05.84 +0400>,<she>,<DPX200>,
      <created by zg, POWCHK disabled, PULCHK disabled
       configuration hash MD5:
       00 E9 B6 7A A2 85 ED C7 34 08 36 98 17 FE 4E 26
       data hash MD5: 16K
       80 3D DF 9A 7F 5C 38 C5 64 0B 98 14 CD BF 5D 94>)
$$ ##END=
$$ 
$$ hash MD5
$$ A0 26 F9 BC 5F 79 56 5C 87 EA 16 00 55 E9 24 5F
##$RELAX= 
##$RELAX= 
##$RELAX= 
##$RELAX= 
##$RELAX= 
##$RELAX= 
$$ Bruker specific parameters
$$ --------------------------
##$DU= <F:/spectra>
##$EXPNO= 1
##$NAME= <H-F>
##$PROCNO= 1
##$TYPE= <nmr>
##$USER= <she>
##$AMP= (0..31)
100 100 100 100 100 100 100 100 100 100 100 100 100 100 100 100 100 100 
100 100 100 100 100 100 100 100 100 100 100 100 100 100 
##$AQSEQ= 0
##$AQ_mod= 1
##$AUNM= <au_zg>
##$AUTOPOS= <>
##$BF1= 200.13
##$BF2= 200.13
##$BF3= 200.13
##$BF4= 200.13
##$BF5= 200.13
##$BF6= 200.13
##$BF7= 200.13
##$BF8= 200.13
##$BYTORDA= 1
##$CFDGTYP= 0
##$CFRGTYP= 5
##$CHEMSTR= <none>
##$CNST= (0..31)
1 1 145 1 1 1 1 1 1 1 1 1 1 1 1 1 1 1 1 1 1 1 1 1 1 1 1 1 1 1 1 1 
##$CPDPRG= <>
##$CPDPRG1= <>
##$CPDPRG2= <>
##$CPDPRG3= <>
##$CPDPRG4= <mlev>
##$CPDPRG5= <mlev>
##$CPDPRG6= <mlev>
##$CPDPRG7= <mlev>
##$CPDPRG8= <mlev>
##$CPDPRGB= <>
##$CPDPRGT= <>
##$D= (0..31)
0 1.2 0 0 0 0 0 0 0 0.06 0 0.03 0 0 0 0 0.0002 0 0 0 0 0 0 0 0 0 0 0 0 
0 0 0 
##$DATE= 1573472585
##$DBL= (0..7)
120 120 120 120 120 120 120 120 
##$DBP= (0..7)
150 150 150 150 150 150 150 150 
##$DBP07= 0
##$DBPNAM0= <>
##$DBPNAM1= <>
##$DBPNAM2= <>
##$DBPNAM3= <>
##$DBPNAM4= <>
##$DBPNAM5= <>
##$DBPNAM6= <>
##$DBPNAM7= <>
##$DBPOAL= (0..7)
0.5 0.5 0.5 0.5 0.5 0.5 0.5 0.5 
##$DBPOFFS= (0..7)
0 0 0 0 0 0 0 0 
##$DE= 6
##$DECBNUC= <off>
##$DECIM= 24
##$DECNUC= <off>
##$DECSTAT= 4
##$DIGMOD= 1
##$DIGTYP= 9
##$DL= (0..7)
0 120 120 120 120 120 120 120 
##$DP= (0..7)
150 150 150 150 150 150 150 150 
##$DP07= 0
##$DPNAME0= <>
##$DPNAME1= <>
##$DPNAME2= <>
##$DPNAME3= <>
##$DPNAME4= <>
##$DPNAME5= <>
##$DPNAME6= <>
##$DPNAME7= <>
##$DPOAL= (0..7)
0.5 0.5 0.5 0.5 0.5 0.5 0.5 0.5 
##$DPOFFS= (0..7)
0 0 0 0 0 0 0 0 
##$DQDMODE= 0
##$DR= 18
##$DS= 0
##$DSLIST= <SSSSSSSSSSSSSSS>
$$ [...]
##$SUBNAM2= <"">
##$SUBNAM3= <"">
##$SUBNAM4= <"">
##$SUBNAM5= <"">
##$SUBNAM6= <"">
##$SUBNAM7= <"">
##$SUBNAM8= <"">
##$SUBNAM9= <"">
##$SW= 24.0689530833862
##$SWIBOX= (0..15)
0 0 2 0 0 0 0 0 0 0 0 0 0 0 0 0 
##$SW_h= 4816.95568400771
##$TD= 16384
##$TD0= 1
##$TE= 0
##$TE2= 300
##$TE3= 300
##$TEG= 300
##$TL= (0..7)
0 120 120 120 120 120 120 120 
##$TP= (0..7)
150 150 150 150 150 150 150 150 
##$TP07= 0
##$TPNAME0= <>
##$TPNAME1= <>
##$TPNAME2= <>
##$TPNAME3= <>
##$TPNAME4= <>
##$TPNAME5= <>
##$TPNAME6= <>
##$TPNAME7= <>
##$TPOAL= (0..7)
0.5 0.5 0.5 0.5 0.5 0.5 0.5 0.5 
##$TPOFFS= (0..7)
0 0 0 0 0 0 0 0 
##$TUNHIN= 0
##$TUNHOUT= 0
##$TUNXOUT= 0
##$USERA1= <user>
##$USERA2= <user>
##$USERA3= <user>
##$USERA4= <user>
##$USERA5= <user>
##$V9= 5
##$VALIST= <valist>
##$VCLIST= <CCCCCCCCCCCCCCC>
##$VD= 0
##$VDLIST= <DDDDDDDDDDDDDDD>
##$VPLIST= <PPPPPPPPPPPPPPP>
##$VTLIST= <TTTTTTTTTTTTTTT>
##$WBST= 1024
##$WBSW= 4
##$XGAIN= (0..3)
0 0 0 0 
##$XL= 0
##$YL= 0
##$YMAX_a= 92448
##$YMIN_a= -54318
##$ZGOPTNS= <>
##$ZL1= 120
##$ZL2= 120
##$ZL3= 120
##$ZL4= 120
##$ABSF1= 10
##$ABSF2= 0
##$ABSG= 5
##$ABSL= 3
##$ALPHA= 0
##$AQORDER= 0
##$ASSFAC= 0
##$ASSFACI= 0
##$ASSFACX= 0
##$ASSWID= 0
##$AUNMP= <proc_1d>
##$AZFE= 0.1
##$AZFW= 0.1
##$BCFW= 1
##$BC_mod= 2
##$BYTORDP= 1
##$COROFFS= 0
##$CY= 11.3945322036743
##$DATMOD= 1
##$DC= 2
##$DFILT= <>
##$DTYPP= 0
##$F1P= 19.5091578491511
##$F2P= -0.509923556040331
##$FCOR= 0.5
##$FTSIZE= 0
##$FT_mod= 4
##$GAMMA= 1
##$GB= 0.15
##$INTBC= 1
##$INTSCL= 1
##$ISEN= 128
##$LB= 0.24
##$LEV0= 0
##$LPBIN= 0
##$MAXI= 10000
##$MC2= 0
##$MEAN= 0
##$ME_mod= 0
##$MI= 1.114404
##$NCOEF= 0
##$NC_proc= 0
##$NLEV= 6
##$NOISF1= 3.799351
##$NOISF2= 2.8
##$NSP= 1
##$NTH_PI= 0
##$NZP= 0
##$OFFSET= 15.70392
##$PC= 1
##$PHC0= -9455.703
##$PHC1= 14.40088
##$PH_mod= 1
##$PKNL= yes
##$PPARMOD= 0
##$PSCAL= 0
##$PSIGN= 0
##$REVERSE= no
##$SF= 200.130013532006
##$SI= 16384
##$SIGF1= 3
##$SIGF2= 2
##$SINO= 400
##$SIOLD= 16384
##$SREGLST= <1H.CDCl3>
##$SSB= 0
##$STSI= 0
##$STSR= 0
##$SW_p= 3612.71676300578
##$SYMM= 0
##$S_DEV= 0
##$TDeff= 0
##$TDoff= 0
##$TI= <>
##$TILT= no
##$TM1= 0
##$TM2= 0
##$TOPLEV= 0
##$USERP1= <user>
##$USERP2= <user>
##$USERP3= <user>
##$USERP4= <user>
##$USERP5= <user>
##$WDW= 1
##$XDIM= 8192
##$YMAX_p= 0
##$YMIN_p= 0
$$ End of Bruker specific parameters
$$ ---------------------------------
##NTUPLES= NMR FID
##VAR_NAME=  TIME,          FID/REAL,        FID/IMAG
##SYMBOL=    X,             R,               I
##VAR_TYPE=  INDEPENDENT,   DEPENDENT,       DEPENDENT
##VAR_FORM=  AFFN,          ASDF,            ASDF
##VAR_DIM=   8192,          8192,            8192
##UNITS=     SECONDS,       ARBITRARY UNITS, ARBITRARY UNITS
##FACTOR=    0.0002076,     1,               1
##FIRST=     0,             0,               0
##LAST=      1.7004516,     0,               0
##MIN=       0,             -54318,          0
##MAX=       1.7004516,     92448,           0
$$ Real data points
##PAGE= N=1
##DATA TABLE= (X++(R..R)), XYDATA
0@%%%%%%%%%%%%%%%%%%%JlMpJ1j2J4j7J9k0K1k5L0l2L5m2M8n0N7o7P2p8Q7r5J06
44E7j19J31j43J58j78J98k17K39k67K96l29L67m02M16l40j85Q192N7354k1330
63D3898m7992Q836j3019j8590J0037J62J1700N3811o60n8983j0719J5389j1373
76a7503J7646K9612j7862k220K6614l2358m3911K6555K9718j187J5613o756l8138
89a4177Q540J7905l4476k799N2327J0059k2997p198k3978j6669L3700Q733k8121
102a9151K4269L4761l1960l3001J689o687J2666L5150r637j8842K3247q770m6171
115d2437L940K4776o99K2302J8041l9671k2820K2887r136j8419L0870K2812p537
128D909R85k2281l7931J9710L3406j5546K552L2091j2923k7853k50j3896k787
$$ plain form
0 0 0 0 0 0 0 0 0 0 0 0 0 0 0 0 0 0 0 0 0 1 -2 2 -5 6 -6 8 -9 10 -10 11 -14 16 -16 19 -23 25 -25 32 -35 37 -41 46 -49 57
44 57 -62 69 -74 84 -94 104 -113 126 -141 155 -174 193 -209 207 -133 -318 7874 65228 43898
63 43898 -4094 4742 -8277 -26867 -16830 -16668 -4968 48843 48183 -10800 -21519 -6130 -17503
76 -17503 143 29755 11893 9673 36287 3929 -39982 -13427 16291 15104 30717 23961 -14177
89 -14177 -5637 12268 -22208 -25007 27320 37379 14382 7184 -16794 -33463 237 8970 -19151
102 -19151 5118 39879 7919 -25082 -23393 -30080 -17414 17736 8099 -10743 12504 3734 -42437
115 -42437 -38497 -13721 -14420 7882 25923 -13748 -36568 -13681 -22817 -41236 -10366 12446 4909
128 4909 5894 -16387 -54318 -34608 -1202 -16748 -14196 17895 4972 -22881 -23131 -37027 -39814
141c9814M6011J6235l3326J392J1935k7694r516J9224J274J6655K8545k7665l7610
154c4354J6483R874j5457J9875K0440j1799M052p0m1121p954M0807R607p195J5574
168A8762n919k1929N141j0018k2445L3546M1235j9573j9183O821j7902j1915J8982
181d397k6K82L4747J838m2483r506J0081n205J6421K0497j6888k690J7739k6659
195f249l0729K6684K2730l432J0750m563k9674L197J2821k1252M279L7865R34
208B3361j7966k197j9483j3888K9233J1850j8822J6952K0255k7922k0068O017
220a2678o004J0629L0308r352j9943J5571l038k9348N980J8079j730J6520J0861
233B5855l2520j3632K1114q823j2819K5923J3377j0173K807j3601k9173J5149
$$ plain form
141 -39814 6197 22432 -10894 -9502 2433 -25261 -34777 -15553 -14279 2376 30921 3256 -34354
154 -34354 -17871 -7997 -23454 -3579 16861 5062 9114 9044 -32077 -40031 776 10383 3188 18762
168 18762 12843 -9086 -3945 -13963 -36408 -2862 38373 18800 -383 6438 -11464 -23379 -4397
181 -4397 -4423 -4141 30606 32444 -10039 -19545 -9464 -14669 1752 22249 5361 2671 20410 -6249
195 -6249 -36978 -10294 12436 9004 19754 15191 -14483 -11286 1535 -19717 -15438 22427 23361
208 23361 5395 3198 -16285 -30173 -940 10910 -7912 9040 29295 1373 -18695 -12678
220 -12678 -18682 -8053 22255 12903 -7040 8531 5493 -23855 -17875 204 -1526 14994 25855
233 25855 -6665 -20297 817 -8006 -20825 5098 18475 8302 11109 -2492 -31665 -16516
245a6516K6777r431J925J9523j5202k0139M437j0484l083L7387J3053k6993l093
258a839M492k1141j008J8612n14J0241K0101k3176l1161J1546P148p437J9621
271E485J3657j5547J115N39l0696m283L3856P228o677R612j0348j9523P867j303
285i018j4179K4106K5999j8187j3695N403j5219l725K1766k394o140K3331J09
298A8157l1349l232J0128m735J3860J5890j6500l998J4860j9268j9900K1638J4522
311A0073m269J0756l710k5920L249J3273j5249M060K8874j655j3418%j6703j1422
325b2061K5210J0807j3956J2798J2852k3897j3800N897n640J0656K7932q086j9850
338a138Q665l131j9905Q632J4634j979J2852O756l0426j0934J9393k911o067J9681
$$ plain form
245 -16516 10261 830 2755 22278 7076 -13063 -8626 -19110 -22193 15194 28247 1254 -1839
258 -1839 2653 -18488 -19496 -884 -1398 8843 28944 5768 -25393 -13847 -6699 -14136 5485
271 5485 19142 3595 4710 5249 -25447 -29730 4126 11354 4677 14289 3941 -15582 -7715 -9018
285 -9018 -23197 909 26908 8721 -4974 429 -14790 -18515 3251 857 -5283 18048 18157
298 18157 -13192 -16424 -6296 -11031 2829 18719 2219 -1779 13081 -6187 -26087 -4449 10073
311 10073 5804 16560 12850 -13070 -9821 3452 -11797 -7737 21137 19482 6064 6064 -10639 -22061
325 -22061 3149 13956 0 12798 25650 1753 -12047 -6150 -11790 -1134 26798 18712 -1138
338 -1138 7527 4396 -15509 -6877 7757 5778 18630 25386 -5040 -15974 3419 508 -5559 14122
352A4122M116j2531L548q513k1566J3559K3305q471j257J1121j4292j2166Q563
365d62q076l392K9630P982k4307k879L717j5446L793J6398n179N367J6798j8068
379E876k4387J0215O044m452J7229P094j6464K557L907k4644l148K7387M233m978
393F469Q654j1199j7604R807J712j1291J8806J8966j6101j0484K551j3177K79
406a2612K2244k458q600J6684j533k5310k35J0042l080J1933J1817j6955n552
419c615J2518j3272j2876J7890R754m633R113n261k2659N723J3051j1724K136
432c855K0837l369j0651J618j3097q182K1785Q292j3137Q797Q827j9234p535O747
446b157n559P803K2448q053j7611Q059j554j5449Q561J1468k676J0780L756k5830
$$ plain form
352 14122 18238 5707 9255 742 -20824 -7265 16040 7569 6312 17433 3141 -9025 -462
365 -462 -8538 -11930 17700 25682 1375 -1504 2213 -13233 -9440 6958 1779 7146 23944 5876
379 5876 -18511 -8296 -2252 -6704 10525 17619 1155 3712 7619 -17025 -20173 7214 11447 6469
393 6469 15123 3924 -13680 -3873 -2161 -13452 5354 24320 8219 -2265 286 -12891 -12612
406 -12612 9632 7174 -1426 15258 13725 -11585 -11820 -1778 -4858 7075 18892 1937 -3615
419 -3615 8903 -4369 -17245 645 10399 5766 14879 9618 -13041 -7318 5733 -5991 -3855
432 -3855 16982 13613 2962 4580 -8517 -16699 5086 13378 241 9038 17865 -1369 -8904 -2157
446 -2157 -7716 87 22535 14482 -3129 4930 3376 -12073 -3512 7956 5280 16060 19816 -6014
460f014q396J7983j508l983J6711O89j2224L943o729j7647J3902K1680q045l642
474F720O954j3454p662J0171n041k623K3215L479k1641j592L795j0504N478J4235
488A1530o707J260J2289j4982j8039J0734O156l463J2603K234j5228L408M486
501F281j8555r67K1518Q31o509O655q914j2762R998K025j0786J3163J3152j3631
515A499o721L010j1348Q41J7913l418p987J3224k504k0596J689Q335l126R809
529F20R912j5612o230R578j0375q551J6680O483n663O813m853j9331N767J2147
543b615r120K865J6272o238r862L186q549n812J8224O290j1921N829N408j6032
557a2075k230Q573n186N423J7016q654j4662P891j50j0716R438R047n490O585
$$ plain form
460 -6014 -14410 3573 2065 -1918 14793 15482 3258 7201 472 -17175 -3273 18407 10362 6720
474 6720 13674 220 -7442 2729 -2312 -4935 18280 21759 118 -1474 2321 -8183 -2705 11530
488 11530 4823 6083 18372 3390 -14649 -3915 2241 -1222 11381 13615 -1613 1795 6281
501 6281 -12274 -13241 8277 9108 2599 9254 340 -12422 -2424 -399 -11185 1978 15130 1499
515 1499 -5222 -2212 -13560 -12719 5194 1776 -6211 7013 4509 -16087 -14398 -6063 -9189 620
529 620 10532 -5080 -11310 -1732 -12107 -20658 -3978 2505 -3158 3655 -1198 -20529 -14762 -2615
543 -2615 -11735 -8870 7402 1164 -8698 -5512 -14061 -19873 -1649 4641 -7280 -1451 3957 -12075
557 -12075 -14305 -5732 -10918 -5495 11521 2867 -11795 -3904 -4054 -14770 -5332 3715 -1775 4810
571D810L549j9215m285J5191k104k627J3613j220j1058N028m053j2944J1480J5866
585A2031p574k193N707j0933n313R634l503k208J8259R86j7723J67L816q589O380
600a056J2037p339m85R808j2043j3324J0950N117l562J0202J004j4004L317M370
614D992j3827J259J7364k055n599N977p603j0590J0305K919r119R664R324j2649
628C62l748M475q659J234J4385m574p402J1276k721j5228M256P456n188P505P921
643A1350j2771n047Q828q258n865J4236L400n516O339l677j5951N783R967p666
657d848L244J2364p365p975M904o352n585J5018M298r886M983K567j3187M77R088
672A745m952L291J2527q431j2215P332j36p674R654O963p837L663K968j4774j547
$$ plain form
571 4810 8359 -10856 -15141 50 -2054 -4681 8932 7712 -3346 1682 -2371 -15315 -3835 12031
585 12031 4457 2264 7971 -2962 -8275 1359 -2144 -4352 13907 14893 -2830 -2663 1153 -7436 -1056
600 -1056 10981 3642 3157 12965 922 -12402 -1452 3665 103 10305 11309 -2695 622 4992
614 4992 -8835 -7576 9788 7733 2134 8111 508 -10082 223 3142 -5977 3687 13011 362
628 362 -3386 1089 -7570 -6336 8049 3475 -3927 7349 4628 -10600 -6344 1112 -4076 3429 11350
643 11350 -1421 -6468 2360 -5898 -11763 2473 5873 357 6696 3019 -12932 -7149 2818 -4848
657 -4848 -1604 10760 3395 -4580 324 -6028 -11613 3405 7703 -2183 2800 5367 -7820 -7343 1745
672 1745 -3207 84 12611 4180 -8035 -703 -839 -8513 1141 8104 267 3930 6898 -7876 -9423
687i423J3113k583k787J0745l699j0542O333r31j1072R558J1195q600j302O234
701F239r515m366J0228l483l779J2656l17j3657L304L369q949N932J0110p798
715b6j617Q619r209r140J0026K734n101Q833J503j2306K676M283j0786K399J3784
730F672m404l666O027o551r078R959K676q259P753O466j0829k135N514p463J446
745e872J2310m349p069Q175k422j1045O376N938o028N344O462j1482l348Q071
759A061n187l522J1457M02o410O204k279j2055N429Q376p963L185R713p773n807
774e169P022n232n035J2260K466r088L950L030j0733K415P843o264J175J0401
788I041p485q754Q307q76o434R169M601r060L258L400j1195m25J0674l496k111
$$ plain form
687 -9423 3690 1107 -1680 9065 5366 -5176 1157 226 -10846 -1288 9907 1307 5 6239
701 6239 -3276 -7642 2586 -897 -4676 7980 7663 -5994 -2690 679 -8270 -2338 7772 -26
715 -26 -1643 6976 -2233 -11373 -1347 1387 -3714 5119 6622 -5684 -3008 1275 -9511 -7112 6672
730 6672 2268 -1398 4629 -1922 -11000 -1041 1635 -6624 1129 7595 -3234 -5369 145 -7318 -5872
745 -5872 6438 2089 -4980 3195 773 -10272 -3896 2042 -3986 1358 7820 -3662 -7010 1061
759 1061 -4126 -7648 3809 4211 -2199 4005 1726 -10329 -4900 3476 -4487 -1302 8411 638 -5169
774 -5169 1853 -3379 -8414 3846 6312 -2776 1174 4204 -6529 -4114 3729 -2535 -1360 9041
788 9041 1556 -7198 1109 233 -6201 2968 7569 -1491 1767 5167 -6028 -6453 4221 725 -1386
803a386R481m132q755O623j83q464Q055P963q854oN721q479k309R576l438m399
819b986J0102p93j0093M364L650q286N117P930q381j636P984o829o471R234J243
834D149n063P303J118j0322L147M683q751K314R907m908l954P034n627p218R074
849B886J971p369O233M973r552l72N627o961M75R970m211o612P312j801q670P153
865A052M161p204M819N319j0530j863P438m668k962R770j437o800N936r41r396
880g306N550O695p726K099P320p702l810P737m246n204R333O54q127M841K876
895B984q342K457O613o456L6Q113o370n715P795j079o411P960K910q453K980M230
911C252q578N50Q429m252k166P582m048o431O349J28p501O586N692p972M67O255
$$ plain form
803 -1386 8095 3963 -4792 1831 1648 -6816 1239 9202 348 342 6063 -2416 -4725 4851 1413 -2986
819 -2986 7116 6323 -3770 594 4244 -4042 1075 9005 624 -1012 6972 143 -6328 2906 4149
834 4149 -914 6389 7507 -2815 332 5015 -3736 -1422 8485 3577 -377 6657 1030 -6188 2886
849 2886 4857 -2512 3721 8694 -858 -1230 4397 -2564 -2089 7881 3670 -2942 4370 2569 -6101 1052
865 1052 5213 -1991 2828 8147 -2383 -4246 3192 -1476 -4438 5332 3895 -2905 3031 2090 -7306
880 -7306 -1756 4939 -2787 -688 6632 -1070 -4880 2857 -1389 -6593 2740 3394 -4733 108 2984
895 2984 -5358 -2901 3712 -2744 -2708 5405 -965 -6680 1115 36 -6375 1585 4495 -3958 -978 3252
911 3252 -5326 -4776 3653 -599 -2765 4817 769 -5662 687 815 -6686 -100 5592 -2380 -1913 4342
927D342p112j902Q401l518m332Q038q95p967N081K677p259M214O368p845p14P177
943D754o037m068Q964n94n973O697M58q854M119M183p520K133Q227n901k640O916
959D864m707n493Q172L24p276N988L677q473J181O337o962o03Q269m764m577P267
975C224j605o702O514K478p726L787M366q110j68P344n206k530Q206k188o629
990d945O318J47p517N195M184p532J819O139o325j946P133m229m631Q072l12p308
1006e738N273K983p882K895N486o924l15P157n222m019Q184j563n885O324J933
1021B687q321L496M925p472O37P304n346k531P255k830n145O605J71o999N689
1036A25L410p760K517N820o340j734P676m358m151P269o83o174N843K131p151
$$ plain form
927 4342 -2770 -4672 3729 211 -4121 3917 3022 -4945 136 2813 -4446 -232 6136 -1709 -2423 4754
943 4754 -1283 -5351 3613 3019 -2954 3743 4201 -4653 -534 3649 -3871 -1738 6489 588 -2052 4864
959 4864 157 -5336 2836 3160 -4116 1872 5549 -2924 -1743 4594 -2368 -2971 5298 534 -4043 3224
975 3224 1619 -5083 1431 3909 -3817 -30 4336 -3774 -3942 3402 -1804 -4334 3872 1684 -4945
990 -4945 1373 1520 -5997 -802 3382 -4150 -2331 3808 -2517 -4463 2670 -1559 -6190 1882 1570 -5738
1006 -5738 -465 2518 -5364 -2469 3017 -3907 -4222 2935 -2287 -6306 1878 315 -5570 754 2687
1021 2687 -5634 -2138 2787 -4685 -4048 3256 -2090 -4621 2634 -196 -5341 1264 1435 -5564 125
1036 125 3535 -4225 -1708 4112 -2228 -3962 3714 -644 -4795 2474 1791 -4383 1460 3591 -3560
1051c560L432M736p426N04P007m541l175P667k456n803O703J163p334M410M242
1066E569o945J392O218o149j671P745l511n068P065q20o696N803L397p295K468
1081A502N571o566j200O937m772l557P927j497n759N615J125p590M127M370p136
1096i03J134O477n253k742O883k852n274O471Q06p129M402L410p407J932O039
1111E994o226j088O930m190m976O987j187o279N749L055p175K732M173p421PO536
1127C621m566k716P620k628n951N426N54o797M775M352p011P77N752o067k258
1142e117P143l120l750O892o07p444M586K710o851L056N463n978j129O293m810
1157b663m008P257n12n277N498J485p527K885L830o095Q01P180m391l233O385
$$ plain form
1051 -3560 -128 4608 -2818 -2314 4693 152 -3023 4644 2188 -3615 3088 4251 -3083 1327 5569
1066 5569 -1376 16 6234 85 -1586 6159 2648 -2420 4645 3825 -2871 2932 6329 -966 1502
1081 1502 7073 507 -693 6244 1472 -2085 5842 4345 -1414 4201 5326 -2264 1863 6233 -903
1096 -903 231 6708 1455 -1287 5596 2744 -2530 3941 4747 -2382 2020 5430 -1977 -45 5994
1111 5994 -232 -1320 5610 1420 -3556 3431 2244 -4035 1714 4769 -2406 326 4499 -2922 -2915 3621
1127 3621 -945 -3661 3959 1331 -4620 806 1360 -5437 -662 3690 -3321 -2544 3208 -2859 -5117
1142 -5117 2026 -1094 -4844 2048 1441 -6003 -1417 1293 -5558 -2502 2961 -3017 -4146 2147 -2663
1157 -2663 -6671 586 74 -5203 295 1780 -5747 -2862 968 -5127 -4326 2854 -1537 -4770 1615
1172A615l120n240O334R94n842M937L267p550O72N411n340p74P539l382l897O335
1188A959j605o675N610L210o083L386M537p121p79O230n031j928P638q57n819
1203c328N357k20o567M380M403o265J821O230o554k654O230l028l426P351L18
1218D048o345M314J947p208K200N439m761L36O075m896m358O126j426m925O109
1233B675K789o621K442K909o690O04O426l736j652O644l094n497M586j39n601
1248c955N414M679p014O27M613o299j885P072k177k982O619j514p371L515K532
1263A874n846L695N422n488j065M972n638l530P748l17m275N269J97p345K853
1278a474L084n474K378O727n244k786N020l681m363O904J053n560N102K149p467
$$ plain form
1172 1615 -1505 -6745 -411 583 -5259 -322 2945 -4605 -3933 1478 -3862 -4636 2903 -479 -4376 1959
1188 1959 354 -6321 -711 2499 -3584 -198 4339 -2782 -3561 2669 -2362 -4290 3348 2491 -3328
1203 -3328 2029 1809 -4758 -378 4025 -2240 -419 5811 -743 -3397 2833 -195 -3621 3730 4048
1218 4048 -2297 2017 3964 -3244 -1044 4395 -366 -30 6045 1149 -3209 2917 1491 -3434 2675
1233 2675 5464 -1157 1285 4194 -2496 -1892 4534 798 -854 5790 2696 -2801 1785 1646 -3955
1248 -3955 1459 6138 -876 -249 4364 -1935 -3820 3252 1075 -1907 4712 3198 -4173 -658 1874
1263 1874 -3972 -277 5145 -343 -1408 3564 -2074 -5604 2144 1827 -2448 2821 3018 -4327 -1474
1278 -1474 1610 -3864 -1486 5241 -3 -2789 2231 -1450 -5813 1091 2144 -3416 1686 3835 -3632
1293c632N20M580m241L58P060l610m135N512k060o226N789K909m954L239L383
1308D492o691j243O111m340j886P544j202n104M127j249n824M849L998n417J812
1323b3N477n964l378N213k624j832P260m18o149L282J854o997K429N021l888J522
1339G85N036o145m106N865j242m083O132K288n842J835J750o941J739O921l495
1354D97k029N834l343n238M265k76m089O468L373p287L62L565n288j317O675j727
1370D45k329O276k552p495L763K476m649L890M685n907j47M113n898k923P985
1385A733L2l947M604m90o859L027K042m828L459O726n165l620L887l029k660O440
1401A352K83m286M527K035q307j30M821l072J475O098m063l797N055k651n918
$$ plain form
1293 -3632 -3112 1468 -2773 -2415 4645 1035 -3100 2412 352 -5874 -85 2824 -2130 1109 4492
1308 4492 -2199 -3442 2669 -1671 -3557 3987 2785 -2319 1808 559 -5265 -416 3582 -1835 -23
1323 -23 5454 -510 -3888 1325 -1299 -3131 4129 3711 -2438 844 2698 -4299 -1870 3151 -737 785
1339 785 5821 -324 -4430 1435 193 -3890 2242 4530 -1312 523 2273 -4668 -2929 3992 497
1354 497 -1532 4302 959 -4279 -14 -290 -4379 2089 5462 -1825 -1463 2102 -3186 -4503 2172 445
1370 445 -1884 4392 1840 -5655 -1892 584 -4065 -175 4510 -1397 -1544 2569 -3329 -6252 1733
1385 1733 1765 -2182 2422 1932 -4927 -1900 142 -4686 -1227 5499 334 -3286 601 -2428 -5088 1352
1401 1352 1635 -2651 1876 3911 -4396 -4526 295 -2777 -1302 4796 733 -3064 1991 -660 -6578
1416f578O018L416m004K948J997p736K67N882m474j050P730j507m581K955j179
1431A04n020N093L999n804J912M796o201k710M476k179o15P566j428o421L522
1446A090J242o467K060N477k810J352L765o005m361N800o80l005O455J584n785
1461b88J445O42o396K164P717l264j902M474l458m987M371M4k913O596K329p413
1477h39k06K970m758k40O877j739j546M766l685p097M232L000l306L276L467n209
1493c7p23L300n716j572P780k51l680L665q51n674L050K227m587L286N840n223
1509H34l029K770k863j828O722m48l943M791N35p680N68M426k414J618N430m638
1525H51l334M510k855n099O068L133l565K903M95p081Q77N264l808l26O997j792
$$ plain form
1416 -6578 -560 2856 -1148 1800 3797 -3939 -3672 2210 -2264 -3314 4416 2909 -1672 1283 104
1431 104 -4916 177 4176 -1628 284 5080 -1121 -3831 645 -1534 -2149 5417 3989 -2432 1090
1446 1090 2332 -4135 -2075 3402 592 1944 5709 -296 -4657 1143 463 -2542 3913 5497 -288
1461 -288 1157 1799 -4597 -2433 5284 2020 118 4592 1134 -3853 518 562 -2351 4245 6574 -839
1477 -839 -1045 1925 -2833 -3073 3804 2065 519 5285 1600 -5497 -1265 1735 -1571 1705 5172 -37
1493 -37 -760 2540 -3176 -4748 3032 2781 -899 2766 1915 -3759 -709 1518 -3069 217 6057 834
1509 834 -2195 575 -2288 -4116 2606 2158 -1785 3006 3541 -4139 -3571 855 -1559 59 5489 851
1525 851 -2483 2027 -828 -5927 141 3274 -291 2612 3107 -3974 -3097 2167 -1641 -1967 5030 3238
1541C238n173K703k015l744N914M045n267J139L657o116k197M623j468Q1O499
1556E919k293o309K868Q32m988K820M980k629R09L158o295l645N733m73k352N438
1572C673J084n559J464L82o158L235O822l212j866L898l583m617M496j27k493
1587b561O278J763p482k37K591m289J427O060k209j268M192l876o823M001L238
1602H05k862L553K371n183p90L056n672j93P588j1m084K800j678n277L616K499
1618E38l972L094M899n176l298L170k692n79O102p14l883L914N08p234N42M223
1634e58j939K516M319n004l245M328k374m330N785K661k772K139l25o452P32N250
1650G31k913k56N828j804l950J838j871k939N614L639n009R93K442n413j609M101
$$ plain form
1541 3238 -1935 768 -1247 -4991 923 4968 -299 840 4497 -1619 -3816 807 -661 -580 5919
1556 5919 3626 -2683 185 1017 -3971 -1151 3829 1200 2109 5267 -1028 -4673 1060 587 -1765 3673
1572 3673 4757 -802 662 1044 -5114 -1879 4943 1731 -135 3763 180 -4437 59 -68 -2561
1587 -2561 3717 5480 -2002 -2239 352 -3937 -2510 3550 1341 73 4265 389 -6434 -2433 805
1602 805 -2057 1496 3867 -1316 -2106 950 -4722 -4915 2673 2662 -1422 1378 -300 -5577 -1961 538
1618 538 -3434 -340 4559 -617 -3915 -745 -3437 -4016 2086 1372 -2511 1403 1911 -5323 -4781 -558
1634 -558 -2497 19 4338 -666 -3911 417 -1957 -6287 -502 2159 -613 1526 1201 -5251 -4519 731
1650 731 -2182 -2438 3390 1586 -2364 -526 -2397 -5336 278 3917 -1092 -99 2343 -3070 -4679 -578
1666e78j145R55O399k985o618K362J140l489L443M427k945M65K415o982k799O297
1682C62R75j596L947l16m985K171Rm801L384O238l070j840K340l660k480M807
1698A485p0k355N590R35o421k56K140k833J966M990l201j284M211l464n885M118
1714c34K942j995L327J260n737N12K828n591j66P304p0l044J889k552m493M272
1730C52K540l765K500M512m784l348J853k160K82O377r17m437L344k30o113J216
1746b778L496j319K543L572o068k954M086k392k580M864K119k565J673j170n973
1761e446J699N370k649k71M640k375l534J329j758k343O645K611n348J49K240
1776I59m644o14L734q52P24N412l132o865K713J165k816L268L523l161J592P08
$$ plain form
1666 -578 -1723 -768 5631 2646 -3972 -1610 -470 -3959 -516 3911 966 1431 3846 -3136 -5935 362
1682 362 1337 -259 3688 3372 -1613 558 567 -4234 -850 5388 2318 478 2818 -842 -3322 1485
1698 1485 1415 -940 4650 5585 -836 -1092 1048 -1785 181 5171 1970 686 4897 1433 -4452 -334
1714 -334 2608 613 3940 5200 -537 -25 2803 -2788 -2954 4350 4280 1236 3125 573 -3920 352
1730 352 2892 -873 1627 6139 1355 -1993 -140 -2300 -2018 4359 3442 -995 2349 2119 -3994 -2778
1746 -2778 718 -601 1942 5514 -554 -3508 578 -1814 -4394 470 2589 24 1697 527 -5446
1761 -5446 -3747 1623 -1026 -1297 3343 968 -2566 -1237 -2995 -5338 1307 3918 -1430 -1281 959
1776 959 -3685 -4299 -565 -1417 -693 4719 1587 -5278 -2565 -1400 -4216 -948 2575 -586 1006 1714
1792A714o346k132O490J428j679K844j392l988K122P9m212L738O072l341k679
1807a282J832k972j715M909p67j684M988P96o552n43K331j511K334M227l533j270
1823d12L809l586m726L896L035j413K470L78n791J045L338m448q2N823L49k814
1839H71J386k611l608M324K189l727K584L912m339k959J493k141J318O324j649
1854C367m383L092j92n904J768L383o89K895K109o113k872M097j455k253N381
1869B231J567k718J108j890n635K771N354k221k78L301k580l132J561j754j415
1884c730O921J877n817j77J640l419M4L574j158O47M304l974n498L176J607j991
1900a974K847K008k961J097J002n859r66O360M04j770K242j509l289J961lm022
$$ plain form
1792 1714 -4632 -6764 -274 1154 -525 2319 927 -3061 -939 -860 -5072 -1334 4738 1397 -1282
1807 -1282 550 -2422 -4137 772 5 -1679 3309 4105 -2447 -2990 -659 -2170 164 4391 858 -412
1823 -412 3397 -189 -4915 -1019 2016 603 3073 3451 -2340 -1295 2043 -2405 -2487 3336 3685 871
1839 871 2257 -354 -3962 362 2551 -1176 1408 5320 981 -1978 -485 -2626 -1308 5016 3367
1854 3367 -1016 2076 1884 -4020 -2252 1131 442 3337 5446 -667 -3539 558 -897 -3150 2231
1869 2231 3798 1080 2188 298 -5337 -2566 2788 567 289 3590 1010 -2122 -561 -2315 -3730
1884 -3730 3191 5068 -749 -926 714 -2705 -2661 913 -245 402 4706 732 -4766 -1590 17 -1974
1900 -1974 873 2881 -80 1017 2019 -3840 -4806 1554 1958 188 2430 921 -2368 -407 -410 -4432
1916d432M130N589l739k469J408l012n67M572q58j921M974J48o379k13K159j184
1932a794K802L200l476j124L337l791m129M524K855r57K151q46n215Q75L218l382
1948a752mN939o25k942O35k728k349M976J666l323K250K624m363k216J764j633
1964b081J870N240k216m218K706j34m279J374L152r00K445J471n772k333M440
1979G65r90j902M533R44k709P83j998m626L414N231k576p29K798k978k419J718
1995g41j412o99O194J061n251l84J620l729R62L386j053P56L316l939n014L179
2011a748J638j613L006J067l355P75J093n245J78N419L37j742J581j606l201K847
2027e69k33k866L700L968l594j962J254k470k93M539j306j600M087l97n307j88
$$ plain form
1916 -4432 -302 5287 1548 -921 487 -2525 -3092 1480 622 -1299 3675 3823 -2556 -2769 -610 -1794
1932 -1794 1008 4208 732 -392 2945 -846 -4975 -451 2404 1447 3598 2752 -2463 -1588 1630 -1752
1948 -1752 -1756 4183 3558 616 1251 -1477 -3826 1150 2816 -507 1743 4367 4 -2212 -448 -2081
1964 -2081 -211 5029 2813 -1405 1301 1167 -3112 -1738 1414 514 2959 4430 -1342 -3675 765
1979 765 -225 -2127 2406 3350 641 1424 -574 -5200 -1786 3445 869 140 2938 -40 -2459 -741
1995 -741 -2153 -2852 3342 4403 -848 -1232 388 -3341 -2379 1007 -46 710 4026 87 -4927 -1748
2011 -1748 -110 -1723 1283 2350 -1005 -230 863 -4382 -4204 1215 1552 -190 1391 -215 -3416 -569
2027 -569 -802 -3668 32 4000 406 -1556 -302 -2772 -3065 1474 168 -1432 2655 2258 -3049 -3237
2043c237K159p29K808K515l321j651L308l210l299M019K284j067J737r22m785
2058c391J340K825k558M68M795j142k770N81k524j716M980J768k963J898J239
2073B830l969j677J904j268K197M859k600m267K264k80l034K053K777j363J743
2088B169J060n321j480M220n71j003L428J02l071J253j482l626L361M540k438
2103A141q29K185l413j404K298j390q61N410Q35n101k88J420k557J181L280k011
2119a04P75L338l821m055K694J359j489K926J172l615P91Q25m299K29N442j72
2135A996j500J268k217k830L010L52k321L206L308l591j851M63j952N53M176r97
2151A073j299K936q61m777L93K091n93K570K056l656j016K509k522k382L955J777
$$ plain form
2043 -3237 -1078 -1807 1001 3516 195 -1456 1852 -1358 -4657 -638 1646 579 2316 1394 -3391
2058 -3391 -2051 774 -1784 -1316 3479 2337 -433 148 -2376 -4092 888 2656 -307 1591 2830
2073 2830 -1139 -2816 -912 -2180 17 4876 2276 -1991 273 -7 -3041 -988 1789 426 2169
2088 2169 3229 -2092 -3572 648 77 -926 2502 2604 -467 786 -696 -4322 -961 3579 1141
2103 1141 312 2497 -916 -2320 -22 -1412 -2273 3137 3972 -1129 -1417 3 -2554 -1373 1907 -104
2119 -104 671 4009 188 -3867 -1173 186 -1303 1623 2795 -820 -29 796 -3503 -3274 2168 1996
2135 1996 496 1764 -453 -3283 -273 79 -2242 964 4272 681 -1170 -707 -2659 -2106 2070 1073
2151 1073 -226 2710 1849 -2928 -2535 -444 -1037 1533 3589 -67 -1083 1426 -1096 -3478 477 2254
2167B254j473J553j354m489K065L059k408N75L745j600k168Q68k391j275M673
2182A634J613k930J222J337m462p20K136j132J701M414k649m173K358l38k472
2197b461K487K174j309J546M41n106j002M027l05m69K450n78k570J554j240l347
2213c708L516L919k377j081J112k456j606L150j005o73M435m0n003M65P15j745
2229b382J782K543j908m44L070l182l521K798J086q87K519L26l715J222P02l214
2245c205N33M166m12j363J268k319k338K939O03k368K900K236l372j587R40j765
2261c144P78M257j267j765K305p94l919P91K058p87K100K014m017j168K652j869
2277a775j478L752O62j410J504j440l650K084K841k091O36K877j871k487J529
$$ plain form
2167 2254 781 2334 980 -3509 -1444 1615 -793 -218 3527 1927 -241 627 -1764 -3039 1634
2182 1634 3247 317 1539 2876 -1586 -2306 -170 -1302 399 4813 2164 -2009 349 11 -2461
2197 -2461 26 2200 891 2437 2878 -2228 -3230 797 492 23 2473 1895 -675 879 -361 -3708
2213 -3708 -192 3727 1350 269 1381 -1075 -2681 469 -536 -1209 3226 3186 -1817 -1352 -637 -2382
2229 -2382 -600 1943 35 -409 2661 -521 -4042 -1244 -158 -1045 1474 1800 -1915 -693 9 -3205
2245 -3205 -2672 1494 1082 -281 987 -1332 -3670 -731 -128 -2496 404 2640 -732 -2319 -1379 -3144
2261 -3144 -2366 1891 624 -1141 1164 370 -3549 -2758 -700 -1487 613 2627 -1390 -2558 94 -1775
2277 -1775 -3253 499 1161 -249 1255 -185 -3835 -1751 1090 -1001 -365 2512 641 -1846 -317
2292c17j860n43M386R33l176J034J001l458L31J834j021J319L479k471l532K112
2308E1M13k101K336J464j878J814L02m553J15L733n95j028K864r50l215K419q12
2325C79k635L098L010k323p07J110k628n68K672r89k84L706n83l844K85O72j911
2342a540K374K211j844m08K386k908k914K736J151q75K414m31l448J263J301l260
2358a792N71L892q75j524J496k482j851K910J209k795K457J461l228q22J055k008
2374b326J109L738j579j849J994r56l304K054J331j254K063J401l670q60K483
2389C75k012p23L514j77j590J575j213l252K051K924k368N95K531k789j489J594
2405d54j525l65M042J28k728R40N88l355R08K293j205Q55K991k938l002K473j27
$$ plain form
2292 -317 -2177 -2720 1666 2599 -577 457 1458 -2000 -1669 165 -856 463 3942 1471 -2061 51
2308 51 464 -1637 699 2163 285 2099 2401 -2152 -2037 1696 1101 73 2937 1987 -1228 1191 379
2325 379 -2256 842 3852 1529 822 1932 -696 -1264 1408 419 135 3841 3258 -586 -301 371 -1540
2342 -1540 834 3045 1201 793 3179 271 -2643 93 1244 369 2783 2352 -1096 167 1468 -1792
2358 -1792 -1221 2671 1796 272 1768 -714 -2565 345 1554 -1241 1216 2677 -551 -1373 -318 -2326
2374 -2326 -1217 2521 942 -907 1087 131 -3173 -1119 212 -1042 1021 2422 -1248 -2108 375
2389 375 -1637 -2360 1154 977 -613 962 -251 -3503 -1452 1472 -896 -301 2230 -559 -2048 -454
2405 -454 -1979 -2344 1698 1826 -902 38 626 -2729 -1821 472 -733 122 3113 175 -2827 -354 -481
2422d81j678K580Q66j991J263Q66l666j1L291n92p88K181j343j920J930q15k382
2439b690L014K531k462l65P52k350j40K877q75r17L088n62l591J066P69j704K317
2456G58J881k504N1K039k799j952L059K01q48K391l41l585J397J369k577P29L252
2473B521j136j470J163k391j026L185N97k103J848J055l262j94J109j549J024
2488f29L500j827k132J950r96k608K240J157j623K253P60l366n35K474j373r39
2504a694L112l33j797J863j223k729K151K087k070M71K054k760q78J809j450n11
2520a898L574kl010J449J57k547J128J930j467O81K356k447k133J911L9j264K463
2537I20P24k597J460M22l260J86L411j244l41J763j109k150K278k49k213K844
$$ plain form
2422 -481 -2159 421 1287 -704 559 1425 -2241 -2252 1039 447 -341 1840 497 -1423 507 -308 -2690
2439 -2690 324 2855 393 28 780 -1570 -1710 1167 292 -625 2463 1901 -1690 -624 145 -1559 758
2456 758 2639 135 186 2225 -574 -2526 533 734 -114 2277 1936 -1649 -252 1117 -1460 -731 2521
2473 2521 1385 -85 1078 -1313 -2339 846 1443 -660 1188 2243 -1019 -1213 -104 -1653 -629
2488 -629 2871 1044 -1088 862 -134 -2742 -502 655 -968 1285 2045 -1321 -1856 618 -755 -1694
2504 -1694 1418 1085 -712 1151 -72 -2801 -650 1437 -633 -162 1892 -868 -1746 63 -1387 -1898
2520 -1898 1676 1674 -1336 113 270 -2277 -1149 781 -686 -5 2351 -96 -2229 -318 -279 -1543 920
2537 920 1644 -953 507 929 -2331 -2145 1266 22 -319 1444 335 -1815 463 214 -1999 845
2553H45J488k501r3J174k199J77K772j212q83K542q05k898J218R10j620K060J589
2570B564k498l9J941k600j223L082N7j090K039q93k610J275J314k190P84K647
2586B560k037o43J350j517j705L117O21k358K129P45l044J25J740k161J243K433
2602B598j821j565J733p34k324K610Q80j724J448Q78l349K76K139j787K8K515
2618A801p53k046K133j010k323K071J767k054O75J180k243m11J796j568q34L532
2634A713k53k807J254L45k438J847J539k052O38K171k166j679J885k95j403K627
2650I26R1k494J522O30k945O50K745j634k2J973j857j700K409k35k171K480J417
2667A785l005N63J211k085K39K829j532o52K090j048k673J896Q82j794K006J150
$$ plain form
2553 845 2333 -168 -261 913 -1286 -1109 1663 451 -432 2110 1305 -1593 -375 535 -1085 975 2564
2570 2564 66 27 1968 -632 -1855 1227 1284 194 2233 1340 -1270 5 1319 -871 -87 2560
2586 2560 523 -120 1230 -287 -1992 1125 1746 -612 1517 2262 -782 -657 1083 -1078 165 2598
2602 2598 777 -788 945 211 -2113 497 1377 -347 1101 1979 -1370 -1094 1045 -742 -714 1801
2618 1801 1048 -998 1135 125 -2198 -127 1640 -414 261 1441 -802 -1213 583 -985 -1819 1713
2634 1713 1460 -1347 -93 252 -2186 -339 1200 -852 -214 1957 -209 -1888 -3 -298 -1701 926
2650 926 1017 -1477 45 675 -2270 -1620 1125 -509 -531 1442 -415 -2115 294 59 -2112 368 1785
2667 1785 -1220 -657 554 -1531 -1292 1537 5 -647 1443 395 -2278 -382 500 -1294 712 1862
2683A862k842L16J696k055m42K728o89j255J907n30k795J848J355k562J238K065
2699A845j734q94J744j819p99K766p4k070J994J73k505O86J522k011Q39K283j732
2716B14j379J936q32j841K605M90k245J810O98k795P44J656j565m10K317r33j645
2733a175J723k02k458K482J080k364R48J519k618j76K105j379n14K419o04k175
2749a389J918k52k216J595J546j911P08J623k127j287K503p44j118K676m74k474
2765a423J409P74k442Q83K610k080R7J573j573j317K138k13j914K267P96k350
2781g65M58J190j734P3K560j724j101K589j269j734J754L54j426J503J046k550
2797g76L21K056k391j79K628p61j811K462p26j965J480R28k046J018J960j864
$$ plain form
2683 1862 -980 -664 1032 -1023 -1465 1263 574 -681 1226 696 -2099 -251 1104 -1458 -220 1845
2699 1845 111 -783 961 -858 -1657 1109 1035 -1035 959 1132 -1373 -687 835 -1176 -337 1946 214
2716 214 -1165 771 -61 -1902 703 1193 -1052 758 1456 -1339 -595 1061 -504 -914 1403 470 -1175
2733 -1175 548 346 -2112 370 1450 -914 34 1553 -1065 -1241 864 -515 -1029 1390 786 -1389
2749 -1389 529 277 -1939 -344 1202 -709 -1 1622 -505 -1792 711 -33 -1151 1525 1051 -1423
2765 -1423 -14 760 -1682 -799 1811 -269 -172 1401 -172 -1489 649 436 -1478 789 1585 -765
2781 -765 -307 883 -851 -778 1782 58 -1043 1546 277 -1457 297 651 -775 728 1774 -776
2797 -776 -455 1601 -790 -969 1659 898 -913 1549 823 -1142 338 1266 -780 238 2198 334
2813C34p16J684j529p42K696n77k185K023L15k386J131J267k001L63K266j876
2829F7j412K670q34j747K183m8j622J149J050k554O19J850j729l18K488j524j485
2846a197K159o15j916K021Q68k445Q21J402k090q7J985j555m14K133p58j958J765
2863A19K77k462J833J166j977N90J519k310m65K209r77p58K006o00j835J404Q84
2880F23k623J101J810j981l3J973j444j694K531l13j901K278J71k123J117P78
2896B70k099J002J974j569r32K202r48j853K215j02j561J405J301k552N13K085
2912A351k033k36K257j372j367K445q99j562J606J052k330P73J756k013l60K154
2928A222j176j343K788r01j767K250K10k441J445J402k310L68J851j815l75K040
$$ plain form
2813 334 -382 1302 -227 -969 1727 1150 -1035 988 1303 -1083 48 1315 -686 -323 1943 67
2829 67 -1345 1325 491 -1256 927 879 -743 406 1456 -1098 -479 1371 -358 -676 1812 288 -1197
2846 -1197 962 347 -1569 452 1320 -1125 -304 1098 -992 -1079 906 -649 -1063 1070 312 -1646 119
2863 119 396 -2066 -233 933 -1044 -454 1065 -1245 -1710 499 -478 -1236 770 170 -1665 -261 623
2880 623 -2000 -899 911 -1070 -1103 870 -574 -2268 263 -50 -1951 327 498 -1625 -508 270
2896 270 -1829 -827 1147 -422 -1354 848 -100 -1953 262 160 -1401 4 1305 -1247 -734 1351
2912 1351 -682 -918 1339 -33 -1400 1045 146 -1416 190 1242 -1088 -315 1441 -572 -932 1222
2928 1222 46 -1297 1491 590 -1177 1073 1283 -1158 287 1689 -621 -253 1598 -217 -592 1448
2944A448p07j409J996k34j749J258J069k730R62J841k172J90J944j360j036J891
2960A202k69j708J633L66j845R94J527k556j7K164j402o43K403j184j633J897
2976I29Nj859J266R27k097M09K045k052n74K402j434r80J998l02k073J835P55
2993A200k131P44J491k144m3J969j595p47K366r59j563K051L55k272J105J089
3009I16k019K40K072k045l88K127q66j572K105n0k256J683J117k526R36J698j866
3026f94j43J894j030j555K310m90j821K082J21j718O75J327j852K1K136j500o94
3043i31J814q22j456J697M10j954J162J217k037M31J654j585l02K079j113j063
3059g99J798n35j547J808P45k320Q48J421j665j81K013j519r46K259p44j739J669
$$ plain form
2944 1448 741 -668 1328 1094 -655 603 1672 -1058 -96 1745 -427 -237 1707 347 -689 1202
2960 1202 933 -775 858 1224 -621 373 1900 -656 -673 1491 89 -554 1849 665 -968 929
2976 929 934 -925 341 1268 -829 -420 1625 -427 -1001 1401 -33 -1013 985 683 -1390 445 1200
2993 1200 -931 -187 1304 -840 -883 1086 -509 -1256 1110 151 -1412 639 994 -1278 -173 916
3009 916 -1103 -863 1209 -836 -1224 903 37 -1535 570 520 -1736 -53 1064 -1462 -526 1172 -694
3026 -694 -837 1057 27 -1528 782 292 -1529 553 674 -1044 -369 958 -894 -873 1263 -237 -931
3043 -931 883 61 -1395 302 712 -1242 -80 1137 -900 -469 1185 -400 -702 1377 264 -799
3059 -799 999 464 -1083 725 1470 -850 -2 1419 -246 -427 1586 67 -879 1380 636 -1103 566
3076E66M07k151J330J480k193O59J498j979m67J908p21j037J746J5k153J533M73
3093I14j993P69J933j756p16K162j365j053J834m12j510J568R89k531J262P73
3109H68j735M3K029j809m56K079p98j743J953r9j817J565O34j950M45J596j564
3126g59m28K184r96j303J888p45j500J420P64k123J435J116j821k64J782j373
3142g23q97K338n27j543J715K53k082Q65J307j742L48J803j863m93J670o20j216
3159a407K284k63j814J286M35k243J086J726j727j70K186j101j254J754m48j585
3175a255J394P74j755J039Q55j577j92J688j316j66J947p63j852J791L34j753
3191h07J126J093j868L11J562j494p86K294j151p47J907l93j457R59M80k360J532
$$ plain form
3076 566 973 -1178 152 1632 -561 98 1596 -383 -850 1058 337 -700 1046 1061 -1092 441 914
3093 914 -1079 -310 1623 -133 -849 1313 -52 -1105 729 317 -1193 375 1364 -1167 95 868
3109 868 -867 -824 1205 -604 -1060 1019 221 -1522 431 332 -1485 80 714 -1236 -791 805 -759
3126 -759 -1187 997 1 -1302 586 -159 -1659 -239 525 -1598 -163 953 -868 -1132 650 -723
3142 -723 -1620 718 191 -1352 363 616 -1466 -601 706 -1036 -688 1115 -748 -1241 429 -191 -1407
3159 -1407 877 614 -1200 86 521 -1722 -636 1090 -637 -807 1379 278 -976 778 330 -1255
3175 -1255 139 913 -842 197 1052 -525 -717 971 -345 -511 1436 673 -1179 612 946 -807
3191 -807 319 1412 -456 -145 1417 -77 -863 1431 280 -467 1440 1047 -410 549 1029 -1331 201
3208B01J607j714j79J357j285q30K097o73j008J465J28j816J053R08k005M94J538
3225A338j702K0J698j116j418J704M30j778J124J101k153N15J374j915P1J792
3241A085p88j217J688o51j217J705L84k085J353J119k004q0J609j458l36J871
3257I78n99j330J683j01k136J039J100j337P09J305j759n78J702p39j068J699
3273E68P7j767J257N30j972Q80J392j446J06J491r45j388J581n84j287J947L19
3290G59j606J006Q72k264L33J664j035n35J996r43j766J774J00j707J487R43j552
3307d74O28O25j158o12J628o25r28K008m53j736J399K35j728J275J494j662m62
3324e46J766j759l20J616n33r52J715M2j828P23O56j720J027J308j288p29J712
$$ plain form
3208 201 1808 94 -85 1272 -13 -843 1254 581 -427 1038 1166 -650 403 1311 -694 -200 1338
3225 1338 -364 -344 1354 238 -1180 524 954 -824 300 1401 -752 -237 1137 -778 -707 1085
3241 1085 297 -920 768 117 -1100 605 989 -1096 257 1376 -628 -708 901 -557 -893 978
3257 978 379 -951 732 631 -1505 -466 634 -703 6 1311 -448 -1026 676 -63 -1131 568
3273 568 645 -1122 135 665 -1307 -427 965 -481 -375 1116 171 -1217 364 -220 -1507 440 759
3290 759 -847 159 1031 -1233 -900 764 -271 -806 1190 247 -1519 255 355 -1352 135 1078 -474
3307 -474 154 779 -379 -991 637 12 -916 1092 639 -1097 302 537 -1191 84 1578 -84 -546
3324 -546 1220 -539 -859 757 224 -728 987 1029 -799 -76 580 -1140 -113 1195 -93 -822 890
3341H90j291r95J675K36j239J292J35j680M39J180j374p3J887q22j198J510o59
3358h7j252J385O29j648J012J263k014k91R90p53m83K243m85j394J382k63k305
3375b071J685Q47j289P56J189j805Q7J031q62p26J616L61j634P56J74j540Q92
3392e33J380j352K67J384j509p17J409n97r43K035L46j708N60P26j825M31J461
3409H15j279L65J427j215j298J654M6j324J234P71j506K87J282j719m69J854n95
3426C30o76J224n0j705J243M23j650J344J015j607jJ309j131o62J797r93n89J800
3444A421p40j540J154N41j665Q37J432j296m54J770j483q07J509k04p33J108K19
3461A069j903L24J403j516J25K064j080r99J197r20j018J224R35j709J112O34
$$ plain form
3341 890 -401 -1396 279 515 -724 568 703 -977 -538 642 -732 -805 1082 260 -938 572 -87
3358 -87 -1339 46 675 -973 39 1302 -712 -1003 -13 -766 -1249 994 509 -885 497 234 -2071
3375 -2071 -386 461 -828 -72 1117 -688 -601 430 -432 -1158 458 819 -815 -59 115 -1425 -533
3392 -533 847 -505 -238 1146 -363 -1080 329 -268 -1211 824 1170 -538 22 748 -1077 -646 815
3409 815 -464 -99 1328 113 -1185 469 515 -809 425 1196 -310 -23 1259 -460 -929 925 330
3426 330 -346 878 828 -877 366 789 -861 483 1498 -109 -110 1199 68 -594 1203 210 -379 1421
3444 1421 681 -859 295 836 -829 8 1440 144 -310 1460 -23 -830 679 475 -258 850 1069
3461 1069 -834 -510 893 -623 -498 1566 486 -513 684 -236 -1254 -30 905 -804 308 942
3477I42j419l23J081j167j6J901n98j178J046k28k130J626Q60o06K33Q34j527
3494f69n81J485p14o96J898o61r89Q84r9j708J199J233j147L39J130j492r21J537
3512B8o51o77K043N2j794P12N11j406K65J408o12k49J503j019j721J682J21j258
3530a062J413L92j506O99Q55k080K02K172o24q84J424j113j181J272K43j218J194
3547A98J380j710J34P52j475l37K155q16p69J512k54j444L78N66j053Q89J275
3564A381j325l92J254r76q87J659J56j304J294M10k044O49Q85j659P91J547j123
3581C16n09J225p14j615J726N55j389J222M95j903J54Q35p05J30J644r53q86P95
3599D23m29j318J495N44j123Q87O46j913k05J521q85j99J742n25j117P41j96j437
$$ plain form
3477 942 -477 -800 281 -886 -902 999 401 -777 269 41 -2089 -463 397 -209 24 858 -669
3494 -669 -1250 235 -479 -1175 723 62 -927 -43 -142 -1850 -651 582 -565 -226 904 -588 -1509 28
3512 28 -623 -1300 743 795 -999 -287 224 -1182 -917 491 -121 -370 1133 114 -1607 75 196 -1062
3530 -1062 351 743 -763 -64 791 -1289 -1087 1085 461 -423 1001 -112 -1293 -21 222 -996 198
3547 198 1578 -132 2 754 -721 -1058 1097 281 -488 1024 770 -674 -296 270 -783 106 1381
3564 1381 56 -336 918 -58 -945 714 870 -434 860 1270 -774 -125 760 -899 -108 1439 316
3581 316 -193 1032 318 -1297 429 984 -405 817 1312 -591 -437 398 -307 -177 1467 514 -372 423
3599 423 -6 -1324 171 715 -408 479 1125 -788 -993 528 -357 -556 1186 661 -456 285 89 -1348
3617a348J290J112j243j67J063j068r49J593l79n05J417k30j843J137N25j693
3633a288Q78J151j042j85J846j653j377J918k86r01J401K41j284P29O19j959L14
3650h78J414j58o40J295q38j451J404q0j142J439R75j541j42O63j007j79J895
3667A029n54q66J373l06j864J081N99j267J180J009j699OQ41p25p73J602M67j171
3685c8P35k6j608J098P60j414O55J312j005q99J207j007p37J737K09j360R68N01
3703A088j466k6R32p15M29J478j107j370J164k09j006J192P09j637J239M35j667
3720e37m25J722q45m09J474m74j107J073m51j300J336R58r63m63J303j556k22
3737h86J158o39o93K079j29j898P53M77j188M84J504j534j15J558j494p36J365
$$ plain form
3617 -1348 -58 1054 -189 -356 707 -361 -1310 283 -96 -601 816 586 -1257 -120 405 -1288
3633 -1288 -410 741 -301 -486 1360 -293 -1670 248 -38 -939 462 703 -581 148 767 -1192 -878
3650 -878 536 378 -262 1033 195 -1256 148 68 -1074 365 1340 -201 -343 320 -687 -866 1029
3667 1029 475 -391 982 676 -1188 -107 492 -775 405 1414 -285 -279 562 -163 -936 666 1133 -38
3685 -38 697 671 -937 161 921 -493 162 1474 469 -430 777 -230 -967 770 979 -381 587 1088
3703 1088 -378 -404 528 -187 242 1720 613 -757 407 198 -808 384 1093 -544 695 1130 -537
3720 -537 -962 760 -85 -494 980 506 -601 472 21 -1279 57 1015 52 -411 892 -664 -886
3737 -886 272 -367 -1060 1019 890 -1008 -255 222 -966 -482 1022 -512 -627 931 -563 -1299 66
3754F6n0p08J176J84j666N38J048j895K88J811r70j29P44o18j044J233n4j056
3772a102J166J035j500j81O83r31R2J607p69p29J150o21j080O58Q56r65J052N79
3790A000j460l0P48p52n17J732k8o28Q76m98j763J002J102j313L45J350j088n02
3808d24P65q60l36J568J87j270R80J34j306L30P77o41N03R46j245r26J341l12
3826B11j034J243N74j173M00O78j851L69J212m91k15J402o85j334J229l85j116
3843i66J012J375j510N45M39r43l22J423j092n28J465k54j224O42L97j495P17
3860c19J247j054M8J186j515n15J096K79p53R58K55k025J001K44j102M18J465
3877I14n75p70Q79o26j269J242K63p06J103N89j673OQ76j043J70J636j338k47
$$ plain form
3754 66 16 -692 484 668 -998 -460 588 -1307 -1019 792 -178 -307 437 -181 -1225 8 -46 -1102
3772 -1102 64 1099 -401 -582 101 -830 -738 869 100 -629 521 -100 -1180 -522 334 -631 421 1000
3790 1000 -460 -490 258 -494 -1011 721 693 65 941 443 -1320 -318 784 -529 -184 1166 78 -424
3808 -424 341 -519 -855 713 900 -370 610 744 -562 -232 545 -96 407 1353 108 -818 523 211
3826 211 -823 420 994 -179 221 899 -952 -583 629 138 -77 1325 640 -694 535 150 -966
3843 -966 46 1421 -89 456 895 -48 -370 1053 -39 -567 898 644 -580 62 459 -1036 -319
3860 -319 928 -126 -78 1108 -407 -922 174 453 -300 658 913 -1112 -111 133 -969 -551 914
3877 914 339 -431 448 -178 -1447 -205 58 -648 455 1044 -629 -623 253 -790 -620 1016 -322 -569
3895e69J070m98j348J207M26m99L64J023j915p1J248j083r7J499k96q03R94o41
3913A1j154O85J025j183O89Q62j132l18O55o51l15J843l68j085M96M09j188L06
3931d13P50o30J66J456j244j242J842m87q54J426jj145Q53R0j738L04J691p10
3949A14k8P27o09r66J067k42j016J142O96j070J67P73j312j1R79r16o9J461n87
3968C00j405R01L16j023O57Q88r81R8J030j313n30J330l88k78J317n40j583R57
3986b47L49j353O13J431j077J42P46j476q32J838P8r03J087L56j551K05O78j184
4004a100M41J694j075q34J196k93j317J028O48q48O60N31j491J54J199j148p8
4021f33J693o27j047J058o14q75Q55J024j347P98O90j148m63J249r04m12J773
$$ plain form
3895 -569 501 3 -1345 -138 288 -211 153 1176 -739 -810 438 -645 -742 757 461 -342 652 11
3913 11 -1143 -458 567 -616 73 935 -197 -515 140 -511 -826 1017 649 -436 60 469 -719 -413
3931 -413 337 -293 -127 1329 85 -1157 685 198 -656 770 769 -376 477 567 -1171 -867 824 114
3949 114 86 813 204 -762 305 63 -953 189 885 -185 -18 755 -557 -568 411 -505 -574 887 300
3968 300 -1105 -204 112 -911 -254 634 -347 -249 781 -532 -1062 268 -120 -398 919 379 -1204 -247
3986 -247 102 -1251 -638 793 -284 -142 604 -872 -1704 134 212 -691 396 752 -799 -594 84 -1100
4004 -1100 -659 1035 -40 -874 322 29 -1288 -260 388 -460 200 731 -760 -606 593 -555 -633
4021 -633 1060 433 -614 444 -170 -1045 -190 834 -513 285 975 -173 -636 613 -291 -703 1070
4038A070k67j425J032J99j334R35N30j030N02J007j347m32O56p7o45J449k15r40
4056c32O06M41j832M31J422o09k85J243o69q20N25j03p88J225O11j409M22N64
4074F43j148J11J094n61m10J474o47j319P39L30q40J054Q78j453j53R21j042p37
4092a066J467K6n72Q25j50j549J152K24j305Q46J032q70m12O92p18j007J766M5
4110D26r98J159j4j308M99L26p93M58Q65n04q95J238o37j009J390J15r73J058
4128D03L34j856P28Q58j133J56J215n00r61J108n41r88R50P57j021O26O90j456
4146f31l50J189q79j81J659k01j570J371k06j109R14N37q80K78J166j265o53J476
4164F65n29o18J112N5j045O51J38j398M68J525j031j16J088p51r95J294m14o92
$$ plain form
4038 1070 803 -622 410 609 -725 210 740 -290 212 1219 -128 -560 96 19 -626 823 608 -332
4056 -332 274 715 -1117 -686 736 127 -158 1085 416 -404 121 18 -770 455 1066 -343 79 643
4074 643 -505 -394 700 139 -271 1203 556 -763 -24 306 -534 520 1398 -55 -208 713 -329 -1066
4092 -1066 401 427 -145 680 530 -1019 133 357 -948 -102 930 60 -352 340 -378 -1385 381 426
4110 426 -572 587 573 -735 -236 90 -703 -245 620 116 -779 459 -178 -1187 203 318 -655 403
4128 403 737 -1119 -391 467 -666 -510 705 205 -756 352 -189 -1177 -227 530 -491 135 825 -631
4146 -631 -981 208 -671 -852 807 606 -964 407 201 -908 6 543 -337 -59 1107 -158 -811 665
4164 665 136 -482 630 685 -360 291 429 -969 -501 1024 -7 -123 965 214 -781 513 99 -593
4182e93J192O84j493K38L88j142L82J221p39j43J040q75j142J217j06o24J046
4199E51M16j589Q7R26o30n88J352j76m62J010q95q61Q17O57j186N19J387j153
4217A82m54O83r11n10J215O8r34J158j86j146O52N06j125O47J239r29o09P89l54
4236a9j010J332j47m83N58M51j492OJ177j046J27J356p96o94J060n40j026J084
4254a02P12j029N29P20j664K26J216j214N9J134o2j346J138m17p27O67R26j011
4272b45L43Q74j371o07J120j84p52J470m4r39L21J97r09L77R45p19j54J375j417
4291c19o25J431k04j185J291L62j362N01O02j037L63R19p85j38J041m90j042R75
4309B98n6n03O99M16j458M96R93j110j95J035l51m44J050m80j348J051P48j397
$$ plain form
4182 -593 599 1283 -210 28 416 -726 -344 877 138 -5 1035 160 -982 235 129 -495 551
4199 551 967 -622 -535 391 -239 -827 525 349 -113 897 2 -859 -42 615 -571 -52 1335 182
4217 182 -272 411 -500 -1010 205 273 -661 497 311 -835 -183 323 -802 -155 1084 155 -454 335 -19
4236 -19 -1029 303 156 -327 231 682 -810 -804 373 -673 -546 810 14 -680 380 -160 -1186 -102
4254 -102 610 -419 110 830 -834 -608 608 -606 -547 587 525 -821 317 -100 -827 -160 766 -245
4272 -245 98 972 -399 -1006 114 -70 -822 648 604 -335 -14 183 -726 -349 596 -123 -277 1098 -319
4291 -319 -944 487 283 -902 389 751 -611 -110 492 -545 -182 737 -48 -186 855 365 -677 298
4309 298 242 -261 438 854 -604 -108 885 -225 -420 615 264 -180 870 390 -958 93 841 -556
4327e56O71J007j319o5P49j122J0J406j51j142Q78L10j169L99O39j093N05J313
4345A270j302p03J435p05o51J167k08q16J015j06j145L72N91p01l1J404r16n12
4363e42R41q45o21J214L32j050K61J147j496l8J027j068j00J638o37p83P99j49
4381C0q66Q39M49q76O7J295j408n71J018J18j035J341k73j158J154r7q80N83Q99
4400F29j121K45Q73p16r96J053j50o14J208J07j437N33P25r35L76Q97p62l35J096
4419F76l02j380J034K98q29Q76J59j049N84N17r19PJ141o22m29J001n53r90J209
4438D29L36j122N83P69q87l84N80n21k60J438m68r97J345m17j143J114J7m01J85
4457A96P81j083m13J455r99o01J182j15o12Q05l57j058L54R08p02J88J145r93
$$ plain form
4327 -556 115 1122 -197 -262 487 -635 -625 781 630 -512 366 676 -493 -94 545 -548 -43 1270
4345 1270 -32 -735 700 -5 -656 511 303 -513 502 396 -749 -377 214 -487 -518 886 -30 -542
4363 -542 399 -446 -1067 147 479 -571 -310 837 -659 -697 330 -738 -838 800 163 -620 179 30
4381 30 -836 3 452 -424 -357 938 -470 -1041 -23 95 -940 401 128 -1030 124 27 -853 -270 629
4400 629 -492 -247 626 -90 -1086 -33 -183 -797 411 518 -919 -386 339 -596 -220 677 -85 -420 676
4419 676 374 -1006 28 326 -503 373 532 -517 67 584 -335 -328 813 191 -238 763 210 -780 429
4438 429 765 -357 226 995 108 -276 304 -217 -477 961 493 -504 841 424 -719 395 412 11 196
4457 196 977 -106 -519 936 -63 -664 518 403 -209 596 239 -819 -465 443 -259 -71 1074 81
4475H1o01J235o64p82J022L12o55K37K15j006K26R33p93k87J453p16j315J353
4493B48m33p23J104N79j198J55J100j273j75J007l50m49J008l52r29P74L25j289
4511h71Q08R28j201J82P60q68m22J249l73m07Q61k22r98L90M42o31L86P93j142
4530c36R6J044q53p93J197Or65J032l7p60L48N15n87l13J224n91k82R04n98q88
4550f37J013J83j359Q49P67j038m6N29n91K89Q71l83r35O07j3j092J384M1o79
4569b40O7J100j189l36J032p37l35J166p0j206R60L55j086J42P52p03J49J002
4587H23q77m66J001l96q02Q97M12j296N79N42r83j7J163p83k0O94m00q46R83l9
4607A69p34Q15K28j222P88J82n80j83P97l63o47J360q10n71R47K13j140M28O92
$$ plain form
4475 81 -520 715 51 -731 291 603 -52 185 400 -606 -380 553 -240 -527 926 210 -1105 248
4493 248 -185 -908 196 775 -423 -268 832 -441 -616 391 41 -408 600 248 -681 93 418 -871
4511 -871 -63 865 -336 -154 606 -262 -684 565 192 -215 646 424 -574 -184 258 -373 13 806 -336
4530 -336 -240 804 -49 -842 355 361 -604 428 391 -369 -21 494 -93 -406 818 227 -55 849 251 -637
4550 -637 376 559 -800 49 816 -222 -268 261 -330 -41 830 447 -488 119 106 -986 398 439 -240
4569 -240 -173 927 -262 -598 434 -303 -638 528 458 -748 212 567 -519 -377 375 -328 -179 823
4587 823 -54 -520 481 85 -717 180 592 -704 -125 417 -566 -583 580 -203 -223 471 71 -775 208 169
4607 169 -565 250 478 -744 44 226 -354 -537 260 -103 -750 610 -200 -771 176 389 -751 -323 369
4626C69q21J83P61r00M1P41m44n92Q99j06p27O06L28p18M67M10o67l27R58o79
4646b18l21P62k44j75M63j1n70M00N16j006R2J065o53k81O91l98n28O92K20r02
4666d06N61L02p95M7R26j026L02O95l11o23O92j86p21R88M50j216N51N18j270
4685e22L41O28o68l09R53j93o37R74r8r78O26P44r58J68O32p26k75O67n02n34
4705f67J031Q5p01L44M30j106M90N57m44l63Q11n88m42R47k06o54Q55j75p48K31
4725c13N77p01l21J350q28l20J122l88o60O30J28q99K32R93q14j1Q54p22o59J012
4745B62j82o83P52J53r61N29M89r59P57N29j125o8R66l64o86Q36J12q93P64M66
4765F94j248K94R34r73K32N32m25o05J065m87o90R81N8p50M14L54p86K75L04n45
$$ plain form
4626 369 -452 -269 492 -408 -367 374 -70 -662 237 131 -596 10 338 -380 87 497 -170 -497 461 -218
4646 -218 -539 223 -21 -196 267 256 -314 86 602 -404 -312 753 100 -181 510 112 -416 276 496 -406
4666 -406 155 457 -338 -291 635 -391 -89 606 295 -328 364 178 -543 445 895 -321 230 748 -522
4685 -522 -181 447 -221 -530 423 230 -407 567 469 -509 117 861 -97 71 703 -23 -298 369 -133 -667
4705 -667 364 449 -252 92 522 -584 -94 463 19 -344 467 -121 -563 384 178 -476 379 204 -544 -313
4725 -313 264 -437 -758 592 -236 -556 566 178 -482 148 276 -623 -391 602 -212 -223 631 -91 -750 262
4745 262 80 -603 149 302 -659 -130 359 -600 157 686 -439 -507 459 95 -591 245 357 -536 228 694
4765 694 -554 -260 674 -299 -67 465 40 -565 500 13 -677 304 362 -388 26 380 -406 -131 173 -372
4785c72j7P93m51j65O58oq85O88L09q64J96R23r83j93Q38n32o6M81j14j46J81
4806B73M39j399N34R70p86j73P98n83j92O00J3q45Q38P9j006P83J13r95M86O98
4826F45j087K52N33m14l75Q01O6q31P64L1r03N06K96p61N06M41m13o15R70l38
4846G4o58Q52q5r77N48N83o06L86K69p63N0P83n72m01N83J88r32Q93O6o42K97
4867f4M84r09j8Q81m69m78R20m64m29N82M9p52M40M76m06P7M31m82j48O59n32
4888a52m21P02j08o73Q25Qk24n02J008p40j25J026n65m59O47l67m55O50K94p31
4908c62M40L67n26l75Q22l53n2O93l44o66O94J45r83M94O78r69K08J017q71k42
4928a85N10k33n38J146l11q25J101l12p22N60N14q96K55N59o92k38J016m58n32
$$ plain form
4785 -372 -389 404 -47 -212 446 440 -445 243 552 -312 -116 807 -176 -369 469 -63 -129 352 238 92 273
4806 273 712 -687 -153 817 31 -142 656 73 -119 481 494 -351 487 566 -440 343 456 -539 -53 645
4826 645 -442 -190 343 -71 -446 355 421 -410 354 385 -518 -12 284 -477 29 470 57 -558 412 74
4846 74 -584 268 183 -794 -246 337 -269 117 386 -377 -327 456 -116 -517 66 254 -678 215 281 -361 -64
4867 -64 420 -489 -507 374 -95 -573 347 -117 -546 36 85 -667 -227 249 -157 -80 351 -131 -279 380 -152
4888 -152 -573 129 21 -652 173 181 -43 -545 463 -277 -402 624 59 -400 247 -120 -575 75 369 -362
4908 -362 78 445 -81 -456 366 13 -39 654 310 -356 338 483 -500 -6 672 -297 -89 928 57 -185
4928 -185 325 92 -446 700 389 -436 665 353 -369 191 705 -191 64 623 -69 -307 709 251 -281
4947b81N34K66q48M76N43p91k57R74o71j78O27n64k79J074o39n07Q03j21o35O31
4967A57L00o17L9P69n23p12O85L9n57N66M74q35J52O74p58n7M08n48o9N85j81
4988il16O28rr62L56O13j039O21Q74j262J81O40n82l24O68K07q62R01Pq23K34
5009b58O17p05k29Q63n37j91P88j27p38N73q7o21P35K36n07p7L03j27m78Q88m49
5030a28l54P66Ko76M22M08r12M69N59q81N9O14n20k76Q08k62m48O70n5n91M25
5051I9O43q23j66Q64l25n70P80m14m57O48K1p06M88P08q82J46N43l69q02J320
5071G46o61k59M54j92o39Q18L22p88J66N62n84j52Q25o61k48O14m04j31M36j8
5091B06l72%O24o71m7Q25n61l07N46q2n80M58j23m23M13M26q64O8J230j063k60
$$ plain form
4947 -281 253 519 -329 147 690 -101 -358 616 -55 -233 394 -170 -449 625 -14 -521 282 161 -474 157
4967 157 457 -160 -121 648 125 -587 98 137 -420 146 620 -215 -63 611 -147 -204 204 -344 -413 172 -9
4988 -9 -325 303 294 -668 -312 301 -738 -117 757 -505 -324 316 -266 -590 78 285 -577 324 331 -492 -258
5009 -258 359 -346 -575 288 -249 -440 348 221 -517 56 -31 -652 83 319 -188 -265 38 -89 -567 321 -128
5030 -128 -482 284 286 -390 32 440 -472 -3 556 -325 -266 348 -172 -448 360 98 -350 320 265 -326 99
5051 99 742 -81 -247 617 292 -278 502 88 -369 279 300 -406 82 790 -92 54 597 228 -574 746
5071 746 85 -174 280 88 -551 267 589 -199 -33 529 -55 -207 618 -43 -291 323 -81 -212 224 206
5091 206 -166 -166 458 -213 -260 565 4 -303 243 161 -419 39 -84 -507 -94 332 -532 -464 766 -297 -557
5112e57J028o03m72R28j26q93Q17o8m50K72M73p13r5P66n80R6L24P0p65Q47l06
5133go04L59M12n06R0M42k31n47J096o45k52O46k52n40O07Q7o10M52K24n00K10
5154f9N23m47m31Q14l00m97N87j55m38P15j84n09J89O94o51m5M65j46o47P57j95
5175C0l32L01N85j012K14Q43q27J36L84j24l47N54j91m19K43K86n54M31J24m15
5195i0M2K82j84l25O72k52j7N08k33r79M71O17p47o1R43o59m03R60l30p33P52
5216B34j59o68P34nm30J81L00p87M08J142j110l04N59j45n23N06L19o09K82L65
5236B90p03L2P37m38j85P38k90o56N59j38l97N38O0n10N8O69o62m2Q51q18R5N15
5258C03l47o19N02K23p55M04O88q30L08N09o35k81Q14k49j93M57J37o77K04L53
$$ plain form
5112 -557 471 -132 -604 324 198 -695 122 54 -396 -124 349 -364 -459 307 -273 -177 147 217 -548 299 -7
5133 -7 -611 -252 160 -346 -256 186 -45 -592 504 -141 -393 253 1 -539 68 155 -455 -3 221 -279 -69
5154 -69 454 7 -424 390 90 -407 180 25 -413 302 118 -391 -202 492 -159 -204 261 115 -532 225 30
5175 30 -302 -1 584 -428 -214 629 -198 -62 322 198 -149 405 214 -205 38 324 -230 201 325 -90
5195 -90 -48 234 50 -275 397 145 128 636 403 -576 -105 512 -235 -296 647 -12 -415 545 215 -518 234
5216 234 75 -593 141 136 -294 -113 187 -600 -192 950 -160 -464 95 -50 -573 -67 252 -357 -75 290
5236 290 -413 -381 356 -82 -267 471 181 -475 84 -54 -451 87 147 -363 -305 364 -298 -340 511 -307 -212 303
5258 303 -44 -663 -161 62 -693 -289 399 -431 -123 386 -249 -530 284 35 -158 299 436 -241 -37 316
5278C16l88p1M57o29RP20m85l22P37k02m95L96N95p80L43K33o59n9P62m18l20
5299b60O31j58n56N72K07o58L22K62m58k7N26l01k68N77p2m21N19j72o69J95M30
5320B21j31k07N03l01o8L04o17J61L31j49k91L47K66j013O44L46q97N52M35k35
5340B01n19O55m29l93Q15k74k80L93n5m83K88M95l24n58Q58m25k36L46j03m75
5360e03M09M46p52L54K56n12k21P55m63n5O48m34o34O82K0m40N82L29n09P2J39
5381A69m02n36Q31k94j82O40R6m37L9K74o38j1R15n13j06N79k74o80P67k61n42
5402e66P63K56l88l60O71p13K75O25p76m26Q84j21p05O32L27m96N11K24q24J94
5422a3L47m64oO82k84p05P03l09l62N91J20n43J19P69p14J29M28m72k69N74k23
$$ plain form
5278 316 -72 -143 314 -315 -306 414 -71 -393 344 142 -353 43 638 -142 201 434 -225 -284 478 60 -260
5299 -260 371 213 -343 229 436 -222 100 362 -96 -123 403 102 -166 411 339 -82 437 265 -404 -209 221
5320 221 90 -117 386 85 17 321 -296 -135 196 47 -244 103 369 -644 0 346 -551 1 436 201
5340 201 -318 337 -92 -485 330 56 -224 169 114 -369 -81 414 90 -468 390 -35 -271 75 -28 -503
5360 -503 -94 352 -400 -46 210 -302 -523 232 -231 -286 362 -72 -706 -24 -4 -444 138 467 -42 30 169
5381 169 -233 -769 62 -232 -414 226 322 -115 -76 198 -440 -451 464 -49 -155 424 150 -530 237 -24 -566
5402 -566 197 453 65 -295 376 -337 -62 563 -213 -639 245 124 -581 51 378 -118 393 617 -207 -13
5422 -13 334 -130 -136 546 262 -443 260 -49 -411 180 300 -243 -124 645 -69 60 488 16 -253 321 98
5443I8l43L99K1o67M48L07m88M9O91o88k82P24l35k52K79J88l95N73n6n47n3N61
5465B32qm08N07o88qL45J28n35M65K01l58Q5K48l43j81O32o09r9J013n71q12R56
5487A92k6q41O63L61q19K82L79n68k69Q50l67k83O49o7p69L27P11r77L52M77k47
5508A0k22N48l91l85Q34j66n10L77K36m39r7M18o63J58Q08n40R4L14n88k98P30
5529B28K05j219Q83L77o71k5O66p17L6L99l92k6O95l93p47Q50L08n71J40l4l72
5550c80L00O84q39J3O93k59n42M91j19r4Q1M33p71L63N05n33l16K65Q2k52J76
5571a9L97l73K85L6m57M52Lp19J63N31l95j74O30m25r1J36J85m31M80L78q23J01
5593a30P66o38k16P19m33k41L85j28n56M63P19r27Q9L94l07l82P58l65m29P29
$$ plain form
5443 98 -245 154 175 -492 -44 263 -225 -176 515 -173 -455 269 -66 -318 -39 149 -246 327 271 -276 -329 232
5465 232 224 -184 323 -365 -373 -28 100 -435 30 231 -127 -42 206 -137 -318 314 -295 -394 619 48 -764 192
5487 192 166 -675 -12 349 -470 -188 191 -377 -646 204 -163 -446 203 136 -633 -306 405 -572 -220 257 10
5508 10 -212 336 -55 -440 394 228 -282 95 331 -108 -205 213 -450 -292 516 -24 70 384 -204 -502 228
5529 228 433 -786 97 474 -197 -222 444 -273 -237 162 -230 -256 439 46 -701 149 457 -114 26 -8 -380
5550 -380 -80 604 -235 -222 471 212 -330 161 42 -52 29 462 -309 54 559 26 -290 -25 57 -195 -19
5571 -19 378 5 290 326 -131 321 324 -395 -232 299 -96 -270 360 -65 -156 -20 165 -266 214 592 -231 -130
5593 -130 636 -2 -218 501 68 -173 212 84 -472 -9 710 -217 -128 266 -41 -423 335 -30 -459 270
5613B70P7p99L57J97m89L82j09l52K68M78m40k47P75k71n87P59k49m90L17N34
5633C81o67J75N28n44J52M3m2m91L25J57l55L43L17l25l30N70n75K04K86m4l74
5654b66L92o5k32J19O59o92j73N86m81j1O76o04r5N62k66l23L52J75o63K97K57
5675B04j86K67n3j79m41O96j38k41M3M18p74M96L28o29M36K71m74q8M01l2r08
5696e83Q91j10m19O11J79p43L52K26n93N3O20k84n42R42p72j93N00p1n04O11K34
5717D05o93K0M93m90k14P85k99m12P87j87l09Q1M10p01K77N16o98J02J31j42M9
5738h9M02l83l10O28l55l63O03m7k73j31O55l94p9L47m26m74R35j30l94L29K11
5759B62j045P11L45o57K08N78m25k99O18k54m53L96K48j89L1K99m29j64N44l45
$$ plain form
5613 270 347 -452 -95 102 -387 -5 -114 -466 -198 280 -160 -407 368 97 -490 269 20 -470 -153 381
5633 381 -286 -111 417 -127 25 68 26 -465 -140 17 -338 5 322 -3 -333 237 -338 -134 152 108 -266
5654 -266 126 61 -171 -52 607 -85 -258 328 -153 -164 512 -92 -187 375 109 -214 138 313 -350 -53 204
5675 204 18 285 232 53 -388 308 170 -71 -28 390 -384 112 440 -189 247 518 44 -44 357 325 -583
5696 -583 308 198 -221 390 569 -174 178 404 -189 -136 484 200 -342 600 -172 -365 135 64 -440 171 405
5717 405 -288 -268 225 -265 -479 306 7 -405 382 195 -114 -33 377 -324 -47 469 -229 -127 4 -138 -89
5738 -89 313 -70 -380 248 -107 -470 133 86 -187 -318 337 -57 -136 211 -215 -689 246 116 -278 51 262
5759 262 -783 -72 273 -384 -176 402 -23 -322 296 42 -411 -15 233 44 75 374 -55 -219 325 -20
5779b0k00R55n73n73M88n9k04K52J02m24N39J26o46J12J78j3k22O10k52l84R46
5800G38m44p11N12M64m54j83N09o05l7M91j43l95N42K03m50K69K90p47j09N80
5820C20l55k01N38m64j53N36l9m78O82n0o22K41K65p15K49P00l19k13M15j57p45
5841e65O55p2l70K66M76o83n8Q76n86k34P01j9r67Q57j65p87Q14J80m81L00L13
5862D51p21J20M04m06p5K71N7j28K89k58n95N51K28n33K96M94p77l4M18J75o27
5883d00L93K43n97N76R0n55L17L00m50k20N33o40J09M58M2n35L06K38n08L40K14
5904B54j63l86Q49n18j99M68l97o9K30J59n39L65L25l75L0L72m79k41O52j39m44
5925b45O74j38l01K29J09n14K19L99o16j80O47m58N0L04jm96N36J35o70J94N12
$$ plain form
5779 -20 -220 735 162 -411 77 18 -186 66 168 -256 283 409 -237 -125 53 40 -182 428 176 -208 738
5800 738 294 -417 95 559 105 -78 431 -174 -211 280 137 -258 284 487 37 306 596 -151 -260 320
5820 320 -35 -236 302 -162 -315 221 182 -296 386 336 -286 -45 220 -495 -246 454 135 -78 337 180 -565
5841 -565 90 18 -352 -86 390 -293 -351 525 -61 -295 406 387 -580 277 112 -675 139 319 -162 138 451
5862 451 -270 -150 254 -152 -227 44 101 -27 262 4 -591 -40 188 -345 -49 445 -332 -366 52 227 -400
5883 -400 -7 236 -361 215 305 -250 67 367 -83 -303 230 -410 -301 157 199 -336 -30 208 -300 40 254
5904 254 91 -295 554 36 -163 305 -92 -161 69 228 -311 54 379 4 34 406 -73 -314 338 199 -245
5925 -245 429 291 -10 219 328 -186 33 432 -184 -364 283 -175 -125 179 178 -318 218 353 -317 -123 389
5946C89q34L00R00p00k23J97N6n98O68j5m85P13k26l56K67J52l00l02Q96j90m03
5967i4M41j46k80K83l0m43M57j34k48k01O42l61l44P32k68k03M78j85n12L97L32
5988C13o71l1P78n79N3L28k47n06M83K55o26L18M36m92K49L18n21k27O37l06m42
6009d80O37j86o4K59J00n75L86K12o27K9M50K01m56M62j36o55L02J26m14M99L6
6030A06j85K42l8m40K65K50j20m51R09l5m54L8L71p04L65K05n55J80M92m78j86
6051b23N21l03r3N03j78p90N66L50o82J89P92m84m19N24j97l39N50j91o1o7L40
6072C08m71K59k20q9L9N69k71l15L23J71p59M68j8m14N93L23n81J95K64n47M0
6093a33N99l43m20N72l46k17M39J91o38L95J04l58k32O90n28k47P37l6n97L00
$$ plain form
5946 389 -445 -145 755 55 -168 29 85 -513 155 140 -345 368 142 -214 53 205 -95 -397 499 309 -94
5967 -94 347 201 -79 204 174 -269 188 54 -194 -395 247 -114 -458 274 6 -197 281 96 -416 -19 313
5988 313 -358 -389 389 -190 -137 191 -56 -562 -79 176 -450 -132 304 -188 61 379 -142 -369 268 -38 -480
6009 -480 157 -29 -93 166 266 -309 77 289 -338 -309 141 342 -114 348 212 -443 -141 -15 -429 70 106
6030 106 -79 163 125 -315 -50 200 80 -371 538 503 49 87 458 -246 119 324 -231 -51 441 -37 -223
6051 -223 298 -5 -98 405 227 -563 3 353 -329 -140 652 168 -251 273 76 -263 287 96 35 -32 308
6072 308 -163 96 -124 -213 -174 395 124 -191 132 303 -456 12 -6 -420 173 496 -85 110 374 -173 -133
6093 -133 466 123 -297 275 -71 -288 151 342 -296 99 203 -155 -387 303 -225 -472 265 229 -368 -68
6113f8k2j33j47N83m54J38M16l49m22M66J56n97O40R1o73L11J45p68N52L06l73
6134b02J40K26l25l4L02l9k66j80P78q45M69J51m07j86P39K6p62P53m39l59O61
6155B01J88m25J13M54n78j11N85m36o1K43N1n60O05K38p23K80L47n89N36j38k43
6176b3k5L29k42m80O90j40n7J56K95q25K72N42p61K89L35l19m13P08j96k42K31
6197A24J07l69Q4M41m95q8L53pj77M73k07l37J57J11p18R37j79k93P2J74o2o48
6219e47M86j84o9O33p1m55M04L5m97j26N27l94O3K88j61j05M17m39m41P05K80
6240C49m14r5K35n53P1O03l21j59L19l28J56L50r5k86K24k7%J6J6m58J41K89j09
6263g6LL79l64R9L12k99l98O39j5m29LK90l74j27L90o5l56R34j59p01M95L3l60
$$ plain form
6113 -68 -90 -223 -370 213 -241 -103 313 -36 -458 8 164 -433 207 298 -375 -64 81 -687 -135 171 -202
6134 -202 -62 164 -161 -195 107 68 -198 -378 400 -445 24 175 -232 -418 321 347 -415 338 -101 -460 201
6155 201 389 -36 77 531 -47 -158 427 -9 -70 173 224 -336 269 507 -216 64 411 -178 358 220 -23
6176 -23 -48 281 39 -441 249 109 52 208 503 -322 -50 492 -269 20 355 36 -377 331 135 -107 124
6197 124 231 -138 -54 387 -108 -196 157 150 -27 446 239 -98 59 170 -548 389 210 -83 -11 163 101 -547
6219 -547 -61 -245 -314 319 248 -207 197 232 -265 -391 136 -258 -195 93 -68 -173 244 -195 -636 69 349
6240 349 -65 -160 75 -478 -407 196 -125 -284 35 -293 -137 213 118 -168 56 29 29 45 61 -397 -256 33 -76
6263 -76 -73 306 -58 41 353 54 -344 295 280 -149 -146 144 -230 -357 33 -32 -388 546 387 -314 181 214 -146
6286a46J85N38o55n8L93k18p5M96m63j6o5N93r49N17P4l45K16M09j55k76J90l74
6308a84r7L78J47m27L65L16n83l1M96n43j5P40l39l26L79l46R6l08M27l24K29
6329E0K65o00L07K38j89l68M01J16m09K90k14l50L77J48j33K14M55r13jO40m81
6350a57j76N10j1k79J63l1l12L01J02q1j22P3J07m62N82n3p51N03M6l82N02N1
6372A23m19L05L82l50J5n2J15o36O10R1l57K07K54l07q2j83L01o8K17Mm29N05
6394B46j63k41J44K53o75K03O69n45N1K16n88L71K54r7l54N24l6l42K33J37l35
6415g5J63M45o78q4M42j74q1K5O0k73N26o4p01L23N72l99j70M68Rq07O56q1k93
6438a91N90K75r50L71L40r58N41R9k65j8L15j29p2K83k20m33M78J84n57L69L23
$$ plain form
6286 -146 39 577 -78 -136 257 39 -36 460 -3 -19 -84 509 -440 77 151 -194 22 431 276 0 190 -184
6308 -184 -281 97 244 -183 182 498 -85 -116 380 -163 -178 562 223 -103 276 -70 26 -282 145 -179 50
6329 50 315 -285 22 260 71 -297 104 220 -189 101 -113 -463 -86 62 -71 143 598 -315 -316 324 -157
6350 -157 -333 177 166 -113 50 19 -293 8 110 29 -93 -20 87 -375 207 154 -597 -94 -48 -430 72 123
6372 123 -296 9 391 41 56 4 119 -517 93 184 -173 34 288 -19 -101 -284 17 -51 166 170 -259 246
6394 246 83 -158 -14 239 -436 -233 436 -109 -58 158 -430 -59 195 98 -256 268 232 -110 123 260 -75
6415 -75 88 533 -145 -229 213 39 -42 -17 43 -230 296 232 -469 -146 426 27 -143 325 334 -473 183 102 -191
6438 -191 399 674 -276 95 435 -523 18 117 -148 -166 149 20 -52 231 11 -422 56 240 -317 52 375
6459C75l06n1L9p3k25O18l85l42N00n0l12n8N50m38J8K30j4k15M49j25l32J56
6481IJ5m49N79l7k18k83N65j81l70N90l88j63O44j91l05L41l8m92J28M58k46k70
6503c02O19l64k78O35j41l02L5K77k27j58N31l90K02M8j59l14N49l73k48N30j40
6524C0m72O10q9l30N2J95k8j86K01L3l2JK11l47L90K86n38m80P55m27K95K68l99
6547ak27M30L1m27M3K53l02L34R2k49k00L57k12k07K76J06k72J9J59j94J50K95
6569B54l05j01L14l91P2N23m55j93K87K77m32M49j81p5J41J2j99k25K37j5k81
6590b87M50o0m51K83L50n49Q8O48q65M90L05o26O1M28l93K3K32p0l22L16k92l57
6612e98N64P3k88K25K34l03J10K69l53j90J56O1k52L88J05j86k02M09m76o7J82
$$ plain form
6459 375 69 18 57 -16 -241 377 -8 -350 150 100 -212 -270 280 -158 -140 90 76 -139 310 185 -147 9
6481 9 24 -425 154 117 -101 -384 181 0 -370 220 -168 -331 313 122 -183 158 120 -372 -244 214 -32 -302
6503 -302 317 -47 -325 310 169 -133 -98 179 -48 -206 325 -65 137 185 26 -288 261 -112 -360 170 30
6524 30 -442 168 79 -251 -199 -4 -32 -218 -17 16 -16 -15 196 -151 239 525 -13 -493 262 -165 130 398 -1
6547 -1 -228 202 233 -194 -151 102 -200 134 226 -23 -223 134 -78 -285 -9 97 -175 -156 3 -191 -41 254
6569 254 -51 -152 162 -229 -157 366 -89 -282 5 282 -150 299 118 43 184 196 -3 -228 9 -6 -287
6590 -287 163 103 -348 -65 285 -264 -176 472 -393 97 402 -224 -163 265 -128 -105 127 57 -265 51 -241 -598
6612 -598 -34 39 -249 -24 210 -93 17 286 -67 -257 -101 -40 -292 96 201 15 -187 222 -254 -321 -139
6633a39Kk26M72o4m33J98K71k96J89J58r7l02M52O8o20L55K29m08J05J55l09J18
6655a22K88j38n9N47m68k18N29l83j99L73J17l46K50L96p02k2M46j36k35M73l02
6676H9j48J88J90n35J76K89n72O53k36j59pK88J80n89O77m05l62J04N21p07K19
6697a46M42r9k35J68n29L47L18j96l83O19j49m78N29k20k61K60J51j59K2L29l97
6718f7O6J39J6n25N11k4m03J25L32p14J35O49m09j27O32n07j64K31K27k87L32
6739A68J25o37K52L68m26q7M04k80j57J33M25p71M18M12m93R9N91q02K51Ko4k38
6761c07O91l32l02M20l25P4m6R6k1j06M39k29J0K53k66r1J80L02p79J91K45j09
6783a2j39L23n09N38R5m00p6R2K49j06J23K69p09J36N71k93o1K14k72o2M23j13
$$ plain form
6633 -139 -137 -363 109 45 -388 -190 81 -215 -26 132 35 -267 185 253 -367 -12 217 -191 -86 69 -240 -122
6655 -122 166 28 -31 516 48 -170 359 -24 -223 150 267 -79 171 567 -135 -157 289 153 -82 391 89
6676 89 -59 129 319 -216 -40 249 -323 330 94 -65 -72 216 396 -193 484 79 -283 -179 342 -365 -146
6697 -146 296 197 -38 130 -399 -52 266 70 -313 306 157 -321 208 -12 -273 -13 138 -21 1 330 -67
6718 -67 -1 138 154 -371 140 116 -287 -162 170 -544 -409 240 -169 -296 336 -171 -335 -104 123 -164 168
6739 168 293 -344 -92 276 -150 -237 167 -113 -270 -137 288 -483 -65 347 -146 -47 544 -258 -7 -5 -69 -307
6761 -307 384 52 -250 170 -155 -81 -127 -31 -52 -158 281 52 62 315 49 -42 138 440 -339 -148 97 -12
6783 -12 -151 172 -337 201 296 -104 -180 -88 161 55 178 447 -262 -126 445 152 91 305 33 -29 394 281
6805B81q37O20lk99L31K05j38k90K62k47p4N27q0m12K22j39k04M41J33n61K75
6826A3L80n72j23J93P0l05M09K39n80R10l84n25N21J24n24M2K07l54J84N69m75
6847A9n43O65J44m69j6K50m60J67K91O1l42M20l28J2J58K08n50K01O8m0l7K67
6869A46n93M12J80p2k56K68m6l08M60l3m85K60M87m74j63L35k57J50M69l95l94
6890c09M41j3Jk41L65m73M30J97m74QL83j16l93M05N4o68N33K56n17K48K73m32
6912d2j53O34n72q0O10k07p15O82J79o35L66L07p45K52J26j95R1L99l71n7K70
6933A44l0k81J22K34m37N54o4j45k38M02l62p1M63l48j14K89J49l12J00Q0m57
6954c22K90M35p76P1L37k41p1M44J7l02J47K76o29M92J06o79K18N34k42l28M02
$$ plain form
6805 281 -556 64 61 -238 93 298 160 -130 132 -115 -189 338 258 -154 68 -71 -275 166 299 -262 13
6826 13 393 -179 -302 -109 -39 -344 65 304 -276 634 250 -275 246 370 -154 -112 95 -259 -75 494 19
6847 19 -524 141 285 -184 -200 50 -410 -243 48 109 -233 187 -141 -129 29 237 -313 -112 -44 -84 -121 146
6869 146 -447 -35 145 73 -183 85 39 -269 191 158 -327 -67 420 -54 -217 118 -139 11 480 85 -309
6890 -309 132 119 120 -121 244 -229 201 398 -76 -68 315 199 -194 211 265 -403 130 386 -131 117 390 -42
6912 -42 -195 439 -133 -213 397 190 -525 157 336 -299 67 374 -371 -119 7 -188 -97 302 -69 -126 144
6933 144 114 -167 -45 189 -248 306 242 97 -141 261 -101 -172 291 -57 -171 118 267 -45 55 135 -322
6954 -322 -32 403 -373 -302 35 -206 -277 167 184 -118 29 305 -324 168 274 -405 -187 347 105 -223 179
6975A79j36l03M00J17q22M34J41O3k1Q7m09J74J52k69k06M91Nk00J50L18n29J93
6997Iq2j6J06R8n15J03K96j41L7K58q5m46K65M28l85k54O15k77j22M85k09m09
7019b41L71J29m99J26L91l99L78q6k01k00K31J16o36N98M4l41M34l42J0j59N51
7040B75l15m7K79j06k13J24L75m36O1j40r7J76N10q20J27L93l3l10N33k60j62
7061h6K84l36KR7L34l12m0m9m5K68J02k51j25K74l03j21M31k1N9j4O1k98kM61
7085C70o02K17L6J13l33L54k55k25J8O04o16J92J64J0p7L4p9k01L89Q2j82L8Q1
7108A32m44K69J58k32O1M12n86L1J58o4l82O94k35j84K01L75l52j33M68n51p1
7129b75L17J02l28N67j87k80R9K80n55j5N59j82m33P17m7n60M11J08m89K85j67
$$ plain form
6975 179 43 -260 140 257 -565 -131 10 73 52 139 -270 -96 56 -213 -419 72 77 -123 27 345 -184 9
6997 9 -73 -89 17 115 -400 -297 -1 -142 -105 153 68 -378 -113 315 -70 -324 291 14 -108 377 168 -241
7019 -241 130 259 -240 -114 277 -122 256 170 -31 -231 0 116 -520 78 122 -219 215 -127 -117 -276 275
7040 275 -40 -87 192 86 -127 -3 372 -64 -3 -143 -240 -64 446 -374 -247 146 113 -197 336 76 -86
7061 -86 198 -138 -136 -39 295 -17 -57 -106 -151 117 219 -32 -157 117 -186 -307 124 103 162 148 209 -89 -91 370
7085 370 -232 -15 21 134 -199 155 -100 -325 -307 297 -319 -127 37 47 -30 4 -75 -276 113 195 13 51 132
7108 132 -312 -43 115 -117 -56 356 -230 -199 -41 -105 -487 207 -28 -212 -11 364 12 -121 347 -204 -275
7129 -275 42 144 -184 383 196 -84 15 295 -260 -275 284 102 -331 386 339 -221 190 298 -191 94 -73
7150g3r3M39M5n01J81K52m03j34N37q4k39J53L47k49k23J63k02m0K64j40k77N55
7172B78p0l56L93j61k83N64j26m96M25K18m93J23J41k69j58O79m64j93L33K0n34
7193d29L26M60p62L33K24k21l72N54q8m79N34r8n3J33K14l89KK99m35J79O3O5
7215F0l23M76j97r2m9K12k93P0q8j5J63K97m25j93K50J52K8j13N73q97M95L61
7237D52p25N9O12j54m12K05p6j99K37L25m76J22J94j05P5n6j52j16L88l58j55
7258c15M25Q1l67L69l72N6OL51k93J87j41Mj90L50k92O2L66k86k25L20K17l22
7280iK25j05j46r9L50r6k09K69J12n30J19K28j19Q9K05n48L89J58k50r7N0J8p8
7303g4M38j86l30M51j25k06j20M56j21l81M29l25o2J47k2j01K08M78p09J40K46
$$ plain form
7150 -73 -166 273 318 -183 -2 250 -153 -287 250 166 -73 80 427 178 -45 118 -84 -124 140 0 -277 278
7172 278 208 -148 245 84 -199 365 239 -257 168 386 -107 16 157 -112 -270 409 -55 -248 85 105 -429
7193 -429 -103 357 -405 -72 152 -69 -441 113 25 -454 80 -18 -71 62 276 -113 -111 188 -247 -68 -5 60
7215 60 -263 213 16 -76 -125 87 -206 -136 -224 -239 -76 221 -204 -397 -147 5 33 -80 493 -404 91 452
7237 452 -273 -214 398 244 -168 37 -39 -238 -1 324 -152 -30 164 59 134 78 -74 -190 198 -160 -315
7258 -315 110 191 -176 193 -179 -123 -117 234 -59 128 -13 -9 -199 151 -141 -79 287 1 -224 96 313 -9
7280 -9 216 111 -35 -134 216 120 -89 180 292 -238 -119 109 -10 79 284 -264 125 283 33 -64 -14 4 -74
7303 -74 364 178 -152 299 174 -32 -152 304 183 -198 231 -94 -156 -9 -31 -132 76 554 -155 -15 231
7324B31o16J95K81p5j27K36K56m30Q3L7l51L87L3j82o9Q0Kn2J32j35j45J08L41
7347B20k99L6O5k12O6M40n29r2O91l65n38O48J72l90J6Q5j35j4R7k97N03O5n37
7370c04J41N94n73pK96qo54M22M74m74J70J02R6j63l1kk99K87K29n20nP29m50
7393E0j35K71l34O1J55k2j93N05m36j05M42o4l88L72k07J2J25R7k42k7K71j67
7415D1j49J89n0q9J39o7q9j99O92o32K57K37k88k84L83Nl06L00k04J23k68L78
7437A19k76j70M94m3k86L02J35k46K44M3m85K52nl50K38K26l57J10M88n48O7L61
7459C13j41m81K40J25l08M3J62m0j94N25l73L8K50j75M5o7QmO7L18m26j76L50
7482I9j31p4K11l30J77N1J28n34J37N25n75L68K68o50K31j1OJ36J74J28n47K36
$$ plain form
7324 231 -385 -190 91 16 -111 125 381 -49 34 71 -280 107 140 -42 -111 -31 -29 -81 51 -84 -229 -121 220
7347 220 -79 -43 22 -190 -124 316 -213 -305 386 21 -517 131 303 -87 -71 14 -121 -135 -38 -335 168 233 -304
7370 -304 -163 431 -142 -149 147 139 -515 -93 381 -93 77 179 275 112 81 79 -220 67 296 -224 -229 500 50
7393 50 -85 186 -148 -87 68 46 -147 358 -78 -183 259 195 -193 179 -28 -16 109 206 -36 -63 208 41
7415 41 -108 81 31 -58 81 14 -75 -274 418 -214 43 280 -8 -292 91 96 -210 90 -114 9 -259 119
7437 119 -157 -327 167 124 -162 140 275 29 273 316 -169 83 78 -272 -34 192 -165 -55 433 -115 -48 313
7459 313 172 -309 -69 56 -252 -209 -47 -87 -281 244 -129 -91 159 -16 29 -38 -30 -34 33 351 -75 -251 99
7482 99 -32 -106 105 -225 -48 3 131 -403 -266 259 -316 52 320 -330 -99 -110 -104 32 206 334 -213 23
7504B3l27J36J20M39m46j03Q2k19j01N92j36n26M66J35l10J32J42l38K22M11k63
7525A31n92M51j56j96M06J9n3K41j76k27J62J97m27K00L44l54j68J53J32l58K10
7546f1L90m46K26m1M0O0Q1Ol93J29r7n6N8K91l00J29K25k22J54o3l41j0L12j42
7570g1K10K10j31k58l7K95m38M6K51j51K30l5j92O3l3R0l53N57l48l8R2O5k21
7593a97J10L71k39q2Po2k37M21n2k77L43J24l93P6j39p9J97J89lj85k9j07j51
7616c94J17M46l96K08J67k24l3N71o89J98L06k04m62N72O3k64J88N5Ml31N71n42
7638g3J87j95K16k56M16j93r2M24k68j94j47M36m05J71K18j96l83N89On73K35
7659g7Q0K13j30l3O8M0L3m8m79N65J44n93N76j99m42L25lj08j36J24n4K93p8Q5
$$ plain form
7504 23 -304 -168 -48 391 -55 -158 -76 -295 -396 196 60 -466 0 135 -175 -43 99 -239 -17 394 131
7525 131 -461 -10 -166 -362 44 63 10 251 75 -152 10 207 -220 -20 324 -30 -198 -45 87 -271 -61
7546 -61 329 -117 109 68 108 168 249 255 -138 -9 -106 -162 -104 187 -113 16 241 19 173 110 -231 -241 71 -71
7570 -71 139 349 218 -40 -77 218 -220 -174 77 -74 156 121 -71 -8 -41 49 -304 253 -95 -133 -41 24 -197
7593 -197 -87 284 45 -37 -30 -92 -329 92 40 -237 106 230 -163 -87 -226 -305 -108 81 78 -107 -136 -243 -394
7616 -394 -277 169 -227 -19 148 -76 -109 462 -227 -29 277 73 -389 183 246 -18 170 225 229 -102 469 -73
7638 -73 114 -81 135 -121 295 102 10 434 166 -28 -175 261 -144 27 245 49 -334 255 261 -312 -77
7659 -77 3 216 86 53 121 161 194 146 -333 232 376 -217 359 160 -282 43 40 -68 -204 -80 -134 159 81 166
7683A66J18m04L81n96K17M39m25q2J34K3J43J68l11L4N29n13k6l1K16l54j10K84
7705@j37O2J94m93L97j04J23j53K05J93l40J13o5l02J13j01K48j63J61J07p1m8
7727f1j44k46M49l8k19q0K70L0m5J57k79Q4K67k95m6J30L44m43K21J34m10L19
7749I9r6j62mJ50jm77O82J01k72o0o9k11N8O69n72L77j59k40o2L83l6o32R50l07
7773A09k86K47n8K80k03O6j69n6L94l33j15R5qj84K91K44k90o1J37l38J53M05
7795C20m88K48J7r4J70j87J6Q7k71M60m53K15K52k08l03N42l79m40N87R7n40K45
7817a07L42p02O11J46m63L8K90k31k90K83J57k06n2N68m44k51K14L77j82K5K6
7838A49k90N47n26j78M40J45m45K75o3l39j40N33P4l18M57l09k1L2k41j85K45
$$ plain form
7683 166 284 -120 261 -335 -118 321 -104 -186 -52 -29 114 282 -29 5 534 21 -5 -36 180 -174 -284 0
7705 0 -137 -75 119 -374 23 -81 42 -111 94 287 -53 60 -5 -307 -194 -295 -47 -210 -49 58 -13 -61
7727 -61 -205 -451 -2 -40 -259 -339 -69 -39 -84 73 -206 -122 145 -150 -196 -66 278 -165 56 190 -220 99
7749 99 3 -159 -163 -13 -14 -491 191 292 20 -40 -109 -320 -262 407 -165 212 53 -187 -249 134 98 -534 416 109
7773 109 -177 70 12 292 89 155 -14 -70 324 -9 -124 -29 -37 -221 70 314 24 -37 100 -238 -85 320
7795 320 -168 80 97 3 173 -14 2 89 -182 278 -175 40 292 84 -219 323 -56 -496 91 188 -352 -107
7817 -107 235 -467 144 290 -173 -135 155 -76 -366 -83 74 -132 -184 384 -60 -311 -97 280 98 123 149
7838 149 -141 406 -120 -298 142 287 -158 117 54 -285 -425 108 182 -136 321 12 -9 23 -218 -403 -158
7859a58J30j02J50J39j69o1J71j42m9J64P8j60M7m5j32n8J83j35Q0M16j11m22
7881a86L16r7k2j31K97k62K26j38K8M9J48j42Q7Q3k77K6J61j74j43O41j33m32
7903g5n1M40k93k0J36j48j39J49K65o02L41L44l99J12K45l36J36k9k80j77O31
7924B50l21J00p8L44m81L21N8l24r2K25K7n3M97m68J78j73k30r6L04rK5j86M43
7947B61n79L69J56O7m54M18k21k12K2J96k82N17l28m35L03K82k62J75K71pn32
7968b75L50M4l17J25j39l56M39K56n27J80M5N7j97M87k40j88M78l3l39K41K55
7989C46k65k00O55o92k61L21L42m57L93j00q9n5M21m47R4K68n26L5K08q7J09J2
8011B5J56n13L86J82m92L37j88L15l49L08m52l7N66j64k89L00k5r4K80L32p63
$$ plain form
7859 -158 -28 -130 20 159 -10 -71 100 -42 -91 73 151 -9 38 -7 -139 -197 -14 -149 -69 347 236 -186
7881 -186 130 33 11 -120 177 -85 141 3 31 80 228 86 173 256 -21 5 166 -8 -151 490 357 -75
7903 -75 -126 314 21 1 137 -11 -150 -1 264 -338 3 347 -52 60 305 -31 105 76 -204 -381 250
7924 250 -71 29 -49 295 -186 135 193 -131 -223 2 29 -24 473 5 183 10 -220 -316 -12 -21 4 -182 261
7947 261 -318 51 207 274 -180 238 17 -195 -173 23 -259 258 -70 -505 -202 80 -182 -7 264 257 -275
7968 -275 75 119 -198 -73 -212 -568 -129 127 -400 -220 -175 -118 -315 172 -68 -256 222 189 -150 91 346
7989 346 81 -119 536 -156 -417 -96 246 -211 182 82 -7 -62 359 -88 6 274 -252 -217 -9 -96 13 25
8011 25 181 -332 54 236 -256 81 -107 208 -141 167 -285 -322 244 80 -209 91 66 -28 252 584 -179
8032a79Q7M36l76k8N40j26r2o87L03l45M74QJ39O2k19k21j27N20l32J79K23j98
8054D1j39L4M13m97J92Q1l03J53J01n88L69M48k11j65K27p2O4J42L6l23Q9K9m22
8077c01J02K30J06j85J94o99L96o2N05l69k2K41l46J11K96k75M9J53k39j58J75
8098i8K88m37J43J94k41K30k00J92j07J42J25j85L34j93n11K99K6j59J26K66p18
8119d84M96j40K58l26K77J39m71M84n7n10K16K75l28K72L8l39J31J14N2k10J77
8140F4j7k4j31J70j07j57K09l42K68M02k32j20K11r2l18O29k77n80M91p8j77J94
8162a4K01K9n67M39l1j33J97J6r7k12K84M1k12L17j93l34L35K5J03LN0m28L29
8185A48P1k76k3K67k20k95
$$ plain form
8032 -179 -92 344 -32 -60 480 354 262 -425 -122 -467 7 15 154 216 -3 -224 -351 169 -163 16 239 41
8054 41 -98 -64 349 -148 44 125 -178 -25 76 -512 -143 305 94 -71 156 84 148 290 326 3 92 121 -301
8077 -301 -199 31 137 -48 146 -553 -157 -219 286 -83 -105 136 -210 -99 197 -78 -29 124 -115 -273 -98
8098 -98 190 -247 -104 90 -151 79 -121 71 -36 106 231 46 380 187 -324 -25 1 -158 -32 234 -484
8119 -484 12 -128 130 -196 81 220 -251 233 176 -334 -118 157 -171 101 139 -200 -69 45 97 -113 64
8140 64 47 23 -108 62 -45 -202 7 -335 -67 335 103 -17 194 102 -216 413 136 -444 47 -31 -208 -14
8162 -14 187 216 -351 88 57 -76 121 137 40 -172 112 153 -59 258 65 -269 66 91 194 197 247 -181 148
8185 148 219 -57 -80 187 -33 -328
8191c28
$$ Imaginary data points
##PAGE= N=2
##DATA TABLE= (X++(I..I)), XYDATA
0@%%%%%%%%Nj3J6j6J6k4L2l3M1m9N7p2Q4r3J08j27J49j70J93k22K50k82L19l60
32a91M04m52N06n64O28o98P74q59R52j053J166j292J430j585J761j960K186k446
50a293K754l122L566m119M831n787P146r248J2968k1522P7292K8982r9945K2061
64A4564J999o496J2454K0559j544L0544j3912o3001j2358M0843P6P016K2548j9467
78C3825k3095J9338k0649l7084L2950M2247j5185q194p464l3156M268L0252k0140
91b087p376M6204M217m4690j2780l445o200L2627J7734l0645P323K9337l4981
104d762l9114J8174J5861R363K5532j1430l3027J2675K247l7549R454M1961R12
117A0297q75P851l6530k5716L2934R782j7715K5504K2415k3772j5375j0291k1558
$$ plain form
0 0 0 0 0 0 0 0 0 0 5 -8 8 -8 8 -16 16 -17 24 -25 32 -40 44 -49 59 -68 81 -89 104 -118 132 -150 169 -191
32 -191 213 -239 267 -297 331 -367 407 -452 500 -553 613 -679 751 -834 927 -1033 1153 -1293
50 -1293 1461 -1661 1905 -2214 2617 -3170 3976 -5272 7696 -13826 63466 92448 -7497 14564
64 14564 16563 10067 22521 43080 41536 72080 58168 -4833 -17191 23652 23728 30744 53292 33825
78 33825 10730 30068 9419 -27665 5285 47532 32347 24153 16689 -16467 -12199 18053 -2087
91 -2087 -9463 36741 40958 -3732 -16512 -19957 -26157 6470 24204 -6441 882 30219 -4762
104 -4762 -43876 -25702 -9841 -478 25054 13624 -19403 -6728 -4481 -42030 -32576 9385 10297
117 10297 9422 17273 -19257 -44973 -12039 -2257 -19972 5532 27947 4175 -11200 -21491 -43049
130d3049K4700M2632j4301j5572K3336j2481l5074O989R635J821L5427J1255m3821
143h503j1617K0561j6284q778K9479Q427j220J3458k6440l8670K3029K7239j3415
156b734Q653J9863j9679j2867L667k4325k170M7420J2802k5033J697l341k4501
169b0548N083Q512j1003K6913L4168k9505l5192R778j805q487K3859R671q359
182C085J7522k729m4497q010K9152M791O584J5788j8797j5678J5103j3856k3641
195c5183L1001L1042j4866p623l208k5243L022K4307r665j134L2212l370l3150
208a1858l740j837n259K8541J7576k3793J290J7513k7103k2452J8850R924N088
221B740K1629j0825k9516J0707P060k3584P328K8302k642j160M991k9120j5140
$$ plain form
130 -43049 -18349 24283 9982 -5590 17746 5265 -29809 -22820 -13185 -11364 24063 35318 -8503
143 -8503 -20120 441 -15843 -24621 4858 13285 12065 25523 -917 -39587 -16558 10681 -2734
156 -2734 5919 25782 6103 -6764 -3097 -27422 -29592 17828 30630 5597 7294 3953 -20548
169 -20548 -15465 -6953 -17956 8957 43125 13620 -21572 -11794 -13599 -22086 1773 11444 3085
182 3085 20607 17878 -26619 -34629 -5477 -686 5898 21686 2889 -12789 2314 -11542 -35183
195 -35183 -4182 26860 11994 4371 1163 -24080 -21058 3249 -6416 -7550 24662 21292 -11858
208 -11858 -15598 -17435 -22694 5847 23423 -370 920 18433 -8670 -31122 -12272 -2348 2740
221 2740 24369 13544 -15972 -5265 1795 -21789 -14461 13841 11199 10039 15030 -14090 -29230
234b9230K8258M945j5222K0200J4104k1781q238l797j7255J7104L2960j0731j3698
247b381J3384j2817k3607J0719P549j002K7234Q309l6013j1979J4828j0639n75
260a6990K4916K363n192Q822k0941k9546J8814K2480p044R022J0808k1015j0267
273a3770O872j6415k21L7360P713k1700k21n341j8654J0248J2359q963J5760K1786
287B6813k4752k3448J0270j218k946K2094L339j4660J2351J174l1180j726K3469
300d20J024M250J2074j7557j2790J4458q153j7318K4256K0557j3494l083j732
313B072k2281L398K2299o910k520K3922m788k4923j040k441n111K4684J4697k0316
327G42M33J1188k2163j5335J7411O719M752J9001j0790k8146O437P434j4263R157
$$ plain form
234 -29230 -972 3973 -11249 8951 23055 1274 -6964 -10761 -28016 -10912 22048 11317 -2381
247 -2381 11003 -1814 -25421 -14702 -7153 -8155 19079 27388 -8625 -20604 -5776 -16415 -16990
260 -16990 7926 10289 5097 13919 -7022 -36568 -17754 4726 -2318 6704 17512 -3503 -13770
273 -13770 -6898 -23313 -23534 13826 21539 -161 -382 -5723 -24377 -14129 -1770 -10733 5027 26813
287 26813 2061 -21387 -11117 -12335 -15281 6813 10152 -4508 7843 9017 -22163 -23889 -420
300 -420 604 4854 16928 -629 -13419 1039 -7114 -24432 -176 20381 6887 3804 2072
313 2072 -20209 -16811 5488 -1422 -3942 19980 15192 -9731 -10771 -13212 -18323 6361 21058 742
327 742 1175 12363 -9800 -25135 -7724 -1005 3747 22748 11958 -16188 -9751 -2317 -16580 -7423
341g423K0587n227j596K250k5247j0386K7106O479j1471J3344M100j9284k250
354i018J647j2962J3579K6024j0896j3720Q364r111j3335J2828M306m199K1022
367A4529N370l0571q003J3742n883K014J9518l345o713R380j4492k3143J5849
380a1748J8080n244P181N687k0243m451R360j3662j508K9868N261j7666N82n747
394d250j4995J1510J2147q649J0480J5450k0203j8197R193j180L98K1202l99j6452
408c945Q653J812k3848J655K0358m9K451P479j6707j0890J4108l126j2141J8116
422C926J3343j2367j043k078j8075N478K0589o930m658J7401m144j8657J571j033
436f677m450K0691J0775j8592r20R843j6339r132J5675K835K031J6130r658k3889
$$ plain form
341 -7423 13164 7937 6341 8591 -16656 -27042 64 6543 -4928 8416 12516 -6768 -9018
354 -9018 -7371 -20333 -6754 19270 8374 -5346 3018 -6093 -19428 -6600 -2294 -6493 14529
367 14529 19899 -10672 -18675 -4933 -10816 -8802 10716 7371 658 10038 -4454 -27597 -11748
380 -11748 6332 1088 8269 13956 -6287 -10738 -1378 -15040 -16548 13320 18581 915 1497 -4250
394 -4250 -19245 -7735 4412 -4237 6243 21693 1490 -16707 -7514 -8694 -8296 12906 12507 -3945
408 -3945 4708 6520 -17328 -15673 4685 4636 7087 14566 -2141 -13031 1077 -2049 -14190 3926
422 3926 17269 4902 3859 1781 -16294 -10816 9773 2843 -1815 15586 11442 -7215 -5644 -6677
436 -6677 -11127 9564 20339 1747 827 10670 -5669 -14801 874 3709 5740 21870 12212 -11677
450a1677P378Q412j1693P395J6448n596j592J876k1399o650K4331N507r825J0236
464A3151J256j7489M08K734j0581J2655K2648j1490j4209O234o958q220J3902
477D041L265n862J5215K375k5922l785J3605m341K622J4962o501q222Q501j0091
491a38j6812J5002J3647n999L864K535j6754j186J0074j0471j613K2101J400j5026
505F24J435k804j1488J0464R627r888O930J2293j5456j2521P978k024j81J7298
519A2287j420j4435P425J540j8596K862J6861j587J909O435j4878r919J2324j545
533g37p951J6087Q148j2208j300l38j5036N850J8559o612m078J2860n640j5522
547g918M700O35l853J6022P486j6365j325P745j2657l693J3923Q4q47J1212q206
$$ plain form
450 -11677 -4299 4113 -7580 -185 16263 10667 9075 10951 -10448 -17098 7233 12740 2915 13151
464 13151 14407 -3082 -2674 60 -10521 2134 24782 13292 -917 5317 -1641 -9861 4041
477 4041 7306 1444 16659 19034 -6888 -10673 2932 -1409 1213 16175 9674 1452 9953 -138
491 -138 -16950 -1948 11699 5700 9564 12099 -4655 -5841 4233 -6238 -7851 14250 15650 624
505 624 2059 -745 -12233 -1769 7858 -2030 4900 17193 1737 -10784 -2806 -4830 -5011 12287
519 12287 10867 -3568 3857 5397 -13199 -10337 6524 4937 6846 13281 -1597 -11516 808 -737
533 -737 -8688 7399 15547 3339 2039 1701 -13335 -7485 11074 4462 384 13244 7604 -7918
547 -7918 -3218 -2583 -6436 9586 17072 707 -618 7127 -5530 -9223 4700 4784 3937 15149 6943
562F943j8368Q309P686r004O711J1039q194k104L004j4627m164J8905K481q718
576a01Q567k47j4745J663M197r221R248J6897j0707j0742N511n655o765J2213
590A13K763o208J1153Q15k0767q68J1034l810K775J1273p322q078P862p341j1962
605a8568J2968J0911o497K468J643j4761L96R559q087n77J7707j496j3349L888
619c795k341r004J0573Q249r409L877R369j2929p659Q948k068n09J3279k879j2050
634h348P868J976j4117M138J3546m175P58O414j1819p344J1142r91o493J3197
648E752N616j1318J181J96j2274N590J5173o065l023J0158o436j1525O184J488
662F97m417J2146O218j3506r80N857r959q28J3026k199k940R122o754j4659Q501
$$ plain form
562 6943 -11425 -3116 4570 -4434 2277 13316 5122 3018 6022 -8605 -12769 6136 8617 -101
576 -101 8466 8219 -6526 -4863 -666 -9887 -639 16258 5551 -5191 320 -5335 -12100 113
590 113 2876 -3332 7821 8636 -12131 -12999 -1965 -5775 -3000 8273 951 -7127 735 -6606 -18568
605 -18568 -5600 5311 -1186 1282 2925 -11836 -11440 -1881 -9968 -10545 7162 5666 -7683 -3795
619 -3795 -6136 -15140 -4567 3682 -5727 -1850 7519 -5410 -13069 -4121 -6189 -6698 6581 3702 -8348
634 -8348 -480 1496 -12621 -8483 5063 888 1646 8060 -3759 -11103 39 -952 -7445 5752
648 5752 11368 50 1231 1427 -10847 -5257 9916 3851 828 10986 4550 -6975 -791 697
662 697 -3720 8426 14644 1138 158 6015 -3944 -4772 8254 6055 3115 12237 5483 -9176 -675
677f75O664p400P075P502r594k697M434j0018k225J5757K88q006O555j528j2135
692f003M915N113q569O112J2030r637p503P127n082n397J1083P32p341Q256J149
707F985j4668J716Q736n591J897J0572p825p186P938m881r100J0881O976p480
721a030L165K224j1954M5Q601o161n94J3671l018j0257M163j872q117R029P069
736D964q965K320P576j0933m874R015k807j389J0806k598j0934N536K237r851
750i897M821J0123o823n03O763r859n339J0029j04n428R577K275j0595K698J225
765a037r764M845J1969o544k962Q643n856q688P610Q04n537R474M476j2189P23
780d033N712q139M88J0503l797l445Q135m949j0402Q258M915p379N671O238r950
$$ plain form
677 -675 5989 -1411 5664 13166 3572 875 5309 -4709 -6934 8823 9111 1105 7660 6132 -6003
692 -6003 -1088 4025 -4544 1568 13598 3961 -3542 3585 -1497 -6894 4189 4921 -2420 5836 6985
707 6985 -7683 -5967 2769 -2822 -925 9647 1822 -5364 2574 -2307 -11407 -526 6450 -1030
721 -1030 2135 4359 -7595 -7550 1051 -5110 -5704 7967 4949 -5308 -1145 -3017 -11134 -2105 4964
736 4964 -4001 -1681 5895 -5038 -9912 -897 -3704 -5093 5713 3115 -7819 -2283 -46 -9897
750 -9897 -5076 5047 -1776 -2279 4484 -5375 -10714 -685 -789 -6217 3360 5635 -4960 -2262 -1037
765 -1037 -10801 -5956 6013 -531 -3493 5150 -706 -9394 -1784 -980 -6517 2957 7433 -4756 -4033
780 -4033 1679 -6460 -5972 4531 734 -2711 5424 475 -9927 -1669 3246 -4133 1538 7776 -2174
795b174j749O226p984j429J2612r24o570O502j266j0835N761M912p575M919R256
810I682r413m656P524m657m025R978np261P026J422j1281L264P129o509J534Q458
826H210p283n654Q011k814p049Q996M431p772L565K620j0235J155P687n409j272
841b813J0239l809p904O106j385p529P899N418q516K093O358q788l431P990l157
856a229k708R666k781r283O310J702q188N198P166p358nO161q486m618J0359j166
872G40n273P666R58r640L722L544q551M021Q733o411k499P502n534o120P902M97
888A257o879P639L351r576J920N906p123J5R171n407l641P711l383p490P577K844
904C892p458N048M946q540j23O756o383j789R719k262n893O411p96q460N278M368
$$ plain form
795 -2174 -3923 2303 -5681 -7110 5502 4578 -1992 4510 3244 -7591 -1830 3082 -4493 426 9682
810 9682 269 -4387 3137 -1520 -5545 4433 4428 -2833 4193 5615 -5666 -2402 4727 -1782 -248 8210
826 8210 927 -4727 3284 470 -6579 2417 6848 -924 2641 5261 -4974 -3819 3868 -1541 -2813
841 -2813 7426 3617 -4287 1819 434 -7095 804 6222 -2294 -201 6157 -2631 -6062 1928 -1229
856 -1229 -3937 5729 2948 -6335 -25 1677 -6511 -1313 5853 -1505 -1510 4651 -3835 -8453 1906 740
872 740 -4533 3133 4091 -5549 -1827 1717 -6834 -2813 5920 -491 -2990 4512 -1022 -7142 760 1257
888 1257 -5622 2017 5368 -4208 -2288 3618 -3505 -3490 5681 274 -3367 4344 961 -6529 1048 3892
904 3892 -3566 1482 6428 -2112 -2235 4521 -1862 -3651 6068 3806 -2087 4324 3528 -4932 346 4714
920D714p116L410P330p698k772P073m113m060Q495o85o748N986J811q923L525
935B29N911p139J689P342o819m066P916k167o640Q130K116q048L602L259q410
950c095J563P175n798j013Q473l998o441O613j252o629O507L499q172K809N559
965E800p571j390P726m438l058P686k524p029O114J719p528M384N205p865L97
980b372O361o368l080Q957k780n383P325P8p916L944L346p154K700O251o207j973
996d271P460m700m521P436r53o485O713K069p964K526N452o889k17P187n276l008
1012e441P634k748n919O934J500p673M532L927q084J394O876n971k097P908k958
1027a86n243P047o97o982N615K692o999K873N887p235r25P743m882m045P714j626
$$ plain form
920 4714 -2402 1008 8338 640 -2132 4941 828 -3232 5263 4578 -2170 3816 5627 -3296 229
935 229 6140 -999 690 8032 1213 -2853 5063 2896 -3744 4386 6502 -1546 2056 5315 -3095
950 -3095 -1532 5643 -155 -1168 7305 3307 -3134 3479 2227 -4402 2105 5604 -2568 241 5800
965 5800 -1771 -3161 4565 127 -2931 4755 2231 -4798 1316 3035 -4493 -109 5096 -2769 -2372
980 -2372 3989 -2379 -5459 3498 718 -4665 2660 2738 -5178 -1234 2112 -5042 -2342 3909 -2298 -4271
996 -4271 3189 -1511 -6032 1404 451 -6034 679 2748 -5216 -2690 2762 -4127 -4344 2843 -2433 -5441
1012 -5441 2193 -555 -6474 460 1960 -5713 -1181 2746 -5338 -3944 2932 -3039 -5136 2772 -186
1027 -186 -5429 1618 921 -6061 -446 2246 -4753 -1880 4007 -3228 -4153 3590 -1292 -5337 2377 751
1043G51o414O625K053p493L651M560o857O72O259n875k069P660k723n118O619
1058B301mp012M898L856p126J333O032n855j548O993l732m014P339j295o726N867
1074A307J805o928L573N431o880l91O357m816l354O939j417n514O332J377p264
1089c443L804L441o791J048O588n555k189P845l893n044O460J25o146N172L309
1104D731p425K020M988o162o67P491m387l873O941j809o050N672K267p237M058
1119E58M885p101N5O222n427k605P686k475m749O305J75p601M791L189o637K589
1135a40O233o358k068O207l480m114P200j68n898N182J511p452K679N382o162
1150a446Q05O499n211l703O460j974n532O784K101o824L555L291o768J14N896
$$ plain form
1043 751 -5663 962 3015 -4478 -827 3733 -3124 -2452 3807 -2068 -4137 3523 800 -4318 2301
1058 2301 2297 -4715 183 4039 -3087 -1754 4278 -1577 -3125 3868 136 -3878 3461 2166 -4560 1307
1074 1307 3112 -3816 -243 5188 -1692 -2083 4274 -542 -3896 3043 1626 -3888 2444 3821 -3443
1089 -3443 361 3802 -2989 -1941 4647 -908 -3097 4748 855 -4189 2271 2396 -3750 1422 4731
1104 4731 -2694 -674 4314 -1848 -2515 4976 589 -3284 3657 1848 -4202 1470 3737 -3500 558
1119 558 5443 -1658 -1603 4619 -808 -3413 4273 1798 -2951 3354 3529 -4072 719 3908 -2729 -140
1135 -140 6093 -265 -2333 3874 394 -3720 3480 3312 -2586 2596 4107 -3345 -666 4716 -1446
1150 -1446 -641 5858 647 -3056 3404 1430 -4102 2682 4783 -2041 1514 4805 -1963 -1849 4047
1165D047m537j018P441l422n576N542l15n915N327L164o186J865N158p404j473
1180c302O983l231k746P009k005o493N168J165o955L996N692o347l09N682n808
1195a501l023O795j373m524O778J02o805L001K682o820K507O315n148j635N827
1210C178l796n278O663J80n180N066K033o990K027L721n829M66P188m157l005
1225c713N980k784n802N605J729n946M395M086o794n27N183n422j401P777j992
1240C74m648N351p18o854M252L005n134K982N640o556k298N922l903k991P408
1255A832l66m671M598J80p769K996N267m247R18O074n214l797N742k550m289P660
1271B364J878o458K793K471p114J559O057m517j73P363m483n327N153l55m638
$$ plain form
1165 4047 -490 -1508 5933 2511 -3065 2477 2162 -3753 1574 4738 -1448 417 5575 -1829 -3302
1180 -3302 3681 450 -2296 4713 2708 -3785 1383 2548 -4407 -411 5281 -1066 -1375 4307 -1501
1195 -1501 -4524 2271 898 -3626 3152 3254 -3551 -550 2132 -4688 -2181 4134 -1014 -2649 3178
1210 3178 -618 -5896 767 947 -4233 833 2866 -4124 -2097 1624 -4205 -3739 3449 -708 -3713
1225 -3713 2267 -517 -6319 -714 1015 -4931 -536 3550 -3244 -3771 1412 -4010 -5411 2366 374
1240 374 -4274 1077 359 -6495 -2243 762 -4372 -1390 4250 -2306 -4604 1318 -2585 -5576 1832
1255 1832 1466 -3205 1393 1573 -6196 -3200 2067 -2180 -1262 4812 -402 -4199 1543 -1007 -5296 2364
1271 2364 4242 -2216 577 3048 -4066 -2507 3550 -967 -1140 6223 1740 -3587 1566 1211 -3427
1286c427O177K860o540J903M152p146q47O760k119j965N898k139o052M842P71
1301C128o314M835M981n366K4L928n926k100O648j735l495O468K75o992K438J969
1317B766n619L500N940n598j437N645m591n153O199P89l938N742P69p994J760
1332a220L375m937P35O551k502k990M114l650n397O379J725m888L908L608p175
1347b364n04L766m407J13P625k732m721M946j331o334M190L250m663L919M027
1362D780p859k073N707k700k258O781n90m565M157p08p559L408N465l784Q53N112
1378D167n364l276N022l119l108P695J897o541K520J330o292J682N473l852N46
1393a220O312m868n812M890K29l254N871J820o129K054L142p164q87P606j397
$$ plain form
1286 -3427 2750 5610 -930 973 5125 -2021 -2868 3892 1773 -192 5706 3567 -2485 2357 3128
1301 3128 -3186 1649 6630 1264 1288 5216 -710 -2810 3838 2103 -1392 5076 5351 -1641 797 2766
1317 2766 -2853 647 6587 989 -448 5197 606 -4547 1652 2441 -1497 4245 5014 -2980 -1220
1332 -1220 2155 -2782 -2047 4504 2002 -988 3126 -524 -5921 458 2183 -2705 1203 4811 -2364
1347 -2364 -2868 898 -3509 -3396 4229 1497 -3224 1722 391 -5943 -1753 1497 -3166 753 4780
1362 4780 -3079 -5152 555 -2145 -4403 2378 1788 -2777 1380 672 -6887 -3479 1986 -1798 -945 4167
1378 4167 -1197 -4473 549 -2570 -5678 2017 3914 -2627 -107 1223 -5069 -3387 2086 -1766 -1220
1393 -1220 5092 224 -5588 -698 -469 -3723 2148 3968 -2161 -107 3035 -4129 -5016 2590 1193
1408A193j681M780l206n393M698O42n695M961N218n362j81K757n730p10P214k204
1424A301l341O217k74o604J885J948m424M159M580n445j084N006m509m179N819
1439A055R24k813N464n65p685J909L894n012J209O535k620k404K969m549m604
1454f293O949K152m403L678K392o567o37L468m401J174P729k975n179L868j201
1469b46n587M562K929l134L332K653p984k122N741k557q28O139o18m286K588j494
1485i12o436M312N722l227K28L380n256k249M293k741k137P345J197o078J536
1500a023J497n648K722M612m084R15N761n264n206M700J97k444N697J030n615
1515b153K312K073p009N05P164j613j192M349l739n465M779N69m512M983M841
$$ plain form
1408 1193 -488 4292 1086 -4307 391 1033 -4662 299 5517 155 -26 2731 -2999 -3709 3505 1301
1424 1301 -2040 4177 3903 -2701 -816 1132 -3292 867 5447 2 -1082 3924 -585 -4764 1055
1439 1055 1979 -834 4630 4065 -3620 -1711 2183 -2829 -1620 4915 2295 -109 2860 -1689 -6293
1454 -6293 656 2808 -1595 2083 4475 -2092 -2729 739 -3662 -2488 5241 2266 -2913 955 -246
1469 -246 -5833 -1271 1658 -1476 1856 4509 -3475 -5597 144 -2413 -3241 2898 2280 -2006 582 -912
1485 -912 -7348 -3036 2686 -541 -313 3067 -2189 -4438 -145 -2886 -5023 2322 3519 -2559 -1023
1500 -1023 474 -5174 -2452 2160 -1924 -1009 4752 -512 -5718 -1018 -821 -3265 2432 3462 -2153
1515 -2153 159 2232 -4777 -4272 2892 1279 87 4436 697 -4768 11 580 -3932 1051 5892
1530E892m581q28J433n205n4P188k028k797N911r47p087J913K181l313M601M477
1546F756o007r38L579m344k453N651R75k056M087j154p724K222M066l938J578
1561C00O056l135k283K542m785l482O738K493m056L122J339o366j53L214l566
1576b022J837O815k837n211K938j098m424M923K504l254L007K087p849j703N311
1591A024j334k61N658k001m529L114j645o200M700N686l379M09K483n989j633
1606c897M570k277j663P384N65o659J120O98m335L214M520l939m2M836n110m306
1622e321M224J071k132N320k01n726K165J863o282N53O480j161p50L295m332m272
1638e206M282O83l682M388L821m502p75J058n245J012O237j262k773M714j342
$$ plain form
1530 5892 1311 483 1916 -3289 -3343 3845 1817 -980 4931 3984 -3103 -1190 991 -2322 2279 6756
1546 6756 749 -189 3390 -954 -3407 2244 3219 1163 5250 4096 -3628 -1406 2660 -1278 300
1561 300 6356 3221 938 3480 -1305 -4787 1951 4444 388 3510 4849 -1517 -1670 1544 -2022
1576 -2022 -185 6630 3793 -1418 1520 422 -4002 921 3425 171 3178 5265 -2584 -4287 1024
1591 1024 -310 -571 5087 3086 -1443 1671 26 -6174 -1474 4212 833 1242 3725 -2264 -3897
1606 -3897 673 -1604 -3267 4117 4682 -1977 -857 -159 -4494 -1280 3240 -699 -741 4095 -1015 -5321
1622 -5321 -1097 -26 -2158 3162 2961 -2765 -600 1263 -5019 -4466 2014 853 103 3398 -934 -5206
1638 -5206 -924 -241 -3923 465 4286 -216 -991 67 -5178 -4166 2071 809 -1964 2750 1408
1653A408n724K110Q72k178M659L956o094j799L259l706j615N548Q15j415L759
1668C855k383p894K865M404k972J898M748l635k586K336l969k461P499J997l858
1683a56K106k88n374J269K961l510K079O735l957m868L020j287k740N389J758
1698C137l826L126J309o967j286N156r80K06M596k747l802L033r45n697M976M647
1714C936k586j07J478n334n81M329k143j609O552M04n849Q55k91l336L987M130
1730C835m037l9M256m569m501L913N99m81M842j26o443K169J582n002P74N856
1746B628p97q56K376m998l744N564N47l300M369K975m636p02O00m441K007O623
1762D215k318k753L773j454m863K042J100j994N351K778o289k145L923l160q20
$$ plain form
1653 1408 -4316 -2206 -1334 -3512 1147 5103 -991 -2790 469 -3237 -4852 696 1511 96 3855
1668 3855 1472 -6422 -3557 847 -2125 -227 4521 886 -1700 636 -3333 -5794 1705 3702 -156
1683 -156 1950 1662 -3712 -2443 518 -2992 -913 5822 1865 -3003 17 -1270 -4010 1379 3137
1698 3137 -689 2437 3746 -3221 -4507 649 -331 -125 4471 1724 -2078 955 10 -5687 -711 3936
1714 3936 1350 1243 2721 -2613 -3194 1135 -1008 -2617 3935 4339 -1510 -655 -946 -4282 -295 3835
1730 3835 -202 -241 4015 -554 -5055 -1142 -543 -1024 3818 3692 -2751 -582 1000 -4002 -3228 2628
1746 2628 1831 975 3351 -1647 -5391 173 720 -2580 1789 4764 128 -574 26 -4415 -2408 4215
1762 4215 1897 -856 2917 1463 -3400 -1358 -258 -2252 3099 5877 -412 -2557 1366 -1794 -2614
1777b614M817p2j376L626k766o750K754M641k491J548L624l590j902J861m294
1792b984j670P805K093m517R75j72m412J358K690k823K234N663l685n212K027
1807f30l27j619M941N72l491K882J279p179p14M972J14J45L181l344l419L393
1823G56j088m650M628M434l098n14L53m698L35M814k681j283O076l94m877L75
1839a512o24k652M428L370m332J92L901m227l938L512N77L15M775j453n983J872
1855a779J439m276J371N319p72n70J172n319k802N225J329k916L625K558m653
1870a049q56kl358K725O385k293l458L121j754l854K465J127j021N097J427o992
1886b290j331L393j751k78M354l33j195K130k771n730L808M300j832Q70K164l580
$$ plain form
1777 -2614 2203 2131 755 4381 1615 -5135 -2381 2260 -231 1317 4941 1351 -551 1310 -2984
1792 -2984 -4654 3151 5244 727 1702 1530 -2882 -1524 1166 -1657 577 6240 2555 -2657 -630
1807 -630 -957 -2576 2365 2937 -554 2328 3607 -3572 -4286 686 800 945 4126 782 -2637 756
1823 756 -332 -4982 -354 4080 982 468 821 -3877 -3542 1272 -1409 -2692 3384 2990 -1887 -1512
1839 -1512 -2136 -4788 -360 3010 -1322 -1130 2771 -1456 -5394 -1882 -1305 -990 3785 2332 -3651 -1779
1855 -1779 -340 -4616 -3245 2074 1302 732 1904 -3415 -6217 -992 337 -2579 1046 3604 -1049
1870 -1049 -1905 -1907 -5265 -2540 3845 1552 -1906 1215 -539 -4393 -1928 -801 -1822 3275 4702 -2290
1886 -2290 -3621 -228 -1979 -2257 2097 1764 569 2699 -72 -5802 -1994 2306 474 1344 3508 -72
1902g2j061J915l512p21O705J399m535R44j51l674J929K082k636K693M562m334
$$ plain form
1902 -72 -1133 782 -2730 -3451 3254 4653 118 1062 911 -2763 -834 1248 -1388 1305 5867 1533
$$ [...]
8191C83
##END NTUPLES=NMR FID
##END=
