##TITLE=1H_CG-1124-12
 CDcl3, 8 sc, 
 15.11.2019
##JCAMPDX= 6.0         $$ Bruker NMR JCAMP-DX V2.0
##DATA TYPE= NMR FID
##DATA CLASS= NTUPLES
##ORIGIN= UXNMR, Bruker Analytische Messtechnik GmbH
##OWNER= root
$$ XWIN-NMR		Version 3.5
$$ Fri Nov 15 14:16:09 2019 Russian Standard Time (UT+4h)  she@DPX200
##.OBSERVE FREQUENCY= 200.1315
##.OBSERVE NUCLEUS= ^1H
##.DELAY= (6, 6)
##.ACQUISITION MODE= SIMULTANEOUS
##.ACQUISITION SCHEME= undefined
##.AVERAGES= 8
##.DIGITISER RES= 18
##SPECTROMETER/DATA SYSTEM= spect
##.PULSE SEQUENCE= zg30
##.SOLVENT NAME= CDCl3
##.SHIFT REFERENCE= (INTERNAL, CDCl3, 0, 15.7039)
##AUDIT TRAIL= $$ (NUMBER, WHEN, WHO, WHERE, WHAT)
$$ ##TITLE= Audit trail, XWIN-NMR		Version 3.5
$$ ##JCAMPDX= 5.01
$$ ##ORIGIN= Bruker BioSpin GmbH
$$ ##OWNER= she
$$ F:/spectra/data/she/nmr/H-F/1/audita.txt
$$ ##AUDIT TRAIL=  $$ (NUMBER, WHEN, WHO, WHERE, WHAT)
(   1,<2019-11-15 14:14:59.54 +0400>,<she>,<DPX200>,
      <created by zg, POWCHK disabled, PULCHK disabled
       configuration hash MD5:
       00 E9 B6 7A A2 85 ED C7 34 08 36 98 17 FE 4E 26
       data hash MD5: 16K
       26 D5 D5 B7 62 75 33 15 9C 28 5C 3C CC 1C 69 E1>)
$$ ##END=
$$ 
$$ hash MD5
$$ 94 F8 C6 52 4D 47 A2 27 28 C5 87 B7 E9 B0 8C F1
##$RELAX= 
##$RELAX= 
##$RELAX= 
##$RELAX= 
##$RELAX= 
##$RELAX= 
$$ Bruker specific parameters
$$ --------------------------
##$DU= <F:/spectra>
##$EXPNO= 1
##$NAME= <H-F>
##$PROCNO= 1
##$TYPE= <nmr>
##$USER= <she>
##$AMP= (0..31)
100 100 100 100 100 100 100 100 100 100 100 100 100 100 100 100 100 100 
100 100 100 100 100 100 100 100 100 100 100 100 100 100 
##$AQSEQ= 0
##$AQ_mod= 1
##$AUNM= <au_zg>
##$AUTOPOS= <>
##$BF1= 200.13
##$BF2= 200.13
##$BF3= 200.13
##$BF4= 200.13
##$BF5= 200.13
##$BF6= 200.13
##$BF7= 200.13
##$BF8= 200.13
##$BYTORDA= 1
##$CFDGTYP= 0
##$CFRGTYP= 5
##$CHEMSTR= <none>
##$CNST= (0..31)
1 1 145 1 1 1 1 1 1 1 1 1 1 1 1 1 1 1 1 1 1 1 1 1 1 1 1 1 1 1 1 1 
##$CPDPRG= <>
##$CPDPRG1= <>
##$CPDPRG2= <>
##$CPDPRG3= <>
##$CPDPRG4= <mlev>
##$CPDPRG5= <mlev>
##$CPDPRG6= <mlev>
##$CPDPRG7= <mlev>
##$CPDPRG8= <mlev>
##$CPDPRGB= <>
##$CPDPRGT= <>
##$D= (0..31)
0 1.2 0 0 0 0 0 0 0 0.06 0 0.03 0 0 0 0 0.0002 0 0 0 0 0 0 0 0 0 0 0 0 
0 0 0 
##$DATE= 1573812899
##$DBL= (0..7)
120 120 120 120 120 120 120 120 
##$DBP= (0..7)
150 150 150 150 150 150 150 150 
##$DBP07= 0
##$DBPNAM0= <>
##$DBPNAM1= <>
##$DBPNAM2= <>
##$DBPNAM3= <>
##$DBPNAM4= <>
##$DBPNAM5= <>
##$DBPNAM6= <>
##$DBPNAM7= <>
##$DBPOAL= (0..7)
0.5 0.5 0.5 0.5 0.5 0.5 0.5 0.5 
##$DBPOFFS= (0..7)
0 0 0 0 0 0 0 0 
##$DE= 6
##$DECBNUC= <off>
##$DECIM= 24
##$DECNUC= <off>
##$DECSTAT= 4
##$DIGMOD= 1
##$DIGTYP= 9
##$DL= (0..7)
0 120 120 120 120 120 120 120 
##$DP= (0..7)
150 150 150 150 150 150 150 150 
##$DP07= 0
##$DPNAME0= <>
##$DPNAME1= <>
##$DPNAME2= <>
##$DPNAME3= <>
##$DPNAME4= <>
##$DPNAME5= <>
##$DPNAME6= <>
##$DPNAME7= <>
##$DPOAL= (0..7)
0.5 0.5 0.5 0.5 0.5 0.5 0.5 0.5 
##$DPOFFS= (0..7)
0 0 0 0 0 0 0 0 
##$DQDMODE= 0
##$DR= 18
##$DS= 0
##$DSLIST= <SSSSSSSSSSSSSSS>
$$ [...]
##$SUBNAM2= <"">
##$SUBNAM3= <"">
##$SUBNAM4= <"">
##$SUBNAM5= <"">
##$SUBNAM6= <"">
##$SUBNAM7= <"">
##$SUBNAM8= <"">
##$SUBNAM9= <"">
##$SW= 24.0689530833862
##$SWIBOX= (0..15)
0 0 2 0 0 0 0 0 0 0 0 0 0 0 0 0 
##$SW_h= 4816.95568400771
##$TD= 16384
##$TD0= 1
##$TE= 0
##$TE2= 300
##$TE3= 300
##$TEG= 300
##$TL= (0..7)
0 120 120 120 120 120 120 120 
##$TP= (0..7)
150 150 150 150 150 150 150 150 
##$TP07= 0
##$TPNAME0= <>
##$TPNAME1= <>
##$TPNAME2= <>
##$TPNAME3= <>
##$TPNAME4= <>
##$TPNAME5= <>
##$TPNAME6= <>
##$TPNAME7= <>
##$TPOAL= (0..7)
0.5 0.5 0.5 0.5 0.5 0.5 0.5 0.5 
##$TPOFFS= (0..7)
0 0 0 0 0 0 0 0 
##$TUNHIN= 0
##$TUNHOUT= 0
##$TUNXOUT= 0
##$USERA1= <user>
##$USERA2= <user>
##$USERA3= <user>
##$USERA4= <user>
##$USERA5= <user>
##$V9= 5
##$VALIST= <valist>
##$VCLIST= <CCCCCCCCCCCCCCC>
##$VD= 0
##$VDLIST= <DDDDDDDDDDDDDDD>
##$VPLIST= <PPPPPPPPPPPPPPP>
##$VTLIST= <TTTTTTTTTTTTTTT>
##$WBST= 1024
##$WBSW= 4
##$XGAIN= (0..3)
0 0 0 0 
##$XL= 0
##$YL= 0
##$YMAX_a= 563340
##$YMIN_a= -131147
##$ZGOPTNS= <>
##$ZL1= 120
##$ZL2= 120
##$ZL3= 120
##$ZL4= 120
##$ABSF1= 10
##$ABSF2= 0
##$ABSG= 5
##$ABSL= 3
##$ALPHA= 0
##$AQORDER= 0
##$ASSFAC= 0
##$ASSFACI= 0
##$ASSFACX= 0
##$ASSWID= 0
##$AUNMP= <proc_1d>
##$AZFE= 0.1
##$AZFW= 0.1
##$BCFW= 1
##$BC_mod= 2
##$BYTORDP= 1
##$COROFFS= 0
##$CY= 11.3945322036743
##$DATMOD= 1
##$DC= 2
##$DFILT= <>
##$DTYPP= 0
##$F1P= 16.9975609425685
##$F2P= -3.02152046262296
##$FCOR= 0.5
##$FTSIZE= 0
##$FT_mod= 4
##$GAMMA= 1
##$GB= 0.15
##$INTBC= 1
##$INTSCL= 1
##$ISEN= 128
##$LB= 0.24
##$LEV0= 0
##$LPBIN= 0
##$MAXI= 10000
##$MC2= 0
##$MEAN= 0
##$ME_mod= 0
##$MI= 1.114404
##$NCOEF= 0
##$NC_proc= 0
##$NLEV= 6
##$NOISF1= 3.799351
##$NOISF2= 2.8
##$NSP= 1
##$NTH_PI= 0
##$NZP= 0
##$OFFSET= 15.70392
##$PC= 1
##$PHC0= -9463.72
##$PHC1= 30.00088
##$PH_mod= 1
##$PKNL= yes
##$PPARMOD= 0
##$PSCAL= 0
##$PSIGN= 0
##$REVERSE= no
##$SF= 200.130013532006
##$SI= 16384
##$SIGF1= 3
##$SIGF2= 2
##$SINO= 400
##$SIOLD= 16384
##$SREGLST= <1H.CDCl3>
##$SSB= 0
##$STSI= 0
##$STSR= 0
##$SW_p= 3612.71676300578
##$SYMM= 0
##$S_DEV= 0
##$TDeff= 0
##$TDoff= 0
##$TI= <>
##$TILT= no
##$TM1= 0
##$TM2= 0
##$TOPLEV= 0
##$USERP1= <user>
##$USERP2= <user>
##$USERP3= <user>
##$USERP4= <user>
##$USERP5= <user>
##$WDW= 1
##$XDIM= 8192
##$YMAX_p= 0
##$YMIN_p= 0
$$ End of Bruker specific parameters
$$ ---------------------------------
##NTUPLES= NMR FID
##VAR_NAME=  TIME,          FID/REAL,        FID/IMAG
##SYMBOL=    X,             R,               I
##VAR_TYPE=  INDEPENDENT,   DEPENDENT,       DEPENDENT
##VAR_FORM=  AFFN,          ASDF,            ASDF
##VAR_DIM=   8192,          8192,            8192
##UNITS=     SECONDS,       ARBITRARY UNITS, ARBITRARY UNITS
##FACTOR=    0.0002076,     1,               1
##FIRST=     0,             0,               0
##LAST=      1.7004516,     0,               0
##MIN=       0,             -131147,         0
##MAX=       1.7004516,     563340,          0
$$ Real data points
##PAGE= N=1
##DATA TABLE= (X++(R..R)), XYDATA
$$ [...]
2771b864K358l604k088M308J7l799R77K404k103o92J457n74o33L45l83J053M68
2788c353k862M73L976j896l906L782K274l721q34L343r8j947R03N35j26O00j009
2805c866M17K177j116j772K592Q56l159J466L738k177k445L274J276k861J87J815
2821D02R43k42j341k91L266r7l320J188L710k053j665L386J13k857J930K271k122
2838C221j135J742L97P9n74o67K134Q05k896m74M270r67l914K400K516k767j185
2855B985K249n88j102J061j86m38p9n93j62J630j625k094L271L86l934K32L431
2872D444j929k989J986J561k071o23O0j55J497j592j563J642N00k824Q78K095
2888I17k949j481L671l64l826R80K335j494j248K55L82O97q14k109J419K068k933
$$ plain form
2771 -2864 -506 -4110 -6198 -1890 -1873 -5672 -4695 -2291 -4394 -5086 -3629 -4203 -4836 -4491 -4874 -3821 -3353
2788 -3353 -6215 -5742 -1766 -3662 -7568 -3786 -1512 -5233 -6067 -2724 -2822 -4769 -3866 -3331 -3457 -2857 -3866
2805 -3866 -3449 -1272 -2388 -4160 -1568 -712 -3871 -2405 1333 -844 -3289 -15 1261 -1600 -1413 402
2821 402 1345 1103 -238 -529 2737 2640 -680 508 4218 2165 500 3886 3999 1142 3072 5343 3221
2838 3221 2086 3828 4225 4304 3730 3063 5197 6002 3106 2632 6902 5935 2021 4421 6937 4170 2985
2855 2985 5234 4646 3544 4605 4419 3981 3902 3309 3147 4777 3152 1058 4329 4715 781 1013 4444
2872 4444 2515 -474 1512 3073 1002 379 439 284 1781 189 -1374 268 768 -2056 -1178 917
2888 917 -2032 -3513 158 -206 -4032 -3052 -717 -2211 -3459 -3204 -2822 -2125 -2939 -5048 -3629 -1561 -4494
2905d494j405L437l18l286J535K228k962m77K648n80j429O57O34J22Q9j456K37
2922d820K878j353l018L740J555l998Q7L314m53k196J702Q35n39L61M27m67J284
2939f61o70p11K351K82k869J246L943k348k385L599J141k865M71K234p15k06P0
2956A907K4J483j44j986J197K709k653j281L371P8l019J358K900k347j377K472
2972D692k69j236O36j51O59L53j886K14K918r65l701K431K512l366j042K991q80
2989C910j794J477K8j226L23n38N5Q88j169j663J967N31l128M25L235k120l242
3006b041K678R87k368o63J119p24J49o4j072Q96K44k148L75K212j980k157L017
3023a540J04l873J814J957j881j708J888M53p25o66o17J111J510k534r01K903
$$ plain form
2905 -4494 -5899 -2462 -2780 -6066 -4531 -2303 -5265 -5742 -3094 -3674 -5103 -4446 -3812 -3690 -3601 -5057 -4820
2922 -4820 -1942 -3295 -6313 -2573 -1018 -5016 -4929 -1615 -2068 -4264 -2562 -1727 -2266 -1905 -1478 -1945 -661
2939 -661 -1331 -2042 309 591 -2278 -1032 2911 563 -1822 1777 2918 53 524 2758 2043 1837 1907
2956 1907 1931 3414 3270 1284 2481 5190 2537 1256 4627 4705 1686 3044 5944 3597 2220 4692
2972 4692 4423 3187 3823 3672 4331 4684 2798 3012 5930 4965 1264 3695 6207 2841 1799 4790 3910
2989 3910 2116 3593 3621 2395 2718 2180 2235 3123 1954 291 2258 2789 -339 86 3321 1201 -2041
3006 -2041 637 1624 -744 -1407 -288 -1012 -863 -927 -1999 -1103 -859 -3007 -2632 -420 -2400 -4557 -1540
3023 -1540 -1436 -5309 -3495 -1538 -3419 -5127 -3239 -2786 -3511 -4177 -4794 -3683 -2173 -4707 -5608 -2705
3039b705M0k907J706J814k633m6K574p37k294J643J154p93p6p4J74J573p53j561
3057c901K470J574l578k13L677p85k253J815J382j256K45J006n28L45K75k56R52
3074I71K47j624J031K699k043j687L355J001l238M10K833o76j285Q40J40P68m9
3091C693j018L59J665j221j017K818o96k876J786K253k364j213K911k96j816P0
3107C038P85M15j25j654Q8K130r40k494J448J839k470p44K738j012k709J740P54
3124B827j641l82O31k02j30p12j047J560P2k179j49K760k036k575K671J171l042
3141b403M1J591j426n9M85p97L85j80j035L1J543j770j353L169q8k673N03K425
3159a611k566j128K617M99j599j32K48M24N10j067n78K311q9k516J508K029k764
$$ plain form
3039 -2705 -2665 -5572 -3866 -2052 -4685 -4731 -2157 -2894 -5188 -3545 -2391 -3184 -3260 -3334 -3160 -1587 -2340 -3901
3057 -3901 -1431 143 -3435 -3648 29 -756 -3009 -1194 188 -1068 -823 183 -345 0 275 19 971
3074 971 1218 -406 625 3324 1281 -406 2949 3950 712 1122 3955 3279 1994 2834 2974 3742 3693
3091 3693 2675 3034 4699 3478 2461 5279 4583 1707 3493 5746 3382 2169 5080 4784 2968 3038
3107 3038 3823 4238 4113 2459 2547 4677 3737 1243 2691 4530 2060 1316 4054 3042 333 2073 2827
3124 2827 1186 804 1435 1233 1103 391 -656 904 976 -1203 -1352 1408 -628 -3203 -532 639 -2403
3141 -2403 -2362 -771 -2197 -2256 -1771 -2568 -2183 -2363 -3398 -3367 -1824 -3594 -4947 -1778 -1866 -4539 -4036 -1611
3159 -1611 -4177 -5305 -2688 -2189 -3788 -3920 -3672 -3248 -2738 -3805 -4383 -2072 -2161 -4677 -3169 -1140 -3904
3176c904q06L345o82j447J061J154j355J09J083m32R22o03q88K057J149k505k39
3193a981L469p87k613J946J492j904N40J553p81k01Q67n40P44O32j013Q13J540
3210C776j691j346K942L97k913O73L367j634j512R32R36j023N38k29m8J325j034
3227C456j391K068L57k648J352J826k690n30K521l61k138O34J516j170q02J10
3243B110k28J541j390j562P72J599k566o66K892p49k277J577Q09k499j70J167
3259C60l41j091O05n21O40p05j694P16K262j611k336K419R57l007P9J919q96j176
3277c421J047j85q46O66k73l23Q12j090q68K196j79k390J568K176k508j631K656
3294b593J94j755P41Q54j32K13n66k56J379k25j136J085J870k389l13K551p02
$$ plain form
3176 -3904 -4710 -1365 -2047 -3494 -2433 -1279 -2634 -2525 -1442 -1874 -952 -1555 -2443 -386 763 -1742 -1981
3193 -1981 1488 701 -1912 34 1526 -378 162 1715 934 733 1600 1060 1804 2436 1423 2236 3776
3210 3776 2085 739 3681 4078 1165 1838 5205 3571 2059 2991 3927 2904 3442 3213 3165 4490 3456
3227 3456 2065 4133 4490 1842 3194 5020 2330 1800 4321 3960 1822 2456 3972 2802 2000 2110
3243 2110 1882 3423 2033 471 1243 2842 276 -390 2502 1753 -524 1053 1862 -637 -807 360
3259 360 19 -1072 -467 -988 -348 -1053 -2747 -2031 231 -1380 -3716 -1297 -340 -3347 -3268 -1349 -2245 -3421
3277 -3421 -2374 -2559 -3405 -2739 -3012 -3335 -2523 -3613 -4481 -2285 -2464 -4854 -3286 -1110 -3618 -5249 -2593
3294 -2593 -2399 -4154 -3413 -2559 -2691 -2478 -3044 -3300 -1921 -2146 -3282 -2197 -327 -2716 -3029 -478 -1180
3311a180j928J971J465j772n91J729J9k15L8J06J247J099j919l83K261l48k261
3328f62K293Q63j786M53J796n52j013R85K19l75R3n4M78J469j248j406K429M71
3346D453l099M74L044j560j018J546N4j615N44K39j86M09j46l18O51m56j850J468
3364B634J129k034o49K822q83k710J178J281j307o74P57p08O25m42j148N92J086
3381A549j892o60J869q95j970J834R37k394l01J734j008j118P86M8K21K8j498
3398b730k49J624r57j738J864J211k866M05J721j596q86J924L22j258J01K63l57
3415c202p3l94j8J651J39k105J351J578j627j441K280L51j815J060P59p25j51
3432b382J122l18R4j50n67J174J420j691n25K584m53k399J658J647j473p6J877
$$ plain form
3311 -1180 -3108 -1137 328 -1444 -2035 -306 -287 -502 -464 -358 889 1988 69 -314 1947 1599 -662
3328 -662 1631 2494 708 1161 2957 2405 1392 2377 2596 2221 2314 2260 2738 4207 2959 1553 3982 4453
3346 4453 1354 1828 4872 3312 2294 3840 3894 2279 2823 3062 2876 3285 3139 2821 3472 3016 1166 2634
3364 2634 3763 1729 1080 3902 3019 309 1487 2768 1461 787 1544 836 1461 1019 -129 463 1549
3381 1549 -343 -1003 866 -29 -1999 -165 772 -1622 -1923 -189 -1197 -2315 -1529 -1481 -1260 -1232 -2730
3398 -2730 -2979 -1355 -2312 -4050 -2186 -975 -3841 -3436 -1715 -3311 -4197 -2273 -1951 -3209 -3108 -2845 -3202
3415 -3202 -3275 -3669 -3687 -2036 -1897 -4002 -2651 -1073 -2700 -4141 -1861 -1510 -3325 -2265 -1506 -2231 -2382
3432 -2382 -1260 -1578 -1484 -1634 -2201 -1027 393 -1298 -1823 761 308 -2091 -433 1214 -259 -335 1542
3449A542n78n57L88j64L05R08n97O2J810j347k093K521J364k573M65K438o59j552
3467A683R73K72r05P09J52j69N28m33o67J357L70k166Q27J954j861j626K410M87
3485C895k057n9J010l78k18k57k37Q57L39j933N97O60j554r1K179j044k256J538
3503I91P21j976j074J590O31m68r45k45M07K96j333o67J758j01k029J229M73j700
3521b442k16K046j462j351J318P83q51o50J40M88N34j284j419J999R71k376L10
3538c462K101j120j643J433R6o42J015O40q76n13L01M0P71k06j110J659J944k719
3556b291j294K635K60j518O92J193m51n14R37p61j86J087k11L1P81n62O0K115
3574B003j147j933K306J570k393o54K098K37n28P7L7R0M14k95l62J240r7q17Q89
$$ plain form
3449 1542 964 407 795 631 936 1844 1247 1309 3119 1772 -321 2200 3564 991 1456 3894 3235 1683
3467 1683 2656 2928 2023 2732 2884 2715 3243 2810 2143 3500 3870 1704 2531 4485 2624 998 3408 3895
3485 3895 1838 1779 2789 2411 2193 1936 1699 2556 2895 962 1559 2219 665 574 2753 1709 -547 991
3503 991 1712 -264 -1338 252 883 415 -530 -775 -368 -72 -1405 -2072 -314 -415 -2444 -1215 -742 -2442
3521 -2442 -2658 -612 -2074 -3425 -2107 -1324 -2175 -2825 -2685 -2197 -1663 -2947 -4366 -2367 -1396 -3772 -3462
3538 -3462 -1361 -2481 -4124 -2691 -2595 -3237 -2222 -1582 -2458 -2971 -2670 -2630 -1859 -2065 -3175 -1516 428 -2291
3556 -2291 -3585 -950 -690 -2208 -1516 -323 -774 -1288 -351 -1112 -1298 -211 -422 -391 390 -172 -112 2003
3574 2003 856 -1077 1229 2799 406 -248 1850 2087 1559 1636 1673 1763 2177 1882 1520 2760 2663 1846 2735
3593B735K95k088P55K571j604j256J795K99j685l19R08L9P00n25r10J048N99j792
3611A565n7J641j016r58J905p37j970R83J580j946m51Q56Q2k39l62m98j28J297
3629A547j455j158J942J07k120P35J505k001n14J455j007j159P90Q45l34n53r08
3646b283j21J295p31j316J601J255k393l35J374r14j163J706O90j264K52J59p07
3663b895K43m50q4J581l4j920N50K041j522j397J920Q10j843Q30P15o33k73R69
3681a392l09O1K09l37Q14R08j199o1K080p64k200J448K110j389m83J388K8n12
3699D00J37o3j36J384k37l22O07k65j130J574R07j901L6K437p39j934J196R82
3717B933p75n02P35j10R22q63j450J575P03j187n5J259j053j036K052mk091N82
$$ plain form
3593 2735 3030 942 1697 4268 2664 1408 3203 3502 1817 1498 2406 2445 3145 2620 1710 2758 3357 1565
3611 1565 1508 3149 2133 1175 3080 2343 373 1356 2936 990 539 1395 1477 1238 876 378 250 1547
3629 1547 92 -1066 876 983 -1137 -402 1103 -898 -1412 43 -964 -2123 -1333 -488 -822 -1375 -2283
3646 -2283 -2404 -1109 -1840 -3156 -1555 -300 -2693 -3028 -1654 -2568 -3731 -2025 -1335 -2599 -2347 -2188 -2895
3663 -2895 -2652 -3102 -3186 -1605 -1639 -3559 -3009 -968 -2490 -3887 -1967 -1157 -3000 -2170 -1455 -2088 -2361 -1392
3681 -1392 -1701 -1640 -1431 -1768 -954 -46 -1245 -1306 774 10 -2190 -742 1368 -21 -504 884 912 400
3699 400 537 474 338 1722 1485 1163 1770 1505 375 1949 2856 955 991 3428 2689 755 1951 2933
3717 2933 2158 1656 2391 2281 3203 2340 890 2465 3168 1981 1926 3185 2132 1096 3148 3144 1053 1635
3735A635J478q27p50J13K45Q80m14j521N2J087j027q29J746K40j809O65L15j192
3753H7l80J117l55r61O77j31k74k65q94K71J457p54j894J307J102j724q10J458
3771i66k91r95P38j54o34O62o7o67M32n34l76R65N85j904O66J935j497j755J171
3790b686J166j339L74R22l09n90K96m29L46N05m86L47J598j786p65K278q4j815
3808b457P94K084j506o78R01L50k72M63k73J53J167o44q16J592j0j556J443J120
3826A855j559l72J983p7j322R27Pk34O2N3J48R72l15j133J139Q70k156K39J936
3845C023m51j414J340N57j603k00J178o2J60L3o38N26L44j695M99J352j111j037
3863H01J879j42j818M75J098p97p63P39q7o10J61k03K9M51j262o77J476j53j582
$$ plain form
3735 1635 3113 2286 1536 1649 1894 2774 2360 839 891 1978 951 122 1868 2108 299 964 1279 87
3753 87 -293 824 469 -492 185 54 -220 -485 -1379 -1108 349 -405 -2299 -992 110 -1614 -2424 -966
3771 -966 -1257 -2252 -1514 -1668 -2302 -1640 -1707 -2374 -1942 -2476 -2852 -1887 -1302 -3206 -2540 -605 -2102 -3857 -2686
3790 -2686 -1520 -2859 -2485 -1563 -1872 -2462 -2166 -2595 -2249 -1744 -2230 -1883 -285 -2071 -2836 -558 -642 -2457
3808 -2457 -1663 421 -1085 -1763 -862 -512 -784 -321 -594 -441 726 82 -734 858 848 -708 735 1855
3826 1855 296 -76 1907 1830 508 1435 1442 1208 1270 1323 1471 2443 2128 995 2134 3004 848 1087 3023
3845 3023 2572 1158 2498 3055 1452 1252 2430 2368 2528 2561 1923 2449 2793 1098 1597 2949 1838 801
3863 801 2680 2538 720 1195 2293 1496 733 1472 1385 775 936 733 762 1213 -49 -726 750 597 -985
3882i85N03J309j137q67R68n20r50R22N70o00j45o55k58R62k84j166Q99P78j624
3901b280l79J259m57j245R60R72j295K00M98n60o3R3j81R39K54j378r6J753q93
3920a899j563J989M67j520J63J182l28n60P28m9j3J50n04N15J353q50q71J537
3938g3L3k070J127J496q87k10J394k26j012O18L39n26Q26r3j02P55j73j426J184
3957I74J298j152l96J682k79j186O71P39p09J75L83n19N21j68n32R99M15j528
3975A388J83J388j089j243J677J076j820k91P77o13l3M12n01L19O18r85o01J048
3993A710q77q01J980m32j885P22J138j647l24J258J24j016J31N4j19Q2q05n97
4011a304J014N39j527L70J050j513k94J378m37j646J114O06o93k68K34k79M18
$$ plain form
3882 -985 -482 827 -310 -1177 -209 -729 -1679 -757 -187 -787 -932 -1587 -1845 -883 -1167 -2333 -1434 -656 -2280
3901 -2280 -2659 -1400 -1857 -3102 -2142 -1170 -2465 -2265 -1767 -2327 -2390 -2297 -2478 -1539 -1285 -2663 -2759 -1006 -1899
3920 -1899 -3462 -1473 -1006 -2526 -2363 -1181 -1509 -2069 -1341 -1390 -1403 -1253 -1757 -1242 111 -739 -1610 -73
3938 -73 -40 -2110 -983 513 -374 -584 810 584 -428 190 529 3 829 736 634 1389 1216 -210 974
3957 974 2272 1120 724 2406 2127 941 1612 2351 1642 1817 2200 1681 2202 2034 1502 2501 2916 1388
3975 1388 1571 2959 1870 627 2304 3380 1560 1269 2046 1433 1400 1812 1311 1630 2248 1263 662 1710
3993 1710 833 32 2012 1580 -305 417 1555 -92 -416 842 966 -50 81 135 16 98 -707 -1304
4011 -1304 -290 249 -1278 -908 142 -1371 -1665 -287 -724 -2370 -1256 -650 -1343 -1611 -1377 -1656 -1238
4028a238l19j167J062J092j670l40J631m16j608P71O71j052N92N68m61o51P21
4045a814l15K38N8q79R79J079q54j486J942L75j670P57J125m42l97M15J65k65
4063i89O36n3l52R33k61l77J037K64j794J710J301j881m54J579M4q09M45L50l71
4082I58P45j76k17O95K01j149N59N27r64J10J293m80j091J196O21j746J57N72
4100A811L3L65J01q18L47N58r57j79J103n13j221J517K89j908N65J280j325n97
4118D51Q94N1k75k6n21l3Q14q17j139J141O62j616L84Q94j278n58J026o79r03
4137a528R97O63n41k40l75p81J232k17j194O75J251j633n74J228q3j212O10M26
4155a296p18K93M59p57n30Q59k22M20J90j157J07J601n36j480J345P51j074l66
$$ plain form
4028 -1238 -1557 -2724 -1662 -570 -2240 -2580 -949 -1365 -2973 -2202 -1531 -2583 -1991 -1423 -1884 -2535 -1814
4045 -1814 -2129 -1891 -1833 -2712 -1733 -654 -1508 -2994 -1052 -677 -2347 -1590 -465 -907 -1304 -889 -724 -989
4063 -989 -353 -406 -758 175 -86 -463 574 838 -956 754 2055 174 -280 1299 1343 534 979 1329 958
4082 958 1703 1527 1310 2005 2206 1057 1616 2143 1179 1289 2582 2102 1011 2207 2828 1082 1239 1811
4100 1811 1844 2209 2310 1492 1839 2397 1440 1261 2364 1851 630 2147 2436 528 1093 2373 1048 451
4118 451 1345 1396 1121 1095 574 541 1355 538 -601 540 1202 -414 -30 864 -414 -972 54 -625 -1528
4137 -1528 -531 132 -409 -649 -1024 -1805 -573 -790 -1984 -1309 -58 -1691 -2265 -1037 -1120 -2332 -1722 -1296
4155 -1296 -2014 -1721 -1262 -2019 -2549 -1690 -1912 -1492 -1302 -2459 -2352 -751 -1287 -2767 -1422 -671 -1745 -2111
4173b111R97k87m36P56l03m79Q49k65Q5R61m10r61J658l55j771J059J649q19q88
4192a071J271M34q64N25k67j59J102n2p16M19L27q58N81R86q89m81J761n97j170
4211B82J045Q19q56k92P46Q7L57k65q73N23J053q39r25J481k11j049J563L1j824
4230H53N29J097q40p26P83J46J02k43j107J08J399q39j139R62J069j523m55R95
4248A171p54n37J290k87j496P69K29n93J49k81n39J133l7j474O74R07j064r57
4266a697R39L40j028O65k55q41O26M72q21J37j97l27M89Q71j302l62J689m57j638
4285b697P14J017q16K1M99k86q6K12l07P5N62n09k89Q45k44r48J635J85j497L60
4305a554J610r38n84Q00K38l92L83k12K3Q71l60n11O50P85j192O2J661j327r1
$$ plain form
4173 -2111 -1114 -1401 -1837 -1081 -1384 -1863 -1014 -1279 -1194 -233 -643 -1604 54 -301 -2072 -1013 636 -183 -1071
4192 -1071 200 634 -230 295 28 -131 971 919 203 622 949 91 672 1658 769 288 2049 1452 282
4211 282 1327 2146 1290 998 1744 1831 2188 1923 1050 1573 2626 1787 862 2343 2132 1083 2646 2677 853
4230 853 1382 2479 1639 913 1696 1842 1944 1701 594 702 2101 1262 123 1085 2154 631 176 1171
4248 1171 417 -120 1170 883 -613 156 385 -208 -59 -340 -879 254 217 -1257 -583 324 -740 -1697
4266 -1697 -758 -418 -1446 -781 -1036 -1877 -1251 -779 -1600 -1463 -1660 -1987 -1498 -627 -1929 -2291 -602 -1059 -2697
4285 -2697 -1983 -966 -1782 -1761 -1262 -1548 -1634 -1422 -1729 -1654 -1092 -1601 -1890 -1045 -1289 -2237 -602 -417 -1914 -1554
4305 -1554 56 -882 -1466 -666 -428 -820 -437 -649 -626 245 -115 -626 24 809 -383 -321 1340 13 -78
4324g8J447m5j308R54K03m06K0M36m64Q52L36j415O40J022j165k84J555n6j264
4343I80Q07P55j326J20Q06k27l81M40p57L73O92j343J64J224m56j157R08M47j073
4362I96J9R65q98o61P98J5n05J9j86J31M02o45p36Q39M05j263J72J138j041o96
4382g32Q29J23q16J11K31m89K30j43k87M71M1p43L43Q07j666j72J285k02j298
4401b077O45R19p76m15N74l36k25M77p77M90M09o31L0R34m71j154J243K88j221
4420b074O2J334n4p70M21k7j05J62k31k0J090o78n56O82P07j087MJ605q19m48
4440h02J027L8r90O29K37k54M24J59j57M56nj054N27J631j353k35J141q8r11M93
4460I13P41q66J67M63q1M05l15k16j94J215j046m79J532l79j058J080P42j345
$$ plain form
4324 -78 1369 1324 16 970 1173 767 787 1223 759 1611 1947 532 1172 2194 1029 745 2300 2244 980
4343 980 1787 2542 1216 1336 2142 1915 1534 1974 1217 1590 2282 939 1103 2327 1871 714 1622 2069 996
4362 996 1015 1980 1082 421 1219 1234 729 748 562 693 1095 450 -286 553 958 -305 -133 1005 -36 -732
4382 -732 97 220 -596 -485 -254 -743 -513 -656 -943 -472 -431 -1174 -831 -24 -1690 -1862 -577 -779 -2077
4401 -2077 -1432 -513 -1289 -1704 -1130 -1466 -1691 -1214 -1991 -1501 -1092 -1723 -1693 -759 -1230 -2384 -1141 -853 -2074
4420 -2074 -2012 -678 -732 -1502 -1081 -1108 -1213 -1051 -1282 -1302 -212 -890 -1446 -764 -57 -1144 -1140 465 -354 -802
4440 -802 225 263 -727 -98 139 -115 309 468 311 767 762 -292 235 1866 513 278 1419 1331 420 913
4460 913 1654 788 955 1418 1337 1742 1427 1211 1017 2232 1186 707 2239 1860 802 1882 2624 1279
4478A279j8N05j26m25K99p6l36N23n41j12P76m84n94O76N50j540L1J293j191k38
4498B51N16K91p86K4K72n45L58m21o90N49M31j213L7J077r88n61R70j35j192P94
4518i61K42n58k12O21j56j1k85o35M41P33j218p5J088l07r20O73O37q24K38N33
4538i56l86k82N22m30k1J011j135M60N24l43o99Q67Q01j470L78J161k81q48M47
4557f80L47l42M41k22n24J016l27l38O57L43p43L53O75q71l50J064M39j116M77
4576B99P05n44k01N94n14O29L93r20L82P52o90m59J123M39j415M16J015o35m28
4595I41P74m29j6K11m26K1N57m32J6N85oj367J030M09j014J28J003j027l96Q84
4615A446p1p86J70L05n52M37k24j041R11N38j431K24Q84q04o01O81M44j093K88
$$ plain form
4478 1279 1261 1766 1640 1215 1514 1438 1102 1625 1084 972 1748 1264 670 1346 1896 356 387 1680 489 251
4498 251 767 1058 272 296 568 23 381 -40 -730 -181 250 -963 -926 151 -837 -1398 -428 -563 -1755 -961
4518 -961 -719 -1277 -1489 -868 -1024 -1035 -1320 -1955 -1514 -781 -1999 -2074 -986 -1293 -2213 -1540 -903 -1727 -1489 -956
4538 -956 -1342 -1624 -1102 -1532 -1553 -542 -1677 -1217 -693 -1036 -1735 -868 -67 -1537 -1159 2 -279 -1127 -680
4557 -680 -333 -675 -234 -456 -980 36 -291 -629 28 371 -372 -19 656 -215 -565 499 938 -178 299
4576 299 1004 460 259 853 339 968 1361 441 823 1575 885 426 1549 1988 573 989 2004 1369 941
4595 941 1715 1286 1270 1481 1055 1076 1633 1201 1217 1802 1796 429 1459 1868 854 982 1985 958 562 1446
4615 1446 1375 589 759 1064 512 949 725 -316 595 1133 -298 -74 810 6 -595 86 530 -563 -275
4634b75O31m65m88J51n34N56J21q97J97P26p58m19P49J18p40Q7M77o94pL66k04
4655a302r8j95M42j95M6k59k72Q45l04j162Q96P03j041J30P81l57o6N81m62L7
4675a252L12K6k83N40j91l13O68K54r06K13J220m44p79J083K98o30P2L74m37L72
4695A97K65m17M79L98m98K48O57q45j91J201j18j009R49L93q47k83Q32o58N06
4714A259K39m21j70J041p53n04P52o0p94P05P07j040k07O26p3o55Q76l41m01J81
4734I67n9k53Q27l33r94R19O39j282k33J275q34q77P90J38o23L47Nj44Kq0l94
4755a97L47M88j318L86Q61j026p11R59j06q89M87L91o07j68L63l78N5J35n23K90
4775a161O10q91n47J420m57q29L55P79r79q0Q50r8n08L87j50r8O52p03J60O91
$$ plain form
4634 -275 356 -109 -597 -446 -980 -424 -303 -1200 -1003 -277 -1035 -1454 -705 -587 -1327 -1240 -763 -1457 -1464 -1098 -1302
4655 -1302 -1400 -1595 -1153 -1348 -1302 -1561 -1833 -988 -1292 -2454 -1558 -855 -1896 -1766 -985 -1342 -1408 -827 -1289 -1252
4675 -1252 -940 -914 -1197 -657 -848 -1161 -493 -239 -1145 -932 288 -156 -935 148 446 -184 -112 262 -175 197
4695 197 462 45 524 922 424 672 1329 484 293 1494 1376 367 1316 1709 862 579 1411 753 1259
4714 1259 1498 1077 907 1948 1195 691 1443 1383 589 1294 2001 961 754 1380 1307 652 1528 1187 786 967
4734 967 908 655 1482 1149 155 1074 1713 431 198 1473 639 -238 552 690 67 414 419 275 277 197 -197
4755 -197 150 638 -680 -294 567 -459 -1170 -211 -317 -1206 -719 -328 -935 -1103 -740 -1118 -1063 -928 -1451 -1161
4775 -1161 -551 -1442 -1989 -569 -1026 -1855 -1500 -721 -1700 -1780 -930 -1028 -1536 -1149 -1299 -1397 -745 -1448 -1288 -597
4795e97j49q49P33N41r64r7J162j14r08P54K01m60J55M65o06O76j55m46N65J72
4815G9m50N2R78n97m57R71L18r55O6R95m15J66k5m77O02L09m76j40R58l74p43
4836C85J117k72o88O01J73m44k3O82N4o71M72n44L07M44p02k97J089P3j221O83
4856A218N64q15r1Q64n70p52P60M5r27M57K05n16N41J6r38O89L2j225K54J047
4876H58q48n96P22P3n30P2M32p40J99P1l47J9K64q90J54R52q85m70R53K09j309
4897a637M18N64n77j16P45p05N9K68K3m50M01k4l73M42J25p39J07Q37q67j32J037
4918e94l73o88O28L97k55Mj00j11N29k23j50M46M51p00J00J083p80n17J035lp84
4939f05M81N65n68K37r8K50Q5M39q70L56R49o90l74R38J73j063L12O72k85k93
$$ plain form
4795 -597 -746 -1595 -862 -321 -1285 -1382 -220 -334 -1242 -488 -287 -747 -592 -127 -733 -57 -212 -658 -93 79
4815 79 -371 -319 659 62 -395 576 894 -61 5 1000 585 751 726 249 851 1160 684 544 1502 1128 385
4836 385 1502 1230 542 1143 1316 872 849 1531 1585 914 1386 842 1149 1593 891 594 1683 1756 535 1218
4856 1218 1782 967 876 1740 1170 418 1178 1223 296 753 958 442 983 999 61 750 782 -443 -189 858
4876 858 10 -586 136 209 -321 -249 183 -557 -358 -287 -634 -615 -351 -1241 -1087 -135 -1020 -1490 -537 -328 -1637
4897 -1637 -1219 -655 -1232 -1348 -603 -1308 -1249 -981 -958 -1408 -1007 -1031 -1404 -962 -837 -1576 -1469 -632 -1499 -1631 -594
4918 -594 -967 -1655 -1027 -630 -885 -881 -981 -1092 -563 -786 -936 -490 -39 -739 -639 444 -336 -853 182 179 -605
4939 -605 -124 441 -127 110 12 262 347 786 -84 272 1221 531 157 1095 1268 205 517 1189 904 611
4959F11M42J2l60M52k99J12K79l87Q2M91k13p46L31N14q82K52P72k66p06O40J22
4980A253n03M80l85l55R04k66p56K95N93r28j99P63k11q00O89J9m09M1K28j22
5000C31k12J99m46N9Mm57K37P50p96o19J003J43j093M78J36k83m38N75l70j30
5020i29M03l88l4O95q17m13Q58K04p24L30L95p76m28N19P4m35M50j51J9J76J37
5041h35p67N83J36o43O73K74q95Q0R26j16r01Q25M51p82L92M54l06JJ64j65M58
5062GL18o42jR08k69p86P69M60p52L54M28m70L1O97n40M7K70J7j54O46p42l62
5084B34J135q0m22j03R10p65j16M87k49k09K47R0l30M74j67k22Q2M47o34J56M26
5105A391m53o04Q77j69m71K12m5k5m0k1n92N96L9m92M5L97r51O8Q54o88l68P61
$$ plain form
4959 611 1053 1065 705 1157 858 970 1249 862 944 1435 1222 476 807 1321 439 691 1463 1197 491 1131 1253
4980 1253 750 1230 845 490 1394 1128 372 667 1260 332 133 896 685 -115 574 593 184 225 453 331
5000 331 119 318 -128 -69 -65 -522 -285 465 -331 -950 53 196 -897 -419 -283 -566 -1004 -429 -799 -929
5020 -929 -526 -914 -948 -253 -1070 -1483 -625 -421 -1145 -815 -420 -1196 -1624 -1105 -1031 -1466 -1016 -1167 -1148 -972 -835
5041 -835 -1602 -1019 -883 -1526 -853 -579 -1474 -1394 -468 -584 -1485 -660 -209 -991 -599 -145 -451 -450 -286 -451 7
5062 7 325 -317 -318 590 321 -465 304 764 12 366 794 324 355 1052 512 559 829 846 692 1338 596 234
5084 234 1369 1289 867 764 1674 909 793 1280 1031 822 1069 1159 829 1303 1136 914 996 1443 809 965 1391
5105 1391 938 334 1211 1042 571 783 738 713 673 652 60 656 695 203 248 645 -306 -238 616 -72 -440 321
5127C21J88q01j54O83l92k91K11k56j61L57o57L51K39m30m39L08K53m75K03J97
5147g45k32l15N44j25j98J49K2n53M15O3j05M65k35r93J317K65n92m81N32L75
5167d27q71N98M44o05L48k4n74P07J06n50M61N74n72M1O33n05p46J095K51p20
5187c36K4O04j55j71J63j50J40K61m95m5P94q4m53N58j5r36Q31K99k09n30R07
5208A002k50k65M00j62k82N95r3j47N67N3o20J79O04m57k53R05n22n02M07p6k00
5229H83K41j92j65N12R1j118J4J065q64l2L32O9o88L44P6l37j30M12k95j71K61
5250C08j17j56M45j110J39Q04o95o72N89M77q06J43M79m32m02O70m42J94J77k64
5270f71m13O03l47k69M71k5p01J87N68o08l41Q31j71l20N08r4k48M64n36k42M43
$$ plain form
5127 321 509 -292 -446 237 -155 -446 -235 -491 -652 -295 -952 -601 -362 -792 -1231 -923 -670 -1145 -942 -745
5147 -745 -977 -1292 -748 -873 -1071 -922 -900 -1453 -1038 -975 -1080 -615 -850 -1843 -526 -261 -853 -1334 -802 -427
5167 -427 -1298 -700 -256 -861 -513 -537 -1111 -404 -298 -848 -387 187 -385 -344 289 -216 -962 133 384 -336
5187 -336 -312 292 137 -34 129 -21 119 380 -115 -160 634 550 97 655 640 -296 535 834 625 95 1002
5208 1002 752 487 887 725 443 1038 945 798 1365 1418 798 977 1581 1124 871 1776 1254 752 1159 1083 883
5229 883 1124 932 767 1279 1370 252 266 1331 467 435 767 836 148 492 568 231 101 513 218 47 308
5250 308 191 35 480 -630 -491 313 -382 -1054 -465 12 -794 -651 -172 -604 -1006 -336 -778 -584 -407 -671
5270 -671 -1084 -481 -828 -1097 -626 -651 -1352 -1165 -597 -1205 -1546 -715 -886 -1206 -698 -792 -1040 -576 -1112 -1354 -911
5291i11L83j063O43N26n25j84Q02J22j047N44M79o50M18J90o0K05K46n83m1Q95
5311C89k76k48P91m16l77Q85Q7r26K75R17o16R2L42k85p9N51o95J32O89n22l60
5332C50N67j6j91j64O18m98k96P28p1n02M10p3l13L10j95n32J007O6q49j53J076
5353A279n37m77O19j36m64O39j82n21K21K08l19J01J93l43L36K06r65j90J001
5372F69j32j068O05N59o54k16K13M8o18R17p58J7M62n22k27M73j2o08O54K29j207
5393a176j39J033m68MJ51k80k61N23j71k16K26j79k24K37K35o75N41P35j035L8
5413a101N78j89o39L52J81j52L33k76ML24M11n86p8R26n26k21O19k64n16N63N30
5434B73q77Q6O31q9o61R18j47l68Q21o21j34R30k53l79M05L20p43M5O55k35l72
$$ plain form
5291 -911 -528 -1591 -948 -422 -947 -1131 -329 -207 -1254 -710 -231 -881 -463 -273 -333 -128 118 -465 -506 389
5311 389 113 -135 656 240 -137 748 835 -91 184 1101 485 577 919 634 555 1106 411 543 1232 710 350
5332 350 917 901 710 546 1164 666 370 1098 1027 525 935 862 549 859 664 132 1139 1205 356 203 1279
5353 1279 742 265 884 748 284 923 741 220 441 649 330 431 624 281 617 823 -142 -332 669
5372 669 537 -531 74 633 -21 -237 -24 24 -594 323 -435 -418 44 -478 -705 -232 -244 -852 -198 31 -1176
5393 -1176 -1315 -282 -750 -746 -595 -875 -1136 -613 -784 -1000 -774 -953 -1177 -940 -705 -1380 -839 -104 -1139 -1101
5413 -1101 -523 -712 -1351 -999 -818 -970 -637 -913 -909 -585 -174 -760 -838 88 -438 -659 -40 -304 -820 -257 273
5434 273 -604 -518 113 24 -637 281 134 -234 587 -34 -168 762 509 130 535 855 112 157 812 577 205
5455B05J068k99l13J54m5k2L40j28o59Q65R7r57N3Q72j10o33M60J36n85L52K42
5476A093o30O64k19m38K08K23n01J40M36o06k06P80Qr04K42K24l96j9M19o32k70
5497c84Q57m28j25J34m30K1L83l29o12P28N7p65j06J029o04n07N56k30R2J20j
5518e44n80M43K93o43L57L11r13N77N73o97j94O37J90o85J55k3j38K34Pk98J31
5539h07K20l89qM57m46K5Q28j78o09N70J0l36pO85l48p3N03p43M02P05n82k46
5561c67O85j89o50N95M30o78J16Q90l06m59L38j54MJ44Q9j85P40k99p46Q60J29
5582I87n17k21R57p93l1O84P5o31J39L5k84N57m24o4L90Q5o17K96L63l44k65N44
5604I21J12r14N49R0k89j07r2q3K87L39m91j28M23m01n27P92k78m18N61l1n33
$$ plain form
5455 205 1273 974 661 815 770 748 1088 960 301 1166 1263 306 359 1231 1121 488 948 1084 499 851 1093
5476 1093 463 1127 908 470 678 901 400 540 976 370 164 944 952 48 290 514 118 99 518 -114 -384
5497 -384 473 45 -80 54 -376 -355 28 -301 -913 -185 -128 -893 -999 30 -574 -1081 -525 -755 -663 -543 -544
5518 -544 -1124 -681 -388 -1031 -674 -363 -1276 -699 -126 -823 -1017 -380 -190 -875 -720 -743 -881 -647 -640 -938 -807
5539 -807 -587 -976 -984 -527 -973 -948 -120 -298 -907 -337 -327 -663 -670 15 -333 -406 97 -646 -244 461 -121 -367
5561 -367 318 129 -521 74 504 -174 -58 832 526 67 405 251 255 399 488 303 1043 744 -2 858 987
5582 987 470 249 1206 413 382 1066 1141 510 649 684 400 957 533 469 859 944 327 623 986 642 377 921
5604 921 1033 119 668 758 469 362 270 187 474 813 322 194 617 216 -311 481 203 -215 346 315 -218
5625b18N1N66n07l34L10J25k53J76o44K97K74J55q45P12L2o79P4M01j24m15K33
5646f13j39n95R07j08l65O09o59j76L58L37p92K23Q80p48k64O7M13m13L22K32
5666e24m38K85J29n35P2N39o59L2J201q00k63O78J05o42L63M26l68O3M24o3l40
5687c15L97J67n46M80L12j72K74M4p04M69M16o14N9Q12l41k74N69o2m28K84J10
5708I37l58K85P8o44L15M08k32k0L12k56m46N86Mo68N89R8o01L02J24m56K48J56
5730G61l72j58O21n18m79O07L66q40K42K45l50n4L40k98j96M38k74j92L16J00
5750C05o98N04L1n64J43P09m99o25O75m88k10L54k32J29K33j66l40M65k04m44
5770i22L26J46j41n8N41l96p67J109n24k88K47J76l19j84M43m07N17K03p83L34
$$ plain form
5625 -218 -167 399 -108 -442 -132 -7 -260 -84 -728 -431 -157 -2 -847 -135 -103 -782 -708 -307 -431 -846 -613
5646 -613 -752 -1347 -440 -548 -913 -304 -963 -1139 -781 -444 -1236 -1013 -133 -881 -1145 -1078 -665 -1078 -756 -524
5666 -524 -962 -677 -548 -1083 -1011 -472 -1131 -1099 102 -698 -961 -283 -178 -820 -457 -31 -399 -336 88 25 -315
5687 -315 82 249 -297 183 495 323 597 641 -63 406 822 208 267 1079 738 464 1033 971 543 827 937
5708 937 579 864 942 298 613 1021 789 769 1081 825 379 965 969 301 890 988 387 689 813 357 605 761
5730 761 389 231 852 334 -145 462 828 -12 230 475 125 71 411 113 -83 355 81 -111 205 305
5750 305 -393 111 142 -422 -279 430 -69 -694 -19 -507 -717 -363 -595 -466 -233 -399 -739 -274 -478 -922
5770 -922 -596 -450 -591 -649 -108 -504 -1271 -162 -686 -974 -727 -551 -870 -1054 -611 -1018 -501 -298 -1081 -747
5790g47K98l08k26P52nq15R05q5k21m5L16j57k56N82l34j19N64l47OL40J72r43
5812f73K71O62n72J53Q29n48k53L00K6k25K83k91Q8O41o7p58M31O02n66J09N14
5833I56j75m49O98K4r73P28L98n59L18k95J08K65O4n52q7Q87m68o01P83l52k11
5854E07M06K56p62M6Q01n89l15K84n7j15L5m85j69P63j43j039O61L70m77q8K02
5875I2j41n11N80k48l32M89N2q39N87J89n93M26j6o57p7J303p20k53L3L26m86
5896g96K62O4n51O04J11n72K02L32n51J67P04o97l72N81L55p52M83L49l14k86
5916f77J46j74k28M36m19J10O09k98r1L73j59l90L89M59n10J32N35j93l43N65
5936B72q9k48K76l76r4N46L69q46K67N13m94J3N44k96m6Q72l43p13M24P3l12N43
$$ plain form
5790 -747 -449 -757 -983 -231 -236 -1051 -146 -231 -452 -497 -181 -338 -594 -12 -346 -465 99 -248 -242 98 270 -673
5812 -673 -402 260 -312 -159 670 122 -131 169 195 -30 253 -38 50 691 624 -134 297 899 333 442 956
5833 956 781 332 1030 1054 81 809 1207 648 966 671 779 1044 1108 556 469 1356 888 287 1070 718 507
5854 507 913 1169 407 453 1254 665 350 634 577 462 497 12 -157 606 463 -576 85 455 -22 -110 92
5875 92 -49 -560 20 -228 -560 -71 -19 -858 -271 -82 -675 -249 -265 -922 -999 304 -416 -669 -636 -310 -796
5896 -796 -534 -470 -1021 -417 -306 -878 -676 -344 -895 -728 -24 -721 -1093 -512 -157 -909 -426 -77 -391 -677
5916 -677 -531 -705 -933 -497 -916 -806 -197 -495 -586 -213 -372 -762 -373 86 -424 -292 243 50 -293 272
5936 272 183 -65 211 -165 -259 287 656 -190 77 590 96 109 653 357 311 1183 840 127 551 624 312 855
5958H55o6m67O09L0o20j70R55m49p5M93O6p09O8K29m72QM36k81p6J70l89L10L66
5981H21l08n53P23j20m63R9J10j13j10L29n22n9N89j18L0K60p44j80M29J59p71
6002e12L90L60n41k12Q99n53m34O31j62n88P08j11n54L61J51p71L55K76m44K42
6022e09J85k35k73N09N2m95o1L26j25J69r3k33K93L37l99l63P97k47m62N68j62
6043d21n96L81P60q19J62N98p01p6L42j45m1P39k90k49J37M93p01K97M63j67p4
6064I2M77l60m61O05O5j19J3J17l8K76N8q13L82M14l21o2L97J39p40K91K84k07
6086D89K01J96p21N26L74p28L48N08l43j56M26n65m69P92J40p55J06N37p23L95
6106E78N5m2j94Q28o02Q8j03j09m52N31M8n41j5N29n60l52O93j53j23K38n51J09
$$ plain form
5958 855 789 322 931 961 341 171 1126 677 602 1095 1161 452 520 749 277 285 721 440 364 534 145 455 821
5981 821 513 -40 683 563 100 199 309 196 86 415 -107 -166 423 305 335 595 -149 -329 100 259 -512
6002 -512 -122 238 -303 -515 384 -169 -603 28 -134 -722 -14 -125 -679 -318 -167 -938 -583 -307 -751 -509
6022 -509 -324 -559 -832 -323 -271 -766 -827 -501 -626 -457 -550 -783 -490 -153 -552 -915 -118 -365 -827 -259 -421
6043 -421 -1017 -636 124 -695 -533 65 -636 -712 -370 -515 -556 183 -107 -356 -219 274 -427 -130 333 166 92
6064 92 569 209 -252 353 418 299 312 429 391 667 725 -88 294 708 387 325 722 861 121 412 696 489
6086 489 690 886 165 691 1065 337 685 1193 850 694 1120 555 86 878 1018 263 369 906 183 578
6106 578 633 591 397 1225 623 711 608 499 47 578 626 85 70 599 39 -313 380 227 104 342 -209 -100
6128a00J08l48j32J26L95o96l5P26n80k65L60k46o31O08L6k32K12N11o86O3K36
6149e70q7k03L46l74l19Q47o29j06M51J27n92M81K38k76N2K83k90L7M62l23K59
6170a86K18j72n18M45J52m22K56J93k27R2J87K14k80kJ6n5K82l29k01N24L16q94
6192c91N70M45r15k4N45q2n8L85K9j78j11K27k76M36km35K85Q97q05k63M47J52
6214H78n33L35L36m41j31K91j78l8K68k46J30m9k26k9O17j06l26O4J90n26j58
6235A22O34l95k37K27j75M22l06k80o5L99m5l89K92L5p31O53Q4q12L30K34K04
6256B01q47N30K43p39L51j12j19l9K70n96k5O60j77o37Q01j32o55L80K18l51p8
6277h53L66m29M26J21n01N4L73j93n75R12m77m55Q26Q2m02o0L09p2l84P32m33
$$ plain form
6128 -100 8 -340 -472 -346 49 -647 -682 44 -536 -801 -441 -687 -1318 -710 -674 -906 -694 -183 -869 -806 -570
6149 -570 -657 -860 -514 -888 -1207 -360 -989 -1095 -644 -517 -1109 -628 -390 -666 -614 -331 -621 -584 -122 -445 -186
6170 -186 32 -140 -658 -213 -61 -483 -227 -34 -261 -169 18 232 -48 -50 -34 -89 193 -136 -337 187 503 -391
6192 -391 179 624 -291 -315 230 148 90 475 504 326 215 442 166 602 600 165 450 1347 542 279 726 878
6214 878 345 680 1016 575 444 735 557 519 787 541 671 622 396 367 984 878 552 616 806 280 122
6235 122 756 361 124 351 176 598 292 12 -53 346 301 -88 204 239 -492 161 245 -567 -237 -3 201
6256 201 -646 -116 127 -612 -261 -373 -492 -531 -261 -857 -882 -222 -399 -1036 -235 -367 -1022 -642 -424 -775 -853
6277 -853 -487 -916 -490 -369 -870 -816 -443 -636 -1211 -299 -776 -1231 -405 -323 -725 -785 -476 -548 -932 -200 -633
6298f33RK70l83l8P74k02k57J79J02l10M69R9k47q3P68q6m76K69l8J71r7K4p0
6321B14K36N1n69L64M14m25j64O43q1o15O95J35n67L60J57l13j77M64j20j84L98
6342I16n07j82N84p5m30L09K50m13j51P73q61p9N67j92o8J83n1k58L90j23o09
6363b7M24J37n66k24Q15m68k03L72l0k75K56k21k87Q0L22m11J27L23q74L90M31
6384I1o73l06O56k36o38Q10om70J66J6k54N59L9p10JM25M7k31L88l49k71K46K78
6407d22m84K16L90l14j95L71k04J27J33j07k59O98l40m12M87J91o13L42K81%n57
6428f71N95j09p0J67J79l19M29p6n12M10M77p61J62N27k97j07P27m70k88K33L67
6449E93l28k42N09k91J50J64k34q4N02m72K28M67k40k80J66J61l06j7P08n90j08
$$ plain form
6298 -633 -624 -354 -737 -775 -1 -203 -460 -281 -179 -489 -20 79 -168 -251 517 431 -45 224 186 357 260 284 214
6321 214 450 501 -68 296 710 285 121 764 683 68 763 898 331 691 848 535 358 822 702 518 916
6342 916 409 227 811 736 306 615 865 452 301 1074 213 134 701 509 441 624 573 315 705 582 -27
6363 -27 397 534 -32 -256 559 91 -112 260 230 -45 211 -10 -297 -217 105 -306 -179 144 -730 -340 91
6384 91 -582 -888 -232 -468 -1106 -296 -302 -772 -606 -590 -844 -285 -246 -956 -955 -530 -483 -714 -326 -675 -946 -700 -422
6407 -422 -906 -690 -300 -614 -809 -438 -642 -515 -382 -489 -748 -50 -390 -802 -315 -124 -737 -395 -114 -114 -671
6428 -671 -76 -185 -255 -88 91 -228 201 125 -387 23 500 -261 -99 428 131 24 751 281 -7 226 593
6449 593 265 23 532 241 391 555 321 237 739 267 495 962 722 442 608 769 463 446 1154 564 456
6470D56L11j38J13L65n05l22P18k24l63L20J92n97l7N22l10j64L79k65o27O19
6490D43k57j06J69J02j35m34M49m67o4O43o02m44M75l0J71j3j80k05kK12l37J77
6512d35M41p12K13J27j90j99L82N9l51J26L14p38j30Q37k04m27L35k97k3L96q5
6533e61m03M57R8l68J73J59j95N8K96l90Q2K70k8m40J58L73m19N74J3p38Q36K06
6555B11p40K50M48k33J22K38l23k67O21j8k73L18K42k23l3L22k43j69N52m92k6
6576B84N01J22q27M34N11o03K94m8j58j53N60k00m7P8k29N82l78K98j025M95M97
6597I88n75j42N36j08o36M33l40O6L80l1n01L69j4l34K74K81m16k78O48o09k3
6618c2M54l10k8O1Q1l87l7N74p85L68n1n16K75J30m2k86N06l61k97r1M98m66R6
$$ plain form
6470 456 767 629 742 1107 602 280 998 774 411 731 923 326 289 811 501 337 716 451 -176 443
6490 443 186 80 249 351 216 -218 231 -236 -300 343 -259 -703 -228 -258 -87 -100 -280 -485 -487 -275 -612 -435
6512 -435 6 -706 -493 -366 -556 -755 -373 -314 -665 -539 -225 -963 -1093 -256 -460 -887 -552 -849 -872 -476 -561
6533 -561 -964 -507 -409 -777 -604 -445 -640 -582 -286 -676 -594 -324 -352 -792 -634 -261 -680 -106 -93 -831 5 211
6555 211 -529 -279 169 -64 58 296 -27 -294 327 309 36 354 596 373 340 662 419 250 802 310 284
6576 284 785 907 80 514 1025 422 716 668 510 357 917 717 670 748 519 1101 723 1021 -4 491 988
6597 988 413 271 807 699 63 496 156 222 602 571 70 439 425 91 365 646 230 -48 600 -9 -32
6618 -32 422 112 84 145 226 -161 -198 376 -409 -41 -92 -608 -333 -203 -245 -531 -25 -386 -683 -774 -276 -742 -646
6641f46L80l31P7K27o9p31Q15n18J66M92l09l58K69M62r46L07L43l40j55M40j14
6662e39j93K48J3k99Q2L28n5r0K79k82j11M45l61K34J81L9n52O23J6m55M79R3
6684A23l85K43M85n95k20O18k4l22M68J28k35J49J91l07K7M63n71P9R7J52k18
6705C46M50k86j90N33L4n89J68M90k28l39L41l79R5M03n11j64O50k80n05O25j90
6726D74k06N46p9o89L55L23k70l56K26K68k07j8k39K62q0L2l98K31J92o67J17
6747a83M23j27n06K20K48k79J8L29l29j32K00k7j6l17j72M94L8l35l01M07Ml36
6769f79n0K46o32K69N61n00J72mj04j26K68K2m27P47n05m76L42N36k76k33O65
6790a84l90j97L92j88LL18n3n4K36K86n46J10K1j12K27L02j76j53M11j07l42J47
$$ plain form
6641 -646 -266 -597 -520 -293 -362 -1093 -278 -796 -630 -138 -447 -805 -536 -74 -1020 -713 -370 -710 -865 -425 -539
6662 -539 -732 -484 -471 -770 -688 -360 -415 -505 -226 -508 -619 -174 -535 -301 -120 -81 -633 -10 6 -449 30 123
6684 123 -262 -19 466 -129 -349 269 245 -77 391 519 284 433 624 317 344 807 236 315 412 564 346
6705 346 796 510 320 853 887 298 466 956 728 389 730 351 446 849 338 174 824 544 39 664 474
6726 474 268 814 735 46 401 724 454 98 324 592 385 367 128 390 310 342 -56 175 367 -300 -183
6747 -183 240 113 -393 -173 75 -204 -186 143 -186 -318 -118 -145 -161 -478 -650 -156 -118 -453 -754 -347 -343 -679
6769 -679 -729 -483 -1115 -846 -285 -785 -613 -617 -721 -847 -579 -557 -984 -237 -742 -1218 -876 -340 -616 -849 -184
6790 -184 -574 -771 -379 -567 -564 -246 -299 -353 -117 169 -377 -267 -246 -358 -131 171 -5 -158 253 146 -196 -49
6812d9K20k5PK49n82N33Rj5k71N17K8p03M85J68q6N3L7k72O2O66n96Q6J12M1l46
6837C28L18j70j17O16p0n98L93K01l73k99L93ll04K48J7k13K69K3j34m12M58n11
6859F0L25M5m11M42J25m57m16O08j10k05J05j71R0n4k5k06PL14j63m70N98j41
6881a10l63J64J15k41L68No03r5M79n7l38R8j18j5K28J74l56K17J55n63K89M64
6903a03r31K17L56m59k16O79J11l66J3M30l33l0J70l48L31K39n92J35L80K04o97
6924h10O43m5l46N82m45J7J83M51p58K49O36k99R1J24Om61P26r1l55L31lk25J72
6947C73j54K94j44K70l44q3N03j62k76M44K17n80K39m1n5JM48m48j40L96L68n80
6969E46k5k02M2J14J51k73R2J67q9j79K98O4o38K26K99m59L68K96o48P2M07k00
$$ plain form
6812 -49 171 146 153 402 -180 353 362 347 76 593 621 -82 403 571 485 538 575 303 365 1031 435 521 633 674 328
6837 328 646 476 359 975 905 307 700 901 528 229 622 619 315 563 580 367 636 659 525 113 571 60
6859 60 385 430 19 461 586 129 -287 321 211 6 111 -60 30 -24 -49 -255 -248 66 -97 -567 31 -110
6881 -110 -473 -309 -194 -435 -67 -62 -665 -760 -281 -338 -676 -578 -696 -711 -483 -309 -665 -448 -293 -856 -567 -103
6903 -103 -1034 -817 -461 -920 -1136 -457 -346 -712 -699 -269 -602 -632 -462 -810 -479 -240 -832 -697 -317 -113 -810
6924 -810 -167 -212 -558 24 -421 -404 -221 230 -528 -279 357 58 149 273 279 -182 544 453 98 429 426 201 373
6947 373 219 513 369 639 295 212 715 553 277 721 938 358 597 556 501 502 950 502 362 758 1126 546
6969 546 521 319 361 475 626 353 445 612 523 344 642 706 68 294 593 134 502 798 150 222 629 429
6991D29l96K21l94J49N44m40l74K50J89m59j26K69j91j50O23l93r3L52m18m11
7011h19M87r9l06K93pj93jL76m50k57O41k81l20J89m4J41K59L6q76O68J26m32
7033h69M68m09K74o2N11m19j15L54J64j29k69J16k80K60L78p92N43J07j51j60
7053d80N93k53m08L13J64j25K68Q6k20L11J14k66R5K55k66m0J72k5m51O75R5l07
7075C00j24M10o2l33N88m99k5K89R2j90J37L12n54J27L47k94o7M04m03k69P10
7096H96k61k59P97p27m2K84k18k22K50M8r5J23p7o8m46N53q4p28O06K46n07P3
7118A42j82Q3l07N54l05k73M91n22J38K11l94l90Q36J12q35L30K18l31j93J78
7138d39r4j28L18Jk21N0M0l63L01M4p9j75N53m15J98K11k22l57J81K5k36L16j36
$$ plain form
6991 429 33 254 -140 9 553 113 -261 -11 178 -281 -407 -138 -329 -479 144 -249 -342 10 -408 -819
7011 -819 -332 -431 -737 -444 -451 -644 -645 -269 -719 -976 -335 -616 -936 -747 -791 -650 -391 -355 -1231 -563 -437 -869
7033 -869 -401 -810 -536 -598 -87 -506 -621 -267 -103 -232 -501 -385 -665 -405 -27 -819 -276 -169 -320 -480
7053 -480 113 -140 -548 -235 -71 -196 72 158 -62 249 363 97 192 447 181 141 313 288 -163 512 607 300
7075 300 176 586 524 191 779 280 255 544 636 446 583 895 341 468 815 521 454 858 455 186 896
7096 896 635 376 1173 446 404 688 470 248 498 546 451 574 497 429 -17 536 452 -276 330 576 69 142
7118 142 -40 43 -264 290 -15 -288 203 -319 -181 30 -364 -754 82 194 -641 -311 -93 -424 -617 -439
7138 -439 -533 -661 -343 -342 -563 -513 -473 -836 -535 -491 -570 -745 -192 -607 -409 -198 -420 -777 -596 -571 -807 -491 -627
7161f27j07K13M02k52l08O49m95k29K64J21j32L24j1j15j34N24l53n9M41m16j6
7182c16O84l84m03Q36l45l24M66J66m14J94R5k2m17R55m99j08P57o38l75P38l65
7203B81K1L41J60m65m9K82j26k12L01J98k46M43m30j1J01L80p44qM60k25j22L26
7225F56l86N4K33k39j84K90J58k14M2O6m48J34L38m12m17R06n02l89P59l51k81
7246a87L01J01m52J17L65l64l47M35No1Mm32K23M75k51q99P09K31m85j78M21k93
7268e62k27P49m07k39M6J82l25O08j56m93M36j6n86K92L95k66j79L92j13k70K38
7289e01jK5j81K68m6j04K14qm82O59kn15N72k26l6M42L27p01j28P20k05k89J47
7312e1L04l64N44k72j17M43j20j56M29j66j71l69O73l76k14O75j36k40N18k19
$$ plain form
7161 -627 -734 -521 -119 -371 -679 -30 -525 -754 -490 -369 -501 -177 -188 -303 -437 87 -266 -325 116 -300 -316
7182 -316 368 -16 -419 417 72 -252 214 380 -34 160 255 233 -184 771 272 164 921 283 -92 646 281
7203 281 302 643 803 338 289 571 445 233 534 732 486 929 499 488 589 969 225 217 677 452 330 656
7225 656 270 324 557 318 134 424 582 368 410 476 28 162 500 88 -329 577 75 -314 445 94 -187
7246 -187 114 215 -237 -120 245 -119 -466 -31 -26 -87 -83 -515 -292 183 -68 -967 -258 -27 -512 -690 -269 -562
7268 -562 -789 -40 -447 -686 -640 -458 -783 -175 -331 -824 -388 -404 -990 -698 -303 -569 -748 -356 -469 -739 -501
7289 -501 -502 -477 -658 -390 -436 -540 -326 -334 -816 -157 -159 -674 -102 -328 -364 78 405 -296 -424 296 91 -198 -51
7312 -51 253 -111 433 161 44 487 367 211 640 474 303 -66 607 231 17 692 556 316 834 615
7332F15l23L80j20k36L7M72n15J67L71m14k65L92j78l01O47j33m05k4P29o26K22
7353D92J42j65M0n8j09k31N67j14o39M25N2j73k33L91j19k37L97n10q5Q51p43
7374e9l20L34K14m32Q3L13o10K68L61n88j28N45k29r7J03k55j18o5J50m27M53
7395e04O6q4j24M48k32k62K14r9l81M70L45o59K31K73m67K51K6l94L71L77m38
7416e72n6M01nl90K30K01l39J8N96n38Q7N56j72l02L18n0j46K49q5q1K83J50n33
7439a80K02M59m90j7J56j39J59K70J3m21K81J28j23K5L23o31L85M58k32n01O45
7460G70l66l08N75j60j45L14J55l97L8K8p7k74P75o69k17M02J44m80L21j70k61
7481bL49K24n24R8L67k27j49J17j05l31M95p4m40K72N33o43j94n7J5jL80l52K23
$$ plain form
7332 615 292 672 552 316 353 825 310 477 848 434 169 561 383 82 729 596 191 167 896 270 492
7353 492 634 469 509 451 342 111 678 564 -75 350 402 229 -4 387 268 31 428 -82 -167 684 -59
7374 -59 -379 -45 169 -263 -180 133 -477 -209 152 -436 -564 -19 -248 -345 -242 -497 -615 -680 -530 -957 -504
7395 -504 -438 -522 -646 -198 -430 -692 -478 -577 -958 -488 -143 -802 -571 -298 -765 -514 -488 -882 -511 -134 -572
7416 -572 -628 -227 -232 -622 -392 -191 -530 -512 84 -454 -367 189 17 -285 33 -17 -163 86 1 -80 203 353 -180
7439 -180 22 481 -9 -26 130 -9 150 420 433 12 293 421 298 323 646 15 400 858 626 125 770
7460 770 404 96 671 511 366 680 835 438 476 504 427 153 928 259 42 444 588 108 429 259 -2
7481 -2 347 571 47 145 512 285 136 253 148 -183 312 238 -202 70 603 -40 -234 -291 -276 -277 103 -249 -26
7504b6K30l49n41M31M03m88l3K37l65J11M07o90L37J54j01l73L95k64N9j36L51
7525b51o20M16L10m15J21L04l5l05K30j55j24L26p5j34l08P47m08J0N7j35j56
7546f00M26l86o7O22P0m50J47K34l04J67J27k71Q2L57j63nK11n6l28N78j32l37
7568g8J92L48l40l4N60l49k65M44Mk24Q1K75l81M33q0k56q0N54k08l91N41k1n97
7591A28M97p8m82L44K73l36j90M10k29l4K89k11k70M07k63l91Q15j42p64L39R3
7612B05J05m47Q44p95J60K37k32k54M81J40m55J67k64k66J69M51l80j7L38j21
7632F6m09L95n1J8j07l84m25N61j1k79K97K2k25k30O23n25j11N09k92j36m5M44
7654b95l84R3L91m35N28K82p26j71N08l1n69L78M45j74j73M13p67J80P50l76o40
$$ plain form
7504 -26 204 -145 -686 -255 148 -340 -373 -136 -501 -390 17 -673 -336 -182 -283 -656 -261 -525 -466 -602 -251
7525 -251 -871 -455 -145 -560 -439 -135 -170 -475 -245 -400 -524 -198 -273 -407 -715 32 -376 -366 -309 -444 -600
7546 -600 -174 -560 -627 -5 65 -385 -238 -4 -308 -141 -14 -285 -203 154 -9 -14 197 141 -187 391 259 -78
7568 -78 114 462 122 88 648 299 34 478 482 258 339 614 233 666 586 330 250 804 596 205 746 725 128
7591 128 625 547 65 409 682 346 156 566 337 303 592 381 111 518 255 -136 679 537 -227 112 205
7612 205 310 -137 707 -88 72 309 77 -177 304 444 -11 156 -108 -374 -205 246 -134 -151 187 66
7632 66 -343 52 1 19 -88 -472 -897 -336 -347 -626 -329 -307 -532 -762 -139 -664 -775 -266 -558 -694 -739 -295
7654 -295 -679 -586 -195 -630 -102 180 -546 -717 -209 -240 -809 -431 14 -160 -333 80 -687 -507 243 -133 -773
7675g73O56M3k74N62k68k70K34L22q51N19P16o55j92O94l78PJ99l1l79L59L55
7696E95q81K46N98j97j08L12l85k31R70n10m59M07Q0j15k2Q4q3J68Q6N4k77K60
7718E92K8n10K56o6L60j98K54n19M18K01n73q4K82J40l32J98Q1p17O77j33m62
7739a07M86J31n47K71K8k00M7j1j70k59L91q9L2j99m0j39L95j18l11J26K37j96
7761b42m22M63M4n37N97j6l22K10N1m59M49K44o68K03J57l11j03M98l76P3J43
7782c24K47r06M46K24k85M21k24j44j48N29k25K8J72o3J5J28j93k24L67J43l75
7803c91N1J55r7j8K34N9o20O73J25l85M13L67q12J18O68p85J81N38j34j97K48
7824C91k8j63k0M36o96K01K95j82M03j43j89J7K10j8m98L02K16n01L33K42k99
$$ plain form
7675 -773 -117 -74 -348 214 -54 -324 -90 232 -619 -100 616 -39 -231 463 85 92 291 260 -119 240 595
7696 595 -286 -40 558 361 253 565 180 -51 919 409 -50 357 437 322 300 384 301 469 555 609 332 592
7718 592 620 110 366 300 660 462 716 197 615 816 243 159 441 581 249 447 528 -189 488 355 -107
7739 -107 379 510 -37 234 262 62 109 98 -72 -331 60 -29 3 -196 -236 -375 20 -98 -409 -283 -46 -242
7761 -242 -664 -201 -157 -694 -97 -113 -435 -225 -174 -633 -184 60 -608 -405 -248 -559 -662 -164 -540 -467 -324
7782 -324 -77 -983 -537 -313 -598 -177 -401 -545 -693 -164 -389 -361 -189 -252 -237 -109 -302 -526 -159 -16 -391
7803 -391 -340 -185 -282 -300 -66 -7 -627 46 171 -214 199 566 -246 -128 540 -245 -64 474 340 143 391
7824 391 363 200 180 616 -80 121 416 234 637 494 305 322 532 514 16 318 534 33 366 608 309
7845C09j27L20j76oL19R0n36j1N47q44M00J70k33K74L17q00k07M82K84n31K96
7866C37m70K28L01l26k41L46Q6m19k41M61j04k49N41n83L6L78k48l94K15N12l31
7887a65m1j65P2p1M13n11p1M64k72k62L23J03m38R2L04j79P3J61j89j33O8J61
7909b63k95J86j37j97L54K53o46M68M98n20j8K55l44j29M57k43ML80p6l04J1M43
7931A37j58j47K82n94L43M08n3l72OJ90j05j4L5j16K59L22k85L0L33n09j92M87
7953B87L43n16M37k52j54N1K25j25n2J60J45l7n1P8l93K17K99p78O14j35j43j65
7975E5O37l95qL10l21j97M53q9k44j0J35Nm0J73m97j8L99r2n34N23k44k92N09
7998B18m97K44M61j96m40j41O00l96k78M55m08l0M98r1k21R6J51o73J01N81l18
$$ plain form
7845 309 182 502 326 320 639 729 193 182 729 -115 285 455 222 496 813 13 -194 288 572 41 337
7866 337 -133 95 396 70 -171 175 261 -158 -399 62 -42 -291 250 -333 -297 81 -167 -561 -346 166 -165
7887 -165 -206 -371 -299 -370 43 -468 -539 -75 -347 -609 -286 -183 -621 -529 -225 -404 -331 -170 -359 -492 -424 -263
7909 -263 -558 -372 -509 -706 -352 -99 -745 -277 221 -299 -317 -62 -406 -535 -78 -321 -317 63 -13 -317 -306 137
7931 137 -21 -168 114 -480 -137 271 218 -154 -148 42 -63 -77 -42 -158 101 423 138 168 501 -8 -200 287
7953 287 630 114 551 299 145 196 421 296 244 404 549 512 461 539 146 363 662 -116 498 363 220 55
7975 55 692 297 289 599 278 81 534 445 201 191 326 331 291 464 -33 -51 348 256 -278 245 1 -291 218
7998 218 -279 -35 426 230 -210 -351 249 -147 -425 30 -378 -408 90 -1 -222 -126 25 -648 -547 34 -284
8019b84l83L32K8q9K08n48J51O16k27n32L10J31j33OK7j73Q1L53l32j78N92j98
8041b42j41j67L80k61K52J41n97O43j58j61j66N13j4m37P59k63k77K36J97m96
8061b59KN47n87L10N96q20K64J68K04m85L14J85l35k0m7K59QM66l46l47L46q5
8083C38k56L45P2n2N8M05n73J86L31p62r4N49j45l01P26m61o9M2rk60O29k31l11
8106A57J41J26j89l8J92j93M5q2L22n88K23J61k10P0N0l91q1L94q2k22M68k88
8128a5j39j10N13m94Oq6J36l28N66p3m98P43l31j68K25j90l29M35j03l81J29J81
8150c11P1N1J4j39L2J60k15l48K50K38m54N9P14p62J46L14j36q1K48J6o15N49
8172a99K21l19K8K67l23K25L0m70J70N40J6m98L8L78n32Q6M11l69K55
$$ plain form
8019 -284 -667 -335 -307 -396 -188 -736 -585 31 -196 -728 -418 -287 -420 -414 -387 -560 -479 -126 -458 -636 -44 -242
8041 -242 -383 -550 -170 -431 -179 -38 -635 8 -150 -311 -477 36 22 -415 344 81 -196 40 237 -259
8061 -259 -257 290 -297 13 609 -211 53 221 425 -60 254 439 104 84 37 296 304 770 424 77 423 338
8083 338 82 427 499 447 505 910 337 523 854 92 -2 547 402 101 827 366 297 339 330 70 699 468 157
8106 157 298 424 235 197 389 196 241 159 481 -107 116 277 67 137 187 -204 -285 109 27 -195 273 -15
8128 -15 -154 -264 249 -245 -239 -325 -189 -517 49 -24 -522 221 -110 -278 -53 -243 -572 -137 -240 -621 -492 -311
8150 -311 -240 -189 -175 -314 -282 -122 -337 -685 -435 -197 -651 -592 122 -640 -494 -180 -316 -397 -149 -133 -748 -199
8172 -199 22 -297 -269 -2 -325 -100 -70 -540 -370 170 186 -312 -274 104 -428 -342 69 -300 -45
8191d5
$$ Imaginary data points
##PAGE= N=2
##DATA TABLE= (X++(I..I)), XYDATA
0@%%%qJ6j6J6k4L2m0N6p2Q8j04J28j54J81k19K60l03L58m22M88n61O48p46Q52
27D54r70J100j245J406j582J775j986K218k474K754l061L399l768M174m623N119
43B690n668O277o960P730q603R599j0752J2106j3716J5677j8125K1278k5522L1577
57A7588m0990N7781r6956L53975K71942m16148R302O7568J4910r2619M8741O9565
69B64659O1595o6718r3013o5927J5976K2430M0746l9607o8756L4047R8188q5722
81A17898j38397M8976J14677o4211j06916J6545Q1098J6893n7330o1032K4212
92g587L5029m9984m2620N1941L0302j6206J2827k2847q9825j463Q7712P750m6000
105e0971L3027N8565l0128r5728m1895P7212Q2768m3697m9068P5840L2811j07588
$$ plain form
0 0 0 0 0 -8 8 -8 8 -16 16 -24 32 -40 48 -56 72 -82 99 -120 140 -163 195 -227 261 -300 348 -398 454
27 454 -516 584 -661 745 -837 938 -1048 1170 -1304 1450 -1611 1788 -1980 2194 -2429 2690
43 2690 -2978 3299 -3661 4069 -4534 5065 -5687 6419 -7297 8380 -9745 11533 -13989 17588
57 17588 -23402 34379 -62577 291398 563340 147192 156494 224062 238972 146353 195094 264659
69 264659 326254 259536 166523 100596 116572 139002 179748 140141 71385 105432 203620 117898
81 117898 -20499 28477 143154 78943 -27973 -11428 69670 86563 29233 -31799 -7587
92 -7587 27442 -22542 -65162 -13221 17081 875 13702 -9145 -98970 -100433 -12721 -4971 -50971
105 -50971 -17944 40621 10493 -85235 -127130 -49918 32850 -10847 -59915 15925 48736 -58852
117e8852m4495P2425K0770j1678M8581M562p6154j6493N3394O171m3139n761N9618
130H949M2928o0560p1569N8037O9739o5417n2978O4580K1455n1302K1719N0606
142C6187l1602l5242J8260K194k5616m265L7391O0916P312p4418l5256M1890q713
155a0962l7343N7995O4142l6005l0668J9871k7496n1869J7887O3941L6894j6431
167D9956m1123K307K4005m3764l8693O9685M9793n6590j1619N7785k3411o2277
179b3946K8275M6908k1890k3285J9538K2181k511j8581P596L0039k6334n2549
191a4559L9852N9818m1240k2692P5347M851r6212j8893O4418J7358j6692J1803
203F3159K1849M15l6346m7621O065L7149P246J7764L0878m8484o7269L4457L6310
$$ plain form
117 -58852 -103347 -30922 -10152 -21830 26751 31313 -44841 -61334 -7940 -1769 -44908 -50669 8949
130 8949 51877 -8683 -80252 -22215 47524 -17893 -70871 -6291 15164 -36138 -14419 36187
142 36187 4585 -30657 -12397 -10203 -35819 -40084 -2693 58223 65535 -8883 -44139 -2249 -10962
155 -10962 -48305 9690 73832 37827 7159 27030 -466 -52335 -34448 29493 66387 49956
167 49956 8833 11140 35145 -8619 -47312 22373 72166 15576 3957 61742 38331 -23946
179 -23946 4329 51237 29347 6062 25600 47781 45270 26689 34285 64324 37990 -14559
191 -14559 25293 85111 43871 21179 96526 101377 5165 -13728 50690 68048 51356 63159
203 63159 85008 85423 49077 1456 7521 44670 51916 69680 100558 52074 -15195 19262 55572
216E5572n7867k0263P4532L1125n4964n0953j224K8147N071l4921l59M4533j7143
229A286n3583J8811K5441m3112r509M1094k2269m2966L4773L7196k9558l1404
241g3800Q541J3000j6079l4036J7083P2643L579p3485k83M9223m2807n4726N8644
254g2503O5170j6121j7195qk6672j6558J8351J8079Q768P636J2911K1537k3913
267b0518p3911N913R6179J2516p1203J2423O3552j8302m9214N231K3751J1925
279a658M063q532P62J2844k901L998J7029k6919k9723M3797K8396m6687J609P0656
293F6734k935o8265j0635L1060P388l745J2082K9174J1496m3882m1176L0607K4057
306D1960l0236J7259N8656j8856n1347R621L732l1892J9360N3527j909l7557j1805
$$ plain form
216 55572 -2295 -22558 51974 83099 28135 -22818 -24042 4105 9176 -25745 -26104 18429 1286
229 1286 -52297 -33486 -8045 -51157 -60666 -19572 -41841 -84807 -50034 -12838 -42396 -73800
241 -73800 -65259 -52259 -68338 -102374 -85291 -12648 -9069 -82554 -82837 -33614 -76421 -131147 -72503
254 -72503 -7333 -23454 -40649 -40657 -67329 -83887 -65536 -47457 -38689 -31053 -18142 3395 -20518
267 -20518 -94429 -88516 7663 20179 -51024 -38601 24951 6649 -42565 -37334 -13583 -1658
279 -1658 2405 -6127 -5365 7479 4578 8576 25605 -1314 -31037 12760 41156 -5531 -3922 66734
293 66734 63799 -4466 -15101 15959 23347 19602 31684 60858 72354 28472 -12704 17903 41960
306 41960 11724 28983 87639 68783 17436 27057 30789 -1103 18257 71784 69875 32318 20513
319B0513J6284Q144k9908k7116M4525M5855m6164m2756M1055J5203m5609l27L0748
332C0447j9093k1443K1277R869j3938n618J761j34j5466k9981J3848N0445j0001
345A1973m3556K1871K0926n7061k8602N0334K2460k2620O858J8115j8266l8685
357e6253j9840K5753M4491m732k8972J7912J1194m3666j0923L3924q871j2869
369e2852M7497J6331n9025k5302L8786K4362k0593k6279J1270M1137k433m6995
381e4096P261M4895j9115l5736K4871J3165k6804J7126L7038k0723l0620J1143
393c1595P808j5394o173J9491L6118N422m6134j9098L4690n808l7545L4687N4690
406C1159k4617l5989J6016L335k4518L691K5025J7499M208j3102r884N858j0174
$$ plain form
319 20513 36797 44941 15033 -12083 32442 78297 32133 -10623 30432 45635 26 -301 30447
332 30447 11354 -10089 11188 21057 7119 1501 3262 3128 -12338 -42319 -28471 21974 11973
345 11973 -31583 -9712 11214 -45847 -74449 -24115 -1655 -24275 -17417 698 -17568 -56253
357 -56253 -76093 -50340 -5849 -10581 -39553 -21641 -10447 -54113 -65036 -31112 -39983 -52852
369 -52852 -5355 10976 -48049 -73351 -34565 -10203 -30796 -57075 -45805 -4668 -7101 -54096
381 -54096 -46835 -1940 -21055 -56791 -31920 -18755 -45559 -28433 8605 -12118 -42738 -31595
393 -31595 -23787 -39181 -45354 -25863 10255 15677 -30457 -49555 -14865 -20673 -58218 -23531 31159
406 31159 6542 -29447 -13431 -10096 -34614 -30923 -5898 11601 15809 2707 -7177 -1319 -11493
419a1493p499L6132J5866l8959K603M9332j5462m9147K0622M1580j3105k4987
431E483O795J9905J1240j1005j1685J3827J087k9505P808L5454j2987j6166L7248
444E7499M363n7753j3726L8990R054j2602R227J1009p686k2756j9334J1803J7789
457B5877j4729M377M0373j6685o5288M026M5843j1380k6022J8677J4090j3544
469E615q547p269q195K053M042O405O648k3429j9633L4265J7937m9181j7926M4700
483a2515Q79m2444N766L4682j404k1036j1571K73O262o812o902K3074J4054k5796
497d3490p523J4245k5638k0151M4238K7792l2257q222K6438j0827l3894J397L1837
510c6055K3279j0452k1741J7178K4016l2710k9529L9518L1383k0713l498J6034
$$ plain form
419 -11493 -18992 17140 33006 -5953 -3350 45982 30520 -18627 1995 43575 30470 5483
431 5483 12278 32183 43423 32418 20733 34560 35647 6142 13950 49404 36417 20251 57499
444 57499 61862 4109 -9617 29373 38427 25825 35052 46061 38375 15619 -3715 8088 25877
457 25877 11148 15525 55898 39213 -26075 -22049 23794 12414 -13608 5069 19159 5615
469 5615 -2932 -10201 -18396 -16343 -12301 -5896 752 -22677 -42310 -8045 9892 -39289 -57215 -12515
483 -12515 -11636 -54080 -48314 -13632 -15036 -36072 -47643 -47370 -41108 -47920 -54822 -31748 -17694 -43490
497 -43490 -51013 -36768 -62406 -82557 -38319 -10527 -42784 -51006 -24568 -35395 -69289 -67892 -36055
510 -36055 -12776 -23228 -44969 -27791 -3775 -36485 -66014 -26496 4887 -15826 -19324 -3290
522c290j2451l432K7453j150k6070O347K8801Q410j8086j8347K1256L8609k2338
535B5712n0864K1104M9826j5311k4988K3196J0283k2352o605K103m804J1211J9459
548C7970L364j0317k0296j0427J9660L570k7454J3477M7025j6639m7477J3915
560F371K5562k3357j4129K6860J7186j1597j7879m284J6328O865j8237n84K1341
573C0446q831j2203K0517k448k9844J7013L4036k6062l3605K4473L1011j0538
585C3965k4033m518J7150O758k7616j2679L5259J4995k7472n398Q947k3373r306
598a7321K7276K422k1339J0443J7301j8330k7432n794J7507K0130j1066k0390
610b6593J6031J0988l4890j1059L4447N15k8087J3324K2827j9301j8784R330R459
$$ plain form
522 -3290 -15741 -19173 8280 7130 -18940 -12593 16208 24618 6532 -11815 9441 48050 25712
535 25712 -25152 -4048 45778 30467 5479 28675 38958 16606 10001 12104 7300 18511 37970
548 37970 41334 31017 10721 294 19954 23524 -3930 9547 56572 39933 -7544 6371
560 6371 31933 8576 -5553 21307 38493 26896 9017 4733 21061 27926 9689 9105 30446
573 30446 21615 9412 29929 27481 -2363 14650 48686 22624 -10981 13492 44503 33965
585 33965 9932 5414 22564 29322 1706 -10973 24286 39281 11809 6411 15358 -8015 -17321
598 -17321 9955 12377 -8962 1481 18782 452 -26980 -32774 -15267 4863 -6203 -26593
610 -26593 -10562 426 -34464 -45523 -11076 -10561 -38648 -25324 -2497 -21798 -40582 -31252 -21793
623b1793r42n126k357Q813K969j2597R020J7641k3408k0857L1486J4676l3610
636c6085Q69L8793j909k9653k388J2294J907l103k16J3986J2738j6474j6298J5033
650a0506R90j8611K0594L0856j9908k1951K0345P578k0181N50J8383P510j662
663A3987m485N89P766q529j0529K6277J9086l1920j3203L8882J0822l1094k085
676A5564K1275l87o923K351Q43K645M605Q37L003q776j8911J3888K9663j9032
690D0645k6770K8732J9664l8731k1733K7770J3679j2356m654L196J47p660j3477
703H452Q52J3632o498o406J6530n514l0851O339K3855j6930j7324K3413J0118
716A9668k3799r650J2805P355q194j5570L222K4585l651l0392O028K6461j2223
$$ plain form
623 -21793 -22735 -27861 -30218 -21405 -18436 -31033 -22013 -4372 -27780 -48637 -17151 -2475 -36085
636 -36085 -35216 3577 1668 -27985 -30373 -18079 -16172 -19275 -19491 -5505 7233 -9241 -25539 -10506
650 -10506 -9516 -28127 -7533 23323 3415 -18536 1809 9387 -10794 -10244 8139 15649 13987
663 13987 9502 10091 17857 9328 -1201 25076 44162 12242 -961 37921 48743 17649 15564
676 15564 36839 36452 29529 31880 32723 35368 39973 40810 43813 35037 16126 30014 59677 40645
690 40645 13875 42607 62271 23540 1807 29577 43256 30900 26246 29442 29589 21929 8452
703 8452 9304 22936 16438 10032 26562 21048 -9803 -3464 20391 3461 -13863 9550 19668
716 19668 -4131 -13781 -976 6379 -1815 -17385 -14163 10422 6771 -23621 -17593 8868 -3355
729c355j8807J2306K090j2428J2233J2089j6290j0105J1336M052j1533j3734N881
742b6265K8852M020l6321p728L3486m050l3891J0007K8208p198j1472N993o650
755b3009j0333Q386J0185r19o692m089J1379R185k0585j2196K8472J0727k7115
768b6604L105K7240j0979k1387J6339J7368j1495j1226M482J2620Q699r471p836
781i145J4666M725j6131M694J5467j1991k597K6556j967k8801L839K2780l451
794A8644j2556L234J3670P832j4980j8005J5966J9774j8222r946K4026J577k3163
807G851O291J3813j4650m587J9720L112j4848m380O355O770m796j2165Q612J7301
821C4399j5331j6946K2872J1196k9280n026K8175l175k4054M089J5503m35o424
$$ plain form
729 -3355 -22162 -9856 -7766 -20194 -7961 4128 -12162 -22267 -10931 -6879 -18412 -32146 -26265
742 -26265 2587 6607 -29714 -37442 -3956 -8006 -41897 -31890 -3682 -10880 -22352 -16359 -23009
755 -23009 -33342 -24956 -14771 -15690 -22382 -26471 -15092 -5907 -26492 -38688 -10216 511 -26604
768 -26604 -23499 3741 -7238 -28625 -12286 5082 -6413 -17639 -13157 -537 8162 -1309 -9145
781 -9145 5521 10246 -5885 -1191 14276 2285 -312 26244 24277 -4524 -685 22095 18644
794 18644 6088 9322 22992 30824 15844 -2161 13805 33579 15357 5411 29437 31014 7851
807 7851 14142 27955 13305 8718 28438 31550 16702 12322 18677 25447 20651 8486 17098 34399
821 34399 19068 2122 24994 36190 6910 1884 30059 26884 2830 6919 22422 21987 15563
834A5563o356j593M666m132m818R687p43j4157Q867J1787k5681j5265K8520J1776
848A8121k5283r394J4722L586r769j1104R3J4144J682j5960K068R837j5469p301
862c0027K0313j671k2156Q797J7668j3709j2018J0723M327q043l798M155Q382
875a7057l319j5232P733K3656j3280k6493J7215K2037j8231j0174J8861L104j1123
888b2303L606L985m694J418O769M061m11r341L85J8054k838k3296J2587L0299
902A8281j3900k4777J4114J7421r452o049O029M234L159j352m261M619J175p172
916B069R106J1499j5669p746K2674L029k0850N838J7526j0246j2134J0626J0564
929B6286m190r690j044J4398N031k0809n826K5039K310k1244M982J2800j2086
$$ plain form
834 15563 9207 7614 12280 8148 3330 13017 12274 -1883 6984 18771 -6910 -22175 6345 18121
848 18121 -7162 -16556 -1834 1752 -8017 -19121 -19028 -4884 -3202 -19162 -17094 -7257 -22726 -30027
862 -30027 -9714 -11385 -33541 -24744 -7076 -20785 -32803 -22080 -17753 -25796 -29594 -25439 -17057
875 -17057 -20376 -35608 -27875 -4219 -17499 -43992 -26777 -4740 -22971 -33145 -14284 -11180 -22303
888 -22303 -18697 -14712 -19406 -17988 -11219 -7158 -7569 -16910 -16525 1529 -1309 -24605 -12018 18281
902 18281 4381 -20396 -6282 11139 1687 -4362 1667 5901 9060 7708 3447 8066 9241 2069
916 2069 11175 22674 7005 -741 21933 24962 4112 9950 27476 17230 5096 15722 26286
929 26286 22096 12406 11362 25760 30791 9982 4156 29195 31505 10261 15243 28043 15957
942A5957m299J4192m513j2673R026J0035q432j1975j27J3052O646j8213j2080
955c404K3166J0742k7397q226K1917j240j5367N816N338j0649p6O467k792n554
969a259l107J099P190l932j4637P292J3824j5484j2078J9413L581k3591N90J9886
983a213l349j5055j261P778N545n920j1226O774J2447j0742r629J2949J44j3522
997b6280J0271J0775j7695o294K0741K288j8461k674J3859P384q630j2996N589
1010b2123J9410o344j8627R998J4291j3369m815J5973l983j2155J0906Q755j0584
1023a2667l191P963K791j897m522J062J0976q10j4741Q290J9986j3250j6994J8690
1037A686J3563j5462n945J2847L136k695r49o81M709L869m757J754O503p462n53
$$ plain form
942 15957 11658 25850 21337 8664 17690 27725 19293 7318 7191 20243 26889 8676 -3404
955 -3404 19762 30504 3107 -5119 16798 15558 191 6007 11345 696 620 7087 4295 -1259
969 -1259 -4366 -3267 3923 -9 -14646 -7354 6470 -9014 -21092 -1679 1902 -21689 -21099 -1213
983 -1213 -4562 -19617 -20878 -13100 -7555 -13475 -24701 -17927 -5480 -16222 -25851 -12902 -12758 -26280
997 -26280 -16009 -5234 -22929 -29223 -8482 -6194 -24655 -27329 -13470 -6086 -14716 -27712 -22123
1010 -22123 -2713 -9057 -27684 -17686 -3395 -16764 -21579 -5606 -9589 -21744 -10838 -2083 -12667
1023 -12667 -15858 -7895 -5104 -7001 -11523 -10461 515 -295 -15036 -6746 13240 -10 -17004 1686
1037 1686 15249 -213 -6158 6689 9825 7130 6181 5500 10209 14078 9321 11075 17578 10116 9563
1052I563J6429n056j9632J3280K1835j4888j8106J2862J3533o186r540j183Q074
1065B0985O356q922n978R912j866j1606R270Q356j7994m129J8688k500j7144M842
1079H270R769p955o970K804M806o6r405m319J3409K178k0986r26K1281m261j8605
1094a0976O880Q978j0309k738O634l035l273L353j30k344l535m647Q151P370j5882
1109a5503q239K1252M104k4280j587J9083k560j2823J731M633q67r33j997P77
1123a7209K855p070j947J1137k994j3138J0368J2283j6084p644J6814J704j4779
1136b5704M519J2440k077q045j699O459P770p022q913J4598J1300j5504o338J6396
1150a820K05j0098Q963O166r787J880J1469l329q805J895R352P458n979j3326
$$ plain form
1052 9563 25992 20936 1304 14584 36419 21531 3425 16287 29820 23634 14094 12911 20985
1065 20985 27341 18419 12441 22353 20487 8881 18151 26507 8513 4384 23072 20572 3428 8270
1079 8270 18039 10084 3114 5918 10724 10658 1253 -3066 10343 12521 -8465 -9391 11890 7629 -10976
1094 -10976 -4096 4882 -5427 -8165 -1531 -4566 -7839 -4486 -4616 -6960 -10495 -15142 -6991 379 -15503
1109 -15503 -23742 -2490 1614 -22666 -24253 -5170 -7730 -20553 -18822 -14189 -15056 -15989 -17986 -17209
1123 -17209 -14354 -21424 -23371 -12234 -15228 -28366 -17998 -5715 -21799 -29443 -12629 -10925 -25704
1136 -25704 -21185 -8745 -10822 -18867 -20566 -14107 -6337 -13359 -22272 -7674 3626 -11878 -18216 -1820
1150 -1820 -1615 -11713 -2750 3416 -6371 -4491 6978 3649 -5156 -3261 6091 13549 7570 -5756
1164e756P989J8897j0038j6151J2929J0815j2782k151J1435k931o582O452J940
1177A4066l906j094r31M116N254o116l295J0968l735j5189J0340J5833j3987j0313
1191B011J6393N799j5151l774Q356N155r95o026n04R030k984j1866N183R600r056
1206A1171k212J1929p351j2892J1565Q937j5434p629J1356N798o522r473j405
1219b162J1681K396j7045l806J3922l857j1659Q285N097j3536j260R021o494p554
1233a6971N745M701l224l705l259K422K743r270k271J6619N27j9561K604J6629
1247f271q386j3449J0109R757m415l267q45O75L349j034k717N440k06n468Q400
1262h328M927j5440j367K1732j622k0104M035J5975k126p142P49L427L127k701
$$ plain form
1164 -5756 2233 21130 11092 -5059 7870 18685 5903 3752 15187 12256 5674 12126 14066
1177 14066 10160 9066 8135 12251 17505 11389 8094 19062 15327 138 10478 26311 12324 2011
1191 2011 18404 24203 9052 5278 13634 18789 17794 11768 11264 20294 17310 5444 10627 20227 11171
1206 11171 8959 20888 13537 645 12210 21147 5713 -1916 9440 15238 8716 -757 -2162
1219 -2162 9519 11915 -5130 -8936 4986 1129 -10530 -2245 2852 -10684 -11944 -2923 -9417 -16971
1233 -16971 -11226 -6525 -9749 -13454 -16713 -14291 -11548 -20818 -23089 -6470 -5943 -25504 -22900 -6271
1247 -6271 -14657 -28106 -17997 -8240 -12655 -15922 -16767 -16092 -12743 -13777 -16494 -11054 -11260 -16728 -8328
1262 -8328 -3401 -18841 -20208 1524 -98 -20202 -16167 -192 -2318 -9460 -8711 -5284 -2157 -4858
1276d858n776O522P137p845K5J0756o586j1207J1631Q907j1087N97J3333k524
1290I025j0374J884N565K548o52l298N892R110r936r886J3296P211j3982P73J5320
1305B2496k687j0576M360L667l328J742J997j881q08j418K123O831n474j2831
1319D213R572J2850j4924j1007J6583O239j3503k679N631l636l507J990K282K635
1333A2739l154o901L050L267j0930j218J4195k791j2034P535N246j4635l916J2686
1347C139J285p982r00L540J746l473r153K914J3164n636j4518Q084Q694j0152
1361i248k840P710m389m488P117j33q790M17O173K325l708r612o01J4096R53j6604
1377b1622L566J5723q631j3864Q569N885o543K077O500k245l262j050j312K393
$$ plain form
1276 -4858 -10634 -4112 3025 -4820 -4795 5961 -625 -11832 -201 8706 -2381 -1784 11549 9025
1290 9025 -1349 535 6100 8648 7996 4698 10590 19700 9764 -122 13174 20385 6403 7176 22496
1305 22496 19809 9233 13593 17260 13932 15674 17671 15790 14982 13564 15687 22518 17044 4213
1319 4213 13785 26635 11711 704 17287 23526 10023 7344 12975 9339 5832 7822 10104 12739
1333 12739 9585 2684 5734 9001 -1929 -3147 11048 8257 -3777 3758 9004 -5631 -9547 3139
1347 3139 4424 -3558 -4458 -918 828 -2645 -11798 -8884 4280 -1356 -15874 -7790 904 -9248
1361 -9248 -12088 -4378 -8767 -13255 -6138 -6271 -15061 -14644 -8471 -6146 -9854 -19466 -20067 -5971 -5018 -21622
1377 -21622 -18056 -2333 -10964 -24828 -16259 -10374 -16917 -14840 -8340 -10585 -13847 -14897 -16209 -13816
1391a3816J550j668P324M183j2382j524J4193l561j3112J0576J4564r407r262
1404a2342P161N782j962k070j148O462N863p435l688R869N6n994O365K044j0067
1419a104M036J5258n552j1653O813Q284m155o970j130Q293R747o645j0212Q798
1433A3808M567j3044q54J3864j926n995P037K88j0958O07P389r26k721P15K184
1448A4035K580o136q412P562R862j1757o534J4626J178j6074J157J1321l631o386
1462C391Q10K56Q72J270l393j192K002l977p93N133o672p775J3375P705j6754
1477e742q182J1480J597q400M90M405J606j338o908l311N939j317n527Q186M829
1492b193j1289k410Q623o743o948J0668N613q795k675N073L80k768k903J115Q460
$$ plain form
1391 -13816 -12266 -13934 -6610 -2427 -14809 -16333 -2140 -5701 -18813 -8237 6327 -3080 -12342
1404 -12342 -5181 601 -1361 -3431 -4579 1883 7746 311 -3377 6492 6548 554 6919 8963 -1104
1419 -1104 2932 18190 12638 985 7798 16082 11927 4957 3827 12120 21867 15222 5010 13808
1433 13808 18375 5331 4477 18341 16415 10420 17457 17745 6787 7394 14783 13857 11136 11851 14035
1448 14035 16615 10479 2067 9629 19491 7734 1200 15826 17004 930 2087 13408 9777 3391
1462 3391 4201 4457 5329 6599 3206 2014 4016 39 -754 4379 -2293 -10068 3307 11012 -5742
1477 -5742 -13924 -2444 -847 -9247 -8757 -4352 -2746 -4084 -10992 -14303 -8364 -9681 -15208 -7022 -2193
1492 -2193 -13482 -15892 -7269 -14012 -20960 -10292 -4679 -13474 -16149 -11076 -10696 -13464 -16367 -15252 -6792
1507f792j289j0978M809J2411r040r223J1855N016j0626L95Q167j367j418M690
1521c390j584m193J08J883N724K311p019J869J2664n564j6231P948J4179n761
1535B944m551Q059J387n791m52K02J456M030P0j43M436m243o822P609N289r641
1551C839R44J2660m366j0253O169O366n343l116L486L162j05m978j849J0080K831
1566A9527j3286j535J0701k969o487Q193K953q872K036N835p368o410N808O898
1580A5024N15o013n885M279M557j0107l801J3591K433j2863O29O813q262m477
1594c567P155J658l983Q92k51k554j813l529J052O962m228r085P254N823j1458
1609i672l279J1023k557r870L449O115l237k699J66K568K222n903p340O920P059
$$ plain form
1507 -6792 -8081 -19059 -14250 -1839 -10879 -20102 -8247 -3231 -13857 -13462 -5295 -6662 -8080 -3390
1521 -3390 -4974 -9167 -9059 -7176 -1452 859 -6160 -4291 8373 2809 -13422 -5474 8705 2944
1535 2944 -1607 6452 7839 2048 1596 1798 3254 7284 7354 7211 11647 7404 582 8191 13480 3839
1551 3839 4783 17443 13077 2824 8993 15359 10016 6900 10386 13548 13443 8465 6616 16696 19527
1566 19527 6241 4706 15407 12438 5951 14144 17097 8225 10261 16096 8728 2318 8126 15024
1580 15024 15539 9526 3641 7920 12477 2370 -1431 12160 14593 1730 2359 9172 910 -3567
1594 -3567 3588 5246 1263 2155 1904 -650 -2463 -5992 -4940 2022 -2206 -11291 -4037 1786 -9672
1609 -9672 -12951 -1928 -4485 -14355 -10906 -4791 -8028 -10727 -10561 -7993 -5771 -11674 -19014 -12094 -5035
1624e035o413k56P701o570q245Q052M095q419K005J0251j175p623k704J265N037
1639h034J28l939N136P649q995q296J0315L403r626L174R805m053n039M868P35
1654b769l066K021J812rP54k384K176P433l510q006Q444P931j2087m910J4401
1669H231N537p889k251K557R74O08j193o31N969K867l844K08n96p121M260J2541
1685B0227n642r215R425O664j2145o828P622O292j083m335k685N337J587r714
1699E507j070Q687j558n912N671l22r234L397Q254p851p265O432L934n001l649
1714B0J554N268M30j0510m374J1155K133j1274K221R711m498p467J753j063k371
1729g312O344L886n904l321N04J017j31n190k393J1503N974j4941o108J1361R06
$$ plain form
1624 -5035 -11448 -11704 -4003 -10573 -18818 -10766 -6671 -15090 -13085 -2834 -4009 -11632 -14336 -13071 -8034
1639 -8034 -7906 -11845 -6709 940 -8055 -16351 -6036 -2633 -12259 -9085 720 -3333 -8372 -3504 -2769
1654 -2769 -5835 -3814 -2002 -2011 -1257 -3641 -1465 5968 2458 -5548 2896 10827 -1260 -6170 8231
1669 8231 13768 5879 3628 6185 7159 7767 6574 5943 11912 14779 10935 11143 10547 3426 7686 20227
1685 20227 14585 5370 14795 21459 9314 2486 10108 16400 15317 10982 8297 13634 15221 5507
1699 5507 4437 13124 11566 5654 11325 11003 1769 5166 13420 5569 -1696 4736 8670 3669 20
1714 20 1574 6842 7272 -3238 -7612 3543 5676 -5598 -3377 6334 1836 -5631 -3878 -4941 -7312
1729 -7312 -968 2918 -2986 -6307 -5803 -4786 -4917 -10107 -12500 -997 4977 -9964 -16072 -4711 -3805
1744c805j0104J768O993j556k220j76k215q3J776q45R68m40n143L757Q292p225
1760a0258q122J0285N700j1630k843J0200J258m109J619J415r24j908k056M102
1774g271P071k917l641O219q3r849L810R531m109k798R244J421r168j556M490
1789C94K849J407j376p9N329j693p601L940O959n778k102R381q94r244M180O693
1805A2365l778l439K249J710O11j864k256N736L490p832l033P009j492n095P924
1820A2305M208r712j695P703k676p282K497O799L075l405p654N0O536m090n779
1835H80P486M527p458p55M098o688m225P950J733o873o84L632m41l697m699J771
1851c443P273k414j0553L168R298o548p083O311J837o451Q7K718k273N19K994
$$ plain form
1744 -3805 -13909 -12141 -5148 -6704 -8924 -9100 -11315 -11398 -9622 -10467 -9499 -9939 -15082 -11325 -3033 -10258
1760 -10258 -18380 -8095 -2395 -14025 -16868 -6668 -5410 -9519 -7900 -6485 -7409 -9317 -11373 -7271
1774 -7271 -200 -3117 -6758 -539 -622 -10471 -6661 2870 -1239 -4037 5207 6628 -2540 -4096 394
1789 394 3243 4650 3274 3195 8524 6831 -770 3170 10129 4351 2249 11630 10736 1492 5672 12365
1805 12365 8587 5148 7397 9107 9718 7854 5598 11334 14824 6992 3959 10968 9476 4381 12305
1820 12305 16513 6801 5106 12809 10133 2851 5348 12147 15222 11817 4163 4213 10749 6659 880
1835 880 8366 12893 5435 4680 8778 2090 -2135 5815 7548 675 -9 3623 3182 -515 -5214 -3443
1851 -3443 3830 1416 -9137 -5969 3329 -3219 -10302 -3991 -2154 -8605 -8518 -5800 -8073 -7554 -4560
1866d560k240k708j326n47L416J123o076L528R936o713j4354N418J1538l789n273
1881a2627M272K714o11k474m359J154N188Q17N2J778m512k025P680j69j0377M363
1897i136J2594m252j0727L965Q053j051m430j851M079N018l048n167N642L913
1911C602m487M04K813n383l57J0561P29q434J975O413l378n184J560N464N133
1926A1431k928o097L906O009q017m689R837M624n341m2J829m550l6N466j125l408
1942F869K646K689k26l700n127L774Q733n056r589P017P154q095m515O174K35
1957H983m291P61J97j716J605J058l62j442m158j730N633k7p425L219Q659o593
1973B371q741M313K648m492N70M501k9l029k904j606K191N8l432L404M980o368
$$ plain form
1866 -4560 -6800 -9508 -10834 -11381 -7965 -6842 -12918 -9390 546 -6167 -20521 -15103 -3565 -7354 -12627
1881 -12627 -8355 -5641 -6252 -8726 -13085 -11931 -6743 -5926 -5874 -4096 -8608 -10633 -2953 -3122 -13499 -9136
1897 -9136 3458 -794 -11521 -7556 497 -554 -4984 -6835 -2756 2262 -786 -5953 -311 3602
1911 3602 -885 -481 2332 -3051 -3408 7153 7882 -552 1423 7836 4458 -726 834 6298 11431
1926 11431 8503 2406 6312 12321 4304 -385 9452 14076 8735 8693 10522 5972 5936 11402 10277 6869
1942 6869 9515 12204 11978 8278 3151 6925 15658 10602 1013 8030 15184 7089 2574 8748 8983
1957 8983 4692 5453 5650 3934 5539 6597 6235 4793 635 -1095 4538 4511 -2914 305 8964 2371
1973 2371 -6370 -2057 591 -3901 -3331 1170 1141 -1888 -4792 -6398 -4207 -4149 -7581 -4177 803 -5565
1989e565m689N990n08p312L550O371m417l761K700J284j697j249k67K504O77n011
2005a1400K20P770k144p540M599M871p437k375P958J156m231J614J842j515j991
2020h603j843L327N311j368l398M024O36p244K188Q239l585l773O869L916p323
2035b627l533M423L970P49j904j123L996Q73n585J749N433k466k386O464k61o644
2051A128L450N926m104l621L082K807n25k404l90M813K744p362l262P220P59o212
2067D049M000N843m929l852L426n35m061K359L250L8j339k749J3J602l841k217
2083A057Q023L345j0167k168P866k030p847L128M439j692j433m82r23l8l91j785
2099a098J687q0m468K583M618n771l822P052P94r292l97O189J36k861l14R07L24
$$ plain form
1989 -5565 -10254 -4264 -4772 -12084 -8534 -2163 -6580 -10341 -7641 -6357 -8054 -9303 -9570 -7066 -6389 -11400
2005 -11400 -11180 -3410 -5554 -13094 -8495 -3624 -11061 -13436 -5478 -4322 -8553 -6939 -5097 -6612 -8603
2020 -8603 -10446 -7119 -1808 -3176 -6574 -2550 -1914 -9158 -6970 1269 -2316 -6089 780 4696 -2627
2035 -2627 -6160 -1737 2233 2982 1078 -45 3951 4824 -761 988 6421 3955 1569 8033 7772 1128
2051 1128 4578 10504 6400 2779 5861 8668 8143 5739 5349 10162 12906 5544 2282 9502 10261 4049
2067 4049 8049 13892 8963 5111 8537 8002 3941 6300 9550 9588 8249 5500 5513 7115 3274 1057
2083 1057 9080 12425 2258 90 7956 5926 -1921 1207 5646 3954 2521 2039 1116 1078 687 -1098
2099 -1098 589 509 -3959 -1376 3242 -2529 -6351 701 1495 -7797 -8194 -2005 -1869 -4730 -5044 -4137 -3813
2116c813k476l904J750M888k605j982M692j398p757K032N928m176p89N315l63
2131d658n004o12K220R11n31j696K097N426m130p129N518O186n776k502O787J38
2147b755m414K532K279k624M76K041k60o57k22J092M269l03n891K439O891m609
2163B84n943P281N784m778k142K483l30j401J214J101K514R10l092K3K473l449
2179B932j223O386J528n611K398M407n906m138N745L653k263k186K34K722J411
2194A0089n112j813O292L14n640J766M141m216r27N316k443n613K565L202k740
2209E181j502J967K148j84n676l225N484K905o514p62O590j755o841J578J640
2224A034l262J422L266j636k931q05k59N42p89k112K665L547n118m613N829J131
$$ plain form
2116 -3813 -6289 -10193 -8443 -3555 -6160 -8142 -3450 -4848 -12605 -10573 -4645 -8821 -9610 -4295 -4658
2131 -4658 -9662 -10274 -8054 -7143 -7674 -9370 -7273 -1847 -5977 -13106 -7588 -1402 -7178 -9680 -2893 -2755
2147 -2755 -7169 -4637 -2358 -4982 -4506 -2465 -2725 -3382 -3604 -2512 1757 1454 -4437 -1998 4893 284
2163 284 -5659 1622 7406 2628 486 2969 2639 1238 2452 3553 6067 6977 3885 3908 6381 2932
2179 2932 1709 8095 9623 4012 6410 10817 4911 773 6518 10171 7908 5722 5956 8678 10089
2194 10089 4977 3164 9456 9770 4130 5896 10037 5821 4894 10210 7767 2154 4719 7921 5181
2209 5181 3679 5646 7794 7610 1934 -1291 4193 7098 584 -178 6412 4657 -2184 -606 1034
2224 1034 -2228 -806 2460 824 -2107 -2912 -3171 -2629 -3418 -5530 -2865 682 -4436 -9049 -3220 -2089
2240b089p155Q44N861j403m234J096J051o7r7j338J54J898k345j173M672m25m889
2257i639K985L743n943k627P138J604m293oK319l65j635r91J431M234k67l494
2273e806K538J081n166R2P560j032m874L739L631m251k469K663J431M73L51q9
2289a28J565K78l444J802M748l073l173N847K230n842K36O126j157l675J129J883
2305E352N29J44j561J613L238k931l204L564O31l400L257M750n686l819N000P81
2321H258m139O2L602J100j056l462n65L552j560m577L317N519n416l702M286o49
2337D570l632K763J465l873m86L448p86l182j239J051L621j437o614J040P087
2352C796k238o670K840L868m097k329K675o86k11K028j782k387pK30J018P23k916
$$ plain form
2240 -2089 -9244 -8400 -2539 -3942 -8176 -7080 -6029 -6096 -6193 -7531 -7377 -5479 -7824 -8997 -4325 -4750 -9639
2257 -9639 -6654 -2911 -8854 -11481 -4343 -2739 -7032 -7038 -4719 -5084 -6719 -7710 -6279 -2045 -2312 -5806
2273 -5806 -3268 -2187 -7353 -7261 299 -733 -5607 -1868 1763 -2488 -4957 -2294 -863 -390 -39 -128
2289 -128 1437 1715 -1729 73 4821 1748 -1425 4422 6652 810 1046 7172 6015 2340 3469 5352
2305 5352 5881 6025 4464 6077 9315 6384 3180 6744 7375 3975 7232 11982 6296 2477 7477 8258
2321 8258 4119 4181 7783 8883 7827 4365 3800 7352 5792 1215 4532 10051 4635 933 5219 4570
2337 4570 938 3701 5166 1293 807 4255 3469 287 -952 99 3720 2283 -4331 -3291 3796
2352 3796 1558 -5112 -2272 1596 -2501 -4830 -2155 -2841 -3052 -1024 -2806 -5193 -5200 -4970 -3952 -3229 -6145
2369f145n25N802j512q539Q17P679j623m587K322K566j402k144p69L74K750n62
2385e498j809J890J90l229K346K585m407j29O640p27o815K115N810j457k893l47
2401e735K220K553j689k625L643L447l886j755L888o51k353M607K028m097K21
2416a84M288k004m109K347L594J402j499l415J416M989l009m674N150L470l812
2431C950p57L328k118j923L266J233k238K74J000K19j29j642q8L340l75n441L039
2448D938M678m099l321M653J434m875j40K229o83j44M61m9O6j655k492K007K631
2465E639m020m15M835k230n336K278L287m081j405L693j09k350j420o53J381L97
2481e09k491K24L396k821l991L765K071n280r26N343j712l332J505P48j416N51
$$ plain form
2369 -6145 -6670 -868 -2380 -10919 -10102 -2423 -4046 -8633 -6311 -3745 -5147 -7291 -8060 -7686 -4936 -5498
2385 -5498 -7307 -5417 -5227 -8456 -6110 -3525 -7932 -8061 -1421 -2148 -8963 -6848 -1038 -2495 -5388 -5735
2401 -5735 -3515 -962 -2651 -5276 -1633 1814 -2072 -3827 61 -590 -2943 1664 3692 -405 -184
2416 -184 4104 2100 -2009 338 3932 5334 3835 420 1836 6825 3816 -858 4292 7762 3950
2431 3950 3193 6521 4403 2480 5746 6979 4741 5015 6015 6234 6105 4463 4375 7715 7340 1899 4938
2448 4938 9616 5517 2196 6849 8283 3408 3268 5497 4814 4670 5131 5082 5148 3493 1001 3008 5639
2465 5639 1619 1204 6039 3809 -1527 751 4038 -43 -1448 2245 2136 -214 -1634 -2287 -906 -509
2481 -509 -3000 -2776 620 -2201 -6192 -2427 -356 -5636 -6562 -1219 -2931 -6263 -4758 -4010 -5426 -4875
2497d875l71m19R07j644r33L806J11m853J400M517l823l396M933K598l761m51
2513f254J464J17p51p71J90K711Q09k600R42K009l378n16N363o47m633L117M113
2530A285l443k583L269J460q02o37l5K314J180l730k34M938k06m151K675K754
2546D054k985O7L800j949k502K796J548j161m81N53J496J687l338k610M765K054
2562G794m841j21N639j143m067J783Q28j608J217J485j622k76K80n71J195j274
2578D698k737L113L556m981l129N115J011n593P24L413j344j952K91P47m75j7
2594B440j942M80J049k325m29L114j860l342L465K072n476j661M846j28l349L57
2610b689J054l56r67j743N63K863j447l223K507J751m360p70M008j652k080L110
$$ plain form
2497 -4875 -5246 -5665 -4758 -6402 -7335 -3529 -3418 -8271 -6871 -2354 -6177 -9573 -4640 -2042 -5803 -6254
2513 -6254 -4790 -4673 -5424 -6195 -6005 -3294 -2485 -5085 -4143 -2134 -5512 -6028 -665 -1312 -5945 -2828 1285
2530 1285 -2158 -4741 -1472 -12 -814 -1451 -1486 828 2008 -1722 -1956 2982 2776 -1375 1300 4054
2546 4054 1069 1136 4936 2987 485 3281 4829 3668 3187 3740 5236 6923 3585 975 5740 7794
2562 7794 2953 2832 8471 7328 3261 5044 5872 4264 5481 6966 5344 5068 5348 4777 5972 4698
2578 4698 1961 5074 8630 3649 520 5635 6646 1053 1777 5190 3846 1894 2185 2932 2457 2440
2594 2440 498 978 2027 -298 -727 2387 527 -2815 650 2722 -2754 -4415 431 303 -3046 -2689
2610 -2689 -1635 -1991 -2958 -4701 -4138 -1275 -2722 -5945 -3438 -1687 -6047 -6817 -2809 -4461 -6541 -3431
2626c431O06l865q9K156J04n71j137p2L008P3m291J078M406k532k758L616J591
2643b108l824M82L265j338j142Q44M67J81M51j292J769J812k616j140M408m95
2659b76m322L228M324l386j868K967O15j601M54R35J398P80k356k70K873o66k403
2676D26L070K023l539K38M261j866l686L059K336k112m69O47O30R09j736j188
2692C003K840J241m470M77M397j561l409L040J169l347m7K344j462j059Q96N88
2708D640Q5j119k048J702K311l218k121M498l88n417J003L920k303k037K091K00
2724A799j348n35n13m07R61r95l78J942j686l032L200J844m743j314M637n67l959
2741e094J219J750j285q03l44K14J493j465j999K492J793l709k61L467j749k687
$$ plain form
2626 -3431 -2825 -6690 -6779 -4623 -4519 -5090 -6227 -6299 -3291 -3218 -7509 -6431 -2025 -4557 -7315 -3699 -2108
2643 -2108 -5932 -5450 -2185 -3523 -4665 -3821 -3354 -3173 -2722 -4014 -2245 -433 -3049 -4189 219 -276
2659 -276 -4598 -1370 2954 -432 -2300 667 1282 -319 135 1070 2468 3248 892 622 3495 2829 426
2676 426 3496 5519 1980 2218 6479 4613 927 3986 6322 4210 3741 4388 5018 5927 4191 3003
2692 3003 5843 7084 2614 3091 7488 5927 2518 5558 6727 3380 3333 5677 4215 3156 4052 4640
2708 4640 4725 3606 1558 3260 5571 2353 232 4730 4342 -1075 -72 3848 1545 -492 1599 1799
2724 1799 451 -84 -597 -1004 -43 -1038 -1416 526 -1160 -4192 -992 852 -3891 -5205 -568 -1135 -5094
2741 -5094 -3875 -2125 -3410 -4213 -4557 -4343 -2850 -4315 -6314 -3822 -2029 -5738 -5999 -2532 -4281 -6968
2757f968L072J345l366J08K704j202j304O94L94J537l41k481J431L259l000k282
2773f400M356J551l757K16L658j972r28J805J11q09J110K30N08N94j449J6L289
2790B129m87l957L089L521m014j051L909N93l057J061J503l36K32l77j37J873
2806D494m07k322K198J933l263J53L876j663l387L162J413k885o15K580L2o84
2822D615p78m61J986K94l375N30L848j757l285K843Q88l175N72K643k329j956
2838A103K081M91j083r84l06J120Q66k810j486L946m68m476J557L129l163k401
2854b884L035j15k060L34M45q98J8m00j84Q35q94j877J905J829m142o14M516j390
2872b541l600J936K363k346r37Q59J59N71m01j414J023J654k374p6K772j944j719
$$ plain form
2757 -6968 -3896 -2551 -5917 -5809 -3105 -4307 -5611 -4917 -4523 -2986 -3327 -5808 -4377 -1118 -4118 -6400
2773 -6400 -2044 -493 -4250 -4034 -376 -2348 -3276 -1471 -1360 -2169 -1059 -829 -321 273 -1176 -1160 2129
2790 2129 1642 -2315 774 4295 281 -770 3139 3732 675 1736 3239 2903 3135 2758 2621 4494
2806 4494 4087 1765 3963 5896 2633 2786 6662 4999 1612 4774 6187 3302 2687 5267 5299 4615
2822 4615 3837 3376 5362 5656 2281 2811 6659 4902 1617 4460 5348 2173 2745 5388 3059 1103
2838 1103 3184 3675 2592 1608 1302 2422 3288 478 -1008 2938 2470 -2006 -449 2680 -483 -2884
2854 -2884 151 36 -2024 -1690 -1245 -2143 -2125 -2525 -2709 -1874 -2768 -4645 -2740 -911 -5053 -5667 -1151 -2541
2872 -2541 -6141 -4205 -1842 -4188 -5125 -4266 -4107 -3536 -3937 -5351 -4328 -2674 -5048 -5124 -2352 -4296 -6015
2889f015L178Q98l798O96L468j178j693Q91M58P34j54j365J476K370k367j681
2905d082L795L97l387J439L074k190j189K970J69k116R85J420k09k7l27o7K381
2922C036n22k677K606K150l313r70M227J0l342J523J851j094J50M02l38N21Q4
2939D304j056J331N44k135K27L412j972k889K832J619l335l83K598p89q30k39
2955C239J37J8P22k198J29K542j902k395L420J11l461P56K732k057k590K450K47
2972A900j655ML19j93K99j442q50K596p79l275J615K696l218j669L132k60k926
2989c706J154Q22j464k49M76m29P95l90j988J835R08k971P8L270j213l373K541
3006c904J783k811o23J988K37m24j00o12O82O75j484J00K903j682j924K961P60
$$ plain form
2889 -6015 -2837 -1939 -5737 -5041 -1573 -2751 -4444 -3553 -3095 -2361 -2515 -3880 -2404 -34 -2401 -4082
2905 -4082 -287 110 -3277 -1838 1236 -954 -2143 827 996 -1120 -135 1285 1076 1049 722 655 3036
2922 3036 2514 -163 2443 4593 1280 310 4537 4547 1205 2728 4579 3485 3635 4037 3699 4220 4304
2939 4304 3248 4579 5123 2988 3215 6627 4655 1766 4598 6217 2882 2499 5097 4308 3478 3239
2955 3239 3376 3394 4116 1918 2047 4589 2687 292 3712 3823 362 1118 3850 1793 -797 1653 1900
2972 1900 245 249 568 375 674 -768 -1618 978 199 -3076 -1461 1235 -1983 -3652 -520 -780 -3706
2989 -3706 -2552 -1730 -3194 -3443 -2967 -3396 -2601 -2991 -4979 -3144 -2236 -5207 -5129 -1859 -3072 -6445 -3904
3006 -3904 -2121 -4932 -5555 -3567 -3330 -3754 -3854 -4466 -3784 -3109 -4593 -4493 -1590 -3272 -5196 -2235 -1475
3023a475l181R43L265j805j794K579R97j154k32j5J170J162j457j218K666J506
3039A957l290Q93K620j846q83L080k84k367J691J459j014n14O03K70J065k39j820
3056A381J981K041l637q77M113k81k925J459K155j863j68J133q97l66R44m89L50
3073D054L12j425M8K224j518k605L299J082l822m47L464q22j903M89L99k04k8
3090B597j183k39J741j224k035K325p9k869J042K611k593k288K930P8k546M18
3106a314R35o01J03j134k65J442m03k788J473J837k022j343K475l40k836J307
3122c474J635k037l82J418l94l14K2n01Q37K87j821j32K716r19k590K334J809
3139a506k674m23K349n45r16R63M49n01O46p81J69J223n22j239K700N33k800N46
$$ plain form
3023 -1475 -4656 -3713 -448 -2253 -4047 -1468 -471 -1625 -1857 -1872 -702 460 -997 -2215 451 1957
3039 1957 -1333 -440 2180 334 -549 2531 2247 -120 1571 3030 2016 1502 2105 2375 3440 3201 1381
3056 1381 3362 5403 1766 889 5002 4721 1796 3255 5410 3547 3379 4512 3615 3249 4193 3704 4054
3073 4054 4366 2941 2989 5213 3695 1090 4389 5471 1649 1202 4666 3844 1941 2430 2829 2625 2597
3090 2597 1414 1175 2916 1692 -343 1982 1903 -966 76 2687 94 -2194 736 814 -1732 -1314
3106 -1314 -379 -980 -877 -2011 -2276 -834 -1237 -4025 -2552 -715 -2737 -4080 -1605 -1945 -4781 -3474
3122 -3474 -1839 -3876 -4258 -2840 -3234 -3548 -3526 -4027 -3190 -2903 -4724 -4856 -2140 -3059 -5649 -3315 -1506
3139 -1506 -4180 -4603 -2254 -2799 -3715 -2752 -2303 -2804 -2158 -2939 -2770 -1547 -2069 -3308 -608 -75 -2875 -2329
3157b329K767j474j668K738Q62j735R9J063J34R5n4n89K114m8j961P84K326j641
3175A483j267L448j28k467J267J635j767r4J101P9J44l24p34J399J084k165q42
3192A852L254o55k733J353K249k079p55J936p57j289J037l81j89Q69q84L7J168
3209D033j383j905K280J012k856j84K926j575k335J254Q58j023m43J21m97O21
3225I04p73j067J146M04k197N84J830j991j677K900n06k744O32J746j219q00M08
3242b420J84N84p72j518N61J558j640j224K803k83k306J231J161k048m78J881
3258b726k10j067Q01M9j10L18j216N92K433j023k671K095J755k575k25K239m3
3275a584j558J294P43p92J92L18j42J103k0j340J712Q84k236O53K757k042j654
$$ plain form
3157 -2329 438 -1036 -2704 34 896 -839 -740 323 457 552 498 -91 2023 1975 14 798 3124 1483
3175 1483 216 3664 3536 1069 2336 3971 2204 2110 3211 3290 3434 3110 2376 3775 4859 2694 1852
3192 1852 5106 4451 1718 3071 5320 3241 2486 4422 3665 2376 3413 3032 2843 3712 2828 2865 4033
3209 4033 2650 745 3025 4037 1181 997 3923 2348 13 1267 2125 1102 659 780 283 904
3225 904 131 -936 210 614 -1583 -999 831 -1160 -2837 63 -443 -3187 -2555 -809 -2028 -2828 -2420
3242 -2420 -2236 -1652 -2424 -3942 -3381 -1823 -3463 -4687 -1884 -2167 -4473 -3242 -2081 -4129 -4607 -2726
3258 -2726 -2936 -4003 -3202 -3153 -3263 -2945 -4161 -3569 -1136 -2159 -4830 -2735 -980 -3555 -3780 -1541 -1584
3275 -1584 -3142 -1848 -1105 -1897 -1705 -1387 -1529 -426 -446 -1786 -74 810 -1426 -773 1984 -58 -1712
3292a712K826R69j582k11J739l51r0k46k52R82Q00j279N82J686j676j046K465
3309C604L08k394J348J852j673j204J893l03q26L78K74M19P30j863q89K658m78
3326C834k415J532J724k364o15K123n72j748P44M37j027J87J35J85M87j130j333
3343A84J567N36k718L1L157j475k332J506O44k014J2O32k75L57j58r12L37j87
3361a108j691Q39J559j719j252K342j4k966P88K059j342j145J210j73R3R7j393
3378c816P01J049j544n49J803n7j961J737J422k398q18K479n02j247J064N39j90
3395b288j39o49m41K059r8j652J616J558k212l77K365p60j264J907J274j464j41
3412g06J198q38L11J33K99J066M73k163M69K289j414j608K629Q82k014K10K076
$$ plain form
3292 -1712 1114 2083 501 290 2029 1678 1588 1342 1090 2072 2872 1593 2175 3861 2185 1139 3604
3309 3604 3912 1518 2866 4718 3045 1841 3734 3431 2605 2983 3257 3676 4406 2543 1654 4312 3834
3326 3834 1419 2951 4675 2311 1696 3819 3247 1499 2243 2680 1653 1840 1975 2160 2647 1517 184
3343 184 1751 2287 -431 -400 2757 1282 -1050 456 1100 -914 -902 -270 -545 -188 -346 -1258 -921 -1108
3361 -1108 -2799 -1960 -401 -2120 -3372 -1030 -1044 -4010 -3222 -1163 -2505 -3650 -2440 -2613 -2520 -2423 -3816
3378 -3816 -3115 -2066 -3610 -4159 -2356 -2413 -4374 -2637 -1215 -3613 -4431 -1952 -2454 -3701 -2637 -2098 -2288
3395 -2288 -2427 -3076 -3517 -1458 -1556 -3208 -1592 -34 -2246 -2623 -258 -1018 -2282 -375 899 -565 -706
3412 -706 492 -346 -35 98 397 1463 1936 -227 242 2531 1117 -491 2138 3020 1006 1216 3292
3429C292j016r09J420l45l7J11m41N51J442j249j400K155J48k399J350J744j557
3446B860o81J547l34j470P06K41j66P02p19o55J507j097j932J563J681k491m70
3463G92K460p73k214J074O03r68R0L26p73R9L8j202J272Pj921M9K445j911j824
3482b331J886J074k464n88J755q37l91J14q3J45M10j357k05J278j189m87J843
3499a427k49k234Q82J858k355q42J989L39o24k84j86Q5O78q96o72K275J88k240
3517c715R21J487j458k44K002j151j248J609J413j144n25N01M32P69r05r07J799
3534c64J264j712n60K191n29j542J368J174j244P75J029j115n06R07J50N64j20
3551A730n84J060J355k032j805K464J401k035J72K013r48j056Q57l47o5R65k26
$$ plain form
3429 3292 2276 1367 2787 2442 2405 2516 2075 2626 4068 2819 1419 3574 3722 1323 2673 4417 2860
3446 2860 2179 3726 3392 1922 2628 2869 2703 3405 2686 2031 3538 2441 509 2072 3753 1262 792
3463 792 3252 2479 265 1339 1942 974 1064 1390 617 716 754 -448 824 831 -1090 -1041 1404 -507 -2331
3482 -2331 -445 629 -1835 -2423 -668 -1505 -1896 -1782 -1865 -1720 -1310 -2667 -2872 -1594 -2783 -3270 -1427
3499 -1427 -1676 -3910 -3028 -1170 -3525 -4367 -2378 -2039 -2663 -2947 -3133 -3048 -2370 -3266 -3938 -1663 -1475 -3715
3517 -3715 -2794 -1307 -2765 -3009 -1007 -2158 -3406 -1797 -384 -1528 -2053 -1552 -1120 -351 -1256 -2163 -364
3534 -364 900 -812 -1372 819 290 -1252 116 1290 46 821 1850 735 229 1136 1286 1850 1730
3551 1730 1146 2206 3561 1529 -276 2188 3589 1554 1726 3739 2791 1735 2592 2245 2180 3145 2919
3568B919m39L79j72m50J225p13k005J740J896k569p26K210m3j473R6N39o23L20
3586B111L2j016Q26Lj400O11P29j477k63K226j153k461J710Q72j970o25J060K91
3604A06j82l04p01K09P09j597k52J815r11j333J452o7k049P40J797j296j013R55
3622a922L21n63k75m67J91O72o25r32J674K79j890J000J212j373p92J673m3j076
3640b936O42R54p18n02j81K3J446J6j467J378J344k200m42J967p8j391J805O41
3658C01j042j91R22k48k86L22K76R87j48j509N72K139j056j720J686J373j444
3675I34N4J336p73k76P97j35k28L28j3J04J055j006o67J640l10k211J152K497
3693D278j357j318J521k8j275J18J02N8J049o04m88K76j12j437J061J224k050
$$ plain form
3568 2919 2480 2859 2687 2237 3462 2749 744 2484 4380 1811 1085 3295 3252 1779 1875 2414 1791 2111
3586 2111 2143 1127 1953 1956 556 1167 1896 419 156 2382 1229 -1232 478 1350 -620 -1245 -185 106
3604 106 -76 -380 -1081 -872 -163 -1760 -2012 -197 -1108 -2441 -989 -1056 -3105 -2365 -568 -1864 -2877 -1922
3622 -1922 -1601 -2164 -2439 -2906 -2715 -2043 -2668 -3600 -1926 -1647 -3537 -2537 -1325 -2698 -3490 -1817 -1860 -2936
3640 -2936 -2294 -1340 -2058 -2560 -2741 -2718 -1272 -1256 -2723 -1345 -1 -2201 -2643 -676 -754 -2145 -340 301
3658 301 -741 -932 -10 -258 -544 -222 54 1041 893 -616 -44 2095 1039 -681 1005 2378 934
3675 934 988 2324 1551 1275 2072 1937 1709 2037 2024 2128 3183 2177 1510 3150 2840 629 1781 4278
3693 4278 2921 1603 3124 3096 1821 1939 2041 2099 3148 2544 2056 2332 2220 783 1844 3068 1018
3710A018j44J993p24k510R71J549p75q37L64Q0J71o36r95P88J329j878j022J802
3728E44o57q65R82K55k298L16J245o47j037J154J25J36n69j162K18J091j001r06
3746c076J663Q05k101j74J446j216l74J509k33j210M68N20m69k21j26J69J214
3763a406R4j983M05K041j356j187K068kq65M33M10q41O20O05l33J44K35p71J464
3782b25N76j413k08K276p13k387J775J462r15l78J077Pm13K35l58N79O11l68M7
3801A267J034r80p97J215P66j365M98J512j318p74R19P51n68l9J20l3O58p48p54
3820A364J164N37j638L55J666j676o67J760j10j488Q1O49n12K2Q2J1O49n82j366
3839C01K64J276j308o42J937m13j977J050O47j768l14J544L3j189K10o44K60N03
$$ plain form
3710 1018 874 2867 2143 -367 604 2153 1378 541 905 985 1156 520 -475 313 1642 -236 -1258 544
3728 544 -113 -978 4 259 -2039 -1723 -478 -1125 -2162 -1008 -883 -747 -1316 -2478 -2260 -1169 -2170 -3076
3746 -3076 -1413 -608 -2709 -2883 -1437 -2653 -3027 -1518 -1751 -2961 -2493 -1973 -2442 -2663 -2789 -2620 -1406
3763 -1406 -1312 -3295 -2890 -849 -2205 -3392 -1324 -1326 -2191 -1758 -1348 -2189 -1569 -964 -1297 -1153 -918 -1689 -225
3782 -225 351 -1062 -1270 1006 293 -2094 -319 1143 228 -150 927 934 521 756 398 977 1588 1220 1267
3801 1267 2301 1321 524 1739 2505 1140 1638 3150 1832 1058 1977 2728 2160 2121 2241 2208 2866 2118 1364
3820 1364 2528 3065 1427 1782 3448 1772 1105 2865 2755 1267 1348 1997 1485 1507 1589 1600 2249 1667 301
3839 301 565 1841 533 -109 1828 1415 -562 488 1135 -633 -947 597 630 -559 -349 -993 -733 -230
3857b30j159j43J837p63j671J239L75j848j20J942j070q17Q46j55l30K3j99J83
3875b060L82n45q41J240Q04k008J28J631j301p54Q97M18p98N20Q82n28l10J05
3893b138m09J182J48j254O03J971j891p80J923j05j121J072P41r20k97Q14j78
3910f39L44J11Q9K52P04q65n0J680r09j252J387Q20j400N34J303q64k56N92J22
3929A703n24N8R4M69Q08n52j182J337N29j764J90K163p39j169R65J6j073M11M75
3948B215j76L19k15l22K55k27j148R83J407j566o31J187K09j933K92J312j313
3965F48J88M00n24k32L54q89K28L77j068l34J661o93j472J486P03j977n98J377
3983c65k72m04j47L3KP5n39l72J043k34q67J133K29j795L5J528j378r81J944O74
$$ plain form
3857 -230 -1389 -1532 305 -458 -2129 -890 -515 -2363 -2483 -541 -1611 -2428 -1582 -1737 -2067 -2044 -2243 -2060
3875 -2060 -1678 -2223 -3064 -1824 -1020 -3028 -2900 -1269 -2570 -3324 -2427 -2009 -2807 -2287 -1405 -1933 -2243 -2138
3893 -2138 -2547 -1365 -1217 -2471 -1868 103 -1788 -2568 -645 -750 -1871 -799 -58 -978 -1275 -461 -639
3910 -639 -295 -184 -95 157 861 -4 -54 1626 717 -535 852 1672 272 806 2109 1245 989 1581 1703
3929 1703 1179 1237 1331 1800 2608 2056 874 2211 2740 976 1166 3329 2590 1421 2386 2402 1329 1740 2215
3948 2215 2039 2358 2143 1821 2076 1849 701 1684 3091 1525 894 2081 2290 357 649 1961 648
3965 648 836 1236 712 480 834 -55 173 550 -518 -852 809 116 -1356 130 833 -1144 -1742 -365
3983 -365 -637 -1041 -1188 -1155 -1153 -1078 -1617 -1989 -946 -1180 -2047 -914 -685 -2480 -2445 -917 -2295 -3276 -1332 -658
4003f58j513m9j15Q1O20l79p21J409L50j314k30J655j083o39J920o35j463J026
4021a738J191j182j28O40j25K76Q2q30J016Q94j267l69J783j77j319P19Q98n36
4039a72L6J133n34r59J103o5J15K55j81K32J013p20j354J313J450j567j12J510
4057B496l33p38Q96k75q3o1M38q87O27N9m44O58K30j459N46J765j531j205J530
4076B229P60j668L42K71l86O9P0p80L99N53j279L44L89o71l96J595m92j807R12
4095D54P41j499n66J392N1l26l31n51L9K49k86n69J349n73j510J047P66j565M1
4114a647J126j165m51Q41L89r21J10j36j19N92l55j270J257R79j507j29J322j022
4132b106r35J719M9j110O22O43l63r44N53P4N38j93k87M43J282j581q47J852J34
$$ plain form
4003 -658 -2171 -2220 -2335 -2254 -1634 -2013 -2734 -1325 -975 -2289 -2519 -864 -1947 -2586 -666 -1301 -2764 -1738
4021 -1738 -547 -1729 -1857 -1217 -1342 -1066 -984 -1814 -798 96 -1171 -1540 243 66 -1253 -534 364 -172
4039 -172 -136 997 463 -496 607 542 657 912 731 963 1976 1256 -98 1215 2665 1098 986 2496
4057 2496 2163 1425 2321 2046 1963 1902 2340 1453 2080 2139 1695 2353 2583 1124 1670 3435 1904 699 2229
4076 2229 2989 1321 1663 1934 1548 1617 1687 907 1306 1859 580 924 1313 642 246 1841 1349 -458 454
4095 454 1195 -304 -870 522 573 247 -84 -635 -596 -347 -633 -1202 147 -426 -1936 -889 -123 -1688 -1647
4114 -1647 -521 -1686 -2137 -1296 -907 -1828 -1718 -1854 -1973 -1381 -1736 -3006 -1749 -770 -2277 -2406 -1084 -2106
4132 -2106 -3041 -1322 -1273 -2383 -1761 -1118 -1481 -2425 -1872 -1798 -1260 -1453 -1740 -1297 -15 -1596 -2443 -591 -457
4151d57r86P17Q99r59r8J075p16k96O33N1M02J07o89j11J669k10j666Q28J470
4170A663r74o29J159k33k88O86l22j63M47K40m30N27o3q94R48M70j683O10K208
4189C279j011j696J434L72q62K01J42k95P16j32p75L50L92q87J14R74r09l16J257
4208B348k73j891P03J336j041n43M14j05l0K32j133j10J492p48j107J050J97j628
4226h37Q57M38j398m13J528m40j465J055L08l73j64q60k8J228n90j301J053J032
4244c70j437o19J257n46n87J085J68j463N26R01n62n9mn8O69p2j452O28J603j168
4264a560j117J576L98j325N93N04p91O15M28o29j95O10l17L41R37p87n56J394
4282A19l0j380O65J358r61l14J318m49p16N20M57l72O22j13n46J029j24j026J286
$$ plain form
4151 -457 -1443 -726 173 -786 -884 191 -525 -821 -188 -137 265 372 -317 -428 1241 1031 -635 193 1663
4170 1663 689 60 1219 986 698 1384 1062 899 1346 1586 1156 1683 1620 726 1674 2144 461 1071 3279
4189 3279 2268 572 2006 2378 1516 1717 1859 1564 2280 2148 1373 1723 2115 1228 1342 2316 1407 1091 2348
4208 2348 2075 184 887 2223 1182 639 1053 948 918 1150 17 -93 1399 651 -456 594 791 -837
4226 -837 20 458 -940 -1353 175 -265 -1730 -675 -367 -740 -904 -1764 -1792 -564 -1154 -2455 -1402 -370
4244 -370 -1807 -2426 -1169 -1715 -2302 -1217 -1049 -2512 -1986 -1085 -1647 -1706 -1710 -1768 -1099 -1171 -2623 -1995 -392 -1560
4264 -1560 -2677 -1101 -703 -2028 -1435 -931 -1722 -1107 -679 -1308 -1503 -893 -1210 -869 68 -719 -1275 119
4282 119 89 -1291 -626 732 -229 -543 775 326 -390 130 587 215 837 724 178 1207 1083 57 1343
4301A343L10j095K30J610q86r97P91M36j89J98K1j63K12L38r75M01L20p24J35
4320A316J387r17q50J139Oj151J50Q75o97l98J103m03O0L36j298k7R43r39m78
4339A57R73L69j759N42Q31j013k61Q95j65o09L06m72j54L09o03m16R29J45j554
4358a550O75J055j689M3J089m31j165N71N82o61L10J13l84n7J52j029J048P37
4376e91j145n47J508n21j133R16Q36j454M93N62o63K61K37m34j49Q99o92N05O93
4395d19j018o87J368N73j258N85O79o22m37R06l44p5P20j21m15R81n81o68J292
$$ plain form
4301 1343 1653 558 788 2398 1512 515 1306 1742 1553 1751 1772 1609 1821 2159 1184 1585 1905 1181 1316
4320 1316 2703 1786 936 2075 2081 930 1080 1955 1258 860 1963 1560 1620 1956 658 631 1574 635 157
4339 157 1130 1499 -260 282 1113 100 -161 734 569 -40 266 -206 -360 -51 -654 -1070 -141 4 -1550
4358 -1550 -875 180 -1509 -1466 -377 -808 -1973 -1402 -820 -1481 -1171 -1058 -1442 -1499 -1347 -2376 -1328 -591
4376 -591 -1736 -2283 -775 -1296 -2429 -1513 -677 -2131 -1638 -1076 -1739 -1478 -1241 -1675 -1824 -925 -1617 -1112 -419
4395 -419 -1437 -2124 -756 -183 -1441 -856 -177 -799 -1236 -330 -674 -749 -29 -150 -565 416 -165 -833 459
$$ [...]
8191G62
##END NTUPLES=NMR FID
##END=
