##TITLE=1H_CG-1124-11
 CDcl3, 8 sc, 
 15.11.2019
##JCAMPDX= 6.0         $$ Bruker NMR JCAMP-DX V2.0
##DATA TYPE= NMR FID
##DATA CLASS= NTUPLES
##ORIGIN= UXNMR, Bruker Analytische Messtechnik GmbH
##OWNER= root
$$ XWIN-NMR		Version 3.5
$$ Fri Nov 15 14:24:50 2019 Russian Standard Time (UT+4h)  she@DPX200
##.OBSERVE FREQUENCY= 200.1315
##.OBSERVE NUCLEUS= ^1H
##.DELAY= (6, 6)
##.ACQUISITION MODE= SIMULTANEOUS
##.ACQUISITION SCHEME= undefined
##.AVERAGES= 8
##.DIGITISER RES= 18
##SPECTROMETER/DATA SYSTEM= spect
##.PULSE SEQUENCE= zg30
##.SOLVENT NAME= CDCl3
##.SHIFT REFERENCE= (INTERNAL, CDCl3, 0, 15.7039)
##AUDIT TRAIL= $$ (NUMBER, WHEN, WHO, WHERE, WHAT)
$$ ##TITLE= Audit trail, XWIN-NMR		Version 3.5
$$ ##JCAMPDX= 5.01
$$ ##ORIGIN= Bruker BioSpin GmbH
$$ ##OWNER= she
$$ F:/spectra/data/she/nmr/H-F/1/audita.txt
$$ ##AUDIT TRAIL=  $$ (NUMBER, WHEN, WHO, WHERE, WHAT)
(   1,<2019-11-15 14:23:39.53 +0400>,<she>,<DPX200>,
      <created by zg, POWCHK disabled, PULCHK disabled
       configuration hash MD5:
       00 E9 B6 7A A2 85 ED C7 34 08 36 98 17 FE 4E 26
       data hash MD5: 16K
       56 FF 7E D2 D4 66 4F 5E AC 60 70 63 F1 08 1D 5A>)
$$ ##END=
$$ 
$$ hash MD5
$$ 99 01 DA 5A 2E 83 89 E0 79 5E 16 E0 53 EF B8 9D
##$RELAX= 
##$RELAX= 
##$RELAX= 
##$RELAX= 
##$RELAX= 
##$RELAX= 
$$ Bruker specific parameters
$$ --------------------------
##$DU= <F:/spectra>
##$EXPNO= 1
##$NAME= <H-F>
##$PROCNO= 1
##$TYPE= <nmr>
##$USER= <she>
##$AMP= (0..31)
100 100 100 100 100 100 100 100 100 100 100 100 100 100 100 100 100 100 
100 100 100 100 100 100 100 100 100 100 100 100 100 100 
##$AQSEQ= 0
##$AQ_mod= 1
##$AUNM= <au_zg>
##$AUTOPOS= <>
##$BF1= 200.13
##$BF2= 200.13
##$BF3= 200.13
##$BF4= 200.13
##$BF5= 200.13
##$BF6= 200.13
##$BF7= 200.13
##$BF8= 200.13
##$BYTORDA= 1
##$CFDGTYP= 0
##$CFRGTYP= 5
##$CHEMSTR= <none>
##$CNST= (0..31)
1 1 145 1 1 1 1 1 1 1 1 1 1 1 1 1 1 1 1 1 1 1 1 1 1 1 1 1 1 1 1 1 
##$CPDPRG= <>
##$CPDPRG1= <>
##$CPDPRG2= <>
##$CPDPRG3= <>
##$CPDPRG4= <mlev>
##$CPDPRG5= <mlev>
##$CPDPRG6= <mlev>
##$CPDPRG7= <mlev>
##$CPDPRG8= <mlev>
##$CPDPRGB= <>
##$CPDPRGT= <>
##$D= (0..31)
0 1.2 0 0 0 0 0 0 0 0.06 0 0.03 0 0 0 0 0.0002 0 0 0 0 0 0 0 0 0 0 0 0 
0 0 0 
##$DATE= 1573813419
##$DBL= (0..7)
120 120 120 120 120 120 120 120 
##$DBP= (0..7)
150 150 150 150 150 150 150 150 
##$DBP07= 0
##$DBPNAM0= <>
##$DBPNAM1= <>
##$DBPNAM2= <>
##$DBPNAM3= <>
##$DBPNAM4= <>
##$DBPNAM5= <>
##$DBPNAM6= <>
##$DBPNAM7= <>
##$DBPOAL= (0..7)
0.5 0.5 0.5 0.5 0.5 0.5 0.5 0.5 
##$DBPOFFS= (0..7)
0 0 0 0 0 0 0 0 
##$DE= 6
##$DECBNUC= <off>
##$DECIM= 24
##$DECNUC= <off>
##$DECSTAT= 4
##$DIGMOD= 1
##$DIGTYP= 9
##$DL= (0..7)
0 120 120 120 120 120 120 120 
##$DP= (0..7)
150 150 150 150 150 150 150 150 
##$DP07= 0
##$DPNAME0= <>
##$DPNAME1= <>
##$DPNAME2= <>
##$DPNAME3= <>
##$DPNAME4= <>
##$DPNAME5= <>
##$DPNAME6= <>
##$DPNAME7= <>
##$DPOAL= (0..7)
0.5 0.5 0.5 0.5 0.5 0.5 0.5 0.5 
##$DPOFFS= (0..7)
0 0 0 0 0 0 0 0 
##$DQDMODE= 0
##$DR= 18
##$DS= 0
##$DSLIST= <SSSSSSSSSSSSSSS>
$$ [...]
##$SUBNAM2= <"">
##$SUBNAM3= <"">
##$SUBNAM4= <"">
##$SUBNAM5= <"">
##$SUBNAM6= <"">
##$SUBNAM7= <"">
##$SUBNAM8= <"">
##$SUBNAM9= <"">
##$SW= 24.0689530833862
##$SWIBOX= (0..15)
0 0 2 0 0 0 0 0 0 0 0 0 0 0 0 0 
##$SW_h= 4816.95568400771
##$TD= 16384
##$TD0= 1
##$TE= 0
##$TE2= 300
##$TE3= 300
##$TEG= 300
##$TL= (0..7)
0 120 120 120 120 120 120 120 
##$TP= (0..7)
150 150 150 150 150 150 150 150 
##$TP07= 0
##$TPNAME0= <>
##$TPNAME1= <>
##$TPNAME2= <>
##$TPNAME3= <>
##$TPNAME4= <>
##$TPNAME5= <>
##$TPNAME6= <>
##$TPNAME7= <>
##$TPOAL= (0..7)
0.5 0.5 0.5 0.5 0.5 0.5 0.5 0.5 
##$TPOFFS= (0..7)
0 0 0 0 0 0 0 0 
##$TUNHIN= 0
##$TUNHOUT= 0
##$TUNXOUT= 0
##$USERA1= <user>
##$USERA2= <user>
##$USERA3= <user>
##$USERA4= <user>
##$USERA5= <user>
##$V9= 5
##$VALIST= <valist>
##$VCLIST= <CCCCCCCCCCCCCCC>
##$VD= 0
##$VDLIST= <DDDDDDDDDDDDDDD>
##$VPLIST= <PPPPPPPPPPPPPPP>
##$VTLIST= <TTTTTTTTTTTTTTT>
##$WBST= 1024
##$WBSW= 4
##$XGAIN= (0..3)
0 0 0 0 
##$XL= 0
##$YL= 0
##$YMAX_a= 967823
##$YMIN_a= -303565
##$ZGOPTNS= <>
##$ZL1= 120
##$ZL2= 120
##$ZL3= 120
##$ZL4= 120
##$ABSF1= 10
##$ABSF2= 0
##$ABSG= 5
##$ABSL= 3
##$ALPHA= 0
##$AQORDER= 0
##$ASSFAC= 0
##$ASSFACI= 0
##$ASSFACX= 0
##$ASSWID= 0
##$AUNMP= <proc_1d>
##$AZFE= 0.1
##$AZFW= 0.1
##$BCFW= 1
##$BC_mod= 2
##$BYTORDP= 1
##$COROFFS= 0
##$CY= 11.3945322036743
##$DATMOD= 1
##$DC= 2
##$DFILT= <>
##$DTYPP= 0
##$F1P= 16.9975609425685
##$F2P= -3.02152046262296
##$FCOR= 0.5
##$FTSIZE= 0
##$FT_mod= 4
##$GAMMA= 1
##$GB= 0.15
##$INTBC= 1
##$INTSCL= 1
##$ISEN= 128
##$LB= 0.24
##$LEV0= 0
##$LPBIN= 0
##$MAXI= 10000
##$MC2= 0
##$MEAN= 0
##$ME_mod= 0
##$MI= 1.114404
##$NCOEF= 0
##$NC_proc= 0
##$NLEV= 6
##$NOISF1= 3.799351
##$NOISF2= 2.8
##$NSP= 1
##$NTH_PI= 0
##$NZP= 0
##$OFFSET= 15.70392
##$PC= 1
##$PHC0= -9462.557
##$PHC1= 28.00088
##$PH_mod= 1
##$PKNL= yes
##$PPARMOD= 0
##$PSCAL= 0
##$PSIGN= 0
##$REVERSE= no
##$SF= 200.130013532006
##$SI= 16384
##$SIGF1= 3
##$SIGF2= 2
##$SINO= 400
##$SIOLD= 16384
##$SREGLST= <1H.CDCl3>
##$SSB= 0
##$STSI= 0
##$STSR= 0
##$SW_p= 3612.71676300578
##$SYMM= 0
##$S_DEV= 0
##$TDeff= 0
##$TDoff= 0
##$TI= <>
##$TILT= no
##$TM1= 0
##$TM2= 0
##$TOPLEV= 0
##$USERP1= <user>
##$USERP2= <user>
##$USERP3= <user>
##$USERP4= <user>
##$USERP5= <user>
##$WDW= 1
##$XDIM= 8192
##$YMAX_p= 0
##$YMIN_p= 0
$$ End of Bruker specific parameters
$$ ---------------------------------
##NTUPLES= NMR FID
##VAR_NAME=  TIME,          FID/REAL,        FID/IMAG
##SYMBOL=    X,             R,               I
##VAR_TYPE=  INDEPENDENT,   DEPENDENT,       DEPENDENT
##VAR_FORM=  AFFN,          ASDF,            ASDF
##VAR_DIM=   8192,          8192,            8192
##UNITS=     SECONDS,       ARBITRARY UNITS, ARBITRARY UNITS
##FACTOR=    0.0002076,     1,               1
##FIRST=     0,             0,               0
##LAST=      1.7004516,     0,               0
##MIN=       0,             -303565,         0
##MAX=       1.7004516,     967823,          0
$$ Real data points
##PAGE= N=1
##DATA TABLE= (X++(R..R)), XYDATA
$$ plain form
0 0 0 0 0 0 0 0 0 0 -6 8 -8 8 -14 16 -16 24 -25 30 -36 44 -52 60 -69 83 -91 107 -127 143 -160 184 -205 233
32 233 -263 295 -327 366 -408 456 -506 560 -622 689 -761 843 -934 1033 -1147 1274 -1419
49 -1419 1583 -1773 1998 -2266 2592 -2998 3515 -4201 5144 -6471 8055 -2465 417426 466303
63 466303 39463 -39340 151455 204797 -27390 -165504 100182 540419 548307 166118 -26037
74 -26037 151174 290200 166403 -34199 34169 359356 459612 116070 -117961 109252
84 109252 333619 169789 -69650 -30096 207984 308288 101980 -123926 -19455 163480
94 163480 19857 -223649 -160245 86162 181647 44208 -166062 -212068 -95545 -105268 -254562
105 -254562 -204720 51575 152958 -15362 -240330 -303565 -182734 -102958 -178166 -136295 112733
$$ packed form
0@%%%%%%%%oJ4j6J6k2L0l2M0m9N5o6Q0r6J12j29J52j74J98k34K70l03L44l89M38
32B33m96N58o22O93p74Q64r62J066j182J311j450J604j777J967k180K421k693
49a419L002l356L771m264M858n590O513p716R345j1615J4526j0520M19891M8877
63D66303m26840p8803J90795N3342k32187j38114K65686M40237P888l82189j92155
74b6037J77211J39026j23797k00602O8368L25187J00256l43542k34031K27213
84A09252K24367j63830k39439L9554K38080J00304k06308k25906J04471J82935
94A63480j43623k43506O3404K46407R5485j37439k10270m6006J16523r723j49294
105b54562M9842K56295J01383j68320k24968o3235J20831P9776p5208M1871K49028
$$ plain form
116 112733 174442 -77951 -259306 -204718 -111210 -70028 -49734 -18356 66874 102840 -37364
127 -37364 -177845 -117497 6366 29817 1086 -3012 52031 108240 21309 -118888 -58463 83858
139 83858 29948 -72931 7504 129185 120112 29417 -52158 -45085 30950 17053 -48363 48658
151 48658 207665 164699 -8703 -97843 -80503 -10923 36349 26472 86213 223596 183966 -56639
163 -56639 -180070 -86629 27494 54569 32725 53229 141310 110379 -127333 -251714 -74082
174 -74082 85952 22137 -56169 -14112 40704 3002 -135948 -232374 -120626 42373 -8331
185 -8331 -149783 -128066 -6914 12240 -109997 -233443 -163433 27535 18725 -160585 -133887
196 -133887 74107 82767 -122431 -236528 -140453 32464 84374 -16085 -30134 128266 155425
$$ packed form
116A12733O1709k52393j81355N4588R3508M1182K0294L1378Q5230L5966j40204
127c7364j40481O0348J23863K3451k8731m098N5043N6209q6931j40197O0425J42321
139H3858n3910j02879Q0435J21681r073r0695q1575P073P6035j3897o5416R7021
151D8658J59007m2966j73402q9140J7340O9580M7272r877N9741J37383l9630k40605
163e6639j23431R3441J14123K7075k1844K0504Q8081l0931k37712j24381J77632
174g4082J60034o3815p8306M2057N4816l7702j38950r6426J11748J62999n0704
185h331j41452K1717J21152J9154j22237j23446P0010J90968q810j79310K6698
196a33887K07994Q660k05198j14097R6075J72917N1910j00459j4049J58400K7159
$$ plain form
207 155425 -67116 -212684 -82824 134247 210330 116200 29856 113131 180172 25 -177957
218 -177957 -27670 242731 278904 121946 19757 79952 160834 51326 -121939 -25965 228417
229 228417 233526 21353 -61043 36932 114971 49310 -90150 -84621 104577 170096 -15356
240 -15356 -135332 -20001 88871 4259 -156062 -168762 17471 145304 6090 -148271
250 -148271 -47792 69978 -52776 -212656 -157805 35894 151016 64541 -103623 -107947 -140
261 -140 -46362 -181818 -123529 91066 193224 87176 -93068 -135133 -15267 17159 -104685
272 -104685 -95046 109008 190406 37300 -115935 -105855 7651 57605 -29921 -74730 62537
283 62537 155966 24920 -112607 -66392 38618 50692 -25131 -78741 7318 131488 69722
$$ packed form
207A55425k22541j45568J29860K17071P6083r4130q6344Q3275O7041j80147j77982
218a77957J50287K70401L6173j56958j02189O0195Q0882j09508j73265R5974K54382
229B28417N109k12173q2396R7975P8039o5661j39460N529J89198O5519j85452
240a5356j19976J15331J08872q4612j60321j2700J86233J27833j39214j54361
250a48271J00479J17770j22754j59880N4851J93699J15122q6475j68164m324J07807
261a40m6222j35456N8289K14595J02158j06048j80244m2065J19866L2426j21844
272a04685R639K04054Q1398j53106j53235J0080J13506M9954q7526m4809J37267
283F2537R3429j31046j37527M6215J05010J2074p5823n3610Q6059J24170o1766
$$ plain form
294 69722 -85089 -69210 48837 42082 -52191 -63288 43602 150998 96586 -74597 -105061
305 -105061 14846 29256 -57409 -20693 116794 166424 78589 -65617 -122278 -26071 55311
316 55311 4667 -5834 109217 154031 33968 -104410 -121014 -11853 84141 37982 -25118
327 -25118 59111 126891 2645 -132062 -91081 21895 57532 2154 -57697 -12758 71176
338 71176 12625 -116306 -94882 20038 34683 -36379 -72837 -25538 55925 32101 -109782
349 -109782 -148189 -21874 36223 -42334 -64366 23383 81738 19119 -116327 -158596 -32461
360 -32461 71019 14493 -27153 54979 89144 -12753 -120643 -120952 -7439 111102 90847
371 90847 4366 30446 88386 10156 -101716 -74556 49419 128423 83761 -17068 -10181 78546
$$ packed form
294F9722j54811J5879J18047o755r4273j1097J06890J07396n4412j71183l0464
305a05061J19907J4410q6665L6716J37487M9630q7835j44206n6661R6207Q1382
316E5311n0644j0501J15051M4814j20063j38378j6604J09161R5994m6159o3100
327b5118Q4229O7780j24246j34707M0981J12976L5637n5378n9851M4939Q3934
338G1176n8551j28931K1424J14920J4645p1062l6458M7299Q1463k3824j41883
349a09782l8407J26315N8097p8557k2032Q7749N8355o2619j35446m2269J26135
360c2461J03480n6526m1646Q2132L4165j01897j07890l09J13513J18541k0255
371I0847q6481K6080N7940p8230j11872K7160J23975P9004m4662j00829O887Q8727
$$ plain form
383 78546 41747 -80545 -57184 75751 104850 21881 -40105 -17149 51278 37764 -77465
394 -77465 -105639 11068 64876 -18789 -74015 -28093 25250 -4418 -115448 -164710 -47459
405 -47459 62106 -11711 -107661 -59552 -1397 -67993 -172397 -174299 -45421 74963 22633
416 22633 -104202 -91403 -13213 -63582 -162812 -134915 -2700 88841 39965 -93206 -116288
427 -116288 -7840 10136 -96492 -101308 37086 116900 42306 -78266 -89312 23023 69695
438 69695 -41438 -96872 30451 125418 42733 -62215 -47868 40775 74791 -12243 -91834
449 -91834 -1932 129323 80845 -53925 -62166 22704 43620 -31600 -92907 -11795 134319 113496
461 113496 -55757 -103883 -2070 30872 -43032 -72413 8148 112131 93366 -60848 -140643
$$ packed form
383G8546l6799j22292K3361J32935K9099q2969o1986K2956O8427j3514j15229
394g7465k8174J16707N3808q3665n5226M5922N3343k9668j11030m9262J17251
405d7459J09565p3817r5950M8109N8155o6596j04404j902J28878J20384n2330
416B2633j26835J2799P8190n0369r9230K7897J32215R1541m8876j33171k3082
427a16288J08448J7976j06628m816J38394P9814p4594j20572j1046J12335M6672
438F9695j11133n5434J27323R4967q2685j04948J4347Q8643L4016q7034p9591
449i1834Q9902J31255m8478j34770q241Q4870K0916p5220o1307Q1112J46114k0823
461A13496j69253m8126J01813L2942p3904k9381Q0561J03983j8765j54214p9795
$$ plain form
472 -140643 -41160 41916 -13742 -57862 8536 83021 56476 -63321 -140322 -56906 57570
483 57570 11824 -83124 -39037 52313 25090 -76865 -118387 -48939 40532 7061 -94858 -72457
495 -72457 36400 28078 -77369 -111377 -54535 606 -10416 -71099 -65683 35395 61771 -51637
507 -51637 -120708 -54985 16369 8369 -26004 -12970 56108 72529 -36249 -118061 -37727 64898
519 64898 52955 15924 39950 74196 58575 -15910 -75145 -15033 92931 87579 14535 18192
531 18192 59432 39729 -19679 -49172 -5680 75822 70882 -21500 -38280 31639 28312 -51284
543 -51284 -75310 -25453 20367 5126 -58873 -70250 1738 15873 -75361 -115628 -49831 -1574
555 -1574 -21416 -55201 -55838 -12144 4612 -74581 -136044 -59087 39527 24444 -28869 -19512 20743
$$ packed form
472a40643R9483Q3076n5658m4120O6398P4485k6545j19797p7001Q3416J14476
483E7570m5746r4948M4087R1350k7223j01955m1522O9448Q9471l3471j01919K2401
495g2457J08857q322j05447l4008N6842N5141j1022o0683N416J01078K6376j13408
507e1637o9071O5723P1354q000l4373J3034O9078J6421j08778q1812Q0334J02625
519F4898j1943l7031K4026L4246j5621p4485n9235O0112J07964n352p3044L657
531A8192M1240j9703n9408k9493M3492Q1502m940r2382j6780O9919l327p9596
543e1284k4026M9857M5820j5241o3999j1377P1988J4135r1234m0267O5797M8257
555a574j9842l3785o37M3694J6756p9193o1463P6957R8614j5083n3313R357M0255
$$ plain form
568 20743 18760 -47513 -95449 -16621 101465 85397 -4137 -1765 53397 43704 -11802 -29864
580 -29864 33516 127272 119224 12595 -16033 63363 82986 10703 -20655 38329 108169 94332
592 94332 -1833 -39526 48599 98009 9991 -54930 11044 87076 63883 -15948 -46059 17499
604 17499 70361 -2931 -88544 -26104 83571 71502 -15075 -45755 -1023 44065 2280 -77197
616 -77197 -36939 93353 104358 -13936 -66739 -5146 44830 12396 -45640 -16633 94057
627 94057 115485 -6106 -78178 -6324 59165 23967 -28471 -14334 56999 87053 2127 -83235
639 -83235 -25416 70544 40137 -42690 -34433 37812 63186 -555 -75081 -40107 54340 38335
651 38335 -55828 -51110 40591 66707 4332 -52823 -34844 35340 46398 -25789 -37834 53665
$$ packed form
568B0743j983o6273m7936P8828J18086j6068q9534K372N5162r693n5506j8062
580b9864O3380R3756q048j06629k8628P9396J9623p2283l1358N8984O9840j3837
592I4332r6165l7693Q8125M9410q8018o4921O5974P6032k3193p9831l0111O3558
604A7499N2862p3292q5613O2440J09675j2069q6577l0680M4732M5088m1785p9477
616g7197M0258J30292J1005j18294n2803O1593M9976l2434n8036K9007J10690
627I4057K1428j21591p2072P1854O5489l5198n2438J4137P1333L0054q4926q5362
639h3235N7819R5960l0407q2827Q257P2245K5374o3741p4526L4974R4447j6005
651C8335r4163M718R1701K6116o2375n7155J7979P0184J1058p2187j2045R1499
$$ plain form
663 53665 91327 14958 -48785 -25804 35406 59232 18634 -5703 59348 107323 31089 -52689
675 -52689 -16549 58974 66149 24192 4432 42883 79022 23519 -54048 -21122 63321 59607
687 59607 2143 -11061 18782 40829 12434 -48949 -43178 35053 46794 -27556 -48777 8459
699 8459 36196 -1696 -49199 -43368 19009 41263 -21405 -48849 16894 51992 -5122 -54221
711 -54221 -32734 22010 49854 16080 -17122 28392 73957 17380 -51061 -17680 54710 70556
723 70556 34297 2115 25548 67697 32337 -41351 -14827 77070 85852 21475 -8125 20232
735 20232 51754 27267 -33711 -26047 57020 72744 -5761 -41163 5616 40050 15920 -32595
747 -32595 -38928 22955 58497 -7325 -63002 -9862 45957 5838 -55098 -47312 14716 50149
$$ packed form
663E3665L7662p6369o3743K2981O1210K3826m0598k4337O5051M7975p6234q3778
675e2689L6140P5523P175m1957j9760L8451L6139n5503p7567L2926Q4443l714
687E9607n7464j3204K9843K2047k8395o1383N771P8231J1741p4350k1221N7236
699H459K7737l7892m7503N831O2377K2254o2668k7444O5743L5098n7114m9099
711e4221K1487N4744K7844l3774l3202M5514M5565n6577o8441L3381P2390J5846
723G0556l6259l2182K3433M2149l5360p3688K6524R1897Q782o4377k9600K8357
735B0232L1522k4487o0978P664Q3067J5724p8505l5402M6779L4434k4130m8515
747c2595o333O1883L5542o5822n5677N3140N5819m0119o0936P786O2028L5433
$$ plain form
759 50149 4387 -51574 -13397 49734 12677 -59256 -43058 27083 54484 16797 -36466 -26393
771 -26393 33483 25546 -48886 -46294 39639 70075 13170 -39635 -28988 20681 27067 -34404 -53126
784 -53126 23717 64546 -3954 -62525 -32692 18867 20337 -26608 -51270 2175 50848 -1994
796 -1994 -70589 -38974 24226 16477 -33148 -51019 -9699 43263 18890 -54262 -42872 34533
808 34533 35082 -32550 -44392 12566 53731 26784 -34981 -37790 29487 47081 -16369 -33400 32009
821 32009 69315 31663 -23665 -31349 19772 53568 5740 -35161 19386 71894 25589 -40548
833 -40548 -32239 21213 46909 9318 -35277 -2771 55696 23430 -50963 -40937 21375 34853
845 34853 -6541 -41456 -20439 32676 24799 -43638 -50192 18824 38455 -13607 -43855 -15663
$$ packed form
759E0149m5762n5961L8177O3131l7057p1933J6198P0141K7401l7687n3263J0073
771b6393N9876p937p4432K592Q5933L0436n6905n2805J0647M9669O386o1471j8722
784e3126P6843M0829o8500n8571K9833N1559J470m6945k4662N3445M8673n2842
796a994o8595L1615O3200p749m9625j7871M1320N2962k4373p3152J1390P7405
808C4533N49o7632j1842N6958M1165k6947o1765k809O7277J7594o3450j7031O5409
821C2009L7306l7652n5328p684N1121L3796m7828m0901N4547N2508m6305o6137
833d0548Q309N3452K5696l7591m4595L2506N8467l2266p4393J0026O2312J3478
845C4853m1394l4915K1017N3115p877o8437o554O9016J9631n2062l0248K8192
$$ plain form
857 -15663 27330 26071 -31790 -57457 5190 47577 -3898 -44601 -1586 44855 27182 -25006
869 -25006 -43723 3041 49534 14284 -37136 -4289 48776 26866 -27335 -34897 7304 49496
881 49496 29614 -27471 -18082 44395 36434 -33318 -40748 15693 44725 15039 -30266 -26364 27520
894 27520 36846 -26839 -48164 11571 43256 3085 -37718 -27262 14325 28704 -20611 -57807
906 -57807 -9320 40592 2827 -46820 -26878 18690 21884 -19529 -52541 -18516 37637 15057
918 15057 -48373 -35071 22350 20151 -27285 -45037 -10850 34820 25119 -32020 -36769 21797 32582
931 32582 -21416 -40970 -1672 34945 25053 -21680 -37713 15367 47500 -4662 -42571 4937
943 4937 48841 22478 -22750 -25905 15379 43574 4814 -40552 -4219 50699 26255 -25605
$$ packed form
857a5663M2993j259n7861k5667O2647M2387n1475m0703M3015M6441j7673n2188
869b5006j8717M6764M6493l5250n1420L2847N3065k1910n4201p562M2201M2192
881D9496j9882n7085R389O2477p961o9752p430N6441K9032k9686m5305L902N3884
894B7520R326o3685k1325N9735L1685m0171m0803J0456M1587J4379m9315l7196
906e7807M8487M9912l7765m9647J9942M5568L194m1413l3012L4025N6153k2580
918A5057o3430J3302N7421k199m7436j7752L4187M5670r701n7139m749N8566J0785
931C2582n3998j9554L9298L6617r892m6733j6033N3080L2133n2162l7909M7508
943D937M3904k6363m5228l155M1284K8195l8760m5366L6333N4918k4444n1860
$$ plain form
955 -25605 -20469 20745 39762 10715 -32006 -14115 46128 38360 -26853 -31297 24064 40234 3593
968 3593 -27694 -9904 40127 44688 -16248 -36601 22197 49654 2242 -31158 -4192 35210
980 35210 35336 -9978 -35520 10317 52250 12093 -34306 -6710 37890 30003 -10989 -32968 -1634
993 -1634 42333 16395 -42622 -25841 34906 28563 -23229 -34932 199 29608 11107 -37333
1005 -37333 -35311 21281 29239 -26940 -45549 -3407 24201 4601 -31819 -34572 12619 36173
1017 36173 -13940 -49031 -2395 37797 7052 -32447 -24181 14992 33626 -2204 -39697 -4690
1029 -4690 46871 20829 -30417 -17536 26297 34542 3006 -27180 -7482 39392 28341 -30290
1041 -30290 -30098 25351 35646 -5495 -30096 -10249 27246 24228 -28626 -43995 11547 34294
$$ packed form
955b5605N136M1214J9017k9047m2721J7891O0243p768o5213m444N5361J6170l6641
968C593l1287J7790N0031M561o0936k0353N8798K7457m7412l3400K6966L9402
980C5210J26m5314k5542M5837M1933m0157m6399K7596M4600p887m0992k1979L1334
993a634M3967k5938n9017J6781O0747o343n1792j1703L5131K9409j8501m8440
1005c7333K022N6592P958n6179j8609M2142K7608j9600l6420k753M7191K3554
1017C6173n0113l5091M6636M0192l0745l9499Q266L9173J8634l5830l7493L5007
1029d690N1561k6042n1246J2881M3833Q245l1536l0186J9698M6874j1051n8631
1041c0290J92N5449J0295m1141k4601J9847L7495l018n2854j5369N5542K2747
$$ plain form
1053 34294 -16914 -48210 -15765 17715 7323 -30907 -45796 -4202 29112 -9866 -52370 -21168
1065 -21168 21674 7075 -31481 -39671 -7152 27004 5115 -41820 -22628 33759 24611 -26882
1077 -26882 -28773 12314 35921 16031 -21031 -15631 33307 37533 -16233 -28008 21205 44946
1089 44946 16839 -13413 -8639 27026 39729 -3946 -32059 12039 47170 10523 -28849 -14769
1101 -14769 19601 26722 -6777 -36086 -4215 39347 10435 -41487 -24748 19641 16466 -19802
1113 -19802 -37595 -13629 25066 13296 -37256 -33985 17459 21900 -21639 -35465 -4829 26622
1125 26622 19121 -24316 -36073 11568 30519 -17859 -40083 3095 35211 14566 -21541 -28990
1137 -28990 4638 28948 -6709 -41014 -5846 33185 7570 -34098 -32871 -2271 16699 -6572
$$ packed form
1053C4294n1208l1296L2445L3480j0392l8230j4889M1594L3314l8978m2504L1202
1065b1168M2842j4599l8556q190L2519L4156k1889m6935J9192N6387r148n1493
1077b6882j891M1087K3607j9890l7062N400M8938M226n3766j1775M9213K3741
1089D4946k8107l0252M774L5665J2703m3675k8113M4098L5131l6647l9372J4080
1101a4769L4370P121l3499k9309L1871M3562k8912n1922J6739M4389l175l6268
1113a9802j7793K3966L8695j1770n0552L271N1444M441m3539j3826L0636L1451
1125B6622p501m3437j1757M7641J8951m8378k2224M3178L2116k0645l6107p449
1137b8990L3628K4310l5657l4305L5168L9031k5615m1668J227L0600J8970k3271
$$ plain form
1149 -6572 -42329 -23215 23858 8560 -43895 -41393 203 11197 -16359 -43651 -30206 12768
1161 12768 12188 -39150 -46965 3175 19854 -16345 -36778 -15455 18613 21481 -19889 -42512 -290
1174 -290 32352 -2329 -32069 -2595 33756 28409 -9287 -31906 -558 39935 15961 -28102
1186 -28102 -5242 40322 25265 -19968 -31555 -2032 30022 17371 -26414 -21863 26274 23579
1198 23579 -28147 -41091 -4646 20994 5878 -31959 -37664 6275 22313 -26701 -52156 -8419
1210 -8419 23444 -786 -32129 -28389 5891 24041 -11961 -47340 -14137 29820 9827 -25583
1222 -25583 -13355 19597 28047 715 -31001 -11400 38340 33844 -10802 -9129 29086 31382 -2092
1235 -2092 -24488 -6750 35582 41221 -3892 -18477 21452 32323 -8112 -27898 -2900 25985
$$ packed form
1149f572l5757J9114M7073j5298n2455K502M1596J0994k7556k7292J3445M2974
1161A2768n80n1338p815N0140J6679l6199k0433K1323L4068K868m1370k2623M2222
1174b90L2642l4681k9740K9474L6351n347l7696k2619L1348M0493k3974m4063
1186b8102K2860M5564j5057m5233j1587K9523L2054j2651m3785M551M8137k695
1198B3579n1726j2944L6445K5640j5116l7837n705M3939J6038m9014k5455M3737
1210h419L1863k4230l1343L740L4280J8150l6002l5379L3203M3957j9993l5410
1222b5583J2228L2952Q450k7332l1716J9601M9740m496m4646J673L8215K296l3474
1235b092k2396J7738M2332N639m5113j4585L9929J0871m0435j9786K4998K8885
$$ plain form
1247 25985 24697 -10232 -31509 -1371 23836 -8964 -38889 -11728 19826 10407 -20048 -33134
1259 -33134 -9554 18349 -5041 -44427 -24192 20153 9620 -26610 -27321 -1625 13809 -3371
1271 -3371 -35478 -25330 22375 26515 -16383 -24854 5460 14384 -8075 -28566 -17890 22489 36264
1284 36264 -5958 -30752 2169 21236 -7825 -27793 -8760 22494 27834 -7545 -38049 -11273
1296 -11273 21913 -2574 -32652 -10128 22996 16777 -13644 -32823 -13850 20162 8644 -31130
1308 -31130 -21160 21503 20373 -15504 -26917 -4709 21453 14768 -21296 -21221 27009 38510 -5890
1321 -5890 -24218 4732 23917 10298 -12678 -10649 27962 48153 7464 -27585 -947 29557
1333 29557 13398 -9627 -2174 27750 40799 6514 -35720 -15629 29012 18506 -16202 -7654
$$ packed form
1247B5985j288l4929k1277L0138K5207l2800k9925K7161L1554r419l0455j3086
1259c3134K3580K7903k3390l9386K0235M4345j0533l6230p11K5696J5434j7180
1271c371l2107J0148M7705M140m2898q471L0314Q924k2459k0491J0676M0379J3775
1284C6264m2222k4794L2921J9067k9061j9968J9033L1254N340l5379l0504K6776
1296a1273L3186k4487l0078K2524L3124o219l0421j9179J8973L4012j1518l9774
1308c1130R970M2663j130l5877j1413K2208K6162o685l6064P5M8230J1501m4400
1321e890j8328K8950J9185j3619k2976K029L8611K0191m0689l5049K6638L0504
1333B9557j6159k3025P453K9924J3049l4285m2234K0091M4641j0506l4708Q548
$$ plain form
1345 -7654 23751 27027 -2713 -33664 -20228 23930 23951 -19973 -24013 15422 21639 -10432 -29700
1358 -29700 -14025 19014 24363 -13537 -29357 11346 33626 -1625 -29227 -9928 19240 20621
1370 20621 -6173 -21055 11581 42317 9331 -32610 -12308 25551 22396 -543 -6384 14064
1382 14064 34706 10776 -34626 -25598 23648 29990 -2451 -9661 10808 22869 3726 -31883
1394 -31883 -29413 18845 34920 -7233 -27842 -249 15298 -6153 -29705 -24309 11023 29490
1406 29490 -5841 -37053 -9178 20789 -1304 -30109 -20753 7848 20120 -3404 -31856 -12475
1418 -12475 25306 9866 -31268 -24407 13116 23515 3428 -17390 -7856 21425 13760 -30511
1430 -30511 -31048 17039 34101 6574 -11359 -2004 13270 9240 -19743 -26801 16672 43561 10656
$$ packed form
1345g654L1405L276k9740l0951J3436M4158K1m3924m040L9435O217l2071j9268
1358b9700J5675L3039N349l7900j5820M0703K2280l5251k7602J9299K9168J381
1370B0621k6794j4882L2636L0736l2986m1941K0302L7859l155k2939n841K0448
1382A4064K0642k3930m5402R028M9246O342l2441p210K0469J2061j9143l5609
1394c1883K470M8258J6075m2153k0609K7593J5547k1451k3552N396L5332J8467
1406B9490l5331l1212K7875K9967k2093k8805R356K8601J2272k3524k8452J9381
1418a2475L7781j5440m1134O861L7523J0399k0087k0818R534K9281p665m4271
1430c0511n37M8087J7062k7527j7933R355J5274m030k8983p058M3473K6889l2905
$$ plain form
1443 10656 -20934 -8439 11220 5873 -13913 -17854 13101 39911 11593 -28345 -13055 18782
1455 18782 10794 -12218 -11287 9596 26185 10010 -24082 -17304 21409 20514 -13536 -15494 12139
1468 12139 25129 11110 -12705 -13827 15249 20892 -13809 -22992 14351 34232 12596 -11048
1480 -11048 -10911 7235 15338 -7410 -19855 14969 42403 13811 -20483 -15323 3795 7926 -3119
1493 -3119 -11104 9919 36066 14568 -28201 -23271 9347 12759 -4975 -10782 3449 20963 7357
1506 7357 -29265 -28072 11715 18336 -11119 -17625 2539 13343 2567 -20506 -24952 4602 17948
1519 17948 -12325 -27885 1471 21012 2936 -20213 -21354 -1073 14116 -5072 -22576 5164
1531 5164 32154 6973 -28174 -24384 202 11712 2170 -11292 5557 32645 11909 -32127
$$ packed form
1443A0656l1590J2495J9659n347j9786l941L0955K6810k8318l9938J5290L1837
1455A8782p988k3012R31K0883J6589j6175l4092O778L8713q95l4050j958K7633
1468A2139J2990j4019k3815j122K9076N643l4701r183L7343J9881k1636k3644
1480a1048J37J8146Q103k2748j2445L4824K7434k8592l4294N160J9118M131j1045
1493c119p985K1023K6147k1498m2769M930L2618L412j7734n807J4231J7514j3606
1506G357l6622J193L9787O621k9455o506K0164J0804j0776k3073m446K9554J3346
1519A7948l0273j5560K9356J9541j8076k3149j141K0281J5189j9188j7504K7740
1531E164K6990k5181l5147L790K4586J1510r542j3462J6849K7088k0736m4036
$$ plain form
1543 -32127 -27730 10295 21037 4086 -7203 1938 20082 10224 -28378 -30985 13973 32179 1449
1556 1449 -17615 -2430 16585 9201 -20633 -28765 8909 32915 -878 -30214 -6701 21361
1568 21361 10609 -17275 -25557 1089 28290 9263 -25987 -9556 29357 17940 -21951 -29595
1580 -29595 -4 28515 19834 -12017 -8514 28354 24475 -21494 -32001 7803 37076 25683
1592 25683 -2379 -10325 15498 24294 -12866 -31568 9350 44481 25571 -8072 -13790 7458
1604 7458 21431 -473 -25733 170 38637 21963 -19781 -21124 6704 18962 1883 -20961
1616 -20961 -9459 26815 23402 -17568 -23689 8739 18291 -3951 -21725 -11721 17739 26982 -3475
1629 -3475 -22779 3172 19400 -5485 -23478 -4273 23851 28846 3554 -20591 -8003 13676
$$ packed form
1543c2127M397L8025J0742j6951j1289R141J8144r858l8602k607M4958J8206l0730
1556A449j9064J5185J9015p384k9834q132L7674K4006l3793k9336K3513K8062
1568B1361j0752k7884q282K6646K7201j9027l5250J6431L8913j1417l9891p644
1580b9595K9591K8519q681l1851L503L6868l879m5969j0507L9804K9273j1393
1592B5683k8062p946K5823Q796l7160j8702M0918L5131j8910l3643n718K1248
1604G458J3973k1904k5260K5903L8467j6674m1744j343K7828J2258j7079k2844
1616b0961J1502L6274l413m0970o121L2428R552k2242j7774J0004K9460R243l0457
1629c475j9304K5951J6228k4885j7993J9205K8124M995k5292k4145J2588K1679
$$ plain form
1641 13676 -1571 -20742 744 29044 23468 -2216 -19583 -13493 7309 6503 -13536 -4762 21749
1654 21749 14443 -15979 -24056 -9739 4872 5165 -9590 -11230 10243 11181 -17512 -24764 -2274
1667 -2274 7884 -2935 -12044 -9607 6097 12950 -8195 -21466 -1017 11931 -4250 -12005 3325
1680 3325 17909 17464 367 -16589 -6007 13088 3034 -9208 11669 32362 20193 -4254
1692 -4254 -14891 -3920 14810 12451 -3763 8774 31829 16156 -17118 -19702 940 16006
1704 16006 12326 -3205 -2135 18970 14838 -20166 -26515 5218 20727 4722 -12627 -9616 10359
1717 10359 14851 -13471 -28374 2543 25782 4194 -18355 -5964 17643 19693 -6455 -27467
1729 -27467 -6003 26542 13816 -15016 -1999 28015 24636 -6924 -26856 -9367 26970 27763
$$ packed form
1641A3676j5247j9171K1486K8300n576k5684j7367O090K0802q06k0039Q774K6511
1654B1749p306l0422q077J4317J4611K93j4755j640K1473R38k8693p252K2490
1667b274J0158j0819r109K437J5704O853k1145j3271K0449J2948j6181p755J5330
1680C325J4584m45j7097j6956J0582J9095j0054j2242K0877K0693j2169k4447
1692d254j0637J0971J8730k359j6214J2537K3055j5673l3274k584K0642J5066
1704A6006l680j5531J070K1105m132l5004o349L1733J5509j6005j7349L011J9975
1717A0359M492k8322j4903L0917K3239k1588k2549J2391K3607K050k6148k1012
1729b7467K1464L2545j2726k8832J3017L0014l379l1560j9932J7489L6337P93
$$ plain form
1741 27763 -4914 -6685 25361 25074 -13609 -31801 -7846 27098 30517 -2008 -17533 9506 22402
1754 22402 -11856 -34316 -7802 25273 22535 -8500 -28067 -7546 18399 -2001 -33837 -15544
1766 -15544 22634 18800 -14517 -28116 -7966 16636 5322 -29788 -24778 15955 23235 -9555
1778 -9555 -22841 -1929 15513 5267 -22685 -25151 12186 33968 4411 -20560 -4711 12510
1790 12510 12 -20165 -18150 11623 34646 12458 -21919 -15000 9134 1474 -17790 -11418 11959
1803 11959 23848 6373 -23694 -22950 4596 8265 -12784 -11183 10010 14046 -1318 -18384 -18055
1816 -18055 3803 12929 -7060 -15580 6080 15959 -1669 -13377 -6016 6458 10086 -2656 -10349
1829 -10349 8286 24250 7189 -10264 -2422 7414 2853 -3147 -1238 13076 26570 12693 -12535
$$ packed form
1741B7763l2677j771L2046k87l8683j8192K3955L4944L419l2525j5525K7039J2896
1754B2402l4258k2460K6514L3075k738l1035j9567K0521K5945k0400l1836J8293
1766a5544L8178l834l3317j3599K0150K4602j1314l5110N010M0733P280l2790
1778i555j3286K0912J7442j0246k7952k466L7337K1782k9557k4971J5849J7221
1790A2510j2498k0177K015K9773K3023k2188l4377O919K4134p660j9264O372K3377
1803A1959J1889j7475l0067P44K7546L669k1049J601K1193M036j5364j7066L29
1816a8055K1858R126j9989q520K1660R879j7628j1708P361J2474L628j2742p693
1829a0349J8635J5964j7061j7453P842R836m561o000J909J4314J3494j3877k5228
$$ plain form
1842 -12535 -9022 7817 3523 -5123 4256 17679 19275 3688 -18560 -16632 6403 9433 -5845
1855 -5845 -1278 16063 12011 -8032 -20240 -13552 7550 13300 -6125 -12037 7842 11112 -10917
1868 -10917 -20574 -6215 10285 11432 -5293 -14902 4539 19733 -1706 -21509 -6762 11949
1880 11949 7192 -7350 -9452 7981 23349 4946 -23487 -15515 11252 10439 -5656 -4786 10749
1893 10749 17848 1144 -27222 -24781 8413 18451 -4009 -10094 7269 12123 -6432 -26717 -22826
1906 -22826 6913 21562 -2271 -20719 -3335 9920 -7639 -24452 -15714 8056 19237 -536
1918 -536 -23204 -9342 14096 1731 -21854 -13948 9371 15088 -813 -17336 -7333 17246 11216
1931 11216 -19548 -19301 10902 20607 3124 -9532 -1281 14286 8940 -18818 -24382 8778 28110
$$ packed form
1842a2535L513J6839m294q646R379J3423J596j5587k2248J928K3035L030j5278
1855e845M567J7341m052k0043j2208O688K1102N750j9425n912J9879L270k2029
1868a0917r657J4359J6500J147j6725r609J9441J5194k1439j9803J4747J8711
1880A1949m757j4542k102J7433J5368j8403k8433P972K6767q13j6095Q70J5535
1893A0749P099j6704k8366K441L3194J0038k2460o085J7363M854j8555k0285L891
1906b2826K9739J4649k3833j8448J7384J3255j7559j6813Q738K3770J1181j9773
1918e36k2668J3862K3438j2365k3585P906K3319N717j5901j6523J0003K4579o030
1931A1216l0764K47L0203R705j7483j2656Q251J5567n346k7758n564L3160J9332
$$ plain form
1944 28110 8781 -8802 -1171 9863 3727 -15190 -20712 7179 31802 12502 -16880 -9999 8652
1957 8652 3446 -12238 -12665 8243 26790 11497 -19600 -16520 10760 11504 -8939 -10858 7409
1970 7409 19395 8629 -15084 -15898 10992 18983 -6044 -14936 6428 21093 10268 -8106 -11244
1983 -11244 6490 15893 -4919 -19686 3733 27180 14451 -8162 -11009 1403 8468 -3006
1995 -3006 -14982 2401 27629 16670 -14047 -18272 -1668 5097 -1899 -8504 1097 20211 13987
2008 13987 -17268 -24317 -226 10935 -1242 -8715 -1005 9788 6572 -14949 -22993 -322 15283
2021 15283 -78 -13366 -2857 8288 4157 -10212 -17281 -3134 12806 605 -16826 -4750
2033 -4750 13994 7135 -9874 -14580 -5132 6358 2811 -10576 -3195 17136 11069 -14123 -19294
$$ packed form
1944B8110j9329j7583P631J1034o136j8917n522K7891K4623j9300k9382O881J8651
1957H652n206j5684m27K0908J8547j5293l1097L080K7280P44k0443j919J8267
1970G409J1986j0766k3713q14K6890P991k5027q892K1364J4665j0825j8374l138
1983a1244J7734R403k0812j4767K3419K3447j2729k2613k847J2412P065j1474
1995c006j1976J7383K5228j0959l0717m225J6604O765o996o605R601J9114o224
2008A3987l1255p049K4091J1161j2177p473P710J0793l216k1521q044K2671J5605
2021A5283j5361j3288J0509J1145m131j4369p069J4147J5940j2201j7431J2076
2033d750J8744o859j7009m706R448J1490l547j3387P381K0331o067k5192n171
$$ plain form
2046 -19294 -5494 4942 3992 -2338 -166 12922 9969 -14534 -22145 -1598 11513 5336 -1576
2059 -1576 -271 5586 4213 -11997 -19242 1212 18302 6275 -7808 -2320 5248 1791 -7613 -11685
2073 -11685 1150 15573 5531 -11784 -4464 9870 5433 -7032 -8631 679 11252 7335 -7361
2086 -7361 -3172 14679 9874 -12012 -13537 2212 11739 8213 -683 318 12316 9789 -13674 -18553
2100 -18553 5258 19055 8840 -2212 -928 6859 5267 -12104 -18608 5605 24657 9193 -10455
2113 -10455 -6086 5543 4184 -8823 -14463 2312 21899 7952 -18821 -13865 8588 8702 -8653
2126 -8653 -14569 -71 16593 8947 -16227 -16768 9070 13171 -10314 -20402 -2955 15434 12026
2139 12026 -9452 -17091 4024 15321 -8616 -25547 -3675 20790 15508 -7754 -17964 -4085
$$ packed form
2046a9294J3800J0436r50o330K172J3088k953k4503p611K0547J3111o177o912
2059a576J305N857j373j6210p245K0454J7090j2027j4083N488P568l457r404m072
2073a1685J2835J4423j0042j7315P320J4334m437j2465j599R310J0573l917j4696
2086g361M189J7851m805k1886j525J5749R527l526q896J001J1998k527k3463m879
2100a8553K3811J3797j0215j1052J284P787j592j7371o504K4213J9052j5464j9648
2113a0455M369J1629j359j3007n640J6775J9587j3947k6773M956K2453J14j7355
2126h653n916J4498J6664p646k5174n41K5838M101k3485j0088J7447J8389l408
2139A2026k1478p639K1115J1297k3937j6931K1872K4465n282k3262j0210J3879
$$ plain form
2151 -4085 10051 -3952 -23479 -6642 22683 17758 -11090 -22032 -7505 8342 1936 -16776
2163 -16776 -11267 16325 16377 -14738 -26969 -7080 10653 5531 -11184 -13270 7280 15166 -9055
2176 -9055 -25462 -6406 13812 5393 -12069 -12394 4290 15234 332 -19103 -9043 12722 7852
2189 7852 -10387 -7946 9356 16928 4866 -14300 -13036 7448 10991 -5265 -5051 13301 17230
2202 17230 1135 -12912 -11854 3905 12711 2149 -4459 8269 13139 -3255 -15176 -7579 5372
2215 5372 11748 4374 -5107 973 8590 -2483 -14099 -4066 9169 7407 -585 -4946 -1568 5565
2229 5565 1037 -9522 -3947 10423 6803 -4141 -2050 5473 6548 537 -7879 -6566 6757 8433
2243 8433 -2774 -775 11400 8893 -4202 -10510 -5617 5905 10159 340 -2998 8711 8121 -10241
$$ packed form
2151d085J4136j4003j9527J6837K9325m925k8848j0942J4527J5847o406j8712
2163a6776N509K7592N2l1115j2231J9889J7733n122j6715k086K0550P886k4221
2176i055j6407J9056K0218q419j7462l25J6684J0944j4902j9435J0060K1765m870
2189G852j8239K441J7302P572j2062j9166J264K0484L543j6256K14J8352L929
2202A7230j6095j4047J058J5759Q806j0562o608J2728M870j6394j1921P597J2951
2215E372O376p374r481O080P617j1073j1616J0033J3235j762p992m361L378P133
2229E565m528j0559N575J4370l620j0944K091P523J075o011q416J313J3323J676
2243H433j1207J999J2175k507j3095o308M893J1522M254r819l338J1709n90j8362
$$ plain form
2257 -10241 -16820 -3306 9028 8367 -813 -6580 1083 5832 -9438 -19028 -3133 12455 5677 -8167
2271 -8167 -10870 -2729 4509 -4132 -16869 -5363 14134 7463 -12068 -12605 1485 7459 -1582 -14459
2285 -14459 -9144 10730 11942 -8757 -12535 5744 12000 -2078 -14623 -8711 10367 16679 -1305
2298 -1305 -13278 1602 12389 -3097 -17934 -7613 11959 17990 2135 -14528 -5455 11212
2310 11212 1243 -17304 -7867 14121 16040 -2066 -16403 -9464 9739 8241 -11363 -10303 12645
2323 12645 17111 -3559 -16169 -6791 10738 11655 -5984 -12443 7772 19637 698 -14187 -2867
2336 -2867 13229 11591 -3520 -10134 5182 21730 8948 -12354 -6124 12017 10029 -4492 -7177
2349 -7177 6356 20271 11940 -10609 -11690 7696 11455 -3561 -6845 6480 15525 6606 -11074
$$ packed form
2257a0241o579J3514J2334o61r180n767P663M749j5270r590J5895J5588o778j3844
2271h167k703Q141P238q641j2737J1506J9497o671j9531n37J4090N974r041j2877
2285a4459N315J9874J212k0699l778J8279O256j4078j2545N912J9078O312j7984
2298a305j1973J4880J0787j5486j4837J0321J9572O031j5855j6663R073J6667
2310A1212r969j8547R437K1988J919j8106j4337O939J9203j498j9604J060K2948
2323A2645M466k0670j2610R378J7529R17j7639o459K0215J1865j8939j4885J1320
2336b867J6096j638j5111o614J5316J6548j2782k1302O230J8141j988j4521k685
2349g177J3533J3915q331k2549j081J9386L759j5016l284J3325R045q919j7680
$$ plain form
2362 -11074 -15195 2513 13366 -89 -8691 3820 12073 1938 -11233 -11965 1929 12467 3043
2375 3043 -10061 -2264 9923 2001 -10132 -7460 4266 9929 2550 -8334 -3730 10269 5817
2388 5817 -9755 -8316 4968 6496 -936 -5083 -664 8990 6695 -8591 -12074 2460 7419 -1622
2402 -1622 -4407 2278 6351 1129 -10511 -14413 -98 9572 -342 -7737 1481 6042 -2548 -12062
2416 -12062 -10865 720 10126 1420 -10527 -3603 6905 -1288 -11966 -6247 5252 9078 1898
2429 1898 -8777 -5161 7987 4618 -9722 -7087 7514 9643 514 -6468 -2323 9246 8530 -7454
2443 -7454 -9906 7112 13736 1038 -5944 789 8635 5822 -7011 -11634 3690 16398 5079
2456 5079 -6951 -79 8698 3244 -7554 -9221 3382 16061 7110 -10235 -5987 8191 4442
$$ packed form
2362a1074m121J7708J0853j3455q602J2511Q253j0135j3171p32J3894J0538r424
2375C043j3104P797J2187p922j2133K672J1726N663p379j0884M604J3999m452
2388E817j5572J439J3284J528p432m147M419R654k295j5286l483J4534M959r041
2402a622k785O685M073n222j1640l902J4315R670r914p395R218M561q590r514
2416a2062J197J1585R406q706j1947O924J0508q193j0678N719J1499L826p180
2429A898j0675L616J3148l369j4340K635J4601K129r129o982M145J1569p16j5984
2443g454k452J7018O624j2698o982O733P846k813j2833m623J5324J2708j1319
2456E079j2030O872Q777n454j0798j667J2603J2679q951j7345M248J4178l749
$$ plain form
2469 4442 -7482 -6513 5892 14293 6801 -8690 -8938 7892 10030 -5614 -7647 6018 12555 4273
2483 4273 -7056 -7235 7059 12708 -2042 -10507 3939 14182 4271 -7238 -4948 5230 9362
2496 9362 -2143 -12518 -31 15303 6972 -8907 -6556 4441 4794 -3258 -9789 -1799 13574
2509 13574 8158 -11175 -12837 2112 5482 -4457 -8384 -734 9809 6991 -10527 -15471 1501
2522 1501 9286 -3552 -10060 -894 7215 3540 -8586 -13078 570 11793 485 -12093 -2727
2535 -2727 9208 3557 -8308 -9811 -85 9335 1722 -12060 -5911 10990 7481 -8205 -9997 426
2549 426 7255 1965 -8422 -5751 9926 10010 -8308 -13346 144 7758 1660 -5808 -3650 7336
2563 7336 9570 -5785 -14725 -434 11904 3414 -6437 -3016 5800 6747 -2879 -11749 -784 14495
$$ packed form
2469D442j1924R69J2405Q401p492j5491k48J6830K138j5644k033J3665O537q282
2483D273j1329j79J4294N649j4750q465J4446J0243r911j1509K290J0178M132
2496I362j1505j0375J2487J5334q331j5879K351J0997L53q052o531P990J5373
2509A3574n416j9333j662J4949L370r939l927P650J0543k818j7518m944J6972
2522A501P785j2838o508R166Q109l675j2126m492J3648J1223j1308j2578R366
2535b727J1935n651j1865j503R726R420p613j3782O149J6901l509j5686j792J0423
2549D26O829n290j0387K671J5677Q4j8318n038J3490P614o098p468K158J0986
2563G336K234j5355q940J4291J2338q490r851L421Q816R47r626q870J0965J5279
$$ plain form
2577 14495 7499 -7463 -3974 7333 6523 -2063 -7069 -614 11549 8718 -7002 -6429 8508 10233
2591 10233 -2108 -6175 756 9259 7921 -3736 -6650 6791 11570 -2669 -9996 556 9005
2604 9005 6206 -1606 -3790 4254 10180 -1416 -11782 -998 11644 6052 -3675 -4065 2228 5797
2618 5797 -758 -9749 -2839 11938 7825 -6574 -6585 3057 4930 -1456 -7136 -3197 8174 7431 -7556
2633 -7556 -9818 3521 6777 -2330 -7225 -1938 5861 6182 -5134 -10243 1716 9038 -2726 -11174
2647 -11174 -2445 6529 4566 -3989 -8340 -35 8352 -876 -12360 -3822 9110 5239 -5708 -7676
2661 -7676 -1197 5318 486 -10781 -5395 10083 8031 -7304 -9403 212 5240 118 -7508 -5391
2675 -5391 7118 9072 -6973 -12496 1412 8917 770 -6468 -3575 5919 8670 -3631 -12066 670
$$ packed form
2577A4495o996j4962L489J1307q10q586n006O455J2163k831j5720N73J4937J725
2591A0233j2341m067O931Q503j338j1657k914J3441M779j4239p327J0552Q449
2604I005k799p812k184Q044N926j1596j0366J0784J2642n592r727l90O293L569
2618E797o555q991O910J4777m113j4399j1R642J873o386n680L939J1371p43j4987
2633g556k262J3339L256r107m895N287P799L21j1316n109J1959P322j1764q448
2647a1174Q729Q974j963q555m351Q305Q387r228j1484Q538J2932l871j0947j968
2661g676O479O515m832j1267N386J5478k052j5335k099R615N028n122p626K117
2675e391J2509J954j6045n523J3908P505q147p238K893R494K751j2301q435J2736
$$ plain form
2689 670 11820 2247 -8698 -3373 7113 8003 -639 -8547 -1230 11889 5987 -8918 -4199 9834
2703 9834 10077 -1184 -7285 -1911 9073 7451 -6224 -5945 10087 12939 -2306 -8766 -655 8395
2717 8395 7225 -3389 -6917 5869 12842 -1342 -11438 -701 10186 6531 -2854 -5944 2806
2730 2806 10891 1494 -11477 -3135 11193 6860 -5572 -6182 2660 8481 3116 -8164 -4898 9885
2744 9885 8712 -5990 -7496 4240 8172 1168 -6975 -5919 5761 9384 -3947 -9592 3517 9864
2758 9864 -83 -8920 -5000 3946 7260 -2162 -9921 -507 8943 -858 -11520 -5167 5049 5182 -2488
2773 -2488 -8550 -2973 6796 1652 -11504 -7454 6152 5147 -5345 -8498 -2619 4784 2738 -8547
2787 -8547 -8196 5832 7768 -5507 -9285 -399 5701 1818 -6150 -7264 3230 8808 -2747 -9618
$$ packed form
2689F70J1150r573j0945N325J0486Q90q642p908P317J3119n902j4905M719J4033
2703I834K43j1261o101N374J0984j622j3675K79J6032K852j5245o460Q111R050
2717H395j170j0614l528J2786O973j4184j0096J0737J0887l655r385l090Q750
2730B806Q085r397j2971Q342J4328m333j2432o10Q842N821n365j1280L266J4783
2744I885j173j4702j506J1736L932p004q143J056J1680L623j3331n645J3109O347
2758I864r947q837L920Q946L314r422p759R414R450r801j0662O353J0216J33p670
2773b488o062N577R769n144j3156M050J3606j005j0492l153N879P403k046j1285
2787h547L51J4028J936j3275l778Q886O100l883p968j114J0494N578j1555o871
$$ plain form
2801 -9618 430 8682 1511 -6615 -4688 2896 7913 171 -9178 -1895 9270 2205 -8464 -4534
2815 -4534 5398 6990 78 -7264 -3338 8021 5102 -8189 -6536 6144 7364 -2007 -7035 -2381
2829 -2381 6238 6373 -5150 -7530 6129 10528 -1693 -8027 -325 7599 5417 -3124 -6558 3556
2843 3556 11525 845 -9045 -115 10101 5463 -3754 -4727 2773 10180 3011 -8500 -3205 9760
2857 9760 6322 -5961 -5181 3503 8530 2613 -7246 -5830 7447 7924 -6176 -8655 3277 7681
2871 7681 -171 -7752 -5874 4693 7748 -4191 -10593 1624 9251 -585 -9170 -4297 3849 5805
2885 5805 -2771 -10329 -1622 9371 1957 -10617 -5246 6251 5417 -3210 -8407 -2059 8080 3923
2899 3923 -9685 -7706 6096 6809 -4703 -8313 -1415 6156 4287 -7220 -9183 4147 8456 -4576
$$ packed form
2801i618J0048Q252p171q126J927P584N017p742r349P283J1165p065j0669L930
2815d534R932J592o912p342L926J1359k919j3291J653J2680J220r371n028M654
2829b381Q619J35j1523k380J3659M399j2221o334P702P924k182q541l434J0114
2843C556P969j0680r890Q930J0216m638r217r73P500P407p169j1511N295J2965
2857I760l438j2283P80Q684N027n917r859J416J3277M77j4100k479J1932M404
2871G681p852p581J878J0567L055j1939o402J2217P627r836q585M873Q146J956
2885E805q576p558Q707J0993p414j2574N371J1497q34q627n197O348J0139m157
2899C923j3608J979J3802P13j1512l610O898P571j869j1507j963J3330M309j3032
$$ plain form
2913 -4576 -10513 -969 5736 1852 -6679 -8532 1238 8537 -2043 -11685 -2371 7922 2176 -7215
2927 -7215 -6650 1157 6839 78 -10417 -4522 8433 4853 -7221 -6073 3654 6842 607 -6462
2941 -6462 -3801 7382 7725 -5700 -7827 4752 8746 -512 -5897 -2057 6258 7692 -2819 -7956
2955 -7956 3329 10237 180 -7617 -1240 6316 5675 -1848 -6627 468 9883 2364 -8864 -2231
2969 -2231 8214 5531 -3082 -5455 625 7234 3370 -7824 -4637 8155 7362 -4396 -6242 2298
2983 2298 6651 2804 -5086 -4910 6509 9021 -3964 -8486 1974 7800 1343 -5361 -3882 4436
2997 4436 8348 -1433 -9306 118 9556 1583 -7875 -3924 4277 5873 -1518 -8686 -2615 8424 2966
3012 2966 -9405 -5945 5254 5735 -3228 -7658 -3457 4962 3769 -8366 -8576 4875 7307 -4490
$$ packed form
2913d576n937R544O705l884q531j853R770P299j0580r642R314J0293n746r391
2927g215N65P807N682o761j0495N895J2955l580j2074J148R727L188o235p069
2941f462K661J1183L43j3425k127J2579L994r258n385L840Q315J434j0511n137
2955g956J1285O908j0057p797O377P556o41p523m779P095R415p519j1228O633
2969b231J0445k683q613k373O080O609l864j1194L187J2792p93j1758j846Q540
2983B298M353l847p890J76J1419K512j2985m522J0460N826o457o704J479Q318
2997D436L912r781p873R424R438p973r458L951Q201J596p391p168O071J1039n458
3012B966j2371L460J1199M81q963m430M201Q419j193j2135k10J3451K432j1797
$$ plain form
3026 -4490 -8903 -2185 4821 3380 -5337 -8254 2555 8193 -3145 -10718 -2132 6176 2736 -5406
3040 -5406 -6752 1112 7983 -322 -10327 -2929 8255 3621 -6235 -5863 2099 6470 681 -8638 -4956
3055 -4956 7502 5947 -6561 -6718 4090 7235 240 -7039 -4593 5154 6799 -4794 -8412 3887
3069 3887 8892 -574 -7034 -2848 4973 7139 -1804 -7327 2040 10174 867 -8819 -2489 6845 6140
3084 6140 -1128 -5559 543 9277 3535 -7841 -3295 9147 7280 -2570 -5446 636 7483 4168
3098 4168 -6287 -5410 7699 8988 -3141 -6592 2272 7377 3131 -4890 -5874 4813 9457 -1704
3112 -1704 -8571 1409 8369 2095 -6353 -4942 3496 8144 333 -8209 -1630 8354 1580 -8568 -5273
3127 -5273 3886 6849 -29 -7285 -3935 6696 4279 -7806 -6855 5037 7025 -1912 -7372 -4022
$$ packed form
3026d490m413O718P006j441q717k917J0809N638j1338p573Q586Q308l440q142
3040e406j346P864O871q305j0005P398J1184m634r856L72P962M371n789r319L682
3055d956J2458j555j2508j57J0808L145o995p279K446R747J645j1593l618J2299
3069C887N005r466o460M186P821K166q943n523R367Q134r307r686O330R334p05
3084F140p268m431O102Q734n742j1376M546J2442j867r850k876O082O847l315
3098D168j0455Q77J3109J289j2129l451Q864N105m246q021r84J0687M644j1161
3112a704o867R980O960o274q448J411Q438M648p811q542O579R984o774j0148L295
3127e273R159K963o878p256L350J0631k417j2085R51J1892J988q937n460L350
$$ plain form
3141 -4022 4197 4671 -6034 -8223 3562 7835 -2429 -8676 -2774 4165 3602 -4430 -8450 581 8215
3156 8215 -875 -9647 -3001 5798 2455 -4946 -6488 192 7209 1976 -8424 -4994 5526 3188
3170 3188 -6532 -6084 1698 6023 1894 -6947 -6063 4731 5000 -5265 -6648 3558 7233 379 -6377
3185 -6377 -5237 3100 6494 -2743 -7272 2686 8615 -46 -7205 -2831 4124 6309 -546 -6297 788
3200 788 9176 1805 -7562 -2564 5972 5413 -1523 -4856 670 8695 4505 -6632 -4843 6583 6129
3215 6129 -3255 -4389 2152 7903 4496 -5239 -6254 4817 8011 -2399 -5533 3304 7803 2149
3229 2149 -5732 -6109 3030 8445 -447 -7374 1389 9109 1292 -7057 -4598 3661 7933 992 -7340
3244 -7340 -1827 7890 2612 -8460 -5278 5297 6840 -333 -6847 -2886 6917 5209 -7288 -7720
$$ packed form
3141d022Q219M74j0705k189J1785M273j0264o247N902O939n63q032m020R031P634
3156H215r090q772O646Q799l343p401j542O680P017n233j0400L430J0520k338
3170C188r720M48P782M325m129q841Q84J0794K69j0265j383J0206L675o854o756
3185f377J140Q337L394r237m529R958N929q661p159M374O955K185o855n751P085
3200G88Q388p371r367M998Q536n59o936l333N526Q025m190j1137J789J1426m54
3215F129r384j134O541N751l407r735j015J1071L194j0410l134Q837M499n654
3229B149p881l77R139N415q892o927Q763P720p817q349K459Q259M272o941q332
3244g340N513R717n278j1072L182J0575J543p173o514L961R803j708j2497m32
$$ plain form
3258 -7720 4530 7071 -2124 -7109 -2530 5724 4874 -6108 -10033 1953 8911 -1331 -7937 -1494
3272 -1494 5874 2884 -6264 -9820 53 8855 1530 -9506 -3532 6170 2500 -6427 -7977 -221 7927
3287 7927 3109 -8886 -6709 5177 4929 -6167 -7343 1823 7419 2681 -6765 -6931 3907 7291
3301 7291 -3868 -8430 1729 8010 2003 -6002 -5340 2966 7166 -1634 -8767 -147 9193 3468 -5356
3316 -5356 -3987 3284 5345 -956 -7927 -2050 9109 5713 -5116 -4739 3962 4471 -1428 -5012 -382
3331 -382 8001 6879 -4686 -6730 3237 5681 -1260 -4390 1426 6732 4981 -3324 -6761 2482 8016
3346 8016 440 -4970 1609 6484 3069 -3237 -4932 1872 7586 1390 -5809 -225 7921 3325 -4223
3361 -4223 -3584 2381 5063 858 -5524 -1792 7662 5082 -5302 -4772 2553 3838 -1118 -4470 -1169
$$ packed form
3258g720J2250K541r195m985M579Q254q50j0982l925J1986O958j0242o606O443
3272a494P368k990r148l556R873Q802p325j1036N974R702l670q927j550P756Q148
3287G927m818j1995K177J1886k48j1096j176R166N596m738r446j66J0838L384
3301G291j1159m562J0159O281o007q005O62Q306M200q800p133Q620R340n725q824
3316e356J369P271K061o301o971N877J1159l396j0829L77Q701N09n899l584M630
3331c82Q383j122j1565k044R967K444o941l130N816N306j751q305l437R243N534
3346H016p576n410O579M875l415o306j695O804N714o196p199N584Q146m596p548
3361d223O39N965K682m205o382L732R454k580j0384N30P325J285m956l352L301
$$ plain form
3376 -1169 6815 5739 -5820 -8083 2080 5436 -2253 -4986 510 5424 3598 -5456 -8535 923
3390 923 7394 -303 -6682 -562 5363 1582 -5581 -7588 404 7447 1488 -8114 -3081 6275 2593
3405 2593 -6249 -6511 1144 6596 1917 -7722 -5093 6534 5260 -6371 -8037 1211 6177 1300 -5700
3420 -5700 -4193 5869 6779 -5473 -10183 72 7553 1645 -5535 -2701 4802 6329 -3178 -10357
3434 -10357 -843 9973 4237 -5924 -3494 4519 5102 -2761 -7961 -970 9962 6499 -6126 -5389
3448 -5389 4918 5956 -1593 -5809 -224 8801 7089 -4803 -7231 4375 8448 -1348 -6683 -60
3462 -60 7557 6320 -2780 -6158 2812 9259 101 -8181 -999 7881 5656 -1893 -4636 1308 7340
3477 7340 877 -8384 -2885 9030 7452 -2597 -5243 842 5024 1292 -6103 -3597 7764 8166
$$ packed form
3376a169P984j076j1559k263J0163L356p689k733N496M914j826r054l079R458
3390I23O471p697o379O120N925l781p163k007P992P043n959r602N033R356l682
3405B593q842k62P655N452m679r639K629J1627j274j1631j666R248M966m877p000
3420e700J507J0062R10j2252m710J0255P481n908p180K834P503J527r507p179
3434a0357R514J0816n736j0161K430Q013N83p863n200O991J0932l463j2625P37
3448e389J0307J038p549m216N585R025j712j1892k428J1606M073r796n335O623
3462f0P617j237r100l378Q970O447r158q282P182Q880k225p549k743N944O032
3477G340o463r261N499J1915j578j0049k646O085M182l732p395K506J1361M02
$$ plain form
3491 8166 -3719 -7499 822 5172 1398 -4154 -2753 5150 7092 -3132 -9152 -466 6323 824
3505 824 -4753 -2174 3843 5220 -1955 -7672 -1372 6740 1668 -6692 -2937 4269 4224 -1841 -5931 -2550
3521 -2550 4410 2156 -6699 -4162 5651 5511 -2674 -6118 -2324 2382 1375 -5170 -4486 4633 6015
3536 6015 -3818 -8119 -1364 3198 875 -3233 -3315 3002 5495 -3526 -9828 -1740 5842 1590 -3622
3551 -3622 -2812 2915 4040 -2168 -7766 -1469 7501 3145 -5579 -3391 3840 4401 -1615 -6459 -1898
3566 -1898 6492 4792 -4977 -4234 6121 6720 -1338 -6140 -1596 4777 5003 -2580 -4295 5452 8517
3581 8517 -1517 -7960 -975 6101 4966 -1226 -3874 2919 7754 -832 -8862 -1820 7604 5444 -2023
3596 -2023 -3657 1096 5798 694 -7298 -2996 8125 6720 -3723 -5367 1542 4828 562 -5788
$$ packed form
3491H166j1885l780Q321M350l774n552J401P903J942j0224o020Q686O789n499
3505H24n577K579O017J377p175n717O300Q112n072q360L755P206m5o065m090L381
3521b550O960k254q855K537R813j40q185l444L794M706j007o545O84R119J382
3536F015r833m301O755M562k323m108q2O317K493r021o302Q088P582m252n212
3551c622Q10N727J125o208n598O297Q970m356q724K188P231N61o016m844M561
3566a898Q390j700r769P43J0355N99q058m802M544O373K26p583j715R747L065
3581H517j0034o443O985P076j135o192k648O793M835q586q030P042R424k160p467
3596b023j634M753M702n104p992M302J1121j405j0443j644O909L286m266o350
$$ plain form
3610 -5788 -3391 6754 7337 -3822 -6346 2440 6567 -175 -5785 -3633 4358 6802 -1744 -7194 1180
3625 1180 7172 -255 -7759 -3785 4191 6116 -392 -5997 -692 6561 634 -9379 -4575 5815
3639 5815 6386 -1479 -6159 -2219 4640 1669 -7668 -5255 6443 7218 -3528 -8184 -2476 3545 1975
3654 1975 -4961 -5948 4164 7720 -3212 -8917 -2065 5118 2087 -4662 -5574 2463 7288 -590 -8740
3669 -8740 -2434 6434 2431 -6211 -5368 2642 7331 1451 -7379 -4262 5347 3291 -6489 -5320 3988
3684 3988 7681 1237 -6127 -4935 3672 5030 -3701 -5682 4373 8363 413 -6547 -4688 3306 5832
3699 5832 -475 -4974 2303 8259 1079 -7122 -3250 4982 6004 157 -4180 297 7103 2465 -6556
3714 -6556 -3423 5788 6058 -755 -3542 595 6260 3840 -4337 -4432 3976 5862 -1785 -3674 2127 5676
$$ packed form
3610e788K397J0145N83j1159k524Q786M127o742n610K152P991K444q546n450Q374
3625A180N992p427p504L974P976J925o508n605N305P253n927j0013M804J0390
3639E815N71p865m680L940O859k971r337K413J1698P75j0746m656N708O021j570
3654A975o936r87J0112L556j0932n705O852P183l031o749r12Q037M825p878q150
3669h740O306Q868m003q642Q43Q010M689n880q830L117R609k056r780J169R308
3684C988L693o444p364J192Q607J358q731j981J0055L990p950o960J859P994K526
3699E832o307m499P277N956p180q201L872Q232J022n847m337M477O806m638r021
3714f556L133R211K70o813k787M137N665k420q177r5Q408J886p647j889N801L549
$$ plain form
3730 5676 3018 -3569 -5354 1968 5863 -558 -4003 2486 6149 546 -5189 -4607 1078 5334 1035
3745 1035 -4126 372 5520 -137 -6580 -3524 2930 4942 599 -3884 -1939 3823 736 -6577 -3612
3760 -3612 4371 4539 -1599 -3909 -941 3451 1883 -5321 -4894 3597 5116 -2768 -5190 524 3806
3775 3806 1143 -5095 -5666 2095 5949 -1563 -6131 731 4889 -551 -6409 -5564 1732 6006 316
3790 316 -6410 -1097 5189 250 -7757 -4455 3919 6248 520 -6457 -3179 4827 2063 -7042 -4811
3805 -4811 5092 7079 -713 -6239 -3199 4702 4585 -4606 -5984 4480 8316 -610 -6948 -1996 5421
3820 5421 5257 -2847 -6873 2355 10024 1819 -6801 -2114 6125 4487 -3310 -6732 1023 9828 4617
3835 4617 -6274 -4423 5969 5535 -3351 -5616 1617 8748 5675 -5583 -6963 3770 7292 -2341
$$ packed form
3730E676k658o587j785P322L895o421l445O489L663n603n735N82N685M256m299
3745A035n161M498N148n657o443L056O454K012m343m483J945N762l087p313K965
3760c612P983J68o138k310K968M392j568p204M27Q491J519p884k422N714L282
3775C806k663o238n71P761L854p512m568O862M158n440n858Q45P296M274n690
3790C16o726N313O286m939q007L302Q374K329n728o977L278Q006k764r105K231
3805d811R903J987p792n526L040P901j17r191j378J0464L836q926o338M952P417
3820E421j64q104m026R228P669q205q620M687Q239j638p797l422P755Q805n211
3835D617j0891J851J0392m34q886k265P233P131l073j1258j380J0733L522r633
$$ plain form
3849 -2341 -6216 1929 8119 3734 -5581 -7514 1912 8237 669 -6648 -152 7358 2996 -5701 -6640
3864 -6640 1065 7171 1981 -6656 -2597 7098 4657 -5069 -5339 1508 5240 1346 -5216 -3714 5798
3879 5798 6154 -3938 -6738 679 4716 466 -3883 -1887 3956 5494 -2733 -8041 -1126 5047 574
3894 574 -3517 -1123 3199 2805 -2866 -7045 -1720 5543 2066 -4295 -2078 2441 691 -4061 -5073
3909 -5073 -1147 3965 2639 -4165 -3285 2774 1638 -4210 -4000 293 3100 1066 -3359 -3233 2972 3359
3925 3359 -3921 -4910 1368 3520 74 -2427 -806 3516 3726 -2750 -6137 649 5266 439 -3063
3940 -3063 551 3898 2453 -3032 -5375 1086 7556 2774 -4126 -762 4803 2150 -3857 -4193 1696
3955 1696 7233 3580 -4807 -3633 5028 3738 -3725 -4249 2295 6559 3025 -4839 -4751 4278 6402 -2785
$$ packed form
3849b341l875Q145O190m385r315j933R426O325p568p317O496P510m362q697r39
3864f640P705O106n190q637M059R695k441r726k70O847L732l894o562J502R512
3879E798L56j0092k800P417M037m250m349J996N843J538q227n308O915O173m473
3894E74m091K394M322l94n671m179N325P263l477o361K217M519j750m752j012
3909e073L926N112j326o804Q80O059j136n848K10M293K807k034m425J26O205L87
3925C359p280r89O278K152l446k501J621M322K10o476l387O786M617m827l502
3940c063L614L347j445n485k343O461O470m782o900L364N565k653o007l36N889
3955A696N537l653q387J174Q661j290p463n24O544M264l534p864Q8R029K124r187
$$ plain form
3971 -2785 -5814 2061 7009 2376 -4249 -3567 3624 6690 -1968 -7863 -151 7927 3291 -4449 -3547
3986 -3547 2683 5260 -1396 -7688 -2126 8096 5715 -5334 -5459 1956 4049 -1465 -6346 -2468 6952
4001 6952 6032 -5343 -8413 1448 5563 -826 -5556 -1877 5041 5094 -4047 -9003 -202 6857 672
4016 672 -6213 -2042 5011 4034 -2775 -6907 -855 6678 1872 -6998 -3574 5207 4497 -2764 -5833 -1579
4032 -1579 4598 2466 -5881 -4980 5141 6078 -3077 -7194 -1664 3258 1584 -4516 -4882 3253 6150
4047 6150 -2676 -8595 -2309 3911 1389 -3494 -3547 1562 4733 -2254 -8420 -2563 5604 2693 -3179
4062 -3179 -3028 2018 3517 -685 -5689 -2291 5909 4519 -3422 -3548 3528 4653 -516 -3656 -1480
4077 -1480 4569 5227 -2257 -3361 3973 6385 -372 -4162 -1088 3593 3638 -567 -3193 2616 6636 -789
$$ packed form
3971b785l029P875M948m633o625O82P191L066q658n895P712Q078m636p740R02
3986c547O230K577o656o292N562J0222k381j1049j25P415K093n514m881L878R420
4001F952r20j1375l070R861M115o389m730L679O918N3r141m956Q801P059o185
4016F72o885M171P053r77o809m132O052P533m806q870L424Q781p10p261l069M254
4032a579O177k132q347R01J0121R37r155m117N530M922j674o100l66Q135K897
4047F150q826n919O286O220k522m883n3N109L171o987o166N857Q167k911n872
4062c179J51N046J499m202n004L398Q200j390p941j26P076J125n169l140K176
4077a480O049O58p484j104P334K412o757l790L074M681M5m205k626N809M020p425
$$ plain form
4093 -789 -6191 -924 4466 3357 -1130 -2505 1114 4570 -557 -6619 -2210 5556 3643 -2899 -3197
4108 -3197 886 3075 -643 -5277 -2644 5570 4658 -3616 -4571 1065 3310 -880 -3943 -2235 3967
4123 3967 4974 -3053 -5560 1677 5142 -873 -5006 -1958 3326 3999 -1683 -5169 626 5899 -312
4138 -312 -6439 -2453 4154 3659 -1150 -4573 -813 4395 513 -7272 -3627 5227 4823 -2381 -4836 -730
4154 -730 3109 973 -5433 -4460 4792 5704 -3270 -6741 -936 3346 1223 -3950 -3889 3431 6013 -2065
4170 -2065 -7068 -666 5235 1128 -4060 -3055 2296 5219 -424 -6569 -1963 5892 2164 -5433 -3573
4185 -3573 3332 5206 277 -5168 -2538 4525 3147 -5367 -4708 4103 5844 -180 -4670 -2500 3532
4200 3532 3807 -3017 -4665 3892 7146 -806 -6044 -1512 4382 4464 -1127 -4132 2475 7421 598 -6566
$$ packed form
4093g89n402N267N390j109m487j375L619L456n127o062M409P766j913o542k98
4108c197M083K189l718m634K633Q214r12q274r55N636K245m190l063J708O202
4123C967J007q027k507P237L465o015m133L048N284O73n682l486N795N273o211
4138c12o127L986O607m95m809l423L760N208l882p785L645Q854m04p204k455M106
4154g30L839k136o406R73R252R12q974l471N805M282k123n173O1P320K582q078
4170b065n003O402N901m107n188J005N351K923n643o145M606P855l728p597J860
4185c573O905J874m929n445K630P063j378q514O59Q811J741o024m490K170O032
4200C532K75o824j648Q557L254p952n238M532N894Q2n591l005O607M946o823p164
$$ plain form
4216 -6566 -1599 6059 4438 -1386 -3249 1302 6274 2051 -5918 -2889 6329 5299 -2621 -3761 1801
4231 1801 5548 2190 -4691 -4454 4300 5725 -2779 -5237 1981 5558 1070 -4887 -4725 2575 5738
4246 5738 -1103 -5941 884 5970 356 -6108 -4445 1959 4953 80 -5228 -1506 5557 1579 -6416
4261 -6416 -4403 3513 4960 -26 -4619 -2368 4020 2717 -5203 -4908 3503 5263 -1002 -4613 -1744
4276 -1744 3146 3030 -3154 -5489 2123 5618 -1126 -5293 -740 3682 1874 -3131 -5315 585 5489
4291 5489 690 -5267 -1430 4202 1301 -4224 -4495 327 4531 1619 -4729 -3027 4184 2108 -4148
4306 -4148 -3509 2384 4316 1053 -3824 -3221 2755 3187 -3285 -3564 3421 5638 139 -3425 -1578 2665
4322 2665 3832 -1552 -4136 2652 6189 250 -4405 -818 3869 2895 -1241 -3781 1429 6290 1701
$$ packed form
4216f566M967P658j621n824j863M551M972m223p969L029R218j030p920j140N562
4231A801L747l358o881K37Q754J425q504k458P218L577m488n957J62P300L163
4246E738o841m838O825N086n614o464J663O404K994m873n308L722P063l978p995
4261f416K013P916J447m986m593K251O388j303p920K95Q411J760o265l611K869
4276a744M890j16o184k335P612L495o744m167M553M422j808n005k184N900M904
4291E489m799n957L837N632k901n525k71M822M204k912o348J702P211k076o256
4306d148O39N893J932l263m877O03N976M32o472k79O985K217n499l564J847M243
4322B665J167n384k584O788L537n939m655L587M687r74m136k540N210M861m589
$$ plain form
4337 1701 -4860 -1440 4772 2549 -2700 -3202 1024 5384 2450 -4396 -3104 4636 3642 -3593 -3657 2539
4353 2539 5162 1778 -4387 -4243 2718 4513 -2911 -4622 2315 5803 669 -4703 -3401 2347 5341
4368 5341 -786 -5565 1018 6439 668 -5829 -3257 2760 4224 -482 -5095 -961 6428 2748 -5763
4383 -5763 -3926 3854 4442 -1457 -4619 -1377 5304 4171 -4737 -5583 2930 5386 -1934 -5055 -701
4398 -701 4255 3388 -4108 -6868 906 5742 -912 -6243 -1081 4457 2116 -4635 -6401 -271 5639
4413 5639 942 -6588 -3061 4468 2212 -4627 -5325 234 4803 1901 -5275 -4294 4071 4112 -4319 -5437
4429 -5437 1364 4855 1335 -4006 -3650 3171 5583 -2182 -5880 1025 5483 1833 -3081 -1918 2859
4444 2859 5137 -522 -5620 -300 6091 2817 -3554 -1351 3513 3889 -336 -4389 -649 6148 3932
$$ packed form
4337A701o561L420O212k223n249n02M226M360k934o846J292P740r94p235o4O196
4353B539K623l384o165J44O961J795p424j711O937L488n134n372J302N748K994
4368E341o127m779O583N421n771o497K572O017J464m706m613M134P389l680q511
4383e763J837P780N88n899l162L242O681j133q908q46Q513K456p320l121M354
4398g01M956q67p496k760P774M836o654n331N162N538k341o751j766O130N910
4413E639m697p530L527P529k256o839o98N559M569k902p176R81Q365M1q431j118
4429e437O801L491l520n341L56O821K412p765l698O905M458l650m914J163M777
4444B859K278n659n098N320O391l274o371K203M864L76m225m053L740O797k216
$$ plain form
4459 3932 -3841 -2925 3482 3417 -1437 -3315 -354 4622 3764 -3289 -4123 2808 4493 -1695 -3741 850
4475 850 4012 2269 -2363 -3996 1711 4740 -864 -4979 -30 4577 1329 -2830 -2833 1388 4090 -37
4491 -37 -5644 -1402 5211 2116 -3982 -2917 1720 2946 -781 -4798 -2184 4870 3427 -4232 -4249 2041
4507 2041 3120 -1285 -3962 -1450 3977 3430 -3482 -5504 1988 4705 -997 -4792 -335 3660 2790
4522 2790 -2561 -5428 654 5745 259 -5832 -1147 4641 2594 -2956 -4102 184 4983 1206 -5539
4537 -5539 -2635 4794 3370 -3557 -4464 359 3715 1065 -4650 -3692 3889 4505 -3872 -6094 88 3637
4553 3637 -21 -4341 -3652 2514 4860 -2536 -7179 -387 5121 933 -4288 -2616 2349 4163 -1367
4568 -1367 -6054 -969 6046 2552 -4178 -2476 3675 4281 -154 -3971 -606 6277 4265 -3696 -3206
$$ packed form
4459C932p773R16O407o5m854j878K961M976q58p053q34O931J685o188k046M591
4475H50L162j743m632j633N707L029n604m115M949M607l248m159lM221K702m127
4491c7n607M242O613l095o098J065M637J226l727m017K614P054j443p659j7O290
4507B041J079m405k677K512N427n47o912k022P492K717n702l795M457L995q70
4522B790n351k867O082N091n486o091M685N788k047n550j146M286M799l777o745
4537e539K904P429j424o927r07M823L356k650n715R58P581O16q377k222O182L549
4553C637l658m320O89O166K346p396m643O792N508m188n221J672M965J814n530
4568a367m687N085P015l494o730J702O151O06m435l817L365O883k012p961M90
$$ plain form
4583 -3206 4293 5392 -446 -3396 -16 4807 4515 -1897 -4194 3252 6358 -286 -4857 -182 4225
4598 4225 3208 -1727 -3854 1659 5611 216 -6084 -1487 4932 2483 -2714 -3324 869 4113 429
4613 429 -5817 -2869 4829 3260 -3214 -4073 1048 3681 512 -4292 -3049 3791 4703 -2986 -4676 1709
4629 1709 4048 -61 -3691 -2086 2913 4338 -1872 -5470 779 5370 -54 -4861 -2196 2862 3422
4644 3422 -1281 -4980 -612 5017 960 -5526 -2924 3356 2815 -1874 -4365 -1175 3326 1889 -5092
4659 -5092 -4039 3238 3768 -2516 -4310 -655 2879 1774 -3397 -3902 2591 4929 -2139 -5348 126
4674 126 4065 1144 -2753 -2790 2086 4980 -435 -5338 47 5093 1788 -3555 -2600 2071 3804 -143
4690 -143 -4601 -1644 4904 2592 -4339 -3195 2632 3356 -563 -3723 -2065 3981 3427 -3685 -4130 2879
$$ packed form
4583c206P499J099n838k950L380M823k92o412k297P446L106o644m571M675M407
4598D225j017m935k127N513L952n395o300M597O419k449n197o10M193L244l684
4613D29o246K948P698j569o474q59N121K633l169m804J243O840R12p689j690O385
4629A709K339m109l630J605M999J425o210l598O249M591n424m807K665N058N60
4644C422m703l699M368N629m057o486K602O280n41m689k491L190M501j437o981
4659e092J053P277N30o284j794L655L534j105n171n05O493K338p068l209N474
4674A26L939k921l897l7M876K894n415m903N385N046l305n343R55M671J733l947
4690a43m458K957O548k312o931J144N827P24l919l160J658O046n54p112m45P009
$$ plain form
4706 2879 4889 -650 -3792 -944 3626 3520 -2154 -4104 2077 6083 -107 -4545 -657 4203 3226
4721 3226 -1436 -3199 1519 5655 1522 -4601 -1209 5407 3415 -1827 -2805 1309 4227 1697 -4091
4736 -4091 -2718 4641 4299 -2813 -4004 1669 4362 1011 -3600 -3193 2968 4316 -2868 -5602 825
4751 825 4365 -80 -4049 -2763 2038 3772 -1392 -5497 -554 4978 549 -5080 -2639 2295 3213
4766 3213 -1378 -4610 -1085 4923 2159 -4956 -3376 3527 3510 -1538 -3995 -1081 3521 2482 -4095
4781 -4095 -4364 2888 4732 -1791 -4337 -197 3415 2103 -3059 -4376 1385 5081 -1227 -5666 -673
4796 -673 4027 1743 -3350 -3731 768 4574 231 -5545 -1885 4740 2105 -3867 -3629 1337 3641 755
4812 755 -4203 -2395 4413 3840 -3275 -3776 2381 4277 537 -3484 -2074 3370 4708 -2136 -4394 2500
$$ packed form
4706B879K010n539l142K848M570j06n674j950O181M006o190m438L888M860r77
4721C226m662j763M718M136m133o123L392O616j992n242r78M114K918k530n788
4736d091J373P359l42p112j191N673K693l351m611M07O161J348p184k734O427
4751H25L540m445l969J286M801J734n164m105M943N532m429n629K441M934R18
4766C213m591l232L525O008k764p115J580O903j7n048k457K914M602j039o577
4781d095k69P252J844o523k546M140L612j312n162j317N761L696o308m439M993
4796f73M700k284n093l81M499L806m343n776L660O625k635n972K38M966K304k886
4812G55m958J808O808n73p115n01O157J896l740m021J410N444J338o844k258O894
$$ plain form
4828 2500 5403 333 -3271 -1037 3753 3922 -1010 -3935 687 5743 1226 -4503 -1326 3828 3304
4843 3304 -1458 -3402 26 4858 2374 -4415 -2573 3954 3117 -1966 -3670 -262 3385 2031 -3348
4858 -3348 -3466 3340 4096 -2099 -4192 779 3628 1386 -3246 -3523 1605 4380 -1437 -5083 -171 4525
4874 4525 929 -3238 -2364 1727 3814 -633 -4770 -1185 4464 1763 -4098 -2549 2156 3136 -795
4889 -795 -4078 -1685 4383 2798 -3751 -3794 2557 3304 -1130 -3896 -1306 3112 2338 -3078 -4404 1931
4905 1931 4520 -1519 -4833 -755 2840 1766 -2524 -4325 899 4603 -604 -5475 -1237 3931 1677
4920 1677 -2581 -3325 629 3726 527 -4978 -2454 4105 2731 -3418 -3443 1276 3302 657 -3873 -2704
4936 -2704 3923 4181 -2647 -4102 1809 4304 192 -3748 -1791 2855 4141 -1528 -4929 1141 5345
$$ packed form
4828B500K903n070l604K234M790J69m932k925M622N056m517n729L177N154n24
4843C304m762j944L428M832k484o789J842O527q37n083j704L408L647j354n379
4858c348j18O806P56o195k093M971K849k242m632k77N128K775n817l646M912M696
4874D525l596m167Q74M091K087m447m137L585N649k701n861J549M705R80l931
4889g95l283K393O068j585o549m3O351P47m434k766K590M418p74n416j326O335
4905A931K589o039l314M078L595j074m290j801N224L704n207m871M238N168k254
4920A677m258p44L954L097l199n505K524O559j374o149k5M719K026k645m530J169
4936b704O627K58o828j455N911K495m112l940J957M646J286n669l401O070M204
$$ plain form
4951 5345 1050 -3882 -1378 3314 3725 -735 -4336 104 5415 1664 -4643 -1934 3662 3695 -495 -3332
4967 -3332 -46 4313 2903 -3952 -3409 3516 4419 -1209 -3778 -328 3638 2585 -2906 -3347 2661 5304
4983 5304 -998 -4450 -140 3807 1888 -2291 -3582 1839 4676 -109 -5252 -783 4512 1703 -3393
4998 -3393 -2820 1074 3556 443 -4668 -2258 3835 2487 -3743 -3920 1720 3608 170 -3752 -2757 2921
5014 2921 3160 -3333 -4461 1715 3963 -610 -3628 -2059 1945 3126 -1852 -4166 953 4870 31
5029 31 -4441 -1361 2516 2113 -1467 -3877 188 4205 1028 -4495 -1767 3478 2614 -1704 -2981 388
5045 388 3247 1460 -3850 -2903 2713 3116 -2603 -3469 1150 3151 818 -3048 -3096 2102 3468 -2019
5061 -2019 -4665 903 3843 307 -3405 -2724 1343 3398 -916 -4561 98 4599 629 -4199 -2188
$$ packed form
4951E345m295m932K504M692M11m460l601M440N311l751o307K709N596L3m190k837
4967c332L286M359j410o855N43O925R03n628k569L450L966j053n491m41O008K643
4983E304o302l452M310L947j919m179j291N421K837m785n143M469N295k809n096
4998c393N73L894K482l113n111K410O093j348o230j77N640J888l438l922R95N678
5014B921K39o493j128O176K248m573l018J569M004J181m978k314N119L917m839
5029C1m472L080L877m03l580k410M065M017l177n523K728N245q64m318j277L369
5045C88K859j787n310R47N616M03n719q66M619K001k333l866m8N198J366n487
5061b019k646N568K940l536l712O81M067K055m314l645M659M501l970m828K011
$$ plain form
5076 -2188 2213 2961 -416 -3355 -462 4445 2118 -3918 -2104 3764 4259 -368 -2716 25 4124
5091 4124 2809 -3052 -2948 3359 4745 -802 -3319 393 3833 2957 -1946 -3590 1946 4953 -480
5106 -480 -4315 0 4260 1458 -2601 -3620 914 4178 416 -4699 -1388 4101 2077 -3496 -3644
5121 -3644 1243 3738 750 -4056 -2709 3334 2976 -3669 -3751 1731 3785 296 -3338 -2592 2682 3618
5137 3618 -2609 -4645 1302 4394 68 -4004 -1916 2238 2922 -1522 -4652 -76 4440 486 -4604
5152 -4604 -2118 2668 2149 -1986 -4213 -1085 3760 1456 -4465 -3223 2755 2473 -2221 -3842 -643
5167 -643 3240 2210 -3360 -3627 1989 3487 -1943 -3650 705 3995 1856 -2545 -3139 1717 4278 -469
5183 -469 -4055 863 4669 1572 -2755 -2501 1226 3709 882 -3822 -574 4613 2154 -3483 -2402
$$ packed form
5076b188M401P48l377k939K893M907k327o036J814N868M95m627k348K741M099
5091D124j315n861J04O307J386n547k517L712L440q76m903j644N536L007n433
5106d80l835M315M260k802m059j019M534L264l762n115L311N489k024n573j48
5121c644M887K495k988m806J347O043l58o645q2N482K054l489l634P46N274R36
5137C618o227k036N947L092m326m072K088M154O84m444l130M576M516l954n090
5152d604K486M786n19m135k227L128M845k304n921J242N978k82m694j621L199
5167f43L883j030n570k67N616J498n430j707M355L290k139m401n94M856K561m747
5183d69l586M918L806l097m327K54L727K483k827m704L248N187k459n637J081
$$ plain form
5198 -2402 1587 3166 -174 -3502 -1484 3517 2839 -3156 -3384 1781 3025 -877 -3116 -1196 2460
5213 2460 2862 -2377 -4199 990 3672 -781 -3424 -446 2926 2433 -1601 -3776 449 4321 702
5228 702 -3277 -385 3734 2385 -1448 -2799 578 4385 2182 -3331 -1320 3933 2635 -2111 -2495
5243 -2495 1146 3366 1367 -2880 -2605 2761 3597 -2247 -3458 1208 3187 532 -2672 -2377 1832 3120
5259 3120 -2052 -4814 -208 3034 -70 -3602 -1631 1707 2582 -1465 -4731 -1274 3559 932 -3931
5274 -3931 -2147 2235 1926 -1613 -3867 -1257 3328 2336 -3367 -2969 2458 2532 -1829 -3309 -503 2962
5290 2962 2125 -2784 -3711 2068 3729 -1273 -4044 -22 3190 1595 -2416 -3091 788 3469 -647 -4649
5306 -4649 -687 3690 1612 -2461 -2099 1133 3316 160 -4208 -1734 4102 2842 -2464 -2435 1794 2885
$$ packed form
5198b402L989J579l340l328K018N001o78n995k28N165J244l902k239J920L656
5213B460M02n239j822N189K682m453k643K978L372m93m034k175M225L872l619
5228G02l979K892M119j349l833j351L377L807k203n513K011N253j298m746l84
5243b495L641K220j999m247K75N366Q36n844j211M666J979k655l204K95M209J288
5259C120n172k762M606L242l104l532J971L338Q75m047l266L457M833k627m863
5274c931J784M382l09l539k254K610M585r92n703L98N427P4m361j480K806L465
5290B962q37m909r27N779J661n002k771M022L212j595m011o75L879K681m116m002
5306d649L962M377k078m073L62L232K183l156m368K474N836j260n306K9M229J091
$$ plain form
5322 2885 94 -2860 -1437 3805 3999 -1890 -3511 1811 3865 -19 -2713 -493 3186 4016 -1329
5337 -1329 -4021 965 4032 665 -3223 -462 3100 2775 -1076 -3661 -259 4089 881 -4248 -1761
5352 -1761 3307 2515 -1967 -3030 -117 3303 1360 -3872 -2990 3130 3613 -1925 -3470 -25 2572 938
5368 938 -2952 -2888 2692 4181 -1485 -4419 9 3158 779 -2402 -2018 1676 3954 -581 -4673 -992
5384 -992 3781 1751 -2858 -1897 1707 3096 -167 -3810 -1647 3759 2400 -3292 -2711 1550 2793 -468
5400 -468 -2969 -1597 2617 2560 -2545 -3786 1401 3248 -782 -3353 -1661 1672 2075 -1636 -3754 497
5416 497 3788 -104 -4007 -1257 1976 1414 -1188 -2342 386 3385 750 -4049 -1778 3052 2304 -1141
5432 -1141 -1876 368 1965 949 -3206 -2368 2910 3213 -1578 -2408 1095 2347 577 -2092 -1720 2284
$$ packed form
5322B885k791k954J423N242J94n889j621N322K054l884k694K220L679Q30n345
5337a329k692M986L067l367l888K761L562l25l851k585L402M348l208n129K487
5352a761N068p92m482j063K913L420j943n232Q82O120M83n538j545L445K597j634
5368I38l890O4N580J489n666k934M428L149k379l181L84L694K278m535m092L681
5384i92M773k030m609R61L604J389l263l643K163N406j359n692N81M261J243l261
5400d68k501J372M214n7n105j241N187J847m030k571J692L333M03l711k118M251
5416D97L291l892l903K750L233n62k602j154K728K999k635m799K271M830p48l445
5432a141p35K244J597j016m155Q38N278L03m791q30L503J252j770k669L72M004
$$ plain form
5448 2284 3497 -935 -2905 1124 3033 212 -2350 -1184 1497 2678 -360 -3181 633 3897 479
5463 479 -2914 -1022 2090 2100 -591 -2202 41 3708 989 -3669 -1788 3380 2810 -1080 -1604 497
5479 497 2575 1614 -2602 -2330 3229 4208 -1218 -3021 304 2388 766 -2259 -2181 2330 3954 -848
5495 -848 -4225 4 3445 739 -2493 -1997 1499 3479 -397 -4286 -1019 3972 1313 -3555 -2679 1237
5511 1237 2684 -372 -3604 -1986 3011 2212 -3623 -3587 1957 3291 -338 -3308 -2047 1761 2430 -2476
5527 -2476 -4231 1641 4399 -326 -3753 -1748 1836 2458 -1053 -3380 666 4616 787 -4570 -2052
5542 -2052 2744 2458 -754 -2499 186 3901 2103 -3509 -2334 3244 3241 -1009 -2457 193 3211 1881
5558 1881 -2462 -3213 2150 3695 -1122 -3485 301 3151 1644 -1796 -3094 389 3349 -368 -3814
$$ packed form
5448B284J213m432j970M029J909k821k562J166K681J181l038k821L814L264l418
5463D79l393J892L112J0k691j611K243L667k719m658J881N168n70l890n24K101
5479D97K078r61m216K72N559R79n426j803L325K084j622l025P8M511J624m802
5495h48l377M229L441k706l232M96L496J980l876l889L267M991k659m868Q76L916
5511A237J447l056l232J618M997p99n835L6N544J334l629k970J261L808O69m906
5527b476j755N872K758m725l427K005L584O22l511k327M046L950l829n357K518
5542b052M796k86l212j745K685L715j798n612J175N578lm250j448K650L018j330
5558A881m343p51N363J545m817k363L786K850j507l440j298L483K960l717l446
$$ plain form
5573 -3814 -352 3503 1324 -2470 -2668 49 2825 655 -2688 -1167 3395 1735 -3133 -2441 1085
5588 1085 2561 899 -1788 -1191 2416 2381 -1959 -2649 1835 3153 399 -1501 -654 1672 2242 -1246
5604 -1246 -2973 1281 3453 -15 -2091 -46 1959 1802 -579 -2194 360 2946 610 -2719 -123
5619 -123 2640 1019 -1891 -1903 -1 2416 1239 -2253 -1268 3025 1448 -2757 -2153 984 2198 732
5635 732 -1601 -1918 1717 1858 -2566 -2725 1677 3257 -140 -2168 -1242 1213 1750 -1632 -3359 547
5651 547 3503 -519 -3311 -1020 1475 1285 -1315 -3218 -563 3458 462 -4166 -1848 2214 1417 -2237
5667 -2237 -3025 -632 2702 1842 -3061 -2743 2419 2417 -2319 -3086 297 3146 2127 -1820 -2920 1798 3336
5684 3336 -1308 -3315 916 3797 1653 -1777 -2363 949 3643 332 -3304 214 4416 1973 -2304
$$ packed form
5573c814L462L855k179l794j98K717K776k170l343J521M562j660m868O92L526
5588A085J476j662k687N97L607l5m340o90M484J318k754j900Q47K326N70l488
5604a246j727M254K172l468k076K045K005j57k381j615K554K586k336l329K596
5619a23K763j621k910j2J902K417j177l492R85M293j577m205O04L137J214j466
5635G32k333l17L635J41m424j59M402J580l397k028R26K455N37l382j727L906
5651E47K956m022k792K291K495j90k600j903K655M021k996m628K318M062p97l654
5667b237p88K393L334q60m903L18N162km736p67L383K849j019l947j100M718J538
5684C336m644k007M231K881k144l430n86L312K694l311l636L518M202k443m277
$$ plain form
5699 -2304 -1923 1164 3211 1099 -2829 -1372 3559 2436 -2408 -2725 1370 2613 -125 -2333 -2081 2142
5715 2142 2877 -1735 -3638 927 3019 -386 -2815 -1442 1644 2746 -1255 -3789 -580 3337 -111
5730 -111 -2895 -708 2426 2203 -858 -3104 -872 3143 1949 -2646 -1311 2929 2018 -1506 -2208 10
5746 10 3181 2304 -1862 -2101 2360 2780 -1604 -2452 375 2203 1373 -1930 -2388 1087 2839 -991 -3628
5763 -3628 9 2472 384 -2135 -1880 476 2429 -350 -4018 -1410 2322 615 -2475 -1658 987
5778 987 1685 -718 -3367 -1898 2599 1844 -2468 -2067 1708 1473 -1084 -2469 -1189 2367 2628 -1411
5794 -1411 -2909 976 2476 -1115 -2617 -119 2128 1772 -837 -3006 252 3034 -191 -3244 -469
5809 -469 2216 1296 -1283 -1904 -124 2576 631 -3438 -1367 2665 1544 -1590 -1248 831 1770 652
$$ packed form
5699b304L81L087K047k112l928J457M931j123m844l17M095J243k738k208K52M223
5715B142P35m612j903M565K092l405k429J373L086J102m001k534L209L917l448
5730a11k784K187L134k23l061k246K232M015j194m595J335M240r11l524p02K218
5746A0L171q77m166k39M461M20m384q48K827J828q30l303m58L475J752l830k637
5763c628L637K463k088k519K55K356J953k779l668K608L732j707l090Q17K645
5778I87O98k403k649J469M497p55m312M01L775k35k557j385J280L556K61m039
5794a411j498L885J500l591j502K498K247l56k609k169L258K782l225l053K775
5809d69K685r20k579o21J780K700j945m069K071M032j121l134L42K079R39j118
$$ plain form
5825 652 -2383 -1950 2196 2399 -1475 -2337 1308 1980 68 -1524 -1011 2232 3143 -655 -2880 771 2594
5842 2594 36 -1936 -611 2108 2521 -430 -2979 -94 3092 988 -2372 -336 2360 1565 -781
5857 -781 -2379 -497 2446 1460 -2608 -1721 2002 1789 -1294 -1623 -253 1928 1121 -2071 -2896 1881 2916
5874 2916 -1298 -2752 -213 1908 361 -1646 -1670 1399 3371 -731 -3313 -60 2321 542 -1963
5889 -1963 -1272 948 2433 -206 -3508 -1224 2837 1315 -2367 -1651 1379 1763 -625 -3023 -1524 2407
5905 2407 2223 -2640 -2742 1507 2143 -1018 -2730 -1053 1642 1934 -1552 -3315 801 3198 -549 -3030
5921 -3030 -839 1577 1605 -1239 -2707 407 3591 969 -3475 -1284 2333 1595 -922 -1632 366 2997
5937 2997 1285 -3148 -1942 2681 2888 -1140 -1535 592 2215 944 -2346 -2166 2107 3673 -1009 -2745
$$ packed form
5825F52l035M33M146K03l874q62L645O72j912j592N13L243R11l798k225L651J823
5842B594k558j972J325K719M13k951k549K885L186k104l360K036K696p95k346
5857g81j598J882K943r86m068Q87L723k13l083l29J370K181q07l192q25M777J035
5874B916m214j454K539K121j547k007k4L069J972m102k582L253K381j779k505
5889a963O91K220J485k639l302K284M061j522l682P16L030L84k388k398J499L931
5905B407j84m863j02M249O36l161j712J677K695K92l486j763M116K397l747k481
5921c030K191K416K8k844j468L114L184k622m444K191L617p38k517p10J998K631
5937B997j712m433J206M623K07m028l95K127J623j271l290J80M273J566m682j736
$$ plain form
5953 -2745 449 2176 622 -1779 -1784 1057 2873 -300 -3374 -611 2796 614 -1973 -1582 926 2355
5969 2355 316 -2856 -1335 2887 1762 -2316 -2047 1125 1897 357 -1486 -1066 1937 2211 -1816 -2754
5985 -2754 1283 3070 24 -1496 -589 1366 1726 -759 -2199 1058 3277 384 -2159 -70 1407
6000 1407 761 -571 -1731 349 2614 601 -2675 -1050 2129 719 -1171 -1177 85 1388 677 -1989
6016 -1989 -1648 1775 1257 -2326 -2030 461 1192 -5 -1685 -1591 926 1470 -1930 -2742 803 2098 -394
6033 -394 -1802 -973 359 946 -950 -2565 678 2734 -420 -2529 -906 1342 699 -747 -1689 288
6049 288 2735 492 -3017 -1396 2100 1237 -1151 -1062 123 2158 1238 -1859 -1729 2367 2584 -1494 -1863
6066 -1863 522 1943 1122 -1533 -1923 1834 2885 -888 -2710 691 2895 841 -1626 -1283 982 2770
$$ packed form
5953b745L194J727j554k401nK841J816l173l074K763L407k182k587L91K508J429
5969B355k039l172J521M222j125m078K69L172P72j540j843M20L003K74m027r38
5985b754M037J787l046j520R07J955L60k485j440L257K219k893k543K089J477
6000A407o46j332j160K080K265k013l276J625L179j410j890oJ262J303p11k666
6016a989L41L423n18l583K96K491P31j197j680R4K517N44l400q12L545J295k492
6033c94j408Q29J332N87j896j615L243K056l154k109J623K248o43j446r42J977
6049B88K447k243l509J621L496q63k388Q9J185K035r20l097J30M096K17m078l69
6066a863K385J421q21k655l90L757J051l773j822L401K204k054k467L43K265J788
$$ plain form
6082 2770 -408 -3043 -185 3716 954 -2570 -1495 1160 2156 420 -2336 -980 2924 1907 -2590
6097 -2590 -2381 1542 2296 162 -1967 -1289 1947 2393 -2068 -3118 1051 3222 -200 -2407 -582 1274
6113 1274 1919 -652 -3129 14 3261 580 -2727 -784 2012 1711 -642 -2222 -690 2475 1424
6128 1424 -2732 -1657 2158 1681 -1710 -2310 -291 1685 1737 -1427 -2396 1873 2227 -1366 -2473 -12
6144 -12 1487 957 -1099 -2065 840 2298 -556 -2854 -118 2126 776 -1489 -1376 39 1606 396
6160 396 -2199 -995 2624 804 -2127 -1094 816 1313 279 -1902 -1385 1637 1265 -2145 -1632 1047
6176 1047 1364 -697 -1440 -857 966 1539 -847 -2155 877 1837 -852 -1664 78 1782 1285 -599 -1548
6193 -1548 210 2286 269 -2069 194 2431 970 -1018 -976 413 2209 735 -1645 -259 2542
$$ packed form
6082B770l178k635K858L901k762l524J075K655R96j736k756J356L904j017m497
6097b590K09L923P54k134k129O78L236M46m461j050M169K171l422k207J825J856
6113A274O45k571k477L143L247k681l307J943K796l01k353j580J532L165j051
6128A424m156J075L815m77l391o00K019J976N2l164r69M269L54l593j107K461
6144a2J499n30k056r66K905J458k854k298K736K244j350k265J13J415J567j210
6160C96k595J204L619j820k931J033J910M97j034k181N17L022l72l410N13K679
6176A047L17k061p43N83J823N73k386j308L032R60k689q12J742J704m97j884r49
6193a548J758K076k017k338K263K237j461j988M2J389J796j474k380J386K801
$$ plain form
6208 2542 1171 -1721 -903 946 1604 590 -1486 -897 2176 1522 -1699 -1729 1055 1983 -202 -1614 -1072
6225 -1072 1252 2310 -735 -2677 851 2274 -793 -2265 -672 1896 1502 -455 -2379 -310 2597
6240 2597 433 -2336 -383 2067 1577 -684 -1703 -568 2003 1228 -2143 -1304 2224 2062 -1228 -1764
6256 -1764 132 1658 1301 -1718 -2134 1321 2524 -909 -2573 93 2066 375 -1517 -2049 144 2150
6272 2150 -224 -2828 -412 2103 312 -1931 -1414 357 1582 1 -2802 -1367 1837 1315 -1862
6287 -1862 -1447 995 1597 -59 -1895 -1527 1515 2095 -1321 -1982 869 1926 -306 -1644 -482 1115
6303 1115 1875 -486 -2202 564 2505 -7 -1902 -186 1513 1166 -263 -1838 -290 2622 893
6318 893 -2316 -617 2029 1352 -902 -1428 74 1906 976 -1830 -2076 1578 2017 -1003 -1592 247 1217
$$ packed form
6208B542j371k892Q18J849O58j014k076N89L073o54l221l0K784R28k185j412N42
6225a072K324J058l045j942L528J423l067j472J593K568l94j957j924K069K907
6240B597k164k769J953K450m90k261j019J135K571p75l371Q39L528j62l290n36
6256a764J896J526l57l019m16L455J203l433j664K666J973j691j892n32K193K006
6272B150k374k604K416K515j791k243N17J771J225j581k803J435L204n22l177
6287a862M15K442O02j656j836L68L042N80l416o61K851J057k232j338J162J597
6303A115P60k361j716K766J941k512j895J716J699l47j429j575J548K912j729
6318H93l209J699K646o77k254n26J502J832r30k806k46L654M39l020n89J839R70
$$ plain form
6335 1217 794 -1267 -1752 1244 2563 -676 -2096 497 1844 32 -1084 -864 603 2645 188 -2355
6351 -2355 -164 2402 281 -1496 -548 1174 1546 503 -1827 -630 1890 1209 -1894 -1263 1279 1219
6367 1219 -290 -1115 -1128 1386 1614 -1438 -2218 1091 1871 -683 -1587 -149 1247 940 -835 -2180 649
6384 649 2753 3 -2216 -153 1506 603 -766 -1192 233 1841 850 -2282 -1328 1946 377 -1401
6400 -1401 -1274 171 1393 560 -1565 -1461 1332 1512 -1672 -1716 727 945 -271 -1316 -1420 985 1308
6417 1308 -982 -2341 454 1543 -219 -1793 -689 440 1529 -598 -2117 -318 2272 245 -2239
6432 -2239 -535 1276 1124 -333 -1305 -107 1979 1342 -1987 -1141 1822 1239 -682 -992 207 1538
6448 1538 1333 -1280 -1670 1639 2443 -824 -1461 532 1456 638 -953 -1045 831 2505 -203 -2122 393
$$ packed form
6335A217m23k061m85K996J319l239j420K593J347j812j116K20J467K042k457k543
6351b355K191K566k121j777R48J722L72j043k330J197K520o81l103O31K542o0
6367A219j509q25j3K514K28l052p80L309P80k554r04J438J396l07j775j345K829
6384F49K104k750k219K063J659r03j369m26J425J608r91l132R54L274j569j778
6400a401J27J445J222q33k125J04K793J80l184m4K443K18j216j045j04K405L23
6417A308k290j359K795J089j762j574J104J129J089k127j519J799K590k027k484
6432b239J704J811j52j457r72J198K086o37l329Q46K963n83j921l10J199J331
6448A538k05k613l90L309Q04l267o37J993R24q18j591r2J876J674k708j919K515
$$ plain form
6465 393 1813 587 -1010 -924 636 1837 459 -2288 -692 2258 672 -1867 -920 604 1148 60
6481 60 -1443 -1030 1740 1833 -1912 -1839 1111 1573 -323 -1235 -685 952 1677 -995 -2188 991 2055 -194
6499 -194 -1660 -384 1015 1083 -303 -2039 318 2370 195 -2406 -609 1505 1204 -793 -1457 -43
6515 -43 1620 883 -2032 -1598 1700 1463 -1223 -1345 -183 963 680 -1345 -2054 1022 1952 -1076 -2142
6532 -2142 257 1254 168 -971 -1647 549 2185 -174 -2588 -360 2045 636 -1237 -904 457 1528
6548 1528 42 -1701 -883 1787 917 -1626 -828 455 909 235 -961 -983 1330 1360 -1412 -1521 916
6565 916 1522 -418 -1347 -480 926 1543 -715 -1795 712 1723 -90 -1756 -93 1296 793 -354
6581 -354 -1239 48 1865 372 -1614 -188 1528 926 -722 -675 201 1316 469 -1337 -673 1694 1292
$$ packed form
6465C93J420j226j597Q6J560J201j378k747J596K950j586k539R47J524N44j088
6481F0j503M13K770R3l745P3K950M62j896r12N50J637P25k672j193L179J064k249
6499a94j466J276J399O8j386j736K357K052k175k601J797K114l01j997o64J414
6515d3J663p37k915M34L298k37k686j22J162J146k83k025p09L076R30l028j066
6532b142K399R97j086j139o76K196J636k359k414K228K405j409j873L33J361J071
6548A528j486j743Q18K670q70k543P98J283M54o74j196k2K313L0k772j09K437
6565I16O06j940r29Q67J406O17k258j080K507J011j813j666J663J389n03j147
6581c54q85J287J817j493j986J426J716o02j648M7Q76J115q47j806O64K367m02
$$ plain form
6598 1292 -939 -1062 659 1087 404 -924 -763 1061 1565 -1195 -1706 795 1268 -228 -938 -377 805
6615 805 1131 -417 -2162 430 1834 -53 -1868 -449 891 659 -163 -1670 -370 1680 504 -1732
6631 -1732 -728 1513 944 -766 -1224 -604 962 779 -1447 -1727 1119 1446 -995 -1411 112 1066 666
6648 666 -949 -1517 951 2011 -639 -2289 26 1587 492 -932 -1066 146 1719 80 -2241 -782
6664 -782 2220 791 -1397 -1043 265 951 375 -1838 -1279 1764 1272 -1611 -1450 1088 1023 -73 -958
6681 -958 -1039 1107 1508 -1158 -1715 598 1706 -129 -1283 -512 734 1382 -522 -1793 209 2092 132
6698 132 -1790 -292 1277 654 -280 -1070 -224 1663 954 -1393 -850 1745 1147 -459 -746 59 1174
6715 1174 1062 -897 -1564 1238 1905 -1140 -1425 229 1148 466 -734 -1035 359 1945 -182 -2194 313
$$ packed form
6598A292k231j23J721M28o83j328J61J824N04k760n11K501M73j496p10N61J182
6615H05L26j548j745K592J404j887j815J419J340k32q22j507J300K050j176k236
6631a732J004K241n69j710m58O20J566j83k226k80K846L27k441m16J523R54m00
6648F66j615n68K468J060k650j650K315J561j095j424j34J212J573j639k321J459
6664g82L002j429k188L54J308O86n76k213N59L043m92k883J61K538o5j096q85
6681i58q1K146M01k666n57K313J108j835j154P71J246O48j904j271K002J883j960
6698A32j922J498J569o23r34p90Q46J887p09k347N43K595n98j606k87Q05J115
6715A174j12j959o67K802O67l045k85J654R19o82j200l01J394J586k127k012K507
$$ plain form
6732 313 1181 144 -813 -698 108 1171 89 -1862 -654 1747 637 -1040 -402 462 979 -44 -1302
6749 -1302 -720 1327 1112 -1569 -1066 1018 1013 -336 -712 -559 708 1181 -592 -1479 737 1485 -664 -1085
6767 -1085 -365 828 749 -385 -1436 205 1569 -201 -1753 -424 866 102 -873 -1065 -200 1096 281
6784 281 -1872 -1138 1155 617 -1421 -1126 364 1072 296 -1051 -1157 1468 1644 -1071 -1393 890 995
6801 995 -90 -647 -807 748 1562 -281 -1713 479 1978 92 -1358 77 728 1003 -53 -1485
6817 -1485 -161 2009 615 -1750 -612 955 1017 -183 -1071 -412 1378 918 -1477 -1309 1017 1155 -660
6834 -660 -810 -31 485 753 -623 -1477 835 1648 -437 -1277 81 1075 665 -459 -1135 32 1767 -27
6852 -27 -1496 -59 1588 479 -915 -875 129 1183 609 -1673 -635 1467 1082 -1415 -1002 815 870
$$ packed form
6732C13Q68j037r57J15Q06J063j082j951J208K401j110j677O38Q64N17j023j258
6749a302N82K047k15k681N03K084nj349l76J53J267M73j773q87K216P48k149m21
6767a085P20J193p9j134j051J641J364j770j552J329J290p64r75j92Q65J296q15
6784B81k153P34K293n38k038K95J490P08p76j347j06K625J76k715l22K283J05
6801I95j085n57j60J555Q14j843j432K192J499j886j450J435O51K75j056j432
6817a485J324K170j394k365J138J567O2j200q88O59J790m60k395J68K326J38j815
6834f60j50P79N16K68j376q54K312Q13k085q40J358R94m10j124o76J167J735j794
6852b7j469J437J647j109j394M0J004J054n74k282J038K102l85k497M13J817N5
$$ plain form
6869 870 147 -900 -923 1044 1208 -942 -1810 456 1042 -450 -891 -492 514 1432 -550 -1948 217
6886 217 1534 -141 -1560 -555 863 766 -517 -1658 -731 1546 20 -1675 -437 1315 459 -474
6902 -474 -857 -437 893 647 -1387 -1198 1565 1307 -765 -1016 221 806 810 -713 -1138 863 1636 -562
6920 -562 -1539 180 1103 106 -598 -983 115 1325 153 -1791 37 1524 255 -972 -486 167 806
6937 806 232 -1292 -569 1320 899 -1254 -886 1059 835 112 -759 -482 756 1302 -954 -1183 870 1659
6955 1659 -488 -923 -228 636 1154 -137 -1156 371 2131 -225 -1341 171 993 644 -109 -958 -251
6972 -251 1118 402 -1449 -364 1330 326 -802 -873 -268 793 478 -1166 -1116 905 942 -1024 -1126 539
6990 539 743 104 -287 -802 472 1379 -468 -1493 327 1043 -266 -775 -299 304 892 73 -1414 -233
$$ packed form
6869H70p23j047k3J967J64k150q68K266N86j492m41L99J006R18j982j398K165
6886B17J317j675j419J005J418r7j283j141R27K277j526j695J238J752q56r33
6902d74l83M20J330k46k034J89K763k58k072k51J237N85Mj523m25K001P73k198
6920e62r77J719R23r97p04l85J098J210j172j944J828J487j269j227M86O53O39
6937H06n74j524P23J889m21k153L68J945k24p23q71K77J238N46k256k29K053P89
6955A659k147m35O95Q64N18j291j019J527J760k356j116J512Q22l49p53q49P07
6972b51J369p16j851J085J694j004j128p1O05J061l15j644N0K021L7j966j02J665
6990E39K04o39l91n15J274R07j847j025J820P16j309n09M76O03N88q19j487J181
$$ plain form
7008 -233 1625 -33 -1203 -365 708 545 80 -1179 -619 1235 687 -1635 -900 1299 696 -499 -681
7025 -681 -571 498 685 -918 -1511 997 1357 -863 -1163 -11 784 366 -342 -1070 212 1639 -132
7042 -132 -1658 255 1348 293 -728 -913 218 1568 261 -1533 -747 1557 491 -1298 -792 424
7058 424 926 156 -1236 -975 1072 1187 -1154 -1073 1087 1480 -102 -799 -816 768 1191 -389 -1751 368
7076 368 1733 -345 -933 -381 717 1004 -117 -1222 -242 1657 194 -1683 -659 1252 621 -33 -892
7093 -892 -493 1022 851 -971 -1024 1308 989 -327 -622 -63 587 965 -745 -1607 583 1488 -607 -1101
7111 -1101 324 782 433 -484 -1365 177 1577 263 -1199 -67 1270 357 -697 -555 -105 1261 684
7128 684 -1250 -700 1200 577 -1094 -1059 418 776 337 -623 -969 857 1083 -912 -1317 532 596 -134
$$ packed form
7008b33J858j658j170Q38J073j63m65j259N60J854n48k322P35K199o03j195j82
7025f81J10J069J87j603n93K508L60k220l00J152P95m18p08p28J282J427j771
7042a32j526J913J093j055j021j85J131J350j307j794P86K304j066j789N06J216
7058D24N02p70j392K61K047J15k341Q1K160L93j582o97j7J584M23j580j362K119
7076C68J365k078n88N52J098K87j121j105R80J899j463j877J024J911o31o54q59
7093h92L99J515j71j822n3K332l19j316k95N59O50L78j710q62K190R05k095m94
7111a101J425M58l49r17q81J542J400j314j462J132J337r13j054J42M50J366n77
7128F84j934N50J900o23j671L5J477L58m39r60l46J826K26j995m05J849O4p30
$$ plain form
7146 -134 -586 -437 330 892 -160 -1388 45 1475 -317 -785 -243 232 197 -151 -639 -206 1346 102
7164 102 -1249 -335 862 -36 -633 -381 -283 1233 749 -812 -943 848 490 -702 -671 523 797 403
7182 403 -570 -853 981 1130 -695 -874 753 768 -296 -551 -295 456 1582 -241 -1418 316 1536
7199 1536 -91 -1174 59 388 649 45 -1303 -268 1406 559 -1281 -527 1139 540 -220 -519 -439
7216 -439 1366 1218 -1095 -1224 1354 874 -659 -575 261 761 791 -526 -1226 737 1581 -519 -1122 44
7234 44 1134 226 -542 -826 -11 1607 136 -1868 -461 1230 355 -886 -652 21 636 192 -1226 -926
7252 -926 1235 1212 -1388 -950 144 766 370 -563 -830 858 1417 -545 -1583 167 966 50 -995 -521
7270 -521 552 1000 14 -1552 21 1442 110 -995 -365 407 794 151 -1029 -350 990 679 -1339
$$ packed form
7146a34m52J49P67N62j052j228J433J430j792m68N42M75l5l48m88M33J552j244
7164A02j351R14J197q98n97K52R8J516m84j561j31J791l58j192L1J194K74l94
7182D03r73k83J834J49j825j79J627J5j064k55K56P51J126j823j177J734J220
7199A536j627j083J233L29K61o04j348J035J674q47j840P54J666n99p60k99Q0
7216d39J805j48k313j29K578m80j533Q4Q36N00L0j317p00J963Q44k100o03J166
7234D4J090r08p68k84Q15J618j471k004J407J691q75j241K34O73O15m44j418L00
7252i26K161k3k600M38J094O22l96r33k67J688N59j962j038J750P99r16j045M74
7270e21J073M48r86j566J573J421j332j105O30P72L87o43j180O79J340l11k018
$$ plain form
7287 -1339 -711 989 531 -227 -601 -616 519 830 -609 -1124 617 1018 -559 -710 158 237 344 -428 -1114
7306 -1114 83 1310 -179 -1141 117 640 398 77 -316 -189 707 260 -1382 -143 1231 508 -623
7323 -623 -72 360 44 613 -676 -647 865 672 -848 -763 706 346 -13 -393 -115 252 874 -650 -1203
7342 -1203 566 1120 -290 -838 258 331 375 -56 -788 139 912 285 -767 166 630 209 68 -159 -194
7361 -194 639 425 -1201 -644 1241 284 -619 -272 298 396 430 -647 -973 1065 868 -1044 -980 573 626
7380 626 -56 -336 -526 115 1433 -430 -1398 376 859 -108 -1084 -471 193 591 166 -1103 -552 1313
7398 1313 466 -1253 -469 448 555 -83 -636 -431 568 481 -1466 -799 1005 1122 -319 -587 -276 178 913
7417 913 -609 -1177 399 1596 -607 -1132 94 611 311 -12 -917 213 1505 147 -1188 -231 911
$$ packed form
7287a339O28J700m58p58l74j5J135L11j439n15J741M01j577j51Q68P9J07p72o86
7306a114J197J227j489r62J258N23k42l21l93J27Q96m47j642J239J374p23j131
7323f23N51M32l16N69j289K9J512j93j520Q5J469l60l59l80K78L67O22j524n53
7342a203J769N54j410n48J096P3M4m31p32R27P73o27j052R33M64m21j41k27l5
7361a94Q33k14j626N57J885r57r03L47N70R8L4j077l26K038j97j912O4J553N3
7380F26o82k80j90O41J318j863r68J774M83r67r76O13O64L98m25j269N51J865
7398A313q47j719P84R17J07o38n53K05R99q7j947O67J804J17j441k68L11M54P35
7417I13j522n68J576J197k203n25J226N17l00l23r05J130J292j358j335R57J142
$$ plain form
7434 911 345 -309 -720 -71 778 393 -1172 -625 1110 710 -1239 -225 108 413 129 -647 -717 741 904
7453 904 -522 -964 711 935 -227 -161 -541 361 1295 42 -994 312 1217 -33 -939 -289 439 907
7471 907 68 -931 -423 1353 312 -1459 -287 984 799 -92 -430 -430 679 1104 -826 -907 875 825 -653
7490 -653 -867 -199 512 399 -443 -966 375 1140 -186 -1236 152 603 -36 -204 -805 -302 1140 100
7508 100 -1387 -40 1275 79 -845 -296 17 604 544 -776 -824 811 601 -986 -715 512 613 309
7526 309 -505 -1261 158 805 -721 -1040 377 849 -213 -393 -361 195 596 321 -981 -187 895 -130
7544 -130 -749 180 461 282 14 -662 -87 710 635 -857 -316 689 231 -371 -202 -154 626 685 -186 -512
7564 -512 453 585 -458 -311 149 337 361 -187 -695 237 700 -362 -635 477 419 -102 -201 -212 -188 483 77
$$ packed form
7434I11n66o54m11O49Q49l85j565N47J735m00j949J014L33L05k84p76p0J458J63
7453I04j426m42J675K24j162O6l80R02R34j253j036J306R05j250r06O50P28M68
7471I07q39r99N08J776j041j771J172J271j85q91l38%J109M25j930q1J782n0j478
7490f53k14O68P11j13q42n23J341P65j326j050J388M51o39j68o01N03J442j040
7508A00j487J347J315j196r24N49L13N87o0j320m8J635k10j587K71J227J01l04
7526C09q14p56J419O47j526l19J417M72j062j80L2N56M01k75j302P94J082j025
7544a30o19R29K81j79k68o76N75P97p5j492N41J005m58o02J69M8P80N9q71l26
7564e12R65J32j043J47M60J88K4n48n08R32M63j062k73J112n8n21r9j1K4O71m06
$$ plain form
7585 77 -968 -227 767 -178 -929 172 405 -94 198 -801 -547 1178 821 -931 -349 827 400 -471 -140
7604 -140 -253 496 225 -773 -876 649 594 -530 -583 463 671 609 -232 -1204 310 1182 193 -1179 58
7623 58 952 -284 -787 -687 -86 717 105 -1105 -218 1092 59 -747 -376 491 575 296 -997 -1119 663
7642 663 714 -1055 -842 449 571 -343 -689 -605 459 1006 -199 -1150 312 965 -95 -793 -83 317 617
7661 617 43 -1316 -309 1461 490 -1342 -349 825 476 -30 -536 -541 698 976 -691 -803 657 599
7679 599 -237 -690 -166 359 965 -221 -1185 431 893 -284 -992 26 197 463 95 -579 55 1243
7697 1243 336 -850 -54 737 64 12 -214 -274 300 681 -1020 -687 1237 673 -516 85 -105 76 421
7716 421 -166 -637 371 929 -241 -830 -1 184 40 31 -166 -155 875 208 -1006 53 615 -223 0
$$ packed form
7585G7j045P41R94r45p51J101K33m99K92r99K54J725l57j752N82J176m27q71L31
7604a40j13P49k71r98j03J525n5j124n3J046K08o2q41r72J514Q72r89j372J237
7623E8Q94j236n03J00O01Q03o12j210Q87J310j033q06L71Q67Q4k79j293j22J782
7642F63N1j769K13J291J22r14l46Q4J064N47j205r51J462O53j060o98P10M00L00
7661F17n74j359J007J770r71j832R93J174l49n06n06nJ239K78j667j12J460n8
7679E99q36m53N24N25O06j186r64J616M62j177p08J018J71K66l68o74O34J188
7697A243r07j186P96P91o73n2k26o0N74L81j701L33J924n64j189O01j90J81L45
7716D21n87m71J008N58j170n89Q29J85j44rj97J1J030o67j214J059N62q38K23
$$ plain form
7735 0 187 100 -68 -27 -18 -221 821 166 -510 -187 600 -119 -171 -203 -219 123 373 -730 -449 722 397 -809
7757 -809 -13 216 -397 5 -213 -535 415 533 -722 -503 265 197 -513 154 -233 436 397 -286 -989 320
7777 320 927 -259 -570 124 42 428 -52 -889 -61 1183 228 -1244 -169 740 33 -409 -368 -170 609
7796 609 601 -1013 -1002 859 649 -423 -285 -104 344 580 -640 -926 550 1410 -406 -1003 23 780 289
7815 289 -264 -714 186 1083 67 -1098 -301 832 365 -583 95 -136 688 486 -644 -757 897 950 -478
7834 -478 -463 244 307 80 -238 -626 553 1113 -188 -1040 306 711 80 125 -227 172 837 347 -1005 -264
7854 -264 1004 159 -372 -230 83 449 128 -396 -434 684 415 -734 -546 327 188 189 -363 -424 163 402
7874 402 -568 -899 300 723 -312 -477 -5 -185 86 46 -720 -295 568 186 -727 126 247 -297 63 -492
$$ packed form
7735@J87q7j68M1Rk03J042o55o76L23P87p19n2l2j6L42K50j103K81J171l25j206
7757h09P96K29o13M02k18l22R50J18j255K19P68o8p10O67l87O69l9o83p03J309
7777C20O07j186l11O94q2L86m80q37Q28J244r55j472J075R09p07m42M1J98P79
7796F09qj614J1J861k10j072J38J81M48K36j220k86J476Q60j816n97J026P57m91
7815B89n53m50R00Q97j016j165P97J133m67r48O78k31Q24k02j130j13J654N3j428
7834d78J5P07O3k27l18l88J179N60j301q52J346M05o31M5l52L99O65m90j352P41
7854b64J268q45n31J42L13L66l21n24l8J118k69j149J88Q73j39Jn52o1N87K39
7874D02r70l31J199M23j035j65M72j80K71m0p66M25Q63l82r13Q53J21n44L60n55
$$ plain form
7894 -492 -198 89 553 -853 -298 911 304 -539 -45 70 -116 496 -512 -55 464 395 -710 -320 560
7913 560 84 -67 147 -180 239 531 -462 -540 627 734 -270 -323 -50 -173 435 63 -557 152 894 -84
7933 -84 -887 306 520 291 159 -515 -1 419 187 -811 -65 540 502 -377 -80 135 108 565 -340 -444 654
7954 654 470 -766 -403 462 346 65 -167 -409 330 397 -181 -678 338 1005 -269 -150 110 -90 384
7973 384 126 -703 171 1093 212 -709 -2 182 410 154 -293 -318 399 424 -821 -590 408 703 -222 -199 -399
7994 -399 -114 542 -295 -604 450 640 -638 -818 -69 533 -113 181 -599 -21 600 -491 -734 46 502
8013 502 -37 -70 -3 -23 536 377 -526 -565 550 66 -665 66 251 120 265 -131 -293 496 543 -720 -461
8034 -461 45 529 -161 -132 -273 24 628 -114 -884 269 805 -279 -622 -216 388 236 10 -846 -594 667
$$ packed form
7894d92K94K87M64j406N55J209o07q43M94J15j86O12j008M57N19o9j105L90Q80
7913E60m76j51K14l27M19K92r93p8J167J07j004n3K73j23O08l72o20P09P42r78
7933h4q03J193K14k29j32o74N14M20k32r98P46O05l8q79K97K15k7M57r05j04J098
7954F54j84j236L63Q65j16k81k32k42P39O7n78m97J016O67j274J19K60k00M74
7973C84k58q29Q74R22q81r21P07J84K28k56m47k5P17K5j245K31R98K95r25K3k00
7994c99K85O56q37l09J054J90j278j80P49O02o46K94p80N78O21j091k43P80M56
8013E02n39l3O7k0N59j59r03l9J115m84p31P31J85j31J45l96j62P89M7j263K59
8034d61N06M84o90K9j41K97O04p42p70J153N36j084l43M06O04j52k26q56K52J261
$$ plain form
8054 667 7 -605 121 521 249 -19 -445 -266 499 689 -486 -444 568 543 -333 -268 23 200 434 104
8074 104 -493 264 700 -503 -608 289 337 125 119 -244 -199 950 -6 -753 80 418 78 -515 -25 -164 556
8095 556 308 -353 -464 318 331 -181 -226 127 209 -192 -217 -464 -54 609 -215 -587 252 295 17 -108 2 -28
8117 -28 546 14 -14 -24 338 -266 -305 241 51 206 117 -92 -646 139 228 -299 -77 442 -136 -82 -206 -251 -110
8140 -110 383 -309 -413 506 238 -526 -62 260 -95 160 10 -452 -92 455 -228 -644 319 317 -410 -31 -234
8161 -234 162 359 -218 -523 19 665 -324 -420 188 353 -62 166 -333 -159 470 307 -806 -23 743 18
8181 18 -364 124 -147 336 415 -310 -402 474 703 -598
$$ packed form
8054F67o60o12P26M00k72k68m26J79P65J90j175M2J012k5q76O5K91J77K34l30
8074A04n97P57M36j203j05Q97M8k12ol63M5J149r56p47Q33L38l40n93M90j39P20
8095E56k48o61j11P82J3n12m5L53Q2m01k5k47M10O63q24l72Q39M3k78j25J10l0
8117b8N74n32k8j0L62o04l9N46j90J55q9k09n54P85Q9n27K22N19n78N4j24m5J41
8140a10M93o92j04R19k68p64M64L22l55K55j50m62L60N47o83m16R63kp27L79k03
8161b34L96J97n77l05N42O46r89r6O08J65m15K28m99J74O29j63j113P83P66p25
8181A8l82M88k71M83P9p25r2Q76K29j301
8191e98
$$ Imaginary data points
##PAGE= N=2
##DATA TABLE= (X++(I..I)), XYDATA
$$ plain form
0 0 0 0 0 -8 8 -8 16 -24 32 -32 48 -56 72 -87 112 -128 154 -184 221 -256 303 -351 408 -468 539 -619
26 -619 705 -800 907 -1026 1154 -1297 1454 -1627 1813 -2022 2246 -2497 2768 -3071 3400 -3762
42 -3762 4167 -4614 5110 -5672 6304 -7024 7850 -8812 9953 -11319 13002 -15133 17922
55 17922 -21758 27399 -36528 53833 -98412 454528 967823 226536 180714 363304 451348
66 451348 202695 159533 394422 704292 513861 54416 -117198 149294 291172 152874
76 152874 -23756 79631 319999 317608 -63653 -257975 9338 240425 32664 -197973
86 -197973 -99279 139137 156490 -81079 -271924 -130183 70130 -52294 -261309 -140339
96 -140339 115717 127153 -82657 -254813 -218607 -37069 15299 -80725 -18758 200908 213875
$$ packed form
0@%%%qJ6j6K4m0N6o4Q0j04J28j59J99k40K82l38M05m77N59o54P59q76J007j158
26f19J324j505J707j933K180k451K751l081L440l835M268m743N265n839O471p162
42c762P929q781R724j0782J1976j3328J4874j6662J8765k1272K4321k8135L3055
55A7922l9680M9157o3927R0361j52245N52940N13295p41287m5822J82590Q8044
66D51348k48653m3162K34889L09870j90431m59445j71614K66492J41878j38298
76A52874j76630J03387K40368k391l81261j94322K67313K31087k07761k30637
86a97973R8694K38416J7353k37569j90845J41741K00313j22424k09015J20970
96a40339K56056J1436k09810j72156L6206J81538N2368r6024O1967K19666J2967
$$ plain form
107 213875 -27490 -213531 -164238 30341 143328 82785 82305 244486 233932 -47971 -182828
118 -182828 -15503 150544 177312 163588 156979 169609 147584 10249 -90152 20147 172231
129 172231 167735 98881 83269 111780 128246 47395 -58603 15491 163943 110212 -13098
140 -13098 53317 157181 95440 -25843 -71923 -25543 65565 73303 14078 72583 175137 77421
152 77421 -118921 -156074 -58028 38111 75097 47256 44250 94537 12873 -204614 -250311 -61704
164 -61704 83828 70854 7843 -14319 8660 -46850 -228397 -273012 -41204 125686 15227
175 15227 -104678 -60290 -8918 -58171 -152897 -172505 -28803 119080 42698 -113101 -78145
186 -78145 50950 45997 -72340 -132716 -20238 157641 134905 -44675 -24337 168821 150709
$$ packed form
107B13875k41365j86041M9293J94579J12987o0543m80J62181j0554k81903j34857
118a82828J67325J66047K6768j3724o609J2630k2025j37335j00401J10299J52084
129A72231m496o8854j5612K8511J6466q0851j05998P4094J48452n3731j23310
140a3098O6415J03864o1741j21283m6080M6380R1108P738n9225N8505J02554r7716
152G7421j96342l7153R8046R6139L6986k7841l006N0287q1664k17487m5697J88607
164f1704J45532j2974o3011k2162K2979n5510j81547m4615K31808J66890j10459
175A5227j19905M4388N1372m9253r4726j9608J43702J47883p6382j55799L4956
186g8145J29095m953j18337o0376J12478J77879k2736j79580K0338J93158j8112
$$ plain form
197 150709 -64777 -119952 47182 210481 204358 68325 21253 132890 137126 -64050 -140652
208 -140652 63460 268579 248703 79685 -32353 23492 78172 -62554 -178216 9282
218 9282 248764 185199 -51152 -147925 -62814 17970 -64035 -183327 -70338 149053 91670
229 91670 -165677 -228533 -83479 -6544 -84635 -186135 -143421 28448 60142 -135559 -235546
240 -235546 -84128 30418 -68960 -196935 -149945 33641 110521 -56939 -209463 -94401
250 -94401 44337 -61100 -183194 -68518 127056 160725 8395 -156000 -131377 7308
260 7308 -1539 -104088 -27869 161026 175540 -5761 -168161 -146373 12224 70544 -31465
271 -31465 -30720 134792 155617 -47862 -182067 -104130 37366 72963 -15379 -59691 52901
$$ packed form
197A50709k15486n5175J67134J63299o123j36033m7072J11637M236k01176p6602
208a40652K04112K05119j9876j69018j12038N5845N4680j40726j15662J87498
218I282K39482o3565k36351r6773Q5111Q0784q2005j19292J12989K19391n7383
229I1670k57347o2856J45054P6935p8091j01500M2714J71869L1694j95701r9987
240b35546J51418J14546r9378j27975M6990J83586P6880j67460j52524J15062
250i4401J38738j05437j22094J14676J95574L3669j52330j64395K4623J38685
260G308q847j02549P6219J88895J4514j81301j62400K1788J58597N8320j02009
271c1465P45J65512K0825k03479j34205P7937J41496L5597q8342m4312J12592
$$ plain form
282 52901 116539 -29516 -152270 -59863 66915 54757 -30976 -63385 15223 101441 19705
293 19705 -129708 -91626 51798 47707 -48476 -40175 62475 115906 22559 -132530 -128748 23971
305 23971 59615 -32117 -12053 98510 88864 -43786 -154247 -139212 -3428 88428 28806
316 28806 -16330 56698 62996 -79412 -181576 -124446 14384 88545 19657 -64676 -9829 44236
328 44236 -72052 -175448 -82351 54020 58690 -24266 -77815 -36129 30430 -24855 -132884
339 -132884 -85441 47834 51700 -37126 -58990 -538 55430 16595 -99204 -104209 40846 99915
351 99915 2217 -35757 44566 74501 -9358 -106376 -87192 62177 153869 68533 -10725 45991
363 45991 66321 -39865 -111403 -47446 80965 153254 86672 -29873 -23330 37588 -20839 -101922
$$ packed form
282E2901O3638j46055j22754R2407J26778j2158q5733l2409P8608Q6218q1736
293A9705j49413L8082J43424m091r6183Q301J02650N3431r3347j55089L782J52719
305B3971L5644r1732K0064J10563r646j32650j10461J5035J35784R1856n9622
316B8806m5136P3028O298j42408j02164N7130J38830P4161o8888q4333N4847N4065
328D4236j16288j03396R3097J36371M670q2956n3549M1686O6559n5285j08029
339a32884M7443J33275L866q8826k1864N8452N5968l8835j15799n005J45055N9069
351I9915r7698l7974Q0323K9935q3859r7018J9184J49369R1692q5336p9258N6716
363D5991K0330j06186p1538O3957J28411P2289o6582j16545O543O0918n8427q1083
$$ plain form
375 -101922 -34950 93970 120683 27584 -79039 -70054 16285 -7492 -112055 -74587 60728
386 60728 62060 -52082 -104512 -58016 2971 -15637 -108911 -115273 6356 49197 -55711 -114273
$$ packed form
375a01922O6972J28920K6713r3099j06623Q985Q6339k3777j04563L7468J35315
386F0728J332j14142n2430M6496O0987j8608r3274o362J21629M2841j04908n8562
$$ [...]
8191b98
##END NTUPLES=NMR FID
##END=
