##TITLE=1H_CG-1124-10
 CDCl3, 8 sc, 
 18.11.2019
##JCAMPDX= 6.0         $$ Bruker NMR JCAMP-DX V2.0
##DATA TYPE= NMR FID
##DATA CLASS= NTUPLES
##ORIGIN= UXNMR, Bruker Analytische Messtechnik GmbH
##OWNER= root
$$ XWIN-NMR		Version 3.5
$$ Mon Nov 18 13:54:00 2019 Russian Standard Time (UT+4h)  she@DPX200
##.OBSERVE FREQUENCY= 200.1315
##.OBSERVE NUCLEUS= ^1H
##.DELAY= (6, 6)
##.ACQUISITION MODE= SIMULTANEOUS
##.ACQUISITION SCHEME= undefined
##.AVERAGES= 8
##.DIGITISER RES= 18
##SPECTROMETER/DATA SYSTEM= spect
##.PULSE SEQUENCE= zg30
##.SOLVENT NAME= CDCl3
##.SHIFT REFERENCE= (INTERNAL, CDCl3, 0, 15.7039)
##AUDIT TRAIL= $$ (NUMBER, WHEN, WHO, WHERE, WHAT)
$$ ##TITLE= Audit trail, XWIN-NMR		Version 3.5
$$ ##JCAMPDX= 5.01
$$ ##ORIGIN= Bruker BioSpin GmbH
$$ ##OWNER= she
$$ F:/spectra/data/she/nmr/H-F/1/audita.txt
$$ ##AUDIT TRAIL=  $$ (NUMBER, WHEN, WHO, WHERE, WHAT)
(   1,<2019-11-18 13:52:34.28 +0400>,<she>,<DPX200>,
      <created by zg, POWCHK disabled, PULCHK disabled
       configuration hash MD5:
       00 E9 B6 7A A2 85 ED C7 34 08 36 98 17 FE 4E 26
       data hash MD5: 16K
       32 F6 2F 03 C3 7F 5F CB D5 2B FA DE 0A B9 38 BC>)
$$ ##END=
$$ 
$$ hash MD5
$$ EE A2 05 6F 0F 2C E5 58 9E A0 47 4E 91 D4 5A F4
##$RELAX= 
##$RELAX= 
##$RELAX= 
##$RELAX= 
##$RELAX= 
##$RELAX= 
$$ Bruker specific parameters
$$ --------------------------
##$DU= <F:/spectra>
##$EXPNO= 1
##$NAME= <H-F>
##$PROCNO= 1
##$TYPE= <nmr>
##$USER= <she>
##$AMP= (0..31)
100 100 100 100 100 100 100 100 100 100 100 100 100 100 100 100 100 100 
100 100 100 100 100 100 100 100 100 100 100 100 100 100 
##$AQSEQ= 0
##$AQ_mod= 1
##$AUNM= <au_zg>
##$AUTOPOS= <>
##$BF1= 200.13
##$BF2= 200.13
##$BF3= 200.13
##$BF4= 200.13
##$BF5= 200.13
##$BF6= 200.13
##$BF7= 200.13
##$BF8= 200.13
##$BYTORDA= 1
##$CFDGTYP= 0
##$CFRGTYP= 5
##$CHEMSTR= <none>
##$CNST= (0..31)
1 1 145 1 1 1 1 1 1 1 1 1 1 1 1 1 1 1 1 1 1 1 1 1 1 1 1 1 1 1 1 1 
##$CPDPRG= <>
##$CPDPRG1= <>
##$CPDPRG2= <>
##$CPDPRG3= <>
##$CPDPRG4= <mlev>
##$CPDPRG5= <mlev>
##$CPDPRG6= <mlev>
##$CPDPRG7= <mlev>
##$CPDPRG8= <mlev>
##$CPDPRGB= <>
##$CPDPRGT= <>
##$D= (0..31)
0 1.2 0 0 0 0 0 0 0 0.06 0 0.03 0 0 0 0 0.0002 0 0 0 0 0 0 0 0 0 0 0 0 
0 0 0 
##$DATE= 1574070753
##$DBL= (0..7)
120 120 120 120 120 120 120 120 
##$DBP= (0..7)
150 150 150 150 150 150 150 150 
##$DBP07= 0
##$DBPNAM0= <>
##$DBPNAM1= <>
##$DBPNAM2= <>
##$DBPNAM3= <>
##$DBPNAM4= <>
##$DBPNAM5= <>
##$DBPNAM6= <>
##$DBPNAM7= <>
##$DBPOAL= (0..7)
0.5 0.5 0.5 0.5 0.5 0.5 0.5 0.5 
##$DBPOFFS= (0..7)
0 0 0 0 0 0 0 0 
##$DE= 6
##$DECBNUC= <off>
##$DECIM= 24
##$DECNUC= <off>
##$DECSTAT= 4
##$DIGMOD= 1
##$DIGTYP= 9
##$DL= (0..7)
0 120 120 120 120 120 120 120 
##$DP= (0..7)
150 150 150 150 150 150 150 150 
##$DP07= 0
##$DPNAME0= <>
##$DPNAME1= <>
##$DPNAME2= <>
##$DPNAME3= <>
##$DPNAME4= <>
##$DPNAME5= <>
##$DPNAME6= <>
##$DPNAME7= <>
##$DPOAL= (0..7)
0.5 0.5 0.5 0.5 0.5 0.5 0.5 0.5 
##$DPOFFS= (0..7)
0 0 0 0 0 0 0 0 
##$DQDMODE= 0
##$DR= 18
##$DS= 0
##$DSLIST= <SSSSSSSSSSSSSSS>
$$ [...]
##$SUBNAM2= <"">
##$SUBNAM3= <"">
##$SUBNAM4= <"">
##$SUBNAM5= <"">
##$SUBNAM6= <"">
##$SUBNAM7= <"">
##$SUBNAM8= <"">
##$SUBNAM9= <"">
##$SW= 24.0689530833862
##$SWIBOX= (0..15)
0 0 2 0 0 0 0 0 0 0 0 0 0 0 0 0 
##$SW_h= 4816.95568400771
##$TD= 16384
##$TD0= 1
##$TE= 0
##$TE2= 300
##$TE3= 300
##$TEG= 300
##$TL= (0..7)
0 120 120 120 120 120 120 120 
##$TP= (0..7)
150 150 150 150 150 150 150 150 
##$TP07= 0
##$TPNAME0= <>
##$TPNAME1= <>
##$TPNAME2= <>
##$TPNAME3= <>
##$TPNAME4= <>
##$TPNAME5= <>
##$TPNAME6= <>
##$TPNAME7= <>
##$TPOAL= (0..7)
0.5 0.5 0.5 0.5 0.5 0.5 0.5 0.5 
##$TPOFFS= (0..7)
0 0 0 0 0 0 0 0 
##$TUNHIN= 0
##$TUNHOUT= 0
##$TUNXOUT= 0
##$USERA1= <user>
##$USERA2= <user>
##$USERA3= <user>
##$USERA4= <user>
##$USERA5= <user>
##$V9= 5
##$VALIST= <valist>
##$VCLIST= <CCCCCCCCCCCCCCC>
##$VD= 0
##$VDLIST= <DDDDDDDDDDDDDDD>
##$VPLIST= <PPPPPPPPPPPPPPP>
##$VTLIST= <TTTTTTTTTTTTTTT>
##$WBST= 1024
##$WBSW= 4
##$XGAIN= (0..3)
0 0 0 0 
##$XL= 0
##$YL= 0
##$YMAX_a= 475139
##$YMIN_a= -108752
##$ZGOPTNS= <>
##$ZL1= 120
##$ZL2= 120
##$ZL3= 120
##$ZL4= 120
##$ABSF1= 10
##$ABSF2= 0
##$ABSG= 5
##$ABSL= 3
##$ALPHA= 0
##$AQORDER= 0
##$ASSFAC= 0
##$ASSFACI= 0
##$ASSFACX= 0
##$ASSWID= 0
##$AUNMP= <proc_1d>
##$AZFE= 0.1
##$AZFW= 0.1
##$BCFW= 1
##$BC_mod= 2
##$BYTORDP= 1
##$COROFFS= 0
##$CY= 11.3945322036743
##$DATMOD= 1
##$DC= 2
##$DFILT= <>
##$DTYPP= 0
##$F1P= 16.9975609425685
##$F2P= -3.02152046262296
##$FCOR= 0.5
##$FTSIZE= 0
##$FT_mod= 4
##$GAMMA= 1
##$GB= 0.15
##$INTBC= 1
##$INTSCL= 1
##$ISEN= 128
##$LB= 0.24
##$LEV0= 0
##$LPBIN= 0
##$MAXI= 10000
##$MC2= 0
##$MEAN= 0
##$ME_mod= 0
##$MI= 1.114404
##$NCOEF= 0
##$NC_proc= 0
##$NLEV= 6
##$NOISF1= 3.799351
##$NOISF2= 2.8
##$NSP= 1
##$NTH_PI= 0
##$NZP= 0
##$OFFSET= 15.70392
##$PC= 1
##$PHC0= -9439.912
##$PHC1= 28.60087
##$PH_mod= 1
##$PKNL= yes
##$PPARMOD= 0
##$PSCAL= 0
##$PSIGN= 0
##$REVERSE= no
##$SF= 200.130013532006
##$SI= 16384
##$SIGF1= 3
##$SIGF2= 2
##$SINO= 400
##$SIOLD= 16384
##$SREGLST= <1H.CDCl3>
##$SSB= 0
##$STSI= 0
##$STSR= 0
##$SW_p= 3612.71676300578
##$SYMM= 0
##$S_DEV= 0
##$TDeff= 0
##$TDoff= 0
##$TI= <>
##$TILT= no
##$TM1= 0
##$TM2= 0
##$TOPLEV= 0
##$USERP1= <user>
##$USERP2= <user>
##$USERP3= <user>
##$USERP4= <user>
##$USERP5= <user>
##$WDW= 1
##$XDIM= 8192
##$YMAX_p= 0
##$YMIN_p= 0
$$ End of Bruker specific parameters
$$ ---------------------------------
##NTUPLES= NMR FID
##VAR_NAME=  TIME,          FID/REAL,        FID/IMAG
##SYMBOL=    X,             R,               I
##VAR_TYPE=  INDEPENDENT,   DEPENDENT,       DEPENDENT
##VAR_FORM=  AFFN,          ASDF,            ASDF
##VAR_DIM=   8192,          8192,            8192
##UNITS=     SECONDS,       ARBITRARY UNITS, ARBITRARY UNITS
##FACTOR=    0.0002076,     1,               1
##FIRST=     0,             0,               0
##LAST=      1.7004516,     0,               0
##MIN=       0,             -108752,         0
##MAX=       1.7004516,     475139,          0
$$ Real data points
##PAGE= N=1
##DATA TABLE= (X++(R..R)), XYDATA
$$ plain form
0 0 0 0 0 0 0 0 -1 8 -8 8 -16 16 -23 24 -32 39 -46 54 -65 75 -88 103 -120 137 -159 182 -208 237 -269 303
30 303 -341 385 -431 484 -540 602 -670 746 -827 915 -1014 1124 -1244 1378 -1525 1691 -1879
47 -1879 2091 -2334 2616 -2947 3341 -3824 4429 -5208 6261 -7773 10138 -14400 24539 -101043
61 -101043 -10707 117932 -78561 -108752 -40254 43502 34893 -46186 -106277 4500 60665 -36353
73 -36353 -95256 -32846 -17309 -23282 -26027 -45869 -2371 99142 52854 -32133 63955 167594
85 167594 75340 -20299 9202 71857 97329 34715 -86566 -54968 96280 79489 -60579
96 -60579 -59600 27317 60531 63454 19146 -34567 34026 107198 18646 -57950 3940 32781 -20400
109 -20400 -46917 -49016 -28327 10003 -36809 -97057 -3635 79443 -19770 -88984 -2979 56847
$$ packed form
0@%%%%%%jRj6J6k4L2l9M7n6P1q5J00j19J40j63J91k23K57k96L41l90M45n06N72
30C03o44P26q16R15j024J142j272J416j573J742j929K138k368K622k903L216l570
47a879L970m425M950n563O288p165Q253r637J1469j4034J7911k4538L8939j25582
61a01043R0336J28639j96493l0191O8498Q3756q609q1079o0091J10777N6165r7018
73c6353n8903O2410J5537n973k745j9842M3498J01513m6288q4987R6088J03639
85A67594r2254r5639K9501O2655K5472o2614j21281L1598J51248j6791j40068
96f0579R79Q6917L3214K923m4308n3713O8593P3172q8552p6596O1890K8841n3181
109b0400k6517k099K0689L8330m6812o0248R3422Q3078r9213o9214Q6005N9826
$$ plain form
121 56847 31234 -10707 -64592 -46736 58031 45043 -83778 -88933 10165 32488 -1482 -34591
133 -34591 -47263 23977 85251 1138 -56191 39907 78920 -4328 -20778 25619 27885 17971
145 17971 -5069 -37859 15315 73604 -4646 -62984 23342 82228 40452 2871 -16422 4307
157 4307 86256 75043 -47583 -45597 69272 67053 -17000 -32435 -2284 37125 55057 -8443
169 -8443 -44836 41860 76795 -10008 -25738 38326 37642 8131 207 -18910 7135 58153 -757
182 -757 -74541 -4644 67260 14347 -39933 -29418 6927 54953 34171 -59016 -41452 69685
194 69685 50750 -46458 -33598 23928 28273 17519 -14477 -35984 29113 68607 -7862 -34704
206 -34704 42988 62894 18971 6245 9048 38322 83553 34512 -37722 30574 111089 45467
$$ packed form
121E6847k5613m1941n3885J7856J04767j2988j28821n155R9098K2323l3970l3109
133c4591j2672P1240O1274q4113n7329R6098L9013q3248j6450M6397K266r914
145A7971k3040l2790N3174N8289p8250n8338Q6326N8886m1776l7581j9293K0729
157D307Q1949j1213j22626J986J14869k219q4053j5435L0151L9409J7932o3500
169h443l6393Q6696L4935q6803j5730O4064o84k9511p924j9117K6045N1018n8910
182g57p3784O9897P1904n2913n4280J0515L6345M8026k0782r3187J7564J11137
194F9685j8935r7208J2860N7526M345j0754l1996k1507O5097L9494p6469k6842
206c4704P7692J9906m3923j2726K803K9274M5231m9041p2234O8296Q0515o5622
$$ plain form
218 45467 -18935 23371 66483 72509 52357 1733 17200 101775 82861 -8234 12385 81236
230 81236 69182 36112 21290 12472 57917 87640 9782 -28366 58241 88595 16837 -7508
242 -7508 23796 47726 61146 21707 -32592 20188 88174 24968 -37127 13232 50666 26100
254 26100 9198 -8120 -1700 54478 43186 -36957 -18359 60962 41802 -16485 -15589 7711 38164
267 38164 44892 -24109 -50836 39687 70038 -19483 -46643 12823 35996 23352 -4041 -38303
279 -38303 -2181 59218 12640 -50998 -3773 41828 8574 -13382 -9764 -3137 30030 22810 -42741
292 -42741 -22882 59159 32310 -42622 -21733 29948 35465 16255 -27608 -34104 45622 68936
304 68936 -23530 -50999 25027 48901 13575 -7537 -20805 4299 56230 22207 -44052 -3318
$$ packed form
218D5467o4402M2306M3112O026k0152n0624J5467Q4575j8914r1095K0619O8851
230H1236j2054l3070j4822q818M5445K9723p7858l8148Q6607L0354p1758k4345
242g508L1304K3930J3420l9439n4299N2780O7986o3206o2095N0359L7434k4566
254B6100j6902j7318O420N6178j1292q0143J8598P9321j9160n8287Q96K3300L0453
267C8164O728o9001k6727R0523L0351q9521k7160N9466K3173j2644k7393l4262
279c8303L6122O1399m6578o3638M7225M5601l3254k1956L618O627L3167p220o5551
292d2741J9859Q2041k6849p4932K0889N1681N517j9210m3863o496P9726K3314
304F8936r2466k7469P6026K3874l5326k1112j3268K5104N1931l4023o6259M0734
$$ plain form
316 -3318 51417 12423 -19877 2402 15319 21453 12713 -28147 -10188 56522 24373 -52267 -16951
329 -16951 49205 31419 -9371 -26935 -17018 41315 57794 -25890 -55544 27555 60177 6865
341 6865 -21064 -13252 12626 48510 20834 -39009 -3139 56170 14579 -26390 11116 30437
353 30437 11374 1576 -8829 5137 47549 17741 -50047 -10482 60154 27268 -29459 -27402
365 -27402 -369 36755 39746 -35245 -63080 25330 61089 -13164 -47642 -12526 14400 23804
377 23804 -2478 -46467 -16418 38669 220 -44304 -1944 20962 -13323 -21224 -9857 -3842
389 -3842 17659 182 -52424 -20021 49398 13472 -53830 -36219 9584 26054 11480 -45189
401 -45189 -59930 21496 50913 -33048 -65667 -8735 16578 54 -19998 -44043 -25141 18969
$$ packed form
316c318N4735l8994l2300K2279J2917O134q740m0860J7959O6710l2149p6640L5316
329a6951O6156j7786m0790j7564R917N8333J6479q3684k9654Q3099L2622n3312
341F865k7929P812K5878L5884k7676n9843L5870N9309m1591m0969L7506J9321
353C0437j9063r798j0405J3966M2412k9808o7788L9565P0636l2886n6727K057
365b7402K7033L7124K991p4991k7835Q8410L5759p4253l4478L5116K6926R404
377B3804k6282m3989L0049N5087l8449m4524M2360K2906l4285p901J1367O015
389c842K1501j7477n2606L2403O9419l5926o7302J7611M5803J6470j4574n6669
401d5189j4741Q1426K9417q3961l2619N6932K5313j6524k0052k4045J8902M4110
$$ plain form
413 18969 -9456 -55242 -18269 11879 -27411 -41830 -16458 -10343 -8435 -21610 -57973 -30934
425 -30934 32837 -3290 -77029 -46933 16082 12353 -23134 -55045 -50682 15127 34720 -43963
437 -43963 -72366 -3620 22111 -13781 -31065 -33254 -17698 16204 -4019 -49239 -16939 23365
449 23365 -17094 -41528 -3691 10118 -6201 -18249 -33834 -10455 38450 3643 -64267 -26278
461 -26278 42733 20511 -27747 -34147 -15360 26846 37048 -28952 -53185 17697 44959 -6441
473 -6441 -26430 -7408 6897 22290 5873 -31101 -2878 39152 -2142 -35756 8733 28810
485 28810 -4376 -18121 -12804 3282 30238 3575 -52853 -21695 43814 15747 -40835 -34273
497 -34273 -4597 16681 13125 -38152 -56989 9420 33194 -30507 -51684 -10811 3458 -7847
$$ packed form
413A8969k8425m5786L6973L0148l9290j4419K5372O115J908j3175l6363K7039
425c0934O3771l6127p3739L0096O3015l729l5487l1911M363O5809J9593p8683
437d3963k8403O8746K5731l5892j7284k189J5556L3902k0223m5220L2300M0304
449B3365m0459k4434L7837J3809j6319j2048j5585K3379M8905l4807o7910L7989
461b6278O9011k2222m8258o400J8787M2206J0202o6000k4233P0882K7262n1400
473f441j9989J9022J4305J5393j6417l6974K8223M2030m1294l3614M4489K0077
485B8810l3186j3745N317J6086K6956k6663n6428L1158O5509k8067n6582O562
497c4273K9676K1278l556n1277j8837O6409K3774o3701k1177M0873J4269j1305
$$ plain form
509 -7847 -22487 -39810 -16600 16892 -20345 -56081 -8945 18929 -23332 -41723 -20631 -5484
521 -5484 6816 -10825 -53470 -28800 34218 7790 -53810 -36308 8174 12692 -4815 -35908
533 -35908 -41062 14410 31821 -32693 -50491 5588 17532 -13507 -22712 -20709 -5335 17664 -11649
546 -11649 -47236 -5125 30068 -13771 -40050 -9528 8242 4864 -9616 -38308 -20174 32957
558 32957 10468 -49769 -27083 23808 12573 -17080 -26841 -20270 15812 25477 -29382 -42658 17163
571 17163 27526 -19883 -27138 -4208 8187 14300 -9963 -38468 892 39735 -6359 -42588
583 -42588 -3200 23986 7126 -10137 -22232 -7427 31580 15156 -38370 -17274 36014 18215
595 18215 -18381 -12430 4234 21165 23138 -15875 -23931 31370 40142 -15083 -20514 21278 29966
$$ packed form
509g847j4640j7323K3210L3492l7237l5736M7136K7874m2261j8391K1092J5147
521e484J2300j7641m2645K4670O3018k6428o1600J7502M4482M518j7507l1093
533c5908n154N5472J7411o4514j7798N6079J1944l1039r205K003J5374K2999k9313
546a1649l5587M2111L5193m3839k6279L0522J7770l378j4480k8692J8134N3131
558C2957k2489o0237K2686N0891j1235k9653r761O571L6082R665n4859j3276N9821
571A7163J0363m7409p255K2930J2395O113k4263k8505L9360L8843m6094l6229
583d2588L9388K7186j6860j7263j2095J4805L9007j6424n3526K1096N3288j7799
595A8215l6596N951J6664J6931J973l9013q056N5301Q772n5225n431M1792Q688
$$ plain form
608 29966 15493 -2685 -16319 17313 51633 7932 -32560 10420 43752 15844 -5555 -3321
620 -3321 8097 32456 21545 -23803 -9155 40668 19923 -22053 -6802 16829 14550 7095 -14534
633 -14534 -18251 24280 28213 -29234 -32604 20746 25270 -8909 -23430 -20293 6879 31069 -9096
646 -9096 -49435 -5834 34168 -775 -29769 -14623 393 10514 2983 -28999 -19007 25053 9158
659 9158 -33726 -13076 17780 2961 -12514 -14608 -9311 18195 17822 -32061 -32271 27568 30595 -19063
673 -19063 -30282 -5511 18346 25936 -9532 -41510 1174 43267 3867 -31138 -5004 16127
685 16127 12850 4942 -14580 -9769 26738 18436 -22454 -4710 30364 10574 -12183 -199 11754
698 11754 22567 17205 -19726 -16466 41205 40866 -18774 -24501 17132 32913 22206 -4946 -24705
$$ packed form
608B9966j4473j8178j3634L3632L4320m3701m0492M2980L3332k7908k1399K234
620c321J1418K4359j0911m5348J4648M9823k0745m1976J5251K3631k279p455k1629
633a4534l717M2531L933n7447l370N3350M524l4179j4521L137K7172K4190m0165
646i096m0339M3601M0002l4943k8994J5146J5016J0121p531l1982R992M4060j5895
659I158m2884K0650L0856j4819j5475k094N297K7506l73m9883k10N9839L027m9658
673a9063j1219K4771K3857P590l5468l1978M2684M2093l9400l5005K6134K1131
685A6127l277p908j9522M811L6507q302m0890J7744L5074j9790k2757J1984J1953
698A1754J0813n362l6931L260N7671l39n9640n727M1633J5781j0707k7152j9759
$$ plain form
711 -24705 11647 49275 10516 -28912 2492 30074 15660 2864 -5225 -1934 25477 20820 -16924
724 -16924 -3994 33862 12001 -18230 2966 24408 18097 4374 -15859 -7293 39815 36513 -23366
737 -23366 -25567 26624 37219 10155 -10430 -15417 15557 46477 9530 -31949 2309 38809
749 38809 15738 -6914 -2440 5361 20006 16818 -11986 -3920 29403 8890 -22836 3206 27699
762 27699 7557 -10236 -12967 -3123 27370 22294 -30601 -32099 24163 31203 -9490 -26012 -13875
775 -13875 11331 27847 -6839 -41784 -4658 32846 1085 -26180 -7655 3553 3348 1937 -14707
788 -14707 -11709 15729 2171 -28395 -5211 23451 -57 -21977 -13468 332 18672 12201 -31532
801 -31532 -30603 26292 29840 -21751 -30749 -27 17006 15391 -10996 -32903 961 33865 329
$$ packed form
711b4705L6352L7628l8759l9428L1404K7582j4414j2796q089L291K7411m657l7744
724a6924J2930L7856k1861l0231K1196K1442o311j3723k0233Q566M7108l302n9879
737b3366k201N2191J0595k7064k0585m987L0974L0920l6947m1479L4258L6500
749C8809k3071k2652M474P801J4645l188k8804Q066L3323k0513l1726K6042K4493
762B7699k0142j7793k731R844L0493n076n2895j498N6262P040m0693j6522J2137
775a3875K5206J6516l4686l4945L7126L7504l1761k7265J8525J1208k05j411j6644
788a4707K998K7438j3558l0566K3184K8662k3508k1920Q509J3800J8340o471m3733
801c1532R29N6895L548n1591q998L0722J7033j615k6387k1907L3864L2904l3536
$$ plain form
814 329 -28620 -2810 13944 3272 -764 -6291 -5368 16264 8500 -22129 -1969 32070 7300
827 7300 -22107 -4676 17677 21522 8277 -20167 -13702 34536 33744 -19035 -22091 18712 27717
840 27717 11021 -5579 -15660 9928 37829 6964 -25184 4457 28100 7461 -4387 852
852 852 5336 16662 9091 -17126 -673 33362 8337 -25364 -1559 24275 14014 -1949 -13634
865 -13634 -8011 26827 25667 -21626 -23570 20915 25525 -2283 -13252 -10062 9114 27458 -1156
878 -1156 -30734 2485 29633 -2009 -20120 -317 9062 5581 -2301 -18104 -5349 23481 2181
891 2181 -32225 -8689 20307 3574 -15401 -16944 -9551 13043 12540 -28155 -30756 15738 18462
904 18462 -19474 -25078 -6059 5632 7693 -13413 -31199 -1059 22351 -11530 -31123 -1661
$$ packed form
814C29k8949K5810J6754j0672m036n527R23K1632p764l0629K0160L4039k4770
827G300k9407J7431K2353L845j3245k8444O465M8238p92n2779l056M0803R005
840B7717j6696j6600j0081K5588K7901l0865l2148K9641K3643k0639j1848N239
852H52M484J1326p571k6217J6453L4035k5025l3701K3805K5834j0261j5963j1685
865a3634N623L4838j160m7293j944M4485M610k7808j0969L190J9176J8344k8614
878a156k9578L3219K7148l1642j8111J9803R379l481p882j5803J2755K8830k1300
891B181l4406K3536K8996j6733j8975j543P393K2594n03m0695k601M6494K724
904A8462l7936n604J9019J1691K061k1106j7786L0140K3410l3881j9593K9462
$$ plain form
916 -1661 10911 -3917 -11780 -16140 -7143 16576 1914 -32184 -12512 21672 4436 -20275 -14271
929 -14271 -1019 10463 7480 -21967 -23253 18513 19205 -22387 -21462 8421 10579 -231 -10736
942 -10736 -17335 4933 23522 -8743 -28966 5076 22522 -1701 -13958 -8346 3137 19667
954 19667 6379 -26145 -8122 30114 11240 -20162 -6523 13036 12170 6084 -9587 -9941 21123
967 21123 21846 -16125 -13202 20601 17436 -3970 -6091 -1512 13004 23341 -5322 -24454 12398
980 12398 32656 -1353 -19639 -464 14049 16626 2329 -21094 -5572 29283 11658 -22921
992 -22921 -7165 16445 7942 -1864 -6883 -7382 12412 15115 -16600 -15835 18863 14134 -14832 -12265
1006 -12265 3897 10380 9087 -12765 -24207 10643 28571 -10926 -29935 17 16499 5177
$$ packed form
916a661J2572j4828p863m360Q997K3719j4662l4098J9672L4184j7236k4711O004
929a4271J3252J1482k983k9447j286M1766O92m1592R25K9883K158j0810j0505
942a0736o599K2268J8589l2265k0223L4042J7446k4223j2257N612J1483J6530
954A9667j3288l2524J8023L8236j8874l1402J3639J9559q66o086j5671l54L1064
967B1123P23l7971K923L3803l165k1406k121M579J4516J0337k8663j9132L6852
980A2398K0258l4009j8286J9175J4513K577j4297k3423J5522L4855j7625l4579
992b2921J5756K3610q503r806n019m99J9794K703l1715P65L4698m729k8966K567
1006a2265J6162O483j293k1852j1442L4850J7928l9497j9009K9952J6482j1322
$$ plain form
1018 5177 -8600 -21529 -8352 21489 6749 -28910 -14591 14252 2735 -12722 -10178 -7940
1030 -7940 2554 4913 -18477 -19254 13371 8290 -25991 -18033 8429 6835 -6369 -18319 -19999
1043 -19999 8816 21759 -16944 -35635 1694 20960 -1045 -16961 -17448 -3703 18746 6459
1055 6459 -28305 -14546 19273 6803 -15678 -7197 1553 2825 3498 -10238 -11090 15202 11114 -21549
1069 -21549 -11898 19201 11497 -10245 -12458 -4743 14438 21599 -12125 -28740 10661 30985 442
1082 442 -18055 -6327 8764 20721 8296 -20248 -8134 26708 13662 -14258 -1897 13532
1094 13532 6558 3271 160 -1175 15592 13688 -14257 -6196 26106 16040 -12231 -7944 8263
1107 8263 18234 16669 -10117 -22599 15361 34870 -3174 -23400 879 16589 14314 1453 -17005
$$ packed form
1018E177j3777j2929J3177K9841j4740l5659J4319K8843j1517j5457K544K238
1030g940J0494K359k3390p77L2625n081l4281P958K6462j594j3204j1950j680
1043a9999K8815J2943l8703j8691L7329J9266k2005j5916m87J3745K2449j2287
1055F459l4764J3759L3819j2470k2481Q481Q750J272O73j3736q52K6292m088l2663
1069b1549R651L1099p704k1742k213P715J9181P161l3724j6615L9401K0324l0543
1082D42j8497J1728J5091J1957j2425k8544J2114L4842j3046k7920J2361J5429
1094A3532o974l287l111j335J6767j904k7945Q061L2302j0066k8271M287J6207
1107H263R971j565k6786j2482L7960J9509l8044k0226K4279J5710k275j2861j8458
$$ plain form
1120 -17005 -6296 23764 11252 -19223 -5318 14849 2516 -6134 -1429 -1118 6681 6187 -15632
1133 -15632 -10523 20597 10440 -22029 -14056 10653 12571 1612 -16206 -20853 11138 26400 -12203
1146 -12203 -31078 448 16890 2057 -10317 -16871 -7531 15480 5439 -24263 -11783 13528
1158 13528 -507 -15618 -5567 -522 -352 -1280 -15399 -11799 15324 7103 -26549 -16015 14662
1171 14662 9881 -9357 -16989 -12634 10338 20555 -13787 -30247 4957 22233 -1705 -14929
1183 -14929 -8613 758 14553 5437 -19562 -7487 20236 5510 -16452 -1681 11145 3499 -2043
1196 -2043 -7335 -3247 17167 10580 -20325 -10184 22942 14251 -10895 -10250 420 13511 18052
1209 18052 -8122 -22709 10948 28199 -1570 -15895 1235 11203 12468 4019 -12865 -1715
$$ packed form
1120a7005J0709L0060j2512l0475J3905K0167j2333q650M705L11P799m94k1819
1133a5632N109L1120j0157l2469P973K4709J918j0959j7818m647L1991J5262l8603
1146a2203j8875L1526J6442j4833j2374o554R340K3011j0041k9702J2480K5311
1158A3528j4035j5111J0051N045J70r28j4119L600K7123q221l3652J0534L0677
1171A4662m781j9238p632M355K2972J0217l4342j6460L5204J7276k3938j3224
1183a4929O316R371J3795r116k4999J2075K7723j4726k1962J4771J2826p646n542
1196b043n292M088K0414o587l0905J0141L3126q691k5146O45J0670J3091M541
1209A8052k6174j4587L3657J7251k9769j4325J7130R968J265q449j6884J1150
$$ plain form
1221 -1715 23745 8323 -16679 1584 19785 5549 -4296 -677 3269 15230 11580 -13956 -7718
1234 -7718 24425 17078 -12474 -8605 8755 14086 11603 -6975 -16891 11856 27430 -5238 -20178
1247 -20178 5863 15844 3575 -4269 -8990 19 17616 3592 -21270 -2986 18753 1183 -13827
1260 -13827 -4580 2825 7250 4092 -16391 -13409 17639 12029 -20939 -15358 9248 8565 -2448 -11739
1274 -11739 -14762 5765 16668 -12565 -24688 5032 14237 -7772 -13852 -6812 -381 8887 -2509
1287 -2509 -23829 -6530 18608 -808 -21792 -7622 5922 3162 -3036 -16204 -12402 13988 9833
1300 9833 -21922 -16099 12308 7424 -9029 -9410 -5941 4470 11511 -8891 -19593 8149 17650
1313 17650 -8382 -14309 2356 8796 7761 -2151 -16211 103 24460 3944 -21359 -1885 18427
$$ packed form
1221a715K5460j5422k5002J8263J8201j4236r845L619L946J1961l650k5536O238
1234g718L2143p347k9552L869J7360N331k483j8578r916K8747J5574l2668j4940
1247b0178K6041R981j2269p844m721R009J7597j4024k4862J8284K1739j7570j5010
1260a3827R247P405M425l158k0483K982L1048n610l2968N581K4606o83j1013r291
1274a1739l023K0527J0903k9233j2123K9720R205k2009o080P040O431R268j1396
1287b509k1320J7299K5138j9416k0984J4170J3544k760o198j3168L802K6390m155
1300I833l1755N823K8407m884j6453l81L469J0411P041k0402j0702K7742R501
1313A7650k6032n927J6665O440j035r912j4060J6314K4357k0516k5303J9474K0312
$$ plain form
1326 18427 7520 -3979 -6685 -2311 16471 14275 -14098 -10528 18760 13671 -7194 -3455 4845
1339 4845 8110 10499 -2939 -11651 12714 21955 -7625 -14917 11057 17515 4057 -5122 -8133 6496
1353 6496 24163 3584 -21273 1134 24054 7338 -7967 -3791 2739 13244 12794 -10967 -11845
1366 -11845 16962 15100 -9780 -6062 8620 6325 2748 -3537 -7495 10000 15739 -12012 -17313
1379 -17313 12946 16802 -6340 -12156 -4493 5544 14640 -2213 -23547 -3482 22131 2983 -18437
1392 -18437 -8873 3458 7542 4303 -14000 -15049 11605 11261 -16197 -12103 8300 2226 -8423
1405 -8423 -6454 -4185 3672 6752 -14123 -18269 10385 14606 -13056 -17390 -1105 6836 7022 -6593
1419 -6593 -22780 -3864 22102 1359 -24672 -8703 10256 5694 -2828 -11926 -10914 9585 10146
$$ packed form
1326A8427j0907j1499k706M374J8782k196k8373L570K9288n089k0865L739Q300
1339D845L265K389j3438q712K4365R241k9580p292K5974O458j3458r179l011J4629
1353F496J7667k0579k4857K2407K2920j6716j5305M176O530J0505m50k3761q78
1366a1845K8807j862k4880L718J4682k295l577o285l958J7495N739k7751n301
1379a7313L0259L856k3142n816P663J0037R096j6853k1334K0065K5613j9148k1420
1392a8437R564J2331M084l239j8303j049K6654l44k7458M094K0403o074j0649
1405h423J969K269P857L080k0875m146K8654M221k7662m334J6285P941J86j3615
1419f593j6187J8916K5966k0743k6031J5969J8959m562q522r098J012K0499N61
$$ plain form
1432 10146 -14365 -10918 11570 3838 -10492 -3216 2919 3859 4903 -8555 -12422 12798 17851 -11761
1446 -11761 -16385 8136 15289 4642 -6360 -12947 4515 25510 3965 -21936 -2197 20338
1458 20338 8645 -3676 -4328 -1250 11327 13750 -7116 -7624 15384 10405 -8054 -345 10937
1471 10937 6980 3330 -3853 -4638 14533 18318 -10786 -14734 15103 19645 -1208 -8596 -4489 8494
1485 8494 20995 2514 -20300 -984 23278 7789 -9301 -3409 3434 9037 8863 -7292 -8126
1498 -8126 13838 9879 -12723 -4619 12758 4767 -5460 -5356 -2500 9204 10758 -13633 -16786 12609
1512 12609 16433 -9767 -15323 -2122 6763 10436 -4103 -22584 -4716 19940 2027 -19287 -7450
1525 -7450 4823 2503 -1642 -9955 -10020 8205 5328 -17125 -9713 11066 1538 -12974 -7034 -558
$$ packed form
1432A0146k4511L447K2488p732j4330P276O135R40J044j3458l867K5220N053k9612
1446a1761m624K4521P153j0647j1002o587J7462K0995k1545k5901J9739K2535
1458B0338j1693j2321o52L078J2577K423k0866n08K3008m979j8459P709J1282
1471A0937l957l650p183p85J9171L785k9104l948K9837M542k0853p388M107J2983
1485H494J2501j8481k2814J9316K4262j5489j7090N892O843N603j74j6155q34
1498h126K1964l959k2602Q104J7377p991j0227J04K856J1704J554k4391l153K9395
1512A2609L824k6200n556J3201Q885L673j4539j8481J7868K4656j7913k1314J1837
1525g450J2273k320m145q313o5J8225k877k2453P412K0779r528j4512N940O476
$$ plain form
1539 -558 3710 3784 -12932 -16970 10370 14537 -13534 -18162 1672 9054 3873 -7164 -17663 -1883
1553 -1883 18837 972 -21247 -4347 12011 2106 -5611 -6008 -3549 7904 6352 -12786 -7903
1566 -7903 14788 6346 -12427 -4562 7148 6206 3063 -7040 -8814 12988 17644 -10400 -15194 10480
1580 10480 15511 1538 -5363 -6272 4832 18789 2918 -16337 1409 19255 3993 -7066 63
1593 63 4969 9301 6879 -8492 -4470 17578 10226 -12135 -3601 13584 7846 -241 -4214 -3949 11637
1608 11637 15575 -8991 -13904 11882 16155 -3356 -7771 -997 5878 12168 585 -15160 1157
1621 1157 18708 662 -14017 102 8698 4576 -434 -8716 -4682 13933 6970 -16589 -8217
1634 -8217 13065 5557 -8500 -7216 -3079 5928 8195 -11108 -16279 8181 13054 -10420 -13634 615
$$ packed form
1539e58M268P4j6716m038K7340M167k8071m628J9834P382n181j1037j0499J5780
1553a883K0720j7865k2219J6900J6358r905p717l97K459J1453j552j9138M883
1566g903K2691q442j8773P865J1710r42l143j0103j774K1802M656k8044m794K5674
1580A0480N031j3973o901r09J1104J3957j5871j9255J7746J7846j5262j1059P129
1593F3M906M332k422j5371M022K2048p352k2361Q534J7185n738q087l973K65J5586
1608A1637L938k4566m913K5786M273j9511m415O774O875O290j1583j5745J6317
1621A157J7551j8046j4679J4119Q596m122n010q282M034J8615o963k3559Q372
1634h217K1282p508j4057J284M137R007K267j9303n171K4460M873k3474l214J4249
$$ plain form
1648 615 4193 1874 -5720 -14597 -1084 14131 -4907 -20236 -1806 10439 -1727 -9465 -9403 -3895
1662 -3895 9083 3004 -18802 -11232 12737 4914 -13674 -9537 43 4061 3521 -9552 -14590 6474
1676 6474 12134 -11087 -13810 5110 6288 -3045 -6145 -7816 1801 11770 -4055 -18334 2154 15942
1690 15942 -1276 -11480 -3883 3878 9648 3423 -14249 -6817 17292 9828 -12948 -6450 8319
1703 8319 7825 3287 -4179 -6526 9353 14801 -6038 -9800 10730 11627 -2933 -3059 1994 7061 11439
1718 11439 -917 -12510 6755 20593 221 -12749 1981 12228 9132 1114 -10118 -3028
1730 -3028 18442 11072 -13280 -6445 12605 8533 -966 -3463 -3394 6486 11539 -5514 -10633 9113
1744 9113 11047 -7380 -6799 4897 5846 3374 -4787 -10830 5246 16793 -5078 -18423 1489 13012
$$ packed form
1648F15L578k319p594q877J3513J5215j9038j5329J8430J2245j2166p738O2N508
1662c895J2978o079k1806P570K3969p823j8588M137R580M018n40j3073n038K1064
1676F474N660k3221k723J8920J178r333l100j671R617R969j5825j4279K0488J3788
1690A5942j7218j0204P597P761N770o225j7672P432K4109p464k2776O498J4769
1703H319m94m538p466k347J5879N448k0839l762K0530Q97j4560j26N053N067M378
1718A1439j2356j1593J9265J3838k0372j2970J4730J0247l096q018j1232P090
1730c028K1470p370k4352O835J9050m072r499k497O9R880N053j7053n119J9746
1744I113J934j8427N81J1696R49k472q161o043J6076J1547k1871j3345J9912J1523
$$ plain form
1758 13012 2417 -7017 -10429 -3087 12858 6102 -17119 -10699 11338 6077 -8143 -6900 -3214
1771 -3214 2101 5374 -7743 -12457 5414 7850 -11686 -10599 5409 3910 -4801 -8318 -8375 3020
1785 3020 10996 -8232 -20491 1673 14507 -2250 -13268 -8168 -121 9573 2621 -17249 -10855
1798 -10855 12595 7131 -11946 -7714 1793 3079 1860 -5112 -8845 5486 8516 -10007 -9373 9373
1812 9373 7152 -6819 -6248 -342 5804 9464 -5264 -15364 5638 18616 -1221 -13487 -1847
1825 -1847 8009 9686 2376 -11256 -5378 16224 10499 -10956 -5147 9726 6629 1024 -880 -1998
1839 -1998 7140 10562 -5315 -6242 12553 10676 -6452 -4197 6450 8906 7002 -3127 -10400 8033
1853 8033 20071 -976 -14381 2381 13609 7419 -1070 -7867 -1479 15338 9139 -11958 -5637
$$ packed form
1758A3012j0595r434l412P342J5945o756k3221O420K2037n261j4220J243L686
1771c214N315L273j3117m714J7871K436j9536J087J6008j499q711l517n7J1395
1785C020P976j9228j2259K2164J2834j6757j1018N100Q047R694o952j9870O394
1798a0855K3450n464j9077M232R507J286j219o972l733J4331L030j8523O34J8746
1812I373k221j3971N71N906O146L660j4728j0100K1002J2978j9837j2266J1640
1825a847R856J677p310j3632N878K1602n725k1455N809J4873l097n605j904j118
1839a998R138L422j5877r27J8795j877j7128K255J0647K456j904j0129p273J8433
1853H033J2038k1047j3405J6762J1228o190q489o797O388J6817o199k1097O321
$$ plain form
1866 -5637 12097 6165 -4026 -2153 399 4368 6185 -5345 -7559 9912 8966 -9755 -8636 7035
1880 7035 6749 -848 -7135 -8959 5037 14166 -5555 -18582 1175 13179 104 -9551 -7581 -1137
1894 -1137 8683 3243 -14891 -8731 10257 3580 -10949 -5960 1245 959 187 -7500 -9202 6140
1908 6140 6818 -12859 -11357 7158 5864 -6866 -9130 -5698 3545 9175 -6562 -17541 1369 13679
1922 13679 -2760 -12089 -4220 2501 5789 737 -12342 -6270 11817 4985 -12366 -4903 6975
1935 6975 2903 -2004 -4646 -3681 7409 7710 -10103 -8821 11263 9487 -6577 -6233 1791 6910 7840
1950 7840 -3063 -11502 4970 16382 -740 -11083 1918 9239 5720 75 -6421 -576 14329
1963 14329 6848 -11196 -2093 13578 6011 -4292 -1530 2869 8584 7417 -6458 -6371 12477 11861
$$ packed form
1866e637J7734n932j0191J873K552L969J817j1530k214J7471r46j8721J119J5671
1880G035k86p597o287j824J3996R129j9721j3027J9757J2004j3075r655J970O444
1894a137R820n440j8134O160J8988o677j4529M989P205k86p72p687j702J5342
1908F140O78j9677J502J8515j294j2730k264L432R243N630j5737j0979J8910J2310
1922A3679j6439r329P869O721L288n052j3079O072J8087o832j7351P463J1878
1935F975m072m907k642R65J1090L01j7813J282K0084j776j6064L44Q024N119R30
1950G840j0903q439J6472J1412j7122j0343J3001P321l519n645o496N845J4905
1963A4329p481j8044R103J5671p567j0303K762M399N715j167j3875Q7J8848o16
$$ plain form
1977 11861 -6343 -6005 5943 7972 5212 -1846 -7811 5141 15289 -1411 -12006 3981 12196
1990 12196 1525 -4397 -3620 1858 10307 3278 -12027 -2660 13736 3358 -10105 -3337 4014 4866
2004 4866 2901 -7957 -8650 8772 9808 -10051 -10653 5072 6062 -1619 -5913 -6940 2295 9177 -5539
2019 -5539 -14661 2058 10017 -4624 -10254 -2534 1429 3559 -2045 -12477 -4749 11014 984 -14587
2033 -14587 -6054 5749 2947 -3234 -9474 -7695 7253 7878 -11732 -12714 6269 6633 -5962 -7281
2047 -7281 -2646 1652 5062 -4643 -11928 2733 10415 -5149 -10632 1330 5430 1647 -2697 -8293
2061 -8293 -947 12451 2364 -14660 -3682 12171 5202 -5374 -6080 -1030 9293 8139 -8307
2074 -8307 -9041 9586 9845 -4398 -4090 3502 4489 4658 -668 -6276 5035 12575 -2135 -8855 6020
$$ packed form
1977A1861j8204L38J1948K029k760p058n965J2952J0148j6700j0595J5987Q215
1990A2196j0671n922P77N478Q449p029j5305R367J6396j0378j3463O768P351Q52
2004D866j965j0858o93J7422J036j9859o02J5725R90p681m294j027R235O882j4716
2019e539r122J6719P959j4641n630P720L963K130n604j0432P728J5763j0030j5571
2033a4587Q533J1803k802o181o240J779J4948O25j9610r82J8983L64j2595j319
2047g281M635M298L410r705p285J4661P682j5564n483J1962M100l783m344n596
2061h293P346J3398j0087j7024J0978J5853o969j0576p06N050J0323j154j6446
2074h307p34J8627K59j4243L08P592R87J69n326n608J1311P540j4710o720J4875
$$ plain form
2089 6020 10874 1499 -3367 -2658 4414 12600 2329 -12687 -144 16831 5548 -7650 -3446 4533
2103 4533 9063 6544 -5834 -7211 9783 11342 -4947 -5454 5303 5530 1807 -1197 -4060 4053
2117 4053 10307 -3439 -10413 5944 10914 -3705 -7804 -138 5089 6213 -2084 -12385 -1221 13892
2131 13892 2562 -13114 -5417 5441 4982 691 -8215 -8566 6557 8202 -9073 -10183 4760 4156
2145 4156 -4548 -5211 -2974 1225 3944 -6102 -10909 3736 8038 -8078 -11361 805 4651 603
2159 603 -5343 -11422 -1879 12100 595 -15841 -6401 8324 4121 -4342 -8218 -5461 5848 6670
2173 6670 -9362 -9975 6597 5757 -6866 -4951 1086 1714 1841 -3639 -7224 4315 9108 -6240 -10143
2188 -10143 4800 8866 400 -5233 -6079 2736 12563 1826 -13962 -2405 13543 5666 -6308
$$ packed form
2089F020M854r375m866P09P072Q186j0271j5016J2543J6975j1283j3198M204P979
2103D533M530k519j2378j377J6994J559j6289n07J0757K27l723l004k863Q113
2117D053O254j3746o974J6357M970j4619m099P666N227J124q297j0301J1164J5113
2131A3892j1330j5676P697J0858m59m291q906l51J5123J645j7275j110J4943o04
2145D156q704o63K237M199K719j0046m807J4645M302j6116l283J2166L846m048
2159F03n946o079R543J3979j1505j6436R440J4725m203q463l876K757J1309Q22
2173F670j6032o13J6572q40j2623J915O037O28J27n480l585J1539M793j5348l903
2188a0143J4943M066q466n633q46Q815R827j0737j5788J1557J5948p877j1974
$$ plain form
2201 -6308 -3851 1662 7238 6318 -5430 -6024 9305 8870 -5156 -3224 5768 4822 1874 -612 -2713
2216 -2713 5878 10661 -3686 -8631 7682 12698 -817 -6235 -899 6106 10814 1229 -11072 -49
2230 -49 15297 4964 -8316 -2476 5252 6159 3759 -4609 -4984 8359 8785 -6609 -5466 7137 5393
2245 5393 -2361 -2822 -1187 4213 6487 -5458 -9630 6342 10992 -5330 -9656 336 5222 3981
2259 3981 -2895 -10888 -1800 11449 1130 -13100 -4389 6043 2438 -2934 -6498 -5232 5118 4987
2273 4987 -10114 -8720 6157 3957 -7835 -6185 -157 1767 1722 -6659 -10083 3890 8359 -7351
2287 -7351 -12008 1122 5325 -500 -5353 -8331 -1514 9530 104 -13719 -3796 8684 1585 -6493
2301 -6493 -4568 -851 4769 3469 -8327 -6960 8179 5550 -8402 -5402 4179 3990 544 -4432
$$ packed form
2201f308K457N513N576r20j1748n94J5329m35j4026J932Q992r46k948k486k101
2216b713Q591M783j4347m945J6313N016j3515n418N336P005M708r585j2301J1023
2230d9J5346j0333j3280N840P728R07k400q368l75J3343M26j5394J143J2603j744
2245E393p754m61J635N400K274j1945m172J5972M650j6322m326R992M886j241
2259C981o876p993R088J3249j0319j4230Q711J0432l605n372l564J266J0350j31
2273D987j5101J394J4877k200j1792J650O028J924m5q381l424J3973M469j5710
2287g351m657J3130M203n825m853k978O817J1044r426j3823R923J2480p099q078
2301f493J925L717N620j300j1796J367J5139k629j3952L000R581j89l446m976
$$ plain form
2315 -4432 -5518 5441 10021 -4938 -9975 4990 9804 -632 -4415 -2607 2916 9590 1797 -9974
2329 -9974 -9 12694 2989 -6732 -466 5537 5813 2916 -4705 -2830 10658 7704 -7304 -3649
2343 -3649 9180 7164 -753 -2294 -1600 6338 10393 -3116 -8697 6324 11411 -1338 -4782 794
2357 794 4885 6449 385 -7760 902 12222 1521 -9034 167 7613 2996 -1603 -4624 -1707
2371 -1707 8260 5523 -9434 -6324 8879 5935 -5386 -5124 -637 4148 5413 -4977 -10018 4073
2385 4073 9188 -4532 -9120 742 3660 185 -3219 -7028 -1073 7861 -1721 -12109 -1539 7652
2399 7652 -756 -7255 -4984 -1187 4749 1642 -11234 -7864 8131 4948 -9580 -7587 1189 3353
2413 3353 1215 -5830 -9100 2728 7988 -5477 -10293 1897 4757 -2533 -4262 -3605 103 5728
$$ packed form
2315d432j086J0959M580j4959n037J4965M814j0436l783J808N523O674p793j1771
2329i974R965J2703r705r721O266O003K76k897p621J875J3488k954j5008L655
2343c649J2829k016p917j541O94P938M055j3509n581J5021N087j2749l444N576
2357G94M091J564o064q145Q662J1320j0701j0555R201P446m617m599l021K917
2371a707R967k737j4957L110J5203k944j1321K62M487M785J265j0390n041J4091
2385D073N115j3720m588R862K918l475l404l809N955Q934r582j0388J0570R191
2399G652q408o499K271L797N936l107j2876L370J5995l183j4528J993Q776K164
2413C353k138p045l270J1828N260j3465m816J2190K860p290j729O57L708N625
$$ plain form
2427 5728 -1361 -10808 60 10020 -765 -8593 -2182 3944 4488 679 -8070 -4446 10637 7165
2441 7165 -9277 -6165 6255 5977 669 -3267 -4409 4447 9433 -2627 -8078 5044 8444 -1285
2455 -1285 -2979 1649 3729 5518 397 -6548 3134 11912 791 -8580 1481 9136 5005 -965
2469 -965 -4819 -351 11240 7501 -8342 -5196 9547 7808 -1839 -2968 -822 4954 8134 -2082
2483 -2082 -7274 4941 8986 -2657 -4767 3171 4246 1666 -1207 -4865 2086 9888 -1282 -10391
2497 -10391 1163 9564 1043 -5405 -4714 261 7596 3973 -10406 -7000 8724 5802 -6621 -5910
2511 -5910 -210 2638 3018 -4430 -8563 2134 6810 -5588 -8481 2102 3235 -3241 -4661 -4284 226
2526 226 5728 -3512 -12301 -317 9043 -1736 -9821 -4388 1553 4355 329 -10492 -7132 8036
$$ packed form
2427E728p089r447J0868R960j0785p828O411O126N44l809q749L624J5083l472
2441G165j6442L112J2420k78n308l936j142Q856M986j2060n451J3122L400r729
2455a285j694M628K080J789n121o945R682Q778j1121r371J0061P655m131n970
2469i65l854M468J1591l739j5843L146J4743j739r647j129K146N776L180j0216
2483b082n192J2215M045j1643k110P938J075k580k873l658O951P802j1170r109
2497a0391J1554Q401q521o448O91M975P335l623j4379L406J5724k922j2423P11
2511e910N700K848L80p448m133J0697M676j2398k893J0583J133o476j420L77M510
2526B26N502r240q789J1984R360j0779q085N433N941K802m026j0821L360J5168
$$ plain form
2540 8036 5075 -9395 -7353 2620 2544 -389 -4528 -6158 1966 6741 -5061 -8444 3874 5506 -4169
2555 -4169 -4845 -180 2331 4358 -2523 -9055 1163 10950 -1142 -9840 -618 6170 4388 -539 -6439
2570 -6439 -3036 9811 6551 -8288 -5053 7529 5858 -1012 -1952 -1185 4493 7367 -2497 -5986 6368
2585 6368 8582 -3480 -3502 4000 5060 3268 -899 -5240 3392 11964 161 -9226 2031 9895 3457
2600 3457 -2386 -3193 335 8990 5565 -7762 -4257 9405 6031 -4047 -2663 1740 3549 4248 -2543
2615 -2543 -5782 5379 7889 -4818 -6179 4707 5180 -192 -3379 -4081 2209 8388 -1802 -11293
2629 -11293 520 9414 -276 -6994 -3428 1236 4884 1589 -8989 -5404 7552 3421 -8603 -4713
2643 -4713 2714 1239 -1020 -4632 -6091 2832 5566 -7231 -9308 3825 4875 -4544 -5832 -3101
$$ packed form
2540H036k961j4470K042R973p6k933m139j630Q124M775j1802l383J2318J632r675
2555d169o76M665K511K027o881o532J0218R787j2092q698R222O788j782m927n900
2570f439L403J2847l260j4839L235J2582j671o870r40P67N678K874r864l489J2354
2585F368K214j2062k2P502J060j792m167m341Q632Q572j1803r387J1257P864o438
2600C457n843q07L528Q655l425j3327L505J3662l374j0078J384M403J809O99o791
2615b543l239J1161K510j2707j361J0886M73n372l187p02O290O179j0190r491
2629a1293J1813Q894r690o718L566M664L648l295j0578L585J2956m131j2024L890
2643d713P427j475k259l612j459Q923K734j2797k077J3133J050r419j288K731
$$ plain form
2657 -3101 980 4895 -3087 -11137 -251 8822 -2212 -9553 -2181 2637 1872 -926 -7107 -4315 7006
2672 7006 3308 -9067 -4762 5345 2474 -3229 -3863 -2456 4112 5369 -5899 -8060 5810 7333
2686 7333 -4636 -5198 1553 3933 3911 -1533 -7110 1710 10061 -273 -8143 1370 7010 2553 -717
2701 -717 -3053 -494 8004 4913 -7462 -2491 9525 4643 -4382 -1432 3026 5333 4674 -3539 -5087
2716 -5087 7474 9500 -3837 -5102 4448 6133 2251 -501 -4013 2303 9863 312 -8393 2030
2730 2030 8962 1348 -3224 -1000 1907 6042 2945 -7259 -2132 9780 3363 -7302 -2308 4982
2744 4982 3999 1274 -4482 -5121 5682 7705 -5686 -7744 4075 5123 -1490 -3909 -3735 1270 6124
2759 6124 -1920 -9846 340 7809 -2122 -7513 -1025 2044 1292 -1057 -7010 -2966 7103 1252 -10299
$$ packed form
2657c101M081L915p982q050J0886R073j1034p341P372M818p65k798o181K792J1321
2672G006l698j2375M305J0107k871n703o34J407O568J257j1268k161J3870J523
2686G333j1969n62O751K380k2n444n577Q820Q351j0334p870R513N640m457l270
2701g17k336K559Q498l091j2375M971J2016m882r025K950M458K307o59q213j548
2716e087J2561K026j3337j265R550J685l882k752l512O316P560r551q705J0423
2730B030O932p614m572K224K907M135l097j0204N127J1912o417j0665M994P290
2744D982r83k725n756o39J0803K023j3391k058J1819J048o613k419J74N005M854
2759F124q044p926J0186P469r931n391O488L069p52k349n953M044J0069n851j1551
$$ plain form
2774 -10299 -4095 5509 1675 -3644 -5676 -4512 3873 5244 -7379 -9939 3878 5851 -4664 -6187
2788 -6187 -1479 862 3117 -2347 -8647 24 7094 -2772 -8222 453 3706 -592 -2419 -4295 -1579
2803 -1579 6585 1620 -9568 -3292 8601 3128 -5394 -4087 243 5272 4756 -5495 -7271 6858
2817 6858 8187 -4223 -5224 2971 3719 2632 -335 -4606 1872 8495 -137 -6787 2805 7416 507
2832 507 -2799 -215 2166 6808 2269 -7736 -954 11649 4581 -6333 -2295 4925 5581 3232 -3539
2847 -3539 -4419 7076 8924 -3918 -5406 4785 5569 565 -1094 -2321 1844 7446 -179 -7052 2825
2862 2825 8267 -1460 -4970 891 3912 3496 -338 -7053 -994 9797 2386 -9411 -3254 5929 3053
2877 3053 -1496 -4203 -4192 4596 6474 -5748 -8375 4017 4945 -3099 -4282 -1617 790 3247 -2406
$$ packed form
2774a0299O204R604l834n319k032J164Q385J371j2623k560J3817J973j0515j523
2788f187M708K341K255n464o300Q671P070r866n450Q675L253m298j827j876K716
2803a579Q164m965j1188O276J1893n473q522J307M330N029n16j0251j776J4129
2817F858J329j2410j001Q195P48j087k967m271O478O623q632o650R592M611o909
2832E07l306K584K381M642m539j0005O782J2603p068j0914M038P220O56k349o771
2847c539q80J1495J848j2842j488J0191P84n004j659j227M165N602p625o873R877
2862B825N442r727l510N861L021m16l834o715O059J0791p411j1797O157R183k876
2877C053m549k707J1Q788J878j2222k627J2392R28q044j183K665K407K457n653
$$ plain form
2892 -2406 -8065 1390 6756 -4137 -8450 541 3472 -587 -3317 -6275 -1735 6637 703 -10762
2906 -10762 -4140 6680 2099 -4910 -5097 -2735 3518 4223 -6635 -8515 4283 5567 -5325 -5690
2920 -5690 804 1896 994 -2132 -5653 1197 6868 -3390 -8008 2261 5875 -1168 -3922 -2887 395
2935 395 6165 1532 -9013 -2490 9593 3379 -6155 -2751 2782 4469 3316 -4120 -5064 6290 7212
2950 7212 -4462 -4333 5023 4465 288 -831 -1668 2790 7381 -1130 -6699 3780 9001 -221 -4251
2965 -4251 556 3827 5703 1486 -6186 -486 10453 3841 -6806 -1352 5814 4070 1191 -2841
2979 -2841 -2882 5689 7028 -4436 -4727 5932 5029 -1775 -2166 -136 2702 5217 -1839 -7386 3126
2994 3126 8631 -2539 -7072 929 4206 1868 -1327 -5739 -1216 7694 1561 -8936 -2606 5832
$$ packed form
2892b406n659R455N366j0893m313Q991K931m059k730k958M540Q372n934j1465
2906a0762O622J0820m581p009j87K362O253P05j0858j880J2798J284j0892l65
2920e690O494J092r02l126l521O850N671j0258m618J0269L614p043k754J035L282
2935C95N770m633j0545O523J2083o214r534L404N533J687j153p436r44J1354R22
2950G212j1674J29R356n58m177j119q37M458M591q511n569J0479N221r222m030
2965d251M807L271J876m217p672N700J0939o612j0647N454P166j744k879m032
2979b841m1Q571J339j1464k91J0659r03o804l91K030K838K515p056n547J0512
2994C126N505j1170m533Q001L277k338l195m412M523Q910o133j0497O330Q438
$$ plain form
3008 5832 1619 -3516 -3593 -2003 3199 4006 -6623 -6679 4636 4300 -5826 -4897 702 1864 920 -3914
3024 -3914 -6967 1599 6606 -4126 -8947 1006 4328 -921 -3880 -4520 -1345 5343 598 -9432 -3359
3039 -3359 6583 1122 -6008 -3604 426 2431 1614 -5330 -5638 5384 4739 -6507 -5530 3412 3137 -808
3055 -808 -2927 -4064 2398 6666 -2927 -8057 2404 7020 -681 -4106 -1282 1593 5151 1501 -6657
3070 -6657 -1239 8934 2237 -5908 -747 4698 3046 1007 -2734 -2151 6738 6199 -5174 -3636 6860
3085 6860 5442 -1914 -2034 -235 3891 6909 -1515 -6481 3869 9090 -484 -4223 1117 4024 3732
3100 3732 1072 -4478 -182 8186 2226 -6696 -234 6889 2095 -1861 -1733 -293 4980 4330 -5780
3115 -5780 -4707 7071 5356 -4246 -3788 940 3116 3301 -2574 -6615 2236 7819 -2813 -7175 1073
$$ packed form
3008E832m213n135p7J590N202Q07j0629n6J1315l36j0126R29N599J162r44m834
3024c914l053Q566N007j0732m821R953L322n249k959o40L175O688m745j0030O073
3039c359R942n461p130K404M030K005q17o944l08J1022o45j1246R77Q942k75l945
3055h08k119j137O462M268r593n130J0461M616p701l425K824K875L558l650q158
3070f657N418J0173o697q145N161N445j652k039l741N83Q889n39j1373J538J0496
3085F860j418p356j20J799M126L018q424m966J0350N221r574l739N340K907k92
3100C732k660n550M296Q368n960q922O462P123m794l956J28J440N273o50j0110
3115e780J073J1778j715r602M58M728K176J85n875m041Q851N583j0632m362Q248
$$ plain form
3130 1073 3588 115 -2401 -4074 -1335 4910 388 -8488 -1867 6269 -291 -5400 -2558 64 2344
3145 2344 1023 -6942 -5586 5910 3911 -7350 -5920 2533 2338 -345 -4070 -6165 1290 6385 -3762
3160 -3762 -8749 1225 4403 -2017 -3820 -2432 -452 3156 -164 -7410 -1617 6624 -42 -6929 -1576
3175 -1576 2820 1976 -117 -4946 -3437 6242 4518 -7149 -4947 5097 4171 -1548 -2902 -2270 2880
3190 2880 6034 -2185 -6520 2980 7069 -984 -3470 982 2786 3484 726 -4413 665 8239 1475
3205 1475 -6390 713 6963 2431 -1334 -2190 102 6717 5013 -5589 -3921 7631 5875 -2595 -2380
3220 -2380 1052 3741 5122 -1045 -5638 3641 7981 -1573 -4874 2354 3694 1621 -583 -2816 940
3235 940 6563 774 -6942 314 7084 565 -4316 -1737 1111 4762 2450 -6083 -4466 6336 4845
$$ packed form
3130A073K515l473k516j673K739O245m522q876O621Q136o560n109K842K622K280
3145B344j321p965J356J1496j999j1261J430Q453j95k683l725k095P455N095j0147
3160c762m987R974L178o420j803J388J980L608l320p246N793Q241o666o887N353
3175a576M396q44k093m829J509R679j724j1667K202J0044r26n719j354O32N150
3190B880L154q219m335R500M089q053k486M452J804O98k758n139N078P574o764
3205A475p865P103O250m532l765q56K292O615j704j0602J668J1552j756q470K15
3220b380L432K689J381o167m593R279M340r554l301P228J340k073k204k233L756
3235I40N623n789p716P256O770o519m881K579K848L651k312q533J617J0802j491
$$ plain form
3250 4845 -5350 -4539 1983 2755 1105 -3191 -5661 1925 5921 -3374 -7178 1735 3610 -1886 -3662
3265 -3662 -2482 -88 3287 -1149 -7653 -1245 6453 -943 -7295 -2225 2023 1825 -677 -5921 -4464
3280 -4464 5492 3576 -7149 -5585 3284 2439 -1930 -3584 -3826 1671 4533 -3618 -7177 2035 4669
3295 4669 -2995 -4671 -335 1449 2434 -1230 -6053 -208 7168 -227 -7343 -572 4830 1806 -1460
3310 -1460 -3439 -1797 5838 4374 -5744 -4163 5668 3905 -2284 -1943 103 3139 4544 -1762 -5041
3325 -5041 4106 6969 -2259 -4248 2594 4391 1927 -677 -3065 1634 7812 791 -6429 1049 7427
3340 7427 2004 -2187 -1375 703 5407 3685 -4513 -3232 7132 5124 -3695 -2167 2527 3404 2679
3355 2679 -1727 -3962 3752 6849 -2740 -5444 2874 4810 -476 -2165 -2012 1345 5571 -24 -6951
$$ packed form
3250D845j0195Q11O522P72j650m296k470P586L996r295l804Q913J875n496j776
3265c662J180K394L375m436o504O408P698p396o352N070M248j98k502n244J457
3280d464R956j916j0725J564Q869q45m369j654k42N497K862q151l559R212K634
3295D669p664j676M336J784R85l664m823N845P376p395p116O771N402l024l266
3310a460j979J642P635j464j0118J581R831j763o189L41K046L036J405o306l279
3325e041R147K863r228j989O842J797k464k604k388M699O178p021p220P478O378
3340G427n423m191Q12K078M704j722q198J281J0364k008q819J528M694Q77p25
3355B679m406k235P714L097r589k704Q318J936n286j689J53L357M226n595o927
$$ plain form
3370 -6951 -138 7184 361 -5266 -1581 1525 2704 911 -5241 -3912 5541 3388 -6081 -3960 2835
3385 2835 1809 -1838 -3057 -3373 2060 4131 -4317 -6944 2627 4577 -2971 -4783 -1472 844 2653
3400 2653 -1662 -7363 -1183 6492 -545 -7291 -1771 2386 927 -1571 -4443 -3016 4707 2520 -6726
3415 -6726 -3828 4431 1866 -3587 -2895 -847 2157 3216 -3827 -6217 3361 5747 -3553 -5215 679
3430 679 2692 1748 -1498 -4770 373 6658 294 -6850 -273 5602 1084 -1574 -1634 -211 4441 3306
3446 3306 -4771 -2198 6527 3603 -3778 -1744 2595 3181 2536 -2155 -3718 4665 6712 -2855 -4654
3461 -4654 3451 5405 875 -1488 -1791 1849 6568 1123 -5817 754 6737 1222 -2931 201 1838
3476 1838 3516 2227 -4088 -1885 6789 3638 -5180 -2481 4194 2738 -310 -2479 -2339 3874 5371
$$ packed form
3370f951O813P322o823n627L685L106J179j793o152J329R453k153r469K121O795
3385B835j026l647j219l16N433K071q448k627R571J950p548j812L311K316J809
3400B653m315n701O180P675p037o746N520M157j459k498k872J427P723k187r246
3415f726K898Q259k565n453O92K048L004J059p043k390R578K386r300j662N894
3430F79K013r44l246l272N143O285o364p144O577N875m518k658o0J423M652j135
3446C306q077K573Q725k924p381K034M339N86o45m691j563Q383K047r567j799
3461d654Q105J954m530k363l03L640M719n445o940O571N983n515m153L132J637
3476A838J678j289o315K203Q674l151q818K699O675j456l048k169J40O213J497
$$ plain form
3491 5371 -3802 -5499 3438 5084 -1519 -3280 -1331 1578 4105 -564 -6419 -412 6045 -203 -5787
3506 -5787 -755 2174 1020 -832 -4382 -2482 4523 1456 -7035 -3530 4182 1826 -3331 -3476 -1546
3521 -1546 2112 3002 -4702 -6846 2930 4560 -3707 -5327 -636 1454 1588 -1964 -6243 -743 5347
3536 5347 -842 -6842 -691 3604 -386 -2953 -2772 -1043 3425 1355 -6105 -3008 5057 2230 -4479
3551 -4479 -2702 853 2586 2099 -3729 -4949 3607 5826 -3631 -5217 2127 3837 677 -1376 -2782
3566 -2782 1047 5707 154 -5641 961 5977 453 -2733 -411 1912 3780 1951 -3837 -1458 7176
3581 7176 3420 -4573 -1441 3844 3602 871 -1844 -2416 4542 6168 -2659 -4368 4073 5246 129
3596 129 -1590 -465 1907 4871 256 -4495 1146 6520 20 -4231 518 2708 1981 134 -3426
$$ packed form
3491E371r173j697Q937J646o603j761J949K909K527m669n855O007O457o248n584
3506e787N032K929j154j852l550J900P005l067q491L505P712k356n157j45J930
3521a546L658Q90p704k144R776J630q267j620M691K090J34l552m279N500O090
3536E347o189o000O151M295l990k567J81J729M468k070p460L097Q065k827o709
3551d479J777L555J733m87n828j220Q556K219r457j586P344J710l160k053j406
3566b782L829M660n553n795O602N016n524l186K322K323J868j829n788K379Q634
3581G176l756p993L132N285k42k731k715n72O958J626q827j709Q441J173n117
3596A29j719J125K372K964m615m751N641N374o500m251M749K190p27j847l560
$$ plain form
3611 -3426 -799 5896 2299 -5802 -2165 4842 2317 -2003 -2458 -1391 2925 3932 -3695 -5457 3068
3626 3068 4890 -2702 -3578 -445 1410 2079 -1587 -5356 221 5025 -1773 -6217 -226 3235 -398
3641 -398 -2488 -3354 -1178 3798 896 -6814 -3674 4528 1531 -4480 -3067 -606 2054 1994 -4179 -5700
3657 -5700 2686 4379 -3985 -4916 902 1850 -222 -2139 -3719 218 4461 -1652 -6498 302 4663
3672 4663 -662 -3173 -1634 722 3178 1033 -5572 -2343 5857 2178 -4567 -2325 2498 2444 991
3687 991 -2742 -3342 3790 5052 -3137 -4143 3155 3951 -390 -1355 -993 1740 4914 -510 -5049 1585
3703 1585 6391 149 -3421 228 3191 3129 568 -3288 -593 6666 3465 -4706 -1398 5028 2542
3718 2542 -252 -1503 -1072 3897 4477 -2743 -3762 4341 4477 -1498 -2119 690 2176 3213 -851 -4378
$$ packed form
3611c426K627O695l597q101L637P007k525m320m55J067M316J007p627j762Q525
3626C068J822p592q76L133J855O69l666l769N577M804o798m444N991L461l633
3641c98k090q66K176M976k902p710L140Q202k997o011J413K461K660o0o173j521
3657e700Q386J693q364r31N818R48k072j917j580L937M243o113m846O800M361
3672D663n325k511J539K356K456k145o605L229Q200l679o745K242M823n4j453
3687I91l733o00P132J262q189j006P298P96m341r65L62K733L174n424m539O634
3703A585M806o242l570L649K963o2k561l856K695P259l201q171L308O426k486
3718B542k794j251M31M969N80p220j019Q103J36n975o21K809J486J037m064l527
$$ plain form
3734 -4378 1633 6483 -902 -4967 574 3711 1315 -1034 -3114 -535 5049 1752 -5751 -1995 4554
3749 4554 1805 -2815 -2038 -487 1890 2171 -3337 -4590 3230 3767 -3830 -4058 1054 1973 48 -2588
3765 -2588 -4197 673 4738 -2218 -6584 255 3802 -921 -3364 -2707 -668 3167 211 -5900 -2633
3780 -2633 4362 1264 -4856 -2551 795 1225 286 -3303 -3853 2812 3599 -4527 -4324 2478 2281 -1420
3796 -1420 -2343 -2449 1270 3803 -1525 -5886 1085 5160 -854 -3843 -601 1498 2610 731 -4326
3811 -4326 -1361 5786 2187 -4406 -1360 3531 2112 -323 -1876 -1467 3710 4051 -3105 -2991 4388 4035
3827 4035 -1691 -1797 624 2586 3649 -761 -4244 2055 6723 181 -3834 997 3516 1982 254
3842 254 -2398 -211 5928 2506 -4549 -704 4920 2093 -1593 -958 428 3241 3187 -3033 -3170 5039
$$ packed form
3734d378O011M850p385m065N541L137k396k349k080K579N584l297p503L756O549
3749D554k749m620P77J551K377K81n508j253P820N37p597k28N112R19j925k636
3765b588j609M870M065o956m366O839L547m723k443O57K039L835k956o111L267
3780b633O995l098o120K305L346M30r39l589n50O665P87q126K03O802j97l701
3796a420r23j06L719K533n328m361O971M075o014k989L242K099J112j879n057
3811d326K965P147l599o593L046M891j419k435j553M09N177L41p156J14P379l53
3827D035n726j06K421J962J063m410l483O299M668o542m015M831K519j534j728
3842B54k652K187O139l422p055L845N624k827l686O35J386K813n4o220j37Q209
$$ plain form
3858 5039 4162 -2873 -3056 1734 2594 1324 -1542 -3701 1489 5623 -1290 -5378 556 3963 181 -2080
3874 -2080 -2166 -361 3319 938 -5188 -1759 4441 746 -4075 -1793 936 1504 481 -3550 -3543 3524
3890 3524 3198 -4432 -4302 2058 2221 -1379 -2913 -3344 817 3972 -2287 -6135 375 3978 -1364 -3826
3906 -3826 -1616 204 1782 -38 -4834 -2123 4191 752 -5060 -1753 2075 1108 -852 -2850 -2530
3921 -2530 3070 3010 -4327 -4297 3320 3124 -2224 -2347 -965 1771 3003 -1410 -4737 1557 5327 -813
3937 -813 -3823 847 2435 1637 209 -3080 -479 5248 1570 -4332 -591 4769 1690 -1275 -909 299
3953 299 3511 3348 -3100 -3079 4838 4269 -2164 -1899 1557 2331 2760 -570 -3233 2192 5937 -483 -3971
3970 -3971 1762 3756 991 -705 -1509 585 4341 1642 -4239 -262 5259 1319 -2739 -959 1330
$$ packed form
3858E039q77p035j83M790Q60j270k866k159N190M134o913m088N934L407l782k261
3874b080q6J805L680k381o126L429O200l695m821K282K729N68j023m031PP067
3890C524l26p630J30O360J63l600j534m31M161L155o259l848O510L603n342k462
3906c826K210J820J578j820m796K711O314l439n812L307L828r67j960j998L20
3921b530N600o0p337L0P617j96n348j23J382K736J232m413l327O294L770o140
3937h13l010M670J588p98j428l289K601N727l678n902L741N360l079k965L66J208
3953B99L212j63o448K1P917n69o433K65L456P74M29l330k663N425L745o420l488
3970c971N733J994k765j696q04K094L756k699n881L977N521l940m058J780K289
$$ plain form
3985 1330 2743 1741 -3249 -3025 4142 3855 -3366 -3478 2053 2116 364 -1632 -2880 1060 4332 -1776
4001 -1776 -5282 1444 3695 -1096 -2930 -941 284 2048 -7 -4711 -1486 4574 270 -5043 -1789
4016 -1789 1678 1035 -398 -3505 -2805 2647 2787 -4468 -4353 2362 2375 -2484 -2793 -1801 708 2673 -2066
4033 -2066 -5127 1012 3893 -1645 -4047 -190 1086 881 -507 -4115 -948 4524 503 -5145 -1363
4048 -1363 3210 792 -1773 -2304 -1293 2965 2442 -3948 -3237 3428 3111 -2502 -2094 395 1256 2194 -1218
4065 -1218 -3619 1727 5139 -1000 -3695 1848 3294 539 -962 -1902 699 5008 1358 -4499 56
4080 56 5567 1747 -2403 -617 1411 3087 2626 -2470 -2402 4579 3970 -2793 -1623 2149 2666 1013 -575
4097 -575 -1933 1959 5150 -1337 -4189 2344 4337 -501 -1911 -426 1130 3390 741 -4312 -516
$$ packed form
3985A330J413j002m990K24P167k87p221j12N531O3j752j996j248L940L272o108
4001a776l506O726K251m791j834J989J225J764k055m704L225O060m304n313L254
4016a789L467o43j433l107P00N452J40p255J15O715J3m859l09R92K509J965m739
4033b066l061O139K881n538k402L857J276k05j388l608L167N472m021n648L782
4048a363M573k418k565n31J011M258n23o390P11O665l17n613M08K489Q61R38l412
4065a218k401N346L412o139k695N543J446k755j501r40K601M309l650n857M555
4080E6N511l820m150J786K028J676m61n096O8O981o09o763J170L772N17j653j588
4097e75j358L892L191o487k852O533J993m838j410J485J556K260k649n053L796
$$ plain form
4112 -516 5476 1148 -3738 -962 1789 1519 817 -2604 -2687 3665 2948 -3753 -3418 2906 1900 -1447 -1886
4129 -1886 -1518 1013 2997 -2550 -4419 1562 3636 -2232 -3692 -207 1273 989 -1103 -4718 -1256
4144 -1256 4337 -9 -5215 -1605 2179 424 -1506 -3025 -2226 2472 2052 -4550 -3438 2899 1795
4159 1795 -3016 -2313 -206 651 1113 -2009 -4369 1538 3887 -2110 -4170 674 2300 77 -1192 -3073
4175 -3073 -460 4273 478 -5117 -889 4107 809 -2369 -1140 378 2367 1936 -3262 -2388 4106
4190 4106 3051 -2635 -1679 2092 1752 1102 -979 -2560 2280 4695 -1567 -3643 2429 4199 292 -1422
4206 -1422 -640 1249 4202 794 -4065 119 5524 941 -2845 45 1673 2346 1557 -2127 -1837 3971
4222 3971 3449 -3042 -2116 3436 2380 -277 -848 -1217 2093 3850 -1941 -3979 2317 4666 -1204 -2497
$$ packed form
4112e16N992m328m886K776K751k70p02l421q3O352p17o701L35O324j006l347m39
4129a886L68K531J984n547j869N981K074n868j460L485J480k84k092l615L462
4144a256N593m346n206L610L784j755j930j519P99M698m20o602J112O337j104
4159A795m811P03K107Q57M62l122k360N907K349n997k060M844J626k223j269j881
4175c073K613M733l795n595M228M996l298l178J229J518J989m31n198Q74O494
4190D106j055n686R56L771l40o50k081j581M840K415o262k076O072J770l907j714
4206a422P82J889K953l408m859M184N405m583l786K890J628O73p89l684K90N808
4222C971n22o491R26N552j056k657n71l69L310J757n791k038O296K349n870j293
$$ plain form
4238 -2497 128 1066 2333 -62 -3751 -294 4574 255 -4289 -510 2587 823 -447 -2321 -1472
4253 -1472 2414 2169 -4165 -3003 3011 1877 -2774 -1811 -619 1041 1746 -2442 -4522 1468 3700 -2312
4269 -2312 -4146 294 1278 276 -1307 -3526 -895 3889 -434 -5449 -1097 3261 -117 -2626 -1876
4284 -1876 -769 1997 1182 -4020 -2937 3514 1738 -3709 -2217 994 1541 773 -2028 -3210 1660 3802
4300 3802 -2064 -3966 1576 2600 -430 -1338 -1491 25 3735 230 -4310 -21 4466 645 -2791
4315 -2791 -312 1314 1905 1357 -2497 -1713 4426 2988 -3123 -1327 3120 2213 174 -776 -1427 2308
4331 2308 4257 -1691 -3292 2690 4100 -442 -1548 107 1306 2991 450 -3310 591 4940 640
4346 640 -3136 369 3041 1459 381 -1622 -919 3975 2482 -3319 -1985 3448 1994 -1716 -1361 -337
$$ packed form
4238b497K625R38J267k395l689L457M868m319m544L779L097j764j270j874Q49
4253a472L886k45o334J162O014j134m651R63J192J660P05m188k080N990K232o012
4269b312j834M440R84j002j583k219K631M784m323n015M352M358l378k509P50
4284a876J107K766q15n202J083O451j776n447J492L211N47p68k801j182M870K142
4300C802n866j902N542J024l030r08j53J516L710l505m540M289M487l821l436
4315b791K479J626N91n48l854P84O139j438o111J796M447r07k039r50o51L735
4331B308J949n948j601N982J410m542j106J655J199J685k541l760L901M349m300
4346F40l776L505K672j582j078k003P03M894j493n801J334N433j454l710L55J024
$$ plain form
4362 -337 1860 2666 -1860 -3878 2323 3768 -1975 -2982 679 1334 935 -405 -3095 -68 3923 -345
4378 -345 -4481 -387 3097 148 -2110 -1941 -1031 2182 1146 -4213 -2481 3656 1656 -3338 -2061 153
4394 153 784 764 -2215 -3801 1396 3339 -2637 -3776 1047 1480 -717 -1430 -2564 -259 2515 -712
4410 -712 -4879 -17 3907 -378 -2939 -998 679 1685 702 -3650 -2524 3869 2155 -4131 -1899
4425 -1899 1958 1491 -85 -1428 -2265 1629 3613 -2066 -3454 2410 2971 -768 -1476 14 803 2734
4441 2734 40 -3390 735 4653 52 -3456 458 2570 1535 579 -1976 -653 4212 2544 -3166
4456 -3166 -1335 3736 2269 -852 -837 -304 1807 3416 -1141 -2723 2831 4005 -1218 -1883 1296 1976
4472 1976 1649 -220 -2336 883 4585 -107 -3942 820 3338 738 -880 -1415 -33 3233 1841
$$ packed form
4362c37K197Q06m526k018O201J445n743j007L661O55l99j340k690L027L991m268
4378c45m136M094L484k949k258J69R10L213j036n359J732O137k000m994J277K214
4394A53O31k0k979j586N197J943n976j139M823M33k197p13j134K305K774l227
4410g12m167M862L924m285k561J941J677J006r83m352J126O393j714o286K232
4425a899L857m67j576j343q37L894J984n679j388N864N61l739p08J490P89J931
4441B734k694l430M125L918m601l508L914K112j035r56k555J323M865j668n710
4456c166J831N071j467l121J5N33K111J609m557j582N554J174n223o65L179O80
4472A976l27j869k116L219L702m692l835M762K518k600j618n35J382L266j392
$$ plain form
4487 1841 -3733 -1756 3777 1719 -2362 -1636 437 1463 1483 -1933 -3190 2013 2975 -2578 -2902 1253
4503 1253 1524 -396 -1428 -2178 59 2978 -778 -4603 104 2932 -877 -3008 -1619 -166 1527
4518 1527 403 -4160 -2115 3170 1130 -3949 -2113 1196 846 -187 -2132 -2750 1571 2747 -2849
4533 -2849 -3481 1737 1664 -1453 -1876 -927 324 2091 -810 -3859 32 3649 -789 -3541 -381 1252
4549 1252 924 -288 -2338 -1200 3788 1574 -3798 -1506 3217 1199 -1080 -990 -1225 1737 2810 -1865
4565 -1865 -2740 2853 3094 -1610 -1710 601 1443 1653 -38 -2680 1305 4386 -251 -3302 600 2743
4581 2743 956 -284 -1105 -139 3676 1768 -3400 -864 3665 1598 -1658 -672 595 1724 2167 -1501
4597 -1501 -2315 2856 3426 -2108 -2157 1809 1862 627 -678 -2073 873 3864 -513 -3423 866 3370
$$ packed form
4487A841n574J977N533k058m081P26K073J026K0l416j257N203R62n553l24M155
4503A253K71j920j032p50K237K919l756l825M707K828l809k131J389J453J693
4518A527j124m563K045N285k040n079J836L309l50j033j945o18M321J176n596
4533b849o32N218p3l117m23R49J251J767k901l049L891L617m438k752L160J633
4549A252l28j212k050J138M988k214n372K292M723k018k279R0k35K962J073m675
4565a865q75N593K41m704j00K311Q42K10j691k642L985L081m637l051L902K143
4581B743j787j240q21R66L815j908n168K536M529k067l256R86J267J129M43l668
4597a501q14N171N70n534m9L966N3j235j305j395K946K991m377k910M289K504
$$ plain form
4613 3370 -92 -1847 -904 585 2233 722 -3350 -1666 3743 1047 -3321 -1343 1293 1029 150 -1744
4629 -1744 -2530 2042 2660 -3087 -3448 1937 1531 -1287 -1563 -1465 307 2348 -1420 -4247 279 3315 -1331
4646 -1331 -3108 -708 564 611 -524 -3405 -1452 2702 744 -4078 -1730 2175 350 -1524 -1804 -1648
4662 -1648 1275 1966 -2762 -3396 2221 2286 -2076 -2265 55 1052 1594 -959 -3281 679 3587 -713 -3255
4679 -3255 284 1979 642 -178 -1724 -610 3137 1015 -3444 -677 3585 1411 -2034 -958 364
4694 364 1861 2056 -1719 -2242 2916 2846 -1640 -1642 1425 1674 1153 -314 -1867 1329 3960 -452 -2778
4711 -2778 1355 3072 458 -889 -419 899 2946 1111 -2869 -323 3994 1483 -2294 -571 1481
4726 1481 1623 976 -1404 -1867 2434 3094 -2155 -2436 2068 2213 -156 -1116 -1165 940 2773 -611 -3451
$$ packed form
4613C370l462j755R43J489J648j511m072J684N409k696m368J978K636k64q79j894
4629a744p86M572O18n747l61N385m06k818k76R8J772K041l768k827M526L036m646
4646a331j777K400J272M7j135k881J953M154j958m822K348L905j825j874k80J56
4662a648K923O91m728o34N617O5m362j89K320R97N42k553k322L960K908m300k542
4679c255L539J695j337q20j546J114L747k122m459K767M262k174l445J076J322
4694C64J497J95l775n23N158p0m486kL067K49n21j467j553L196K631m412k326
4711b778M133J717k614j347M70J318K047j835l980K546M317k511l777J723K052
4726A481J42o47k380m63M301O60n249k81M504J45k369r60m9K105J833l384k840
$$ plain form
4743 -3451 944 3030 -851 -2560 -143 841 1249 -521 -3016 -1075 3161 436 -3634 -1062 1954
4758 1954 637 -798 -2016 -1772 1492 1922 -3110 -3291 1819 1866 -1821 -1998 -808 436 1438 -1039
4774 -1039 -3380 553 2692 -1642 -3209 131 1140 -74 -834 -1996 -567 2545 378 -3908 -1136
4789 -1136 2777 515 -1856 -1479 -466 1593 1513 -2880 -2579 2524 2279 -2060 -1861 1080 1063 739 -827
4806 -827 -2214 680 3085 -772 -2937 847 2484 23 -1096 -961 630 2915 971 -3212 -102
4821 -102 3702 1372 -2035 -734 1307 1946 996 -1574 -1503 2968 3005 -1904 -1798 2060 1878 516 -453
4838 -453 -856 1291 3089 -740 -2791 1558 3452 -251 -1687 105 1154 2125 221 -2469 -132 3736
4854 3736 1154 -2947 -522 1992 1107 240 -1513 -1343 2477 2474 -2126 -2339 2108 2230 -1001 -1449 -760
$$ packed form
4743c451M395K086l881j709K417R84M08j770k495J941M236k725m070K572L016
4758A954j317j435j218K44L264M30n032j81N110M7l687j77J190J244J002k477
4774a039k341L933K139m334j567L340J009j214p60j162J429L112k167m286K772
4789a136L913k262k371L77J013K059q0m393L01N103k45m339J99K941j7l24j566
4806h27j387K894K405l857k165L784J637k461j119J35J591K285j944m183L110
4821a02L804k330l407J301K041O39r50k570P1M471L7m909J06L858j82j362r69
4838d53m03K147J798l829k051M349J894l703j436J792J049R71j904k690K337L868
4854C736k582m101K425K514q85q67j753J70L820lm600k13M447J22l231m48O89
$$ plain form
4871 -760 892 1914 -1470 -3144 895 2898 -1392 -2553 253 1236 273 -687 -2129 -832 2578 -54
4887 -54 -3601 -983 2139 522 -1688 -1793 -720 1422 1231 -2917 -2703 1807 1857 -2211 -2161 -52 191
4904 191 575 -1560 -2747 690 2468 -1723 -3294 618 1521 -368 -1394 -1483 -176 2154 39 -3570
4920 -3570 -767 3234 476 -2478 -948 855 1559 681 -2297 -1956 2682 2310 -2413 -1904 1483 1505 243
4937 243 -603 -1153 1168 2898 -776 -2664 1267 3192 -119 -1258 -86 717 2298 637 -2460 34
4953 34 3947 911 -2489 64 2293 1330 321 -1085 -649 2898 2431 -2041 -1557 2541 2230 -515 -493
4970 -493 -315 1155 2383 -694 -2406 1427 3270 -765 -2211 299 1478 1154 -219 -1755 248 3032
4986 3032 449 -2740 -191 2390 487 -911 -1021 -622 1676 1415 -2916 -2332 2305 1542 -2067 -1577
$$ packed form
4871g60J652J022l384j674M039K003m290j161K806R83r63r60j442J297L410k632
4887e4l547K618L122j617k210j05J073K142j91m148K14M510N0m068N0K109K43
4904A91L84k135j187L437J778m191j571L912R03j889j026q9J307K330k115l609
4920c570K803M001k758k954J530J803P04q78k978L41M638l72m723N09L387K2j262
4937B43q46n50K321J730l674j888L931J925l311j139J172Q03J581j661l097K494
4953C4L913l036l400K553K229r63j009j406M36L547m67m472M84M098l11k745K2
4970d93J78J470J228l077j712L833J843m035j446K510J179l24j373j536K003K784
4986C032k583l189K549K581j903j398j10L99K298k61m331N84M637p63l609M90
$$ plain form
5002 -1577 197 933 586 -1375 -2734 1147 2570 -1424 -2965 318 1422 -642 -1354 -1736 -283 2022
5018 2022 -180 -3596 -714 2285 -268 -2231 -985 271 658 265 -2762 -2273 2029 1389 -2684 -2057
5034 -2057 695 1105 -113 -1463 -2087 561 2217 -1402 -2796 669 1838 -746 -1367 -790 130 1826
5050 1826 -98 -2801 -228 2985 234 -2507 -432 1451 953 47 -1708 -816 2481 1934 -2289 -1142
5066 -1142 2477 1737 -374 -695 -617 1360 2314 -949 -2425 1707 2847 -465 -1545 339 1299 1476 295
5083 295 -1714 439 3075 555 -2224 328 2336 1088 -539 -1051 -26 2478 1774 -2455 -1323 2853
5099 2853 1930 -1129 -1118 522 1074 1640 -837 -2468 1618 2782 -1211 -2139 622 1634 146 -542 -1169
5116 -1169 94 2718 -172 -3200 -79 2377 -135 -1808 -1028 -64 1135 466 -2753 -1921 2450 1526
$$ packed form
5002a577J774P36l47j961j359L881J423l994j541L283J104k064p12l82J453K305
5018B022k202l416K882K999k553j963J246J256L87l93l027M89M302o40m073O27
5034b057K752M10j218j350o24K648J656l619j394L465J169k584o21N77R20J696
5050A826j924k703K573L213k751k741K075J883m98r06j755Q92L297n47m223J147
5066a142L619p40k111l21P8J977R54l263j476M132J140l312j080J884R60J77j181
5083B95k009K153K636k520k779K552K008j248j627n12J025K504p04m229J132M176
5099B853r23l059J1J640N52N66k477j631M086J164l993r28K761J012j488o88o27
5116a169J263K624k890l028L121K456k512j673P80R64J199o69l219Q32M371r24
$$ plain form
5132 1526 -2334 -1696 774 700 12 -1639 -1946 1037 2156 -1455 -2889 586 1494 -751 -1570 -1152 -177
5149 -177 1620 -387 -2868 -376 1962 -452 -2608 -654 561 622 -134 -2047 -1250 2046 1338 -2903
5165 -2903 -1680 1607 899 -800 -1300 -1200 968 2014 -1491 -2671 893 2368 -859 -1237 462 622
5181 622 1094 -257 -2016 208 3042 329 -2565 158 1774 568 -457 -857 -243 2599 1601 -2301
5197 -2301 -1076 2995 1567 -984 -817 515 1623 1799 -888 -1894 1623 2875 -745 -1769 967
5212 967 1574 636 -144 -1245 511 2970 70 -2227 520 2638 458 -994 -562 548 1473 1304 -2096
5229 -2096 -1239 2665 1556 -1959 -1066 1000 992 695 -1046 -1843 1160 2265 -1295 -2281 1031 1426 -359
5246 -359 -1045 -1004 561 1883 -210 -3169 83 2257 -196 -2382 -670 597 1069 -215 -2619 -1176
$$ packed form
5132A526l860O38K470p4o88j651l07K983J119l611j434L475R08k245q19M18R75
5149a77J797k007k481K492K338k414k156J954J215O1p56j913P97L296p08m241
5165b903J223L287p08j699n00J00K168J046l505j180L564J475l227l78J699J60
5181F22M72j351j759K224K834k713k894K723J616j206j025m00O14K842r98l902
5197b301J225M071j428k551J67J332J108J76k687j006L517J252l620j024K736
5212I67O07r38p80j101J756K459k900k297K747K118k180j452M32J110R25j69l400
5229b096Q57L904j109l515Q93K066qk97j741p97L003J105l560r86L312L95j785
5246c59o86M1J565J322k093k959L252K174k453k186J712J267M72j284k404J443
$$ plain form
5262 -1176 2111 998 -3011 -1756 1448 728 -786 -1512 -1475 867 1628 -2134 -2895 878 1476 -1208 -1523
5279 -1523 -651 116 856 -609 -2303 69 2427 -488 -2807 -414 885 -36 -566 -1369 -538 1739 989
5296 989 -2783 -1252 1938 971 -1414 -1047 -601 1206 1385 -1416 -1982 1604 1969 -1086 -1730 431 1306
5313 1306 791 -398 -1331 450 2777 127 -2211 357 2290 456 -924 -320 414 1876 1167 -1948
5329 -1948 -709 2982 1368 -1451 -515 987 1416 1474 -963 -1552 1790 2597 -1191 -2040 1347 1577 249
5346 249 -413 -1086 661 2211 -44 -2295 492 2568 172 -1447 -75 561 1237 53 -1876 -699
5362 -699 2388 680 -2710 -1109 1420 639 -266 -1280 -1519 1171 1716 -1650 -2321 1108 1772 -1094 -1579
5379 -1579 -620 140 1017 -760 -2467 -82 2114 -530 -2459 -362 825 108 -853 -1748 -668 1808
$$ packed form
5262a176L287j113m009J255L204p20j514p26L7K342P61l762p61L773N98k684l15
5279a523Q72P67P40j465j694K372K358k915k319K393J299r21n30q03Q31K277p50
5296I89l772J531L190r67k385L67M46J807J79k801n66L586L65l055o44K161Q75
5313A306n15j189r33J781K327k650k338K568J933j834j380O04P34J462p09l115
5329a948J239L691j614k819R36J502M29N8k437n89L342Q07l788q49L387K30j328
5346B49o62o73J747J550k255k251K787K076k396j619J372O36O76j184j929J177
5362f99L087j708l390J601K529p81r05j014k39K690N45l366o71L429O64k866m85
5379a579R59P60Q77j777j707K385K196k644j929K097J187p17r61q95J080K476
$$ plain form
5395 1808 453 -2989 -1154 1906 620 -1244 -1320 -569 635 1059 -1853 -2222 1330 1591 -1354 -1728 82
5412 82 640 527 -579 -1983 391 2194 -417 -2638 -5 1625 320 -1132 -848 135 1742 670
5428 670 -2431 -875 2335 1360 -1716 -778 807 1263 895 -1384 -1457 1824 2004 -1472 -1553 1199 1581 470
5446 470 -297 -611 515 2580 -36 -1996 886 2311 7 -889 -153 831 1319 359 -1618 -195 2626
5463 2626 1035 -1799 -217 1788 1221 231 -945 -735 1771 2141 -1361 -1433 1710 1598 -335 -769 -247
5480 -247 619 1791 -125 -2097 783 2225 -87 -1693 82 918 718 -221 -1742 -242 2086 306
5496 306 -2629 -508 1677 604 -736 -1185 -515 1156 1195 -2030 -2179 1319 1591 -1384 -1617 -216 406
5513 406 597 -936 -1969 115 1966 -835 -2486 -134 1249 -545 -978 -1006 -539 1395 304 -2395
$$ packed form
5395A808j355l442J835L060j286j864p6P51J204M24k912l69L552K61k945l74J810
5412H2N58j13j106j404K374J803k611k221K633J630j305j452K84R83J607j072
5428F70l101J556L210r75l076R38J585M56l68k279p3L281J80l476q1K752L82j111
5446D70p67l14J126K065k616j960K882J425k304q96P36R84M88r60j977J423K821
5463B626j591k834J582K005n67r90j176K10K506L70l502p2L143j12j933m34N22
5480b47Q66J172j916j972K880J442k312j606J775Q36k00r39j521J500K328j780
5496C06k935K121K185j073j340m49O70J671L9l225j49L498K72k975k33J401O22
5513D06J91j533j033K084J851k801j651K352J383j794m33k8M67J934j091k699
$$ plain form
5529 -2395 -1150 2185 478 -1897 -891 72 729 525 -1972 -1658 1200 1688 -1928 -1714 832 942 -125
5546 -125 -644 -1507 423 1885 -830 -2249 507 2023 -232 -916 -444 528 1542 503 -1899 -397
5562 -397 2685 958 -1874 -280 1505 1311 134 -999 -486 2093 2100 -1358 -860 1782 1563 -205 -202 -165
5580 -165 1050 2028 -411 -1977 1014 2354 -118 -1178 400 1159 1130 149 -1296 121 2252 730
5596 730 -2242 -197 1887 696 -406 -778 -479 1321 1471 -1542 -1344 1560 1682 -1205 -1016 323 960
5613 960 1059 -686 -1954 429 2093 -640 -2175 436 1167 82 -809 -1146 -153 1697 183 -2441 -778
5630 -778 1878 122 -1668 -869 -162 702 510 -2002 -1927 1462 1323 -1788 -1564 180 689 -49 -978 -1324
5648 -1324 544 1738 -925 -2271 414 1112 -433 -1219 -777 -394 1057 137 -2547 -471 1840 11
$$ packed form
5529b395J245L335j707k375J006R63O57k04k497L14K858M88l616K14K546J10j067
5546a25n19q63J930J462k715j419K756J516k255o84M72R72J014j039k402J502
5562c97L082j727k832J594J785j94j177j133N13K579Pl458M98K642k19j768LL7
5580a65J215R78k439j566K991J340k472j060J578P59k9r81j445J417K131j522
5596G30k972K045K084j191j102l72K99J800J50l013J98K904J22k887J89J339O37
5613I60R9j745j268K383J664k733j535K611P31j085q91l37R93J850j514k624J663
5630g78K656j756j790P99P07Q64j92k512P5L389j39l111K24J744N09p38r29l46
5648a324J868J194k663j346K685O98j545p86M42L83J451r20k684K076K311j829
$$ plain form
5664 11 -1911 -480 490 382 -47 -1395 -1061 1662 1368 -1592 -1650 1248 1037 -574 -803 -812 638 1730
5682 1730 -619 -2059 743 2061 -396 -1074 417 769 1140 198 -1321 15 2539 297 -1977 209
5698 209 1785 890 -215 -747 -88 1782 1515 -1342 -951 1877 1524 -1145 -557 284 976 1617 -280 -1654
5716 -1654 863 2521 -415 -1244 684 1299 483 67 -830 51 1958 297 -1865 26 1828 517
5732 517 -1328 -457 188 1114 885 -1408 -1191 1891 1178 -1511 -1292 672 912 312 -592 -1365 404 1942
5750 1942 -794 -1956 654 1230 -314 -970 -779 -273 993 52 -2015 -638 1628 -251 -1734 -612
5766 -612 420 191 -273 -1734 -1282 1493 768 -1969 -1568 1093 777 -807 -1355 -1278 452 1420 -991 -2438
5784 -2438 663 1436 -783 -1050 -334 116 777 -177 -1955 -573 1757 -21 -2076 -305 1359 412 -531
$$ packed form
5664A1j922J431R70j08m29j348L34K723k94k960n8K898k11j611k29rJ450J092
5682A730k349j440K802J318k457o78J491L52L71r42j519J336K524k242k274K186
5698B09J576q95j105n32O59J870k67k857L91K828l53k669N88Q41O92O41j897j374
5716a654K517J658k936q29J928O15q16m16q97Q81J907j661k162J891J802j311
5732E17j845Q71O45R26k29k293K17L082p13k689K19J964K40o00r04p73J769J538
5750A942k736j162K610N76j544o56J91N06J266r41k067J377K266j879j483J122
5766f12J032k29m64j461M52K775p25k737M01K661l16j584n48P7J730R68k411j447
5784b438L101P73k219k67P16M50O61r54j778J382K330j778k055J771J664r47r43
$$ plain form
5801 -531 -1158 -344 1704 1064 -1844 -1064 1823 1234 -902 -759 66 707 1334 -613 -1607 913 1945 -533
5819 -533 -1286 548 850 597 243 -796 -87 2220 576 -1736 197 1804 223 -648 -78 599 1486
5836 1486 1106 -1340 -870 2229 1496 -1049 -443 747 939 830 -523 -1328 1220 2061 -844 -1543 1108
5853 1108 1587 157 -496 -461 426 1446 227 -2022 476 2159 102 -1055 -108 665 477 -42 -1376
5870 -1376 -1096 1435 1047 -1668 -1329 1007 567 -466 -1080 -1021 528 1252 -1191 -2071 762 1163 -932
5887 -932 -1171 -782 -74 777 -178 -1986 -569 1615 -257 -2237 -288 741 174 -542 -1427 -1062 1155
5904 1155 797 -2151 -1532 1374 409 -949 -884 -691 621 1027 -1108 -1970 905 1668 -934 -1183 195
5921 195 376 391 -343 -1520 -64 1955 -40 -1897 -25 1376 -236 -738 -300 70 1228 633 -1475
$$ packed form
5801e31o27Q14K048o40k908P80K887n89k136J43Q25O41O27j947r94K520J032k478
5819e33p53J834L02k53l54j039P09K307j644k312J933J607j581q71N70O77Q87
5836A486l80k446M70L099p33k545O06J190J92j09j353q05K548Q41k905o99K651
5853A108M79j430o53L5Q87J020j219k249K498J683k057j157R47P73j88n19j334
5870a376K80K531l88k715L39K336m40j033o14N9J549P24k443q80K833M01k095
5887i32k39L89P08Q51r55j808J417K184j872j980J949J029n67p16q85L65K217
5904A155l58k948O19K906r65j358O5J93J312M06k135q62K875P63k602k49J378
5921A95J81J5p34j177J456K019j995j857J872J401j612n02M38L70J158n95k108
$$ plain form
5938 -1475 -788 2058 1086 -988 -465 875 849 1102 -566 -1009 1247 1943 -701 -1601 781 1528 312
5955 312 -37 -570 262 1838 233 -1751 407 2115 -8 -712 258 337 914 588 -1368 -632 1896 1075
5973 1075 -1467 -472 1446 1044 34 -513 -639 1253 1754 -868 -1691 1143 1535 -541 -741 -436 290
5990 290 1328 -103 -1686 211 1651 156 -1552 -169 525 84 -248 -1174 -834 1488 680 -1838 -1367
6007 -1367 1470 217 -923 -1079 -649 567 860 -1417 -2085 798 952 -865 -1237 -138 480 638 -726
6024 -726 -1858 -78 1382 -497 -2097 56 908 -163 -715 -1060 -274 1226 286 -1958 -987 1367 375
6041 375 -1574 -689 402 663 657 -1286 -1283 1093 1578 -782 -1338 473 845 61 -287 -934 247 1377 -44
6060 -44 -1615 227 1634 -96 -1054 316 560 1154 469 -1324 -278 2070 780 -1312 -269 1248
$$ packed form
5938a475O87K846r72k074N23J340k6K53j668m43K256O96k644r00K382P47j216
5955C12l49n33Q32J576j605j984K158J708k123p04R70P9N77l26j956P36K528q21
5973A075k542R95J918m02j010n47j26J892N01k622q23K834L92k076k00L05P26
5990B90J038j431j583J897J440j495j708J383O94m41l32r26L40K322q08k518M71
6007a367K837j253j140j56M30J216K93k277o68K883J54j817l72J099O18J58j364
6024g26j132J780J460j879j600K153Q52j071n52l45P86J500r40k244R71K354r92
6041C75j949Q85J091K61oj943LK376M85k360n56J811L72p84l48o47J181J130j421
6060d4j571J842J407j730r58J370K44N94o85j793J046K348j290k092J043J517
$$ plain form
6076 1248 727 138 -548 -1053 1445 1708 -815 -1540 1291 1457 -154 -458 -367 438 1511 214 -1524 373
6094 373 2037 152 -926 384 864 453 241 -710 -346 1988 966 -1568 -407 1272 601 -584 -343
6111 -343 -110 930 1460 -1111 -1558 1120 1340 -866 -1092 -180 423 569 -308 -1536 -43 1758 -171
6128 -171 -1561 -489 877 134 -852 -1210 -653 1190 529 -1997 -474 1328 201 -1538 -712 -135 509
6145 509 442 -1407 -1619 748 1054 -1427 -1633 126 606 -27 -502 -1274 -47 1578 -274 -1608 -12
6162 -12 1088 -212 -936 -519 -52 842 341 -1492 -689 1373 485 -1399 -770 768 482 149 -884 -943
6180 -943 1015 1134 -1162 -1390 1237 1276 -413 -351 -349 116 1692 175 -1274 357 1797 25 -1161 374
6198 374 792 924 452 -863 -303 1928 735 -1229 -217 1500 839 -154 -434 -110 1244 1357 -918
$$ packed form
6076A248n21n89o86n05K498K63k523p25K831J66j611l04R1Q05J073j297j738J897
6094C73J664j885j078J310M80m11k12r51L64K334j022k534J161J679o71j185K41
6111c43K33J040N30k571m47K678K20k206k26R12O03J46q77j228J493J801j929
6128a71j390J072J366p43r86l58N57J843o61k526J523J802j127j739Q26N77O44
6145E09o7j849k12K367L06k481k06J759M80o33m75p72J227J625j852j334J596
6162a2J100j300p24M17M67Q94n01j833Q03K062q88j884O29J538k86l33j033n9
6180i43J958J19k296k28K627L9j689O2KM65J576j517j449J631J440j772j186J535
6198C74M18J32m72j315N60K231j193j964J012J717o61r93k80L24J354J13k275
$$ plain form
6215 -918 -1094 1281 1720 -524 -574 330 653 784 -14 -1012 563 1593 -13 -1449 331 1167 437 -215
6233 -215 -995 -22 1126 446 -1470 -96 1385 486 -835 -427 63 741 647 -1440 -1337 1289 1245 -1188
6251 -1188 -1227 324 696 115 -573 -1318 343 1200 -508 -1898 288 1127 -152 -656 -492 -267 886 -110
6269 -110 -1749 -735 1200 -31 -1419 -688 507 287 -224 -1177 -1411 1100 1116 -1537 -1342 675 560
6286 560 -493 -748 -686 338 1169 -577 -1678 363 1148 -176 -852 -152 361 656 4 -1038 -328 1585
6304 1585 366 -1171 -546 1294 242 -272 -490 -238 1233 921 -889 -1192 1134 1049 -748 -753 510 774
6322 774 1137 -180 -1218 657 1814 -298 -1210 325 1003 696 -167 -677 -59 1674 673 -1281 -83
6339 -83 2054 425 -589 -53 146 1016 879 -954 -1014 1544 1186 -579 -949 613 814 571 -374 -954
$$ packed form
6215i18j76K375M39k244n0R04L23J31p98r98J575J030j606j436J780Q36p30o52
6233b15p80R73J148o80j916J374J481q99j321M08M90O78r4k087J03K626m4k433
6251a188l9J551L72n81o88p45J661Q57j708j390K186Q39j279n04J64K25J153r96
6269a10j639J014J935j231j388P31J195k20n11r53k34K511J6k653J95K017j15
6286E60j053k55O2J024Q31j746j101K041P85j324o76P00N13K95o52j042P10J913
6304A585j219j537O25J840j052n14k18K52J471l12j810l03K326q5j797nJ263K64
6322G74L63j317j038J875J157k112r12J535O78l07q63n10O18J733j001j954J198
6339h3K137j629j014N36J99Q70j37j833o0K558l58j765l70J562K01k43r45n80
$$ plain form
6357 -954 477 1587 -602 -1790 387 1211 -252 -380 -240 243 857 262 -1433 -616 1072 200 -1211
6374 -1211 -432 133 393 -59 -1246 -1069 816 960 -1315 -1261 800 564 -733 -1089 -1030 305 1531 -477
6392 -477 -1784 174 869 -670 -1037 -392 178 428 -204 -1328 -752 1028 -95 -1509 -264 647 176
6409 176 -286 -708 -580 1154 748 -1227 -1270 981 844 -833 -668 -498 471 1184 -698 -1593 462 1495
6427 1495 -516 -1016 180 598 450 87 -731 -263 1413 299 -1466 -296 1357 376 -320 -492 -56
6444 -56 883 635 -967 -448 1710 1156 -772 -140 657 917 658 -721 -892 811 1714 -384 -1192 591
6462 591 1235 156 67 -349 222 1309 538 -1247 128 1504 436 -1034 -247 379 902 190 -530 -576
6480 -576 1161 752 -1522 -719 823 686 -346 -872 -729 350 1347 -526 -1598 368 1086 -371 -725
$$ packed form
6357i54J431J110k189j188K177Q24j463j28J40M83O14n95j695Q17J688q72j411
6374a211P79N65K60m52j187J77J885J44k275N4K061k36j297l56N9J335J226k008
6392d77j307J958O95j539l67O45N70K50o32j124N76J780j123j414J245R11m71
6409A76m62m22J28J734m06j975m3K251j37j677J65J70R69P13j882q95K055J033
6427A495k011n00J196M18j48l63q18M68J676j114j765J170J653r81o96j72M36
6444e6R39k48j602N19K158n54j928O32P97K60k59j379j71J703R03k098q08J783
6462E91O44j079q9m16N71J087p71j785J375J376j068j470P87O26N23p12p20m6
6480e76J737m09k274Q03J542j37j032n26J43J079R97j873j072J966P18j457l54
$$ plain form
6497 -725 -68 240 693 -81 -1311 -332 1370 -53 -1320 -299 751 167 -432 -736 -414 614 573 -1560
6515 -1560 -1203 822 592 -698 -688 -600 199 644 -884 -1382 373 1431 -692 -1376 -115 437 -382 -322
6533 -322 -1225 -306 1083 -117 -1428 -232 1029 40 -795 -560 -125 603 809 -901 -748 1146 785 -1136
6551 -1136 -634 230 501 619 -144 -1018 980 1660 -689 -1109 562 1060 135 -98 -587 102 1282 245
6569 245 -1174 60 1346 161 -560 -170 485 443 416 -825 -571 1690 913 -948 -324 970 1048 213
6587 213 -298 -310 882 1421 -376 -1256 898 1133 9 -515 -342 651 1070 107 -1256 191 1464 -44
6605 -44 -912 -218 393 346 87 -719 -494 1216 901 -1064 -844 1032 622 -758 -692 -503 559 1171 -1082
6624 -1082 -1460 528 1010 -557 -1076 -28 512 441 -404 -1491 -183 1272 -242 -1573 -167 873 -40
$$ packed form
6497g25O57L08M53p74j230R79J702j423j267J021J050n84n99l04L22J028m1k133
6515a560L57K025k30j290J0Q8P99M45j528m98J755J058k123o84J261N52q19O0
6533c22r03R19J389j200j311J196J261r89q35K35M35P28K06j710J53J894l61j921
6551a136N02Q64K71J18p63q74J998O80k349m20J671M98r25k33m89O89J180j037
6569B45j419J234J286j185p21L90O55m2k7j241K54K261p77j861O24J294P8q35
6587B13n11j2J192N39j797q80K154K35j124n24J73R93M19r63j363J447J273j508
6605d4q68O94O11m7k59q06K25J710l15j965K20J876m10j380O6J89J062O12k253
6624a082l78J988M82j567n19J048N40p1q45j087J308J455j514j331J406J040r13
$$ plain form
6641 -40 -445 -867 -634 721 386 -1487 -1010 764 463 -967 -626 -66 397 466 -899 -1247 656 924 -1025
6660 -1025 -1476 55 660 72 -523 -946 -50 959 152 -1702 -31 1248 95 -594 -493 109 592 512
6678 512 -1031 -552 1286 1013 -935 -894 743 725 80 -718 -188 1009 1152 -638 -1102 708 1008 -29
6696 -29 -716 -286 540 1302 156 -900 289 1496 36 -720 357 650 827 73 -468 -427 1508 660
6714 660 -992 -429 1210 709 -191 -629 -229 759 1110 -387 -1068 747 1317 -529 -699 209 637 851
6732 851 -22 -1130 -5 1316 83 -1301 65 625 151 -108 -734 -471 642 663 -1229 -844 739
6749 739 321 -868 -637 -78 -79 707 -837 -1194 435 1195 -862 -1463 281 393 -44 -399 -924 -231 801
6768 801 -226 -1700 -126 619 -120 -793 -672 27 166 312 -951 -650 1190 360 -1334 -380 261 287
$$ packed form
6641d0m05m22K33J355l35j873M77J774l01j430L41N60M63O9j365l48J903K68j949
6660a025m51J531O05n88n95m23Q96J009q07j854J671J279j153o89J01O02M83q0
6678E12j543M79J838k73j948M1J637j8o45p98N30J197J43j790m64J810L00j037
6696b9o87M30Q26P62j146j056J189J207j460p56J077K93J77p54n41M1J935q48
6714F60j652N63J639n01r00m38M00R88L51j497o81J815N70j846j70R08M28K14
6732H51q73j108J125J321j233j384J366N60m74k59o26K63J113K1j892L85J583
6749G39m18j189K31N59jP86j544l57J629P60k057o01J744J12m37l55n25O93J032
6768H01j027j474J574P45p39o73J21O99J39J46j263L01J840q30j694R54O41K6
$$ plain form
6786 287 39 -798 -1040 593 848 -727 -1207 934 846 -258 -530 -742 180 1022 51 -1100 111 1336
6804 1336 -37 -864 72 40 507 1 -648 -266 1377 412 -1261 -371 901 550 79 -506 -54 849 932
6823 932 -702 -748 1186 1347 -221 -515 198 710 959 108 -755 251 1689 116 -1026 412 974 171
6841 171 -135 -461 -342 988 745 -899 -63 1116 176 -729 -388 34 656 650 -1008 -1160 1017 966 -985
6860 -985 -752 228 310 170 -164 -920 -124 1426 -60 -1284 76 727 -24 -489 -437 162 815 173 -1507
6879 -1507 -617 1406 374 -1486 -595 -64 309 -108 -828 -516 620 822 -1051 -1205 585 206 128 -648
6897 -648 -855 100 858 -186 -1564 56 955 -455 -731 -262 -114 494 184 -1218 -553 820 346 -1200
6915 -1200 -372 631 420 -88 -318 -419 639 850 -799 -963 695 536 -316 -647 -233 860 976 8
$$ packed form
6786B87k48q37k42J633K55j575m80K141q8j104k72k12R22Q42r71j151J211J225
6804A336j373q27R36l2M67n06o49L82J643r65j673Q90J272l51m71n85M52R03Q3
6823I32j634m6J934J61j568k94P13N12K49q51q63J006J438j573j142J438N62q03
6841A71l06l26J19J330k43j644Q36J179r40r05L41M22O22oj658j52K177n1j951
6860i85K33R80Q2j40l34p56P96J550j486j224J360O51p51m65N2N99O53o42j680
6879a507Q90K023j032j860Q91N31L73m17p20L12J136K02j873j54J790l79p8p76
6897f48k07R55P58j044j378J620Q99j410k76M69J48O08l10j402O65J373m74j546
6915a200Q28J003k11n08k30j01J058K11j649j64J658j59q52l31M14J093J16r68
$$ plain form
6933 8 -995 328 1665 -208 -1020 4 574 461 104 -796 -177 1172 314 -909 -175 1492 349 -413
6951 -413 -290 216 265 859 -512 -576 1460 1101 -686 -394 460 658 509 -245 -672 410 1120 -123 -1071
6970 -1071 425 1029 142 -106 -324 499 840 268 -898 -136 1137 351 -844 -367 273 404 362 -763
6988 -763 -697 896 849 -801 -975 707 780 -242 -555 -892 414 1045 -627 -1541 75 1181 -258 -761
7006 -761 -260 7 516 0 -1028 -444 877 -4 -1408 -343 283 -473 -182 -801 -452 696 668 -842
7024 -842 -1190 806 526 -752 -670 -98 241 761 -388 -1556 263 1115 -478 -820 -225 215 12 -413
7042 -413 -921 -350 766 430 -1221 -385 624 377 -323 -304 -155 545 525 -860 -882 888 851 -755 -403
7061 -403 491 787 352 -440 -819 801 1401 -247 -1026 146 919 240 -81 -465 174 1055 645 -741 59
$$ packed form
6933Hj003J323J337j873q12J024N70j13l57r00O19J349q58j223P34J667j143p62
6951d13J23N06M9N94j371o4K036l59j787K92Q54J98j49p54m27J082P10j243r48
6970a071J496O04q87k48k18Q23L41n72j166P62J273p86j195M77O40J31m2j125
6988g63O6J593m7j650j74J682P3j022l13l37J306O31j672r14J616J106j439n03
7006g61N01K67N09n16j028N84J321q81j404J065O26p56K91o19L49J148k8j510
7024h42l48J996k80j278Q2N72L39N20j149j168J819Q52j593l42N95M40k03m25
7042d13n08N71J116l36j651Q36J009k47p00J9J49P00k0j385k2J770l7j606L52
7061d03Q94K96m35p92l79J620O00j648p79J172P73o79l21l84O39Q81m10j386Q00
$$ plain form
7080 59 1203 532 -536 224 310 626 331 -426 -532 818 943 -936 -545 643 564 58 -400 -459 387 1053
7100 1053 -471 -1077 320 909 -117 -747 4 164 961 187 -1115 -300 1214 34 -881 32 501 130
7118 130 39 -463 -418 837 713 -1040 -836 726 687 -275 -692 -424 214 575 -806 -1324 124 1129 -392
7137 -392 -1058 -261 431 382 -99 -1030 -169 835 17 -1067 -267 902 23 -627 -643 -238 403 243 -1156
7156 -1156 -662 970 510 -754 -757 103 243 408 -977 -929 172 1022 -340 -1004 9 630 372 -410 -682
7175 -682 -20 814 498 -1197 -14 1156 209 -380 -132 64 483 474 -862 -334 1030 814 -628 -271 747
7194 747 672 217 -16 -492 526 1175 -218 -1018 618 1117 -4 -226 9 99 882 274 -1022 99 1422
7213 1422 484 -951 295 744 122 190 -51 -262 578 651 -872 -869 825 510 -283 -192 -373 521 784 -442
$$ packed form
7080E9J144o71j068P60Q6L16k95p57j06J350J25j879L91J188p9n06m58n9Q46O66
7100A053j524o06J397N89j026o30P51J60P97p74j302Q15J514j180r15R13M69l71
7118A30r1n02M5J255j24j753K04J562l9r62m17K68O38L61j381n18J448J005j521
7137c92o66P97O92m9m81r31Q61J004q18j084Q00J169q79o50j6M05O41j60j399
7156a156M94J632m60j264lQ60J40J65j385M8J101Q50j362o64J013O21k58p82k72
7175f82O62Q34l16j695J183J170r47n89K48J96M19rj336N28J364k16j442L57J018
7194G47p5m55k33m76J018O49j393q00J636M99j121k22K35R0P83o08j296J121J323
7213A422r38j435J246M49o22O8k41k11Q40P3j523LJ694l15p93R1j81Q94K63j226
$$ plain form
7233 -442 -987 936 1011 -348 -843 -292 179 547 104 -707 -149 1081 120 -1253 -369 773 299 -274 -766
7252 -766 -605 715 402 -911 -589 699 493 -321 -798 123 -235 183 -715 -1018 307 766 -518 -1093
7270 -1093 132 462 -155 -241 -478 -245 874 -118 -1250 -182 819 -256 -722 -549 -30 429 466 -881
7288 -881 -740 965 209 -839 -498 261 543 121 -472 -714 702 836 -725 -1065 292 659 -128 -223 -241
7307 -241 61 879 -90 -968 -174 1246 314 -697 -260 652 394 268 -534 -421 874 838 -920 -345 849
7326 849 623 -187 -179 -75 408 907 -206 -779 594 1111 -223 -456 135 714 520 140 -569 -112 1146
7345 1146 156 -846 69 579 224 -60 -402 -286 763 583 -845 -615 677 579 -410 -357 113 183 365
7364 365 -343 -924 195 1275 -533 -804 160 446 -17 -341 -746 29 773 -102 -1191 -309 718 -57
$$ packed form
7233d42n45J923P5j359m95N51M71L68m43q11N58J230r61j373Q84J142m74n73m92
7252g66J61J320l13j313L22J288k06q14m77R21l58M18q98l03J325M59j284n75
7270a093J225L30o17q6k37K33J119r92j132J068J001j075m66J73N19M59L7j347
7288h81J41J705p56j048L41P59K82m22n93k42J416J34j561l40J357L67p87r5j8
7307b41L02Q18r69q78P94J420r32j011M37R12k58j26q02J13J295l6j758N75J194
7326H49k26q10QJ04M83M99j113n73J373N17j334k33N91N79j94l80p09M57J258
7345A146r90j002R15N10l55k84l42J16J049j80j428K30J292r8r89N3M70P0J82
7364C65p08n81J119J080j808k71R64K86m63l24m05P75P44q75j089Q82J027p75
$$ plain form
7382 -57 -588 -294 -167 157 339 -834 -763 743 30 -1082 -639 289 -126 21 -433 -785 576 760 -694
7401 -694 -1122 482 338 -124 -368 -319 124 325 -412 -1138 -45 1108 -74 -696 -157 301 200 253 -762
7420 -762 -425 731 137 -956 -583 475 340 154 -221 -376 296 979 -588 -595 623 811 94 -338 293
7439 293 345 872 -62 -691 470 1122 299 -778 495 1066 422 62 -461 -58 1075 524 -698 -183 720
7458 720 617 -470 -69 427 737 715 -71 -1000 892 826 -465 -589 207 399 519 -54 -694 209 1414
7477 1414 2 -998 363 895 200 -168 -328 180 693 497 -888 -337 772 265 -472 -264 110 306
7495 306 79 -659 -527 486 793 -1187 -733 349 558 -255 -492 -674 50 703 -67 -867 -78 842 -205
7514 -205 -789 -567 -92 254 380 -671 -785 687 418 -1146 -303 285 229 -426 -587 -202 257 732 -933
$$ packed form
7382e7n31K94J27L24J82j173P1J506p13j112M43R28m15J47m54l52J361J84j454
7401f94m28J604j44m62k44M9M43K01p37p26J093J153j182o22N39M58j01N3j015
7420g62L37J156n94j093L73J058j35j86l75j55O72O83j567pJ218J88p17m32O31
7439B93N2N27r34o29J161O52q23j077J273N71o44l60n23M03J133n51j222N15R03
7458G20j03j087M01M96L10k2p86r29J892o6j291j24P96J92J20n73o40R03J205
7477A414j412j000J361N32o95l68j60N08N13j96j385N51J109n07p37K08L74J96
7495C06k27p38J32J013L07j980M54J082K09q13k37j82P24O53p70q00P89R20j047
7514b05n84K22M75L46J26j051j14J472k69j564Q43N88n6o55j61L85M59M75j665
$$ plain form
7533 -933 -882 640 491 -581 -704 -294 219 340 -365 -1156 169 903 -166 -804 -342 319 201 130 -711
7552 -711 -72 894 326 -890 -222 916 308 -313 -363 2 560 479 -605 -500 1010 832 -524 -398 188
7571 188 549 644 -12 -612 449 1209 -57 -839 233 984 107 -311 -243 430 653 387 -493 -94 1037
7590 1037 287 -928 -128 557 531 310 -488 -442 724 937 -531 -549 580 382 -147 -217 -487 312 959 66
7610 66 -804 124 917 -24 -453 -245 -137 314 -376 -828 -513 674 53 -910 -214 255 105 -282 -556 -282
7630 -282 553 618 -867 -869 582 601 -468 -494 -354 234 361 -427 -957 197 512 -261 -850 -68 369 263
7650 263 22 -707 -316 691 61 -1231 -12 442 425 -262 -361 -138 618 474 -477 -725 576 688 -580
7669 -580 -298 -17 522 206 -285 -696 174 974 -260 -781 250 594 168 -212 -163 -64 674 245 -1076 -316
$$ packed form
7533i33N1J522j49j072j23M10N13J21p05p91J325P34j069o38M62O61j18p1q41
7552g11O39R66n68j216O68J138o08o21n0L65N58q1j084J05J510j78j356J26N86
7571A88L61R5o56o00J061P60j266p82J072P51q77m18O8O73K23k66q80L99J131
7590A037p50j215Q00O85k6k21p98M6J166K13j468j8J129j98n29p0k70P99O47q93
7610F6q70R28P93r41m29K08J08M51o90m52L15J187o21r63O96M69j50l87k74K74
7630b82Q35O5j485kJ451J9j069k6J40N88J27p88n30J154L15p73n89P82M37j06
7650B63k41p29L91J007o30j292J219M54j7o87r9K23P56j44r51k48J301J12j268
7669e80K82K81N39l16m91m11Q70Q00j234n21J031L44m26l80M9R9P38m29j321P60
$$ plain form
7689 -316 1167 457 -511 19 218 345 411 -295 -275 907 744 -587 -489 500 724 130 -126 -157 427 1278
7709 1278 301 -906 302 1010 -213 -290 -110 353 689 338 -672 -247 948 475 -587 -339 378 272
7727 272 129 -283 23 704 449 -729 -751 410 579 -191 -258 -140 349 631 -440 -947 335 589 -348
7746 -348 -1012 -157 158 400 -12 -792 -518 1081 -124 -653 -379 466 101 -420 -436 -19 463 405 -978 -962
7766 -962 537 182 -494 -488 -170 471 20 -236 -1096 450 837 -501 -761 -88 583 173 -309 -188 -316 462
7786 462 171 -1109 -435 442 222 -203 -234 -36 256 327 -329 -439 621 335 -844 -673 535 483 -17 -745
7806 -745 -482 537 770 -206 -577 299 576 -12 -338 -343 278 740 309 -802 -39 1009 334 -255 174 99
7826 99 573 208 -361 -134 766 773 -859 -202 366 634 -369 -416 -129 392 611 -437 -729 334 672 125
$$ packed form
7689c16J483p10r68N30J99J27O6p06K0J182j63j331R8R89K24n94k56l1N84Q51
7709A278r77j207J208P08j223p7J80M63L36l51j010M25J195m73j062K48P17j06
7727B72j43m12L06O81k55j178k2J161J69p70o7J18M89K82j071n07J282K54r37
7746c48o64Q55L15K42m12p80K74J599j205n29K74Q45l65n21j6M17M82n8j383J6
7766i62J499l55o76OL18O41m51k56q60J546L87j338k60O73O71m10m82J21j28P78
7786D62k91j280O74Q77k20m25l1J98K92P1o56j10J060k86j179J71J208n2n00p28
7806g45K63J019K33r76l71Q76K77n88l26nO21M62m31j111P63J048o75n89M29p5
7826I9M74l65n69K27R00Pj632O57N68K68j003m7K87N21K19j048k92J063L38n47
$$ plain form
7846 125 -571 105 169 300 129 -754 102 1066 -83 -631 78 454 430 -51 -360 138 382 381 -622 -605 560
7867 560 529 -202 -694 21 53 64 -195 -657 280 558 -524 -711 119 386 31 -238 -679 -246 311 184 -882
7888 -882 -459 683 -2 -618 -227 -308 -141 210 -708 -806 415 194 -783 -462 -34 159 338 -422 -558 108
7908 108 656 -536 -971 148 634 -284 -287 -446 167 324 -250 -913 -129 735 382 -608 -101 353 269 38
7928 38 -643 -269 918 313 -732 -219 823 445 -104 -417 -175 523 871 -221 -580 615 734 51 -322
7947 -322 49 401 776 -95 -433 20 784 146 -560 -116 718 182 97 -242 -103 747 550 -543 -435 781
7967 781 436 -175 -235 -177 147 523 -396 -646 491 751 -127 -561 228 436 -39 -347 -528 -150 868 -60
7987 -60 -805 47 390 246 -443 -261 -264 285 286 -893 -323 768 608 -721 -359 27 199 10 -235 -710 524
$$ packed form
7846A25o96O76O4J31j71q83Q56R64j149n48P09L76k4m81l09M98K44jj003J7J165
7867E60l1p31m92P15L2J1k59m62R37K78j082j87Q30K67l55k69m41M33N57j27j066
7888h82M23J142o85o16L91q1J67L51r18r8J221k21r77L21M28J93J79p60j36O66
7908A08N48j192m35J119M86r18lj59O13J57n74o63P84Q64l53r90N07M54q4k31
7928C8o81L74J187o05j045N13J042l78n49l13K42O98L48j092l59J195J19o83l73
7947c22L71L52L75q71l38M53P64o38p06M44Q34n36q5l39J39Q50j97j093J08J216
7967G81l45o11o0N8L24L76r19k50J137K60q78m34P89K08m75l08j81L78J018r28
7987f0p45Q52L43j44o89J82lN49Jj179N70J091j60j329L62L86J72j89k45m75J234
$$ plain form
8008 524 627 -624 -742 34 379 -40 -414 -320 173 395 -186 -844 -250 427 49 -581 -254 235 167 -106
8028 -106 -591 -276 474 361 -517 -251 427 144 -66 -346 -238 591 426 -451 -599 466 557 -268 -381 -6
8048 -6 193 242 3 -496 59 478 -99 -559 -131 630 259 -15 -344 -289 599 18 -470 -510 588 372 -385
8069 -385 -132 238 278 770 -141 -472 708 585 -475 -250 57 349 497 -105 -168 207 964 60 -777 417
8089 417 570 93 -302 9 -156 565 281 -597 -230 802 450 -491 -248 232 156 354 -335 -519 726 913
8109 913 -344 -357 239 324 -98 -249 -255 367 749 -138 -1067 85 792 -148 -718 -300 283 215 25 -704 -447
8130 -447 603 20 -771 -381 266 375 -213 -511 -363 302 324 -701 -489 437 282 -393 -576 -236 69 270
8150 270 -427 -888 -124 476 18 -630 -172 266 235 -345 -284 -204 717 415 -738 -140 665 131 -460 -63 -29
$$ packed form
8008E24J03j251j18P76L45m19l74R4M93K22n81o58N94O77l78o30L27M89o8k73
8028a06m85L15P50j13q78K66O78k83k10k80J08Q29j65q77j48J065R1q25j13L75
8048fJ99M9k39m99N55M19n77m60M28P61l71k74l29N5Q88n81m88m0J098k16p57
8069c85K53L70M0M92r11l31J180j23j060K25L07K92J48o02o3L75P57r04q37J194
8089D17J53m77l95L11j65P21k84q78L67J032l52r41K43M80p6J98o89j84J245J87
8109I13j257j3N96Q5m22j51oO22L82q87r29J152P07r40n70M18N83o8j90p29K57
8130d47J050n83p91L90O47J09n88k98J48O65K2j025K12R26j55o75j83L40L05K01
8150B70o97m61P64O00m58o48M58M38l1n80O1Q0R21l02j153N98Q05n34n91L97L4
$$ plain form
8171 -29 561 115 -182 -615 566 368 -567 -511 356 219 140 -27 -245 407 925 -124 -423 -141 662 116
$$ packed form
8171b9N90m46k97m33J181j98r35N6Q67j37p9j67k18O52N18j049k99K82Q03n46
8191A16
$$ Imaginary data points
##PAGE= N=2
##DATA TABLE= (X++(I..I)), XYDATA
$$ plain form
0 0 0 0 0 -5 8 0 8 -8 16 -16 24 -24 32 -40 48 -56 71 -82 98 -114 135 -156 181 -210 241 -275 314 -355 404
29 404 -457 513 -577 646 -722 807 -899 1000 -1110 1232 -1364 1509 -1672 1853 -2051 2272
45 2272 -2521 2803 -3123 3491 -3919 4429 -5039 5793 -6745 7996 -9722 12266 -16402 24296
59 24296 -44828 211350 475139 143646 95607 176399 242119 174530 97119 45129 147379
70 147379 194096 90176 18221 106513 137843 111624 105389 106599 125191 191791 140010 39554
82 39554 99505 185258 70980 -40022 14360 87321 76668 13009 -63790 -13644 131178 111128
94 111128 -38229 -24845 94412 111753 67645 25046 -13380 36873 97635 10327 -74144 -225
106 -225 50951 -8839 -32517 -2674 21846 47979 21170 -25807 47896 123463 23385 -55258
$$ packed form
0@%%%nJ3qQj6K4l2M0m8N6p2Q8j04J27j53J80k12K49k91L37l91M51n16N89o69P59
29D04q61R70j090J223j368J529j706J899k110K342k596K873l181L525l904M323
45B272m793N324n926O614p410Q348r468J0832j2538J4741j7718K1988k8668M0698
59B4296o9124K56178K63789l31493m8039Q0792O5720o7589p7411n1990J02250
70A47379M6717j03920p1955Q8292L1330k6219o235J210J8592O6600n1781j00456
82C9554N9951Q5753j14278j11002N4382P2961j0653o3659p6799N0146J44822k0050
94A11128j49357J3384J19257J7341m4108m2599l8426N0253O0762q7308q4471P3919
106b25N1176n9790k3678K9843K4520K6133k6809m6977P3703P5567j00078p8643
$$ plain form
118 -55258 40796 103652 41332 -12336 -28461 138 83459 70102 -49616 -41751 82567 101333
130 101333 38084 15249 27208 80622 121716 41825 -23687 66261 113757 18784 -10393 54766
142 54766 60097 31589 22426 10562 49408 98551 31990 -27695 58157 117568 46218 -5986
154 -5986 3737 28855 77827 59075 -50610 -47355 74302 70370 -32723 -37321 21002 48674
166 48674 46033 -5150 -35460 41361 79037 -11062 -38444 39300 44061 -4990 -6170 -366 15973
179 15973 54328 13161 -49468 20091 97788 34879 -27873 7947 54605 73322 46340 -26438
191 -26438 -8643 97418 79049 -29459 -12212 67327 61441 28146 11716 4171 54688 88391
203 88391 15173 -19997 59472 81529 17020 1282 24506 42196 63229 23676 -39102 20311
$$ packed form
118e5258R6054O2856o2320n3668j6125K8599Q3321j3357j19718P865J24318J8766
130A01333o3249k2835J1959N3414M1094p9891o5512Q9948M7496r4973k9177O5159
142E4766N331k8508r163j1864L8846M9143o6561n9685Q5852N9411p1350n2204
154e986R723K5118M8972j8752j09685L255J21657l932j03093m598N8323K7672
166D8674k641n1183l0310P6821L7676r0099k7382P7744M761m9051j180N804J6339
179A5973L8355m1167o2629O9559P7697o2909o2752L5820M6658J8717k6982p2778
191b6438J7795J06061j8369j08508J7247P9539n886l3295j6430p545N0517L3703
203H8391p3218l5170P9469K2057o4509j5738K3224J7690K1033l9553o2778N9413
$$ plain form
215 20311 99268 28722 -46494 10415 64052 43993 12788 -17398 -2328 66612 48338 -44568
227 -44568 -25336 55838 35509 -17651 -19266 -9815 18112 38586 -25890 -63541 20957 55135
239 55135 -28451 -56745 -4729 16283 5966 -26128 -63404 -17851 45559 -15345 -83816 -24643
251 -24643 25833 -13948 -39844 -35514 -25490 13183 5621 -64340 -48368 34620 15160 -55150
263 -55150 -42074 290 14114 7441 -41577 -59592 23556 54902 -37989 -66271 11645 37049
275 37049 598 -23711 -35617 -4030 47114 4809 -61145 -12225 44148 1137 -32310 -12434
287 -12434 -270 13818 8490 -42127 -29628 46052 21335 -60616 -33783 30432 20566 -14710
299 -14710 -38471 -32934 29672 46870 -42584 -69203 19127 45104 -11704 -33083 -21398 790
$$ packed form
215B0311P8957p0546p5216N6909N3637k0059l1205l0186J5070O8940j8274r2906
227d4568J9232Q1174k0329n3160j615R451K7927K0474o4476l7651Q4498L4178
239E5135q3586k8294N2016K1012j0317l2094l7276M5553O3410o0904o8471N9173
251b4643N0476l9781k5896M330J0024L8673p562o9961J5972Q2988j9460p0310
263e5150J3076M2364J3824o673m9018j8015Q3148L1346r2891k8282P7916K5404
275C7049l6451k4309j1906L1587N1144m2305o5954M8920N6373m3011l3447J9876
287a2434J2164J4088n328n0617J2499P5680k4717q1951K6833O4215r866l5276
299a4710k3761N537O2606J7198q9454k6619Q8330K5977n6808k1379J1685K2188
$$ plain form
311 790 36364 6774 -55354 -16529 46695 5637 -38612 -5877 15351 6046 -2700 -26464 -14806
324 -14806 40460 14643 -60106 -24481 48570 18584 -36685 -35492 -10914 26627 30837 -43365
336 -43365 -68933 17773 49652 -22544 -53414 -21983 3604 18894 -7096 -58134 -27052 35097
348 35097 -4087 -55804 -14556 14750 -15366 -27414 -22187 -12254 14953 -6673 -62909 -26849
360 -26849 44764 5864 -60550 -40723 2346 18909 7011 -51252 -68172 16765 50044 -35506
372 -35506 -72006 -15539 14585 1671 -24511 -53660 -26598 26226 -8373 -60882 -19694 14265
384 14265 -26211 -39727 -14924 -10146 -5545 -15409 -53151 -27637 35723 16 -70610 -40265 18500
397 18500 17367 -12612 -50029 -50239 21600 45758 -39762 -71620 2059 32053 -5205 -27350 -31860
$$ packed form
311G90L5574k9590o2128L8825O3224m1058m4249L2735K1228r305q746k3764J1658
324a4806N5266k5817p4749L5625P3051k9986n5269J193K4578L7541M210p4202
336d3365k5568Q6706L1879p2196l0870L1431K5587J5290k5990n1038L1082O2149
348C5097l9184n1717M1248K9306l0116j2048N227R933K7207k1626n6236L6060
360b6849P1613l8900o6414J9827M3069J6563j1898n8263j6920Q4937L3279q5550
372c5506l6500N6467L0124j2914k6182k9149K7062N2824l4599n2509M1188L3959
384A4265m0476j3516K4803M778M601r864l7742K5514O3360l5707p0626L0345N8765
397A8500j133k9979l7417k10P1839K4158q5520l1858P3679K9994l7258k2145m510
$$ plain form
410 -31860 -13489 23215 545 -46617 -13018 26279 -13251 -35054 -480 8299 -4897 -13028
422 -13028 -31649 -11219 40774 8063 -63031 -27075 44653 25859 -24064 -36830 -16365 34846
434 34846 44591 -29666 -54972 22819 52111 -669 -21716 -4393 11870 32586 16858 -24943
446 -24943 1846 47006 9910 -22218 18992 37296 8868 -2789 -859 15511 47777 18264
458 18264 -42977 -5172 65776 32906 -28697 -20022 13338 37252 33046 -23551 -43653 27060
470 27060 53614 -10729 -35527 -120 15701 14632 -102 -28936 -7923 33286 -2626 -41597
482 -41597 2341 28970 -12254 -28180 -7233 6367 17179 -3894 -47351 -17768 46781 15086
494 15086 -48593 -29523 15137 21724 5321 -31698 -40757 20853 43701 -23625 -47016 7257
$$ packed form
410c1860J8371L6704k2670m7162L3599L9297l9530k1803L4574Q779j3196q131
422a3028j8621K0430N1993l2711p1094L5956P1728j8794m9923j2766K0465N1211
434C4846R745p4257k5306P7791K9292n2780k1047J7323J6263K0716j5728m1801
446b4943K6789M5160l7096l2128M1210J8304k8428j1657J930J6370L2266k9513
458A8264o1241L7805P0948l2870o1603Q675L3360K3914m206n6597k0102P0713
470B7060K6554o4343k4798L5407J5821j069j4734k8834K1013M1209l5912l8971
482d1597M3938K6629m1224j5926K0947J3600J0812k1073m3457K9583O4549l1695
494A5086o3679J9070M4660O587j6403l7019r059O1610K2848o7326k3391N4273
$$ plain form
506 7257 24527 -1697 -14671 -18387 -275 27431 -2329 -38348 5405 38186 -7953 -30742
518 -30742 3895 20527 15683 491 -27106 -5286 50899 24762 -39556 -15544 40021 32862
530 32862 2037 -14674 -9251 35972 49068 -13025 -31252 31385 46241 1402 -7877 8419
542 8419 19307 30784 9059 -21728 13868 50972 5987 -25355 13439 34690 16002 458
554 458 -12646 2902 45431 24749 -34358 -10701 46581 28326 -12901 -10735 7215 30545 33635
567 33635 -12733 -24766 34710 47405 -7546 -15175 21371 30636 23024 5515 -12252 19985 55797
580 55797 12072 -26271 18652 51025 21332 -29 2747 17532 44081 29204 -19732 -585
592 -585 54517 33309 -12732 -351 25730 29902 23187 -5780 -12729 35580 44031 -14172 -21434
$$ packed form
506G257J7270k6224j2974l716J8112K7706k9760l6019M3753L2781m6139k2789
518c0742L4637J6632m844j5192k7597K1820N6185k6137o4318K4012N5565p159
530C2862l0825j6711N423M5223J3096o2093j8227O2637J4856m4839r279J6296
542H419J0888J1477k1725l0787L5596L7104m4985l1342L8794K1251j8688j5544
554D58j3104J5548M2529k0682n9107K3657N7282j8255m1227K166J7950K3330L090
567C3635m6368j2033N9476J2695n4951p629L6546R265p612j7509j7767L2237L5812
580E5797m3725l8343M4923L2373k9693k1361K776J4785K6549j4877m8936J9147
592e85N5102k1208m6041J2381K6081M172o715k8967o949M8309Q451n8203p262
$$ plain form
605 -21434 28519 33807 4515 -8826 -9437 15905 41099 846 -38919 6115 43616 6039 -21704
618 -21704 -5992 9163 20490 9670 -26499 -14402 34549 16502 -31124 -12474 21111 10535
630 10535 -5146 -14206 -13488 18934 23491 -28519 -32147 25376 28648 -16955 -26036 -6775 14009
643 14009 25692 -8281 -42547 1136 43396 2741 -32493 -5673 16338 14114 4631 -16936
655 -16936 -8703 31723 19588 -25108 -5399 32929 14643 -7873 567 10478 25176 23509 -15480
668 -15480 -15501 41951 43779 -13867 -19923 19415 36486 27676 -2262 -23610 16619 55373 12749
681 12749 -27445 6257 34357 18498 4760 -4299 530 29762 23645 -16817 -4282 34583 14636
694 14636 -14709 2345 19166 17250 8911 -15103 -11096 37681 35516 -25509 -27720 25068 34992
$$ packed form
605b1434M9953N288k9292j3341o11K5342K5194m0253l9765M5034L7501l7577k7743
618b1704J5712J5155J1327j0820l6169J2097M8951j8047m7626J8650L3585j0576
630A0535j5681r060P18L2422M557n2010l628N7523L272m5603r081J9261K0784
643A4009J1683l3973l4266M3683M2260m0655l5234K6820K2011k224r483k1567
655a6936Q233M0426j2135m4696J9709L8328j8286k2516Q440R911J4698j667l8989
668a5480k1N7452J828n7646o056L9338J7071q810k9938k1348M0229L8754m2624
681A2749m0194L3702K8100j5859j3738r059M829K9232o117m0462J2535L8865j9947
694A4636k9345J7054J6821j916q339k4014M007M8777k165o1025k211N2788R924
$$ plain form
707 34992 8334 -13150 -18509 13613 44307 5351 -35169 1167 35747 11575 -8743 -5721
719 -5721 667 19295 16452 -17888 -10101 29000 10592 -24578 -1561 23440 7325 -9765 -16307
732 -16307 -5966 28061 21599 -33985 -33179 25036 30239 -11210 -26658 -15691 9874 28976 -6018
745 -6018 -44318 -7387 33355 3256 -27074 -12520 2160 7308 2993 -19649 -15311 16720 2223
$$ packed form
707C4992k6658k1484n359L2122L0694l8956m0520L6336L4580k4172k0318L022
719e721O388J8628k843l4340P787L9101j8408l5170K3017K5001j6115j7090o542
732a6307J0341L4027o462n5584Q06N8215N203m1449j5448J0967K5565J9102l4994
745f018l8300L6931M0742l0099l0330J4554J4680N148m315k2642M338L2031j4497
$$ [...]
8191i7
##END NTUPLES=NMR FID
##END=
