##TITLE=1H_CG-1123-1
 DMSO, 8 sc, 
 31.1.2020
##JCAMPDX= 6.0         $$ Bruker NMR JCAMP-DX V2.0
##DATA TYPE= NMR FID
##DATA CLASS= NTUPLES
##ORIGIN= UXNMR, Bruker Analytische Messtechnik GmbH
##OWNER= root
$$ XWIN-NMR		Version 3.5
$$ Fri Jan 31 14:35:04 2020 Russian Standard Time (UT+4h)  she@DPX200
##.OBSERVE FREQUENCY= 200.1315
##.OBSERVE NUCLEUS= ^1H
##.DELAY= (6, 6)
##.ACQUISITION MODE= SIMULTANEOUS
##.ACQUISITION SCHEME= undefined
##.AVERAGES= 8
##.DIGITISER RES= 18
##SPECTROMETER/DATA SYSTEM= spect
##.PULSE SEQUENCE= zg30
##.SOLVENT NAME= DMSO
##.SHIFT REFERENCE= (INTERNAL, DMSO, 0, 15.7039)
##AUDIT TRAIL= $$ (NUMBER, WHEN, WHO, WHERE, WHAT)
$$ ##TITLE= Audit trail, XWIN-NMR		Version 3.5
$$ ##JCAMPDX= 5.01
$$ ##ORIGIN= Bruker BioSpin GmbH
$$ ##OWNER= she
$$ F:/spectra/data/she/nmr/H-F/1/audita.txt
$$ ##AUDIT TRAIL=  $$ (NUMBER, WHEN, WHO, WHERE, WHAT)
(   1,<2020-01-31 14:33:44.62 +0400>,<she>,<DPX200>,
      <created by zg, POWCHK disabled, PULCHK disabled
       configuration hash MD5:
       00 E9 B6 7A A2 85 ED C7 34 08 36 98 17 FE 4E 26
       data hash MD5: 16K
       74 E9 FA F7 C8 F0 01 E6 0C 8A F6 E4 F9 00 35 5E>)
$$ ##END=
$$ 
$$ hash MD5
$$ 97 1F 2F 76 BC 01 6C E4 77 AA 90 86 51 BA B0 40
##$RELAX= 
##$RELAX= 
##$RELAX= 
##$RELAX= 
##$RELAX= 
##$RELAX= 
$$ Bruker specific parameters
$$ --------------------------
##$DU= <F:/spectra>
##$EXPNO= 1
##$NAME= <H-F>
##$PROCNO= 1
##$TYPE= <nmr>
##$USER= <she>
##$AMP= (0..31)
100 100 100 100 100 100 100 100 100 100 100 100 100 100 100 100 100 100 
100 100 100 100 100 100 100 100 100 100 100 100 100 100 
##$AQSEQ= 0
##$AQ_mod= 1
##$AUNM= <au_zg>
##$AUTOPOS= <>
##$BF1= 200.13
##$BF2= 200.13
##$BF3= 200.13
##$BF4= 200.13
##$BF5= 200.13
##$BF6= 200.13
##$BF7= 200.13
##$BF8= 200.13
##$BYTORDA= 1
##$CFDGTYP= 0
##$CFRGTYP= 5
##$CHEMSTR= <none>
##$CNST= (0..31)
1 1 145 1 1 1 1 1 1 1 1 1 1 1 1 1 1 1 1 1 1 1 1 1 1 1 1 1 1 1 1 1 
##$CPDPRG= <>
##$CPDPRG1= <>
##$CPDPRG2= <>
##$CPDPRG3= <>
##$CPDPRG4= <mlev>
##$CPDPRG5= <mlev>
##$CPDPRG6= <mlev>
##$CPDPRG7= <mlev>
##$CPDPRG8= <mlev>
##$CPDPRGB= <>
##$CPDPRGT= <>
##$D= (0..31)
0 1.2 0 0 0 0 0 0 0 0.06 0 0.03 0 0 0 0 0.0002 0 0 0 0 0 0 0 0 0 0 0 0 
0 0 0 
##$DATE= 1580466823
##$DBL= (0..7)
120 120 120 120 120 120 120 120 
##$DBP= (0..7)
150 150 150 150 150 150 150 150 
##$DBP07= 0
##$DBPNAM0= <>
##$DBPNAM1= <>
##$DBPNAM2= <>
##$DBPNAM3= <>
##$DBPNAM4= <>
##$DBPNAM5= <>
##$DBPNAM6= <>
##$DBPNAM7= <>
##$DBPOAL= (0..7)
0.5 0.5 0.5 0.5 0.5 0.5 0.5 0.5 
##$DBPOFFS= (0..7)
0 0 0 0 0 0 0 0 
##$DE= 6
##$DECBNUC= <off>
##$DECIM= 24
##$DECNUC= <off>
##$DECSTAT= 4
##$DIGMOD= 1
##$DIGTYP= 9
##$DL= (0..7)
0 120 120 120 120 120 120 120 
##$DP= (0..7)
150 150 150 150 150 150 150 150 
##$DP07= 0
##$DPNAME0= <>
##$DPNAME1= <>
##$DPNAME2= <>
##$DPNAME3= <>
##$DPNAME4= <>
##$DPNAME5= <>
##$DPNAME6= <>
##$DPNAME7= <>
##$DPOAL= (0..7)
0.5 0.5 0.5 0.5 0.5 0.5 0.5 0.5 
##$DPOFFS= (0..7)
0 0 0 0 0 0 0 0 
##$DQDMODE= 0
##$DR= 18
##$DS= 0
##$DSLIST= <SSSSSSSSSSSSSSS>
$$ [...]
##$SUBNAM2= <"">
##$SUBNAM3= <"">
##$SUBNAM4= <"">
##$SUBNAM5= <"">
##$SUBNAM6= <"">
##$SUBNAM7= <"">
##$SUBNAM8= <"">
##$SUBNAM9= <"">
##$SW= 24.9337058887773
##$SWIBOX= (0..15)
0 0 2 0 0 0 0 0 0 0 0 0 0 0 0 0 
##$SW_h= 4990.01996007984
##$TD= 16384
##$TD0= 1
##$TE= 0
##$TE2= 300
##$TE3= 300
##$TEG= 300
##$TL= (0..7)
0 120 120 120 120 120 120 120 
##$TP= (0..7)
150 150 150 150 150 150 150 150 
##$TP07= 0
##$TPNAME0= <>
##$TPNAME1= <>
##$TPNAME2= <>
##$TPNAME3= <>
##$TPNAME4= <>
##$TPNAME5= <>
##$TPNAME6= <>
##$TPNAME7= <>
##$TPOAL= (0..7)
0.5 0.5 0.5 0.5 0.5 0.5 0.5 0.5 
##$TPOFFS= (0..7)
0 0 0 0 0 0 0 0 
##$TUNHIN= 0
##$TUNHOUT= 0
##$TUNXOUT= 0
##$USERA1= <user>
##$USERA2= <user>
##$USERA3= <user>
##$USERA4= <user>
##$USERA5= <user>
##$V9= 5
##$VALIST= <valist>
##$VCLIST= <CCCCCCCCCCCCCCC>
##$VD= 0
##$VDLIST= <DDDDDDDDDDDDDDD>
##$VPLIST= <PPPPPPPPPPPPPPP>
##$VTLIST= <TTTTTTTTTTTTTTT>
##$WBST= 1024
##$WBSW= 4
##$XGAIN= (0..3)
0 0 0 0 
##$XL= 0
##$YL= 0
##$YMAX_a= 233103
##$YMIN_a= -163053
##$ZGOPTNS= <>
##$ZL1= 120
##$ZL2= 120
##$ZL3= 120
##$ZL4= 120
##$ABSF1= 10
##$ABSF2= 0
##$ABSG= 5
##$ABSL= 3
##$ALPHA= 0
##$AQORDER= 0
##$ASSFAC= 0
##$ASSFACI= 0
##$ASSFACX= 0
##$ASSWID= 0
##$AUNMP= <proc_1d>
##$AZFE= 0.1
##$AZFW= 0.1
##$BCFW= 1
##$BC_mod= 2
##$BYTORDP= 1
##$COROFFS= 0
##$CY= 11.3945322036743
##$DATMOD= 1
##$DC= 2
##$DFILT= <>
##$DTYPP= 0
##$F1P= 16.9975609425685
##$F2P= -3.02152046262296
##$FCOR= 0.5
##$FTSIZE= 0
##$FT_mod= 4
##$GAMMA= 1
##$GB= 0.15
##$INTBC= 1
##$INTSCL= 1
##$ISEN= 128
##$LB= 0.24
##$LEV0= 0
##$LPBIN= 0
##$MAXI= 10000
##$MC2= 0
##$MEAN= 0
##$ME_mod= 0
##$MI= 1.114404
##$NCOEF= 0
##$NC_proc= 0
##$NLEV= 6
##$NOISF1= 3.799351
##$NOISF2= 2.8
##$NSP= 1
##$NTH_PI= 0
##$NZP= 0
##$OFFSET= 15.70392
##$PC= 1
##$PHC0= -9791.092
##$PHC1= 15.80081
##$PH_mod= 1
##$PKNL= yes
##$PPARMOD= 0
##$PSCAL= 0
##$PSIGN= 0
##$REVERSE= no
##$SF= 200.130013532006
##$SI= 16384
##$SIGF1= 3
##$SIGF2= 2
##$SINO= 400
##$SIOLD= 16384
##$SREGLST= <1H.CDCl3>
##$SSB= 0
##$STSI= 0
##$STSR= 0
##$SW_p= 3612.71676300578
##$SYMM= 0
##$S_DEV= 0
##$TDeff= 0
##$TDoff= 0
##$TI= <>
##$TILT= no
##$TM1= 0
##$TM2= 0
##$TOPLEV= 0
##$USERP1= <user>
##$USERP2= <user>
##$USERP3= <user>
##$USERP4= <user>
##$USERP5= <user>
##$WDW= 1
##$XDIM= 8192
##$YMAX_p= 0
##$YMIN_p= 0
$$ End of Bruker specific parameters
$$ ---------------------------------
##NTUPLES= NMR FID
##VAR_NAME=  TIME,          FID/REAL,        FID/IMAG
##SYMBOL=    X,             R,               I
##VAR_TYPE=  INDEPENDENT,   DEPENDENT,       DEPENDENT
##VAR_FORM=  AFFN,          ASDF,            ASDF
##VAR_DIM=   8192,          8192,            8192
##UNITS=     SECONDS,       ARBITRARY UNITS, ARBITRARY UNITS
##FACTOR=    0.0002004,     1,               1
##FIRST=     0,             0,               0
##LAST=      1.6414764,     0,               0
##MIN=       0,             -163053,         0
##MAX=       1.6414764,     233103,          0
$$ Real data points
##PAGE= N=1
##DATA TABLE= (X++(R..R)), XYDATA
$$ [...]
$$ plain form
1918 -171 -155 342 -52 263 -457 -262 -14 273 135 -10 -276 -27 68 78 109 53 -27 -96 143 123 -117 -194 53
1941 53 346 218 -223 -259 -316 40 168 54 -335 -361 -416 189 89 -277 -82 31 219 215 -152 -187 -296 395 274
1964 274 0 -110 -123 152 72 93 -42 -264 105 254 33 100 -82 -206 -39 390 76 5 -52 80 -111 -21
1986 -21 147 -195 113 -197 14 -246 -346 -362 240 -17 36 -121 -49 -64 119 154 31 -153 -110 -179 -335 -16 -120
2009 -120 -1 133 204 286 -11 58 -167 321 273 155 71 -91 -99 172 -120 108 310 168 -74 -23 169 -4 35
2032 35 36 381 -6 37 -242 -37 -64 -95 -210 -62 212 11 98 -120 65 33 91 240 76 -202 -151 -45 -387
2055 -387 -35 -126 235 73 243 73 -244 4 103 -33 -50 80 285 483 -73 -221 -136 87 244 194 -115 -183
2077 -183 140 28 -145 -207 8 -210 202 -154 -94 -229 298 281 258 -10 -55 -69 82 -1 124 -44 -23 162 125
$$ packed form
1918a71J6M97l94L15p20J95K48K87j38j45k66K49R5J0L1n6q0o9K39k0k40p7K47
1941E3K93j28m41l6n7L56J28j14l89k6n5O05j00l66J95J13J88ml67l5j09O91j21
1964B74k74j10j3K75q0K1j35k22L69J49k21O7j82j24J67M29l14p1n7J32j91R0
1986b1J68l42L08l10K11k60j00j6O02k57N3j57P2j5J83L5j23j84M3o9j56L19j04
2009a20J19J34P1Q2k97O9k25M88m8j18q4j62qK71k92K28K02j42k42N1J92j73L9
2032C5JL45l87M3k79K05k7l1j15J48K74k01Q7k18J85l2N8J49j64k78N1J06l42
2055c87L52r1L61j62J70j70l17K48R9j36j7J30K05J98n56j48Q5K23J57n0l09o8
2077a83L23j12j73o2K15k18M12l56O0j35N27j7k3k68m5j4J51q3J25j68K1J85l7
$$ plain form
2100 125 -112 -417 185 127 124 -270 -103 -96 -92 162 281 189 -150 4 56 -236 229 -180 97 -122 -17 186 -69
2123 -69 142 -148 44 336 -14 147 -41 80 95 -97 -92 232 -81 7 368 362 -46 -84 29 182 -15 142 -169
2146 -169 -290 327 150 226 -269 -36 -182 399 254 -314 -114 161 522 204 -442 -131 -284 104 158 -107 -243
2167 -243 -97 -50 187 -611 -283 138 -97 95 -270 -601 -221 -78 -16 -244 -66 -101 369 -69 -122 -58 132 158
2189 158 61 64 -104 -17 111 313 -63 -65 120 224 222 -45 -101 291 436 -41 -184 -138 -170 534 245 82 -189 312
2213 312 204 404 84 -131 -165 359 213 -145 -189 -194 249 296 225 -339 -88 143 108 511 -523 -219 183 -93
2235 -93 -106 -225 82 -338 -109 -257 -204 -145 -23 147 58 -105 -65 -9 211 50 -348 113 112 -276 -138 -98 -179 211
2259 211 440 -190 -1 37 486 107 81 -301 -39 169 218 -328 -284 178 538 544 -230 -222 -13 205 157 -146 -352
$$ packed form
2100A25k37l05O02n8ll94J67PMK54J19r2l39J54N2k92M65m09K77k19J05K03k55
2123f9K11k90J92K92l50J61j88J21J5j92NL24l13Q8L61om08l8J13J53j97J57l11
2146a69j21O17j77P6m95K33j46N81j45n68K00K75L61l18o46L11j53L88N4k65j36
2167b43J46M7K37p98L28M21k35J92l65l31L80J43O2k28J78l5M70m38n3O4J90K6
2189A58r7Lj68Q7J28K02l76kJ85J04kk67n6L92J45m77j43M6l2P04k89j63k71N01
2213C12j08K00l20k15l4N24j46l58m4nM43M7p1n64K51K31l5M03j034L04M02k76
2235i3j3j19L07m20K29j48N3N9J22J70q9j63M0N6K20j61l98M61jl88J38M0q1L90
2259B11K29o30J89L8M49l79k6l82K62K08M9n46M4M62L60Op74QK09K18m8l03k06
$$ plain form
2282 -352 100 397 419 -229 -266 -190 309 693 66 -272 -242 190 352 -71 -369 -383 41 333 34 -264 -256 212
2304 212 384 -458 -262 -470 -29 520 -409 -367 -289 226 421 -300 -393 -184 90 275 76 -48 -205 204 115
2325 115 -105 -354 -251 257 273 -111 -314 -66 324 470 -156 -116 -289 266 17 -2 -178 89 438 685 74
2346 74 -418 -275 209 321 19 -370 53 99 430 94 -502 -252 232 353 -5 -505 -143 305 358 47 -114
2367 -114 -199 386 491 41 -66 -397 42 205 53 -541 -303 115 66 -131 -337 -351 27 305 179 -526 -151
2388 -151 232 455 39 -715 -74 270 472 -94 -423 -383 264 250 -257 -246 -262 -60 357 -159 -205 -327 563 690
2410 690 300 -34 -332 268 614 231 -386 -566 138 653 -18 -525 -67 105 299 309 -501 -757 -79 533
2430 533 -92 -191 -379 97 410 285 -397 -408 126 389 15 -478 -275 -114 412 -198 -377 -102 -20 415 48
$$ packed form
2282c52M52K97K2o48l7P6M99L84o27l38L0M32J62m23k98j4M24K92k99k98QM68
2304B12J72q42J96k08M41N49r29M2P8N15J95p21r3K09K74J85j99j24j57M09q9
2325A15k20k49J03N08J6l84k03K48L90J46o26M0j73N55k49j9j76K67L49K47o11
2346G4m92J43M84J12l02l89M23M6L31l36n96K50M84J21l58n00L62M48N3l11j61
2367a14q5N85J05m50j07l31M39J63j52n94K38M18m9j97k06j4L78K78j26p05L75
2388a51L83K23m16p54O41L44K02n66l29M0O47j4n07J1j6K02M17n16m6j22Q90J27
2410F90l90l34k98O00L46l83o17j80P04N15o71n07M58J72J94J0q10k56O78O12
2430E33o25r9j88M76L13j25o82j1N34K63l74m93K03J61N26o10j79K75Q2M35l67
$$ plain form
2451 48 -187 -736 -41 124 164 -555 -540 195 167 322 -284 -164 -55 130 -27 -538 -293 -36 402 116 -385
2472 -385 -264 4 439 219 -299 -16 275 252 108 -410 -334 51 484 327 -46 -70 273 442 -75 -281 -156
2493 -156 130 447 510 -484 -669 -158 491 241 -437 -325 141 288 48 -1 -701 -77 103 352 -194 -506 441
2514 441 175 266 -205 -463 -133 271 -74 -360 -744 -101 487 165 -385 -593 188 372 309 -484 -473 101 515
2535 515 295 -538 -302 -60 635 474 -355 -601 -37 559 461 -200 -379 -251 715 487 109 -492 -179 352
2555 352 280 -217 -629 -310 203 329 -38 -414 -172 578 469 -132 -533 147 385 150 -120 -165 -179 239 527
2576 527 -269 -479 -107 293 55 -200 -204 112 170 358 -213 -549 -43 419 352 -258 -250 253 337 465 -379 -523
2598 -523 49 301 385 -82 -473 -87 466 361 -426 -439 9 547 375 17 -600 -192 93 372 -37 -506 -360
$$ packed form
2451D8k35n49O95J65M0p19J5P35k8J55o06J20J09J85j57n11K45K57M38k86n01
2472c85J21K68M35k20n18K83K91k3j44n18P6L85M33j57l73k4L43J69n17k06J25
2493a56K86L17O3r94j85N11O49k50o78J12M66J47k40m9p00O24J80K49n46l12R47
2514D41k66R1m71k58L30M04l45k86l84O43N88l22n50k08P81J84o3p93J1N74M14
2535E15k20q33K36K42O95j61q29k46N64N96r8o61j79J28R66k28l78o01L13N31
2555C52p2m97m12L19N13J26l67l76K42P50j09o01m01O80K38k35k70m5j4M18K88
2576E27p96k10L72M00k38k55mL16N8J88n71l36N06M62o7o10QN03Q4J28q44j44
2598e23N72K52Q4m67l91L86N53j05p87j3M48N38j72l58o17M08K85K79m09m69J46
$$ plain form
2619 -360 323 556 -198 -663 -266 262 476 135 -458 -406 401 403 206 -266 -268 271 465 10 -258 -253 99 296
2641 296 -227 -502 -237 419 583 -424 -487 -274 470 631 -191 -441 -286 320 557 -181 -390 66 386 349
2661 349 -82 -758 -409 192 326 202 -45 -77 172 326 -283 -564 -335 278 527 121 -588 -56 438 443 -28
2682 -28 -160 -250 236 446 -109 -346 -155 276 339 -18 -417 -440 254 508 40 -489 -256 198 390 -328 -342 -267
2704 -267 216 580 4 -406 -260 193 354 174 -162 -22 143 653 35 -316 -87 123 452 -199 -274 -303 50
2725 50 669 83 -72 -217 361 423 -41 -424 -391 254 689 113 -384 -226 350 407 146 -382 -322 246 341 261
2747 261 -55 -381 98 547 13 -315 -368 108 418 96 -423 -273 126 63 192 -321 -108 71 311 64 -411
2768 -411 -409 18 330 439 -277 -374 83 458 -108 89 -123 50 597 98 -364 -363 13 353 -101 -496 -163 259
$$ packed form
2619c60O83K33p54m65L97N28K14l41n93N2Q07Kj97m72kN39J94m55k68NL52J97
2641B96n23k75K65O56J64j007o3K13P44J61q22k50J55O06K37p38k09M56L20l7
2661C49m31o76L49O01J34j24k47l2K49J54o09k81K29O13K49m06p09N32M94Nm71
2682b8j32r0M86K10n55k37J91M31O3l57l99k3O94K54m68n29K33M54J92p18j4P5
2704b67M83L64n76m10J46M53J61j80l36J40J65N10o18l51K29K10L29o51p5k9L53
2725E0O19n86j55j45N78O2m64l83L3O45M35n76m97J58N76N7k61n28O0N68R5q0
2747B61l16l26M79M49n34l28n3M76L10l22n19J50L99o3J29n13K13J79K40k47m75
2768d11KM27L12J09p16r7M57L75n66J97k12J73N47m99m62JL76L40m54l95L33M22
$$ plain form
2790 259 149 92 -461 -395 -39 190 293 -273 -369 276 331 186 -147 -370 187 331 248 44 -284 -219 153 222
2812 222 -180 -506 -78 485 83 -427 -198 342 166 24 -210 -313 157 331 30 -301 -422 82 150 166 -40
2833 -40 -544 39 423 17 -412 29 58 268 -142 -124 -461 106 384 40 -279 -254 120 577 60 -90 -146 -286
2855 -286 434 197 -368 -520 301 682 -164 -249 -60 65 351 386 -458 -429 -56 63 53 -83 -224 -77 578
2876 578 125 -282 -451 -40 302 538 -58 -485 -117 -63 185 -114 -371 -181 439 -14 276 -309 116 142 306
2897 306 -313 -271 117 170 182 75 -78 11 450 22 -173 -299 -205 318 47 -360 -263 -28 547 164 -284 -163
2919 -163 -52 372 205 -181 -152 -58 134 168 -28 -124 73 234 416 -109 -315 51 404 200 -209 -459 -400 260
2941 260 224 -153 -370 14 176 421 17 -308 98 247 162 -163 -373 -10 446 474 -5 -488 -14 103 9
$$ packed form
2790B59j10n7n53O6L56K29J03n66r6O45N5j45l33k23N57J44q3k04l28O5L72O9
2812B22m02l26M28N63m02n10K29N40j76j42k34j03M70J74l01l31j21N04O8J6k06
2833d0n04N83L84m06m29M41K9K10m10J8l37N67K78l44l19K5L74M57n17j50n6j40
2855b86P20k37n65j52Q21L81q46q5J89J25K86L5q44K9L73J19j0j36j41J47O55
2876E78m53m07j69M11L42K36n96m27L68N4K48k99k57J90O20m53K90n85M25K6J64
2897C06o19M2L88N3J2j07j53Q9M39m28j95j26R4N23k71m07R7K35N75l83m48J21
2919a63J11M24j67l86K9R4J92L4j96r6J97J61J82n25k06L66L53k04m09k50N9O60
2941B60l6l77k17L84J62K45m04l25M06J49q5l25k10L63M56K8m79m83M74J17r4
$$ plain form
2962 9 -78 -151 -301 79 213 83 -369 -69 145 325 152 -114 -231 276 285 185 -206 75 -49 236 -323 -382
2984 -382 185 307 208 256 -553 -39 301 252 104 -434 -331 -116 226 -17 -293 -98 125 166 222 -149 -141 131
3006 131 505 -65 16 -270 173 129 -160 -227 -226 102 -59 110 -54 50 19 379 194 -125 -109 310 248 -37 -279
3029 -279 -210 219 -91 72 -605 -164 -258 -116 -126 17 -245 118 470 -342 -115 85 210 -17 18 -317 -259 192
3051 192 216 80 -250 13 320 292 106 -265 -359 397 89 208 30 -20 273 239 -84 -88 102 -242 242 217 -531
3074 -531 -220 13 494 -290 -304 -352 -47 262 -64 -16 -229 -182 238 170 -245 -262 87 -3 -72 -149 -13 122 260
3097 260 -198 -226 -214 102 129 46 -38 -73 328 86 1 -148 25 -36 -42 -1 -150 218 -27 169 131 -281 -73 157
3121 157 -35 224 -55 8 -60 140 172 -311 41 95 98 -6 281 -54 196 101 148 -178 -172 146 226 69 83 9
$$ packed form
2962Iq7p3j50L80J34j30m52L00K14J80j73k66j17N07Rj00l91K81j24K85n59n9
2984c82N67J22r9M8q09N14L40m9j48n38J03K15L42k43k76J95K23M1N6l71QK72
3006A31L74n70Q1k86M43m4k89o7JL28j61J69j64J04l1L60j85l19J6M19o2k85k42
3029b79O9M29l10J63o77M41r4J42j0J43k62L63L52q12K27K00J25k27L5l35N8M51
3051A92K4j36l30K63L07k8j86l71r4P56l08J19j78n0K93l4l23mJ90l44M84k5p48
3074e31L11K33M81p84j4m8L05L09l26M8k13M7M20o8m15j7L49r0o9p7J36J35J38
3097B60m58k8J2L16K7q3q4l5M01k42q5j49J73o1oM1j49L68k45J96l8m12K08K30
3121A57j92K59k79O3o8K00L2m83L52N4Lj04K87l35K50r5M7l26OL18Q0j57J4p4
$$ plain form
3145 9 -8 46 254 12 -197 260 -100 91 -100 -157 -118 300 -146 158 132 -38 179 55 32 21 131 -188 167
3168 167 -307 -203 138 125 144 -156 -249 153 -8 -4 -263 -149 -53 115 224 209 -139 -120 106 326 -4 -82 35
3191 35 305 -318 23 -107 39 81 73 -299 -337 47 48 252 39 -151 65 169 28 -114 -192 29 6 318 -22
3214 -22 -122 21 139 -33 -82 -150 144 100 235 155 -144 -218 37 -148 -48 -126 58 122 303 142 -102 -181 184
3237 184 -85 153 -378 3 112 30 102 -42 -3 111 202 -32 -74 254 90 -47 22 1 58 401 152 -354 -82
3260 -82 -338 256 220 -12 -97 -66 99 -100 -114 -264 -178 290 218 -171 278 -24 -243 109 292 -106 -313 -28
3282 -28 294 36 46 50 11 5 -228 169 -160 186 -50 126 -270 226 -116 191 -126 -313 107 -250 98 -133
3304 -133 -198 -50 69 70 -107 -16 187 408 -28 11 -72 -257 156 137 153 -116 3 -39 73 -97 -37 -65 131 203
$$ packed form
3145Ij7N4K08k42k09M57l60J91j91n7L9M18m46L04k6j70K17j24k3j1J10l19L55
3168A67m74J04L41j3J9l00r3M02j61Mk59J14R6J68J09j5l48J9K26K20l30p8J17
3191C5K70o23L41j30J46M2ql72l8L84JK04k13j90K16J04j41j42p8K21k3L12l40
3214b2j00J43J18j72m9o8K94m4J35q0k99p4K55j85J00p8J84O4J81j61k44p9L65
3237A84k69K38n31L81J09q2P2j44L9J14R1k34m2L28j64j37O9k1N7L43k49n06K72
3260h2k56N94l6k32q5L1J65j99j4j50Q6M68p2l89M49l02k19L52J83l98k07K85
3282b8L22k58J0Ml9ok33L97l29L46k36J76l96M96l42L07l17j87M20l57L48k31
3304a33o5J48J19Jj77R1K03K21m36L9q3j85M13j9J6k69J19m2J12j70O0k8J96P2
$$ plain form
3328 203 -26 88 -194 -111 -124 144 108 142 125 39 -58 -318 -106 108 -14 467 -18 -20 -94 99 255 51 -151
3351 -151 124 158 56 409 -150 -87 52 4 83 81 76 -88 -175 92 -84 22 -169 -62 -180 -61 -14 47 35 -10
3375 -10 132 -64 -183 150 48 -69 72 21 156 -251 -199 -185 98 -110 -109 359 121 -67 -13 -198 -34 155
3397 155 122 -54 -221 70 36 -310 -91 15 28 -311 -118 155 114 -138 -20 -247 200 113 121 275 220 62 -135
3420 -135 -148 -317 -15 105 -127 -168 -162 80 107 -10 22 -451 -126 55 -11 83 -154 114 10 51 99 321 165
3443 165 110 -111 -132 -192 66 140 -251 -159 -7 -37 0 -138 -128 27 24 255 228 -77 -83 288 -74 223 -190 -223 -47
3468 -47 -29 268 100 -95 112 -182 -72 114 -172 87 -20 -131 -255 80 161 253 170 79 84 83 -50 15 -58 -107
3492 -107 -5 -90 57 49 -59 148 200 61 -91 298 48 -47 -151 -182 56 -84 -175 211 99 275 174 87 -79
$$ packed form
3328B03k29J14k82Q3j3K68l6L4j7q6r7k60K12K14j22M81m85kp4J93J56k04k02
3351a51K75L4j02L53n59O3J39m8P9knj64q7K67j76J06j91J07j18J19M7O1j2m5
3375a0J42j96j19L33j02j17J41n1J35m07N2J4K83k08JM68k38j88N4j85J64J89
3397A55l3j76j67K91l4l46K19J06J3l39J93K73m1k52J18k27M47q7QJ54n5j58j97
3420a35j3j69L02J20k32m1OK42K7j17L2m73L25J81o6R4k37K68j04M1M8K22j56
3443A65n5k21k1o0K58P4l91R2J52l0L7j38J0J55lK31k7l05oL71l62K97m13l3J76
3468d7J8K97j68j95K07k94J10J86k86K59j07j11j24L35Q1R2q3r1Njj33O5p3m9
3492a07J02q5J47qj08K07N2j39j52L89k50r5j04l1K38j40r1L86j12J76j01q7j66
$$ plain form
3515 -79 170 85 70 -14 -115 235 -65 11 -2 -125 -58 27 118 148 16 21 -5 -169 -381 101 49 -133 -29 43 1
3540 1 124 -143 -89 141 11 -4 -217 99 -104 34 138 -54 63 106 -9 -44 220 -68 -143 -94 217 111 234
3563 234 -30 165 -294 129 -166 -185 -140 -89 -53 -62 7 -101 188 -2 165 97 159 -10 -108 279 40 -131 186
3586 186 251 -227 119 -260 10 -23 8 -39 -168 -94 23 23 -5 6 -97 -203 -111 50 49 9 150 43 89 -57 -138
3611 -138 222 -106 182 106 -266 -116 -19 -107 -66 -191 -64 -82 141 -45 -325 184 59 24 98 -3 19 137 82
3634 82 -180 -206 124 -129 -117 -115 -110 179 -133 -113 75 40 -169 -57 145 232 -38 208 214 288 135 35 119 142 82
3659 82 32 52 62 135 -179 133 63 -455 -169 26 -83 -24 199 -386 97 -235 111 115 32 -50 -353 -20 45 194
3683 194 -84 110 332 145 -221 63 -57 50 115 -50 237 101 -126 -16 -77 206 19 210 15 284 -30
$$ packed form
3515g9K49q5j5q4j01L50l00P6j3j23O7Q5R1L0j32Nk6j64k12M82n2j82J04P2m2
3540AJ23k67N4K30j30j5k13L16k03J38J04j92J17M3j15l5K64k88p5M9L11j06J23
3563B34k64J95m59M23k95j9M5N1L6rO9j08K89j90J67o8O2j69r8L87k39j71L17
3586A86O5m78L46l79K70l3L1m7j29P4J17%k8J1j03j06R2J61jm0J41j07M6j46q1
3611a38L60l28K88p6l72J50R7q8M1j25J27j8K23j86k80N09j25l5P4j01K2J18n5
3634H2k62k6L30k53J2KNK89l12K0J88l5k09J12K02Q7k70K46OP4j53j00Q4K3o0
3659H2n0K0J0P3l14L12p0n18K86J95j09N9K23n85M83l32L46Mq3q2l03L33O5J49
3683A94k78J94K22j87l66K84j20J07O5j65K87j36k27J10o1K83j87J91j95K69l14
$$ plain form
3704 -30 -386 -376 -29 -57 247 -143 33 251 -56 78 55 305 137 80 181 -136 -1 293 118 -153 21 -5
3726 -5 53 155 48 -224 222 29 31 14 183 43 108 43 -119 163 -206 159 130 132 -177 44 -85 -84 82 -12 -3
3751 -3 118 35 -128 -67 -207 -101 -78 87 92 50 214 -60 217 155 133 103 253 -18 -20 -153 -43 32 143 -33 -93
3776 -93 207 -77 93 -213 62 -110 49 3 39 26 306 -18 82 226 45 110 19 -223 189 -54 -86 -318
3798 -318 -78 108 -61 90 -192 -30 -3 222 -279 2 -132 143 -245 239 30 -213 -212 128 201 199 -356 -50
3820 -50 149 -143 395 -44 193 -281 113 -203 61 129 126 237 -218 45 249 -62 -79 289 261 50 90 168 49
3843 49 -13 -77 -125 74 127 -50 -100 38 110 -136 264 -341 91 134 -116 259 122 -11 -11 233 -124 -297 -157
3866 -157 -44 -126 -44 262 -120 -114 14 -243 85 -25 -74 47 79 120 16 -8 -134 -49 60 -180 126 4 -51
$$ packed form
3704c0l56J0L47k8L04l90J76K18l07J34k3K50j68n7J01l17J35K94j75k71J74k6
3726eN8J02j07k72M46j93Kj7J69j40O5o5j62K82l69L65k9Kl09K21j29JJ66r4R
3751cJ21q3j63O1j40J06K3J65Nm2J64k74K77o2k2l0J50k71kj33J10P5J11j76o0
3776i3L00k84J70l06K75j72J59m6L6j3K80l24J00J44j81O5r1k42M12k43l2k32
3798c18K40J86j69J51k82J62K7K25n01K81j34K75l88M84k09k43JL40P3kn55L06
3820e0J99k92N38m39K37m74L94l16K64O8lJ11m55K63K04l11j7L68k8k11M0P8j19
3843D9o2o4m8J99N3j77n0J38P2k46M00o05M32M3k50L75j37j33%K44l57j73J40
3866a57J13q2Q2L06l82OJ28k57L28j10m9J21L2M1j04k4j26Q5J09k40L06j22n5
$$ plain form
3889 -51 -229 -155 7 -227 82 -163 -232 120 154 -139 33 -116 180 73 -43 -131 -403 -9 123 -143 -203 -12
3911 -12 187 -153 39 71 -11 434 -104 -57 -145 210 16 -71 -34 -35 164 -1 202 82 245 228 -58 -137 -18 10
3935 10 31 -171 142 -110 94 164 -272 -4 84 -226 380 4 -169 -145 -147 23 126 -34 -137 -1 55 -162 -134
3958 -134 13 -140 157 -98 -244 -44 224 -229 -91 -172 -126 139 -212 -36 23 -161 -114 118 -226 -29 47 4
3980 4 36 -25 5 6 38 103 7 39 92 4 191 41 -175 -31 308 -145 33 -109 -156 -31 -36 319 68 280 86
4005 86 -32 -135 -202 -82 60 -222 -1 172 -119 -89 -148 -105 -290 -145 67 119 -192 -44 -1 -57 -91 58 -157
4028 -157 -87 -69 117 -171 -30 304 83 44 -169 80 95 121 85 134 55 -167 172 -368 -254 157 104 -231 10
4051 10 11 -28 366 210 91 -134 -46 -336 -260 239 59 -58 -2 -144 45 -217 -177 1 -164 -226 -63 332 182
$$ packed form
3889e1j78P4J62k34L09k45o9L52L4k93J72j49K96j07j16q8k72L94J32k66o0J91
3911a2J99l40J92L2q2M45n38M7q8L55j94q7L7jJ99j65K03j20J63j7k86p9J19K8
3935A0K1k02L13k52K04P0m36K68Q8l10O06l76j73K4kJ70J03j60j03J36N6k17K8
3958a34J47j53K97k55j46K00K68m53J38q1M6K65l51J76N9j84M7K32l44J97P6m3
3980DL2o1L0JL2O5r6L2N3q8J87j50k16J44L39m53J78j42m7J25nL55k51K12j94
4005H6j18j03o7J20J42k82K21J73k91L0n9M3j85J45K12N2l11J48M3n6l4J49k15
4028a57P0J8J86k88J41L34k21l9k13K49J5K6l6M9p9k22L39n40J14M11n3l35K41
4051A0Jl9L94j56j19k25Q8k90P6M99j80j17N6j42J89k62M0J78j65o2J63L95j50
$$ plain form
4074 182 -68 157 54 169 -234 -207 182 -6 -180 28 -219 -35 155 -43 98 -140 6 50 -180 -388 -43
4095 -43 266 -155 -20 -178 -120 -140 -95 230 29 112 157 150 -60 124 128 14 11 -22 75 -273 148 -21 -266 150 203
4120 203 17 -46 -3 103 17 28 -210 14 -49 -63 -304 -147 -143 -132 43 -55 20 -251 -134 16 79 91 43 50 -149
4145 -149 142 -64 -34 -38 42 -108 -47 12 -50 93 6 -59 189 -153 289 0 -4 126 138 -4 -207 -65 267 36
4169 36 -46 176 181 111 -3 78 -216 -25 -335 205 -204 -66 125 47 -27 56 13 -19 59 87 275 -85 33 -245
4193 -245 -263 123 82 61 -100 -83 224 241 98 38 -5 102 -117 233 169 -250 308 229 -129 -151 267 273 -69 -200
4217 -200 -279 88 3 -115 196 74 -55 198 -165 115 49 -5 18 -104 41 82 -159 -177 -77 35 134 -10 -9
4240 -9 1 165 -217 13 174 -62 -227 161 -31 151 -149 -189 275 -75 60 -138 -93 -42 -59 -134 -160 -169 -131 -45
$$ packed form
4074A82k50K25j03J15m03K7L89j88j74K08k47J84J90j98J41k38J46M4k30k08L45
4095d3L09m21J35j58N8k0M5L25k01Q3M5pk10J84Mj14ll3R7l48M21j69k45M16N3
4120B03j86o3M3J06q6J1k38K24o3j4k41J57MJ1J75r8P5k71J17J50O3J2m8Pj99
4145a49K91k06L0mQ0j50O1N9o2J43q7o5K48l42M42k89mJ30J2j42k03J42L32k31
4169C6q2K22Np0j14Q1k94J91l10N40m09J38J91p8p4Q3m3l2P8K8J88l60J18k78
4193b45j8L86m1k1j61J7L07J7j43o0m3J07k19L50o4m19N58p9l58k2M18Ol42j31
4217b00p9L67q5j18L11j22j29K53l63K80o6n4K3j22J45M1k41j8J00J12R9j44J
4240iJ0J64l82K30J61k36j65L88j92J82l00m0M64l50J35j98M5N1j7p5k6rL8Q6
$$ plain form
4264 -45 -146 -5 181 29 84 -243 -14 -244 -162 -219 61 227 292 -156 6 28 -309 -75 449 0 154 87
4286 87 -72 -60 1 112 -147 -207 -89 -125 -6 34 -288 -36 -233 -40 130 235 -33 41 -119 50 -92 18
4308 18 -48 186 -193 -196 -284 89 -63 -118 439 85 -61 142 135 400 -123 -335 127 67 -244 -124 -24 -171 -321
4331 -321 -50 271 -56 32 -167 -148 46 -128 109 161 -98 132 155 -108 131 114 -114 -59 -133 -289 146 -239
4353 -239 33 -61 -270 -70 74 223 91 182 -74 92 -146 87 71 -153 -133 -53 -28 211 228 -19 -238 -39
4375 -39 -34 302 48 -169 -48 -72 26 232 149 -246 -216 35 62 101 224 -210 -119 -183 -88 61 -31 35 53 -127 -68
4400 -68 3 34 -10 334 64 81 142 76 45 -363 259 219 -105 -4 -180 -31 200 -138 60 -163 -84 -457 11
4423 11 69 23 39 -46 150 228 76 59 -74 54 -312 333 -64 -78 -78 -69 154 -84 17 -53 410 -292 -159 -44
$$ packed form
4264d5j01J41J86j52N5l27K29k30Q2n7K80J66O5m48J62K2l37K34N24m49J54o7
4286H7j59J2O1J11k59o0J18l6J19M0l22K52j97J93J70J05k68P4j60J69j42J10
4308A8o6K34l79lq8L73j52n5N57l54j46K03pK65n23k12M62o0l11J20J00j47j50
4331c21K71L21l27Q8j99J9J94j74K37N2k59K30K3k63K39j7k28N5p4j56M35l85
4353b39K72r4k09K00J44J49j32R1k56J66k38K33j6k24K0Q0K5K39J7k47k19J99
4375c9NL36k54k17J21k4R8K06q3l95L0K51K7L9J23m34R1o4R5J49r2O6J8j80N9
4400f8P1L1m4L44k70J7O1o6l1m08O22m0l24J01j76J49K31l38J98k23P9l73M68
4423A1N8m6J6q5J96P8j52j7j33J28l66O45l97j4%RK23k38J01p0M63p02J33J15
$$ plain form
4447 -44 46 208 480 70 62 -22 -123 107 -23 9 100 223 8 -181 66 103 200 178 -26 -156 -34 -32 -49 -264
4471 -264 326 -47 267 -185 156 104 -129 -90 -43 269 -83 -183 -175 -76 68 -100 67 24 -36 133 127 -145 -86 52
4495 52 75 -139 4 -126 91 15 -17 -148 -90 139 260 -100 -29 57 295 -176 11 47 7 -122 0 459 -185
4518 -185 -186 25 -136 134 -15 90 -330 -35 140 9 160 -295 86 181 56 22 -90 172 -217 -124 237 8
4540 8 245 243 176 -134 39 -3 -179 117 -198 78 3 -22 -107 129 15 -296 -69 -406 161 -51 65 175 53
4563 53 -58 -115 -152 185 244 -13 49 233 84 -179 233 -134 191 250 72 -130 13 125 133 24 -46 -15 -14 -6 17
4588 17 53 -194 -29 30 -152 14 276 253 184 50 10 -68 -124 172 101 -197 -152 94 144 -225 231 140 -116 -108 -219
4613 -219 152 276 144 -65 12 5 255 79 242 -136 324 -91 164 28 -52 -74 -157 -133 -14 69 185 152 -273
$$ packed form
4447d4R0J62K72m10qq4j01K30j30L2R1J23k15j89K47L7R7k2k04j30J22Kj7k15
4471b64N90l73L14m52L41n2k33L9M7L12l52j00QR9J44j68J67m3o0J69ok72N9J38
4495E2K3k14J43j30K17p6l2j31N8K29J21l60P1Q6K38m71J87L6m0j29J22M59o44
4518a85jK11j61K70j49J05m20K95J75j31J51m55L81R5j25l4j12K62l89R3L61k29
4540HK37ko7l10J73m2j76K96l15K76p5k5q5K36j14l11K27l37N67k12J16J10j22
4563E3j11n7l7L37N9k57O2J84j49k63M12l67L25N9j78k02J43J12Qj09p0L1JQK3
4588A7L6k47J65N9j82J66K62k3o9j34m0p8n6K96p1k98M5K46N0l69M56r1k56Qj11
4613b19L71J24j32k09P7pK50j76J63l78M60m15K55j36q0k2q3K4J19Q3J16l3m25
$$ plain form
4636 -273 167 -141 -144 102 -34 -123 -133 325 206 47 91 157 102 90 -203 464 154 -171 84 -228 132 70 -6
4659 -6 -204 107 -100 61 215 -173 -39 4 -16 0 -69 -94 268 -65 114 12 30 99 -146 -66 -46 -83 75 -35
4683 -35 -235 -61 26 -125 104 60 63 -40 -164 23 9 -28 -79 168 -8 -73 -296 165 -6 -218 -5 -77 102
4706 102 -49 -193 -155 256 79 -61 -24 -70 -113 52 -9 -281 -177 18 -71 -9 -87 -40 -44 199 -14 -257 -14 99
4730 99 138 92 -20 60 -200 141 -5 41 36 -198 114 167 -130 -101 -391 80 42 112 -52 -188 -107 -137 -297 1
4754 1 -35 122 137 -234 -215 -179 5 -76 124 -22 198 -20 -58 -223 69 122 -162 -43 261 278 219 -2 -73 -101
4778 -101 -72 13 -124 -21 -45 285 67 -196 -137 118 28 213 184 -50 3 56 -209 -33 -47 -213 -56 106 -32
4801 -32 35 -105 -20 93 -194 -71 -91 39 -134 82 -77 64 -6 -28 248 -25 -108 138 -76 154 -52 92
$$ packed form
4636b73M40l08lK46j36q9j0M58j19j59M4O6n5j2k93O67l10l25K55l12L60o2p6
4659fj98L11k07J61J54l88J34M3k0J6o9k5L62l33J79j02J8O9k45Q0K0l7J58j10
4683c5k00J74Q7j51K29m4Lj03j24J87j4l7n1K47j76o5k23M61j71k12K13p2J79
4706A02j51j44L8M11j77j40L7m6m3J65o1k72J04J95q9O2p8M7mK43k13k43K43J13
4730I9L9m6j12Q0k60L41j46M6nk34L12N3k97K9k90M71l8P0j64j36Q1l0j60K98
4754Al6J57J5l71J9L6J84q1K00j46K20k18l8j65K92N3k84J19L04J7n9k21p1k8
4778a01K9Q5j37J03k4L30k18k63N9K55r0J85k9k34N3N3k65J76j4j66J57J62j38
4801c2O7j40Q5J13k87J23k0J30j73K16j59J41p0k2K76k73q3K46k14K30k06J44
$$ plain form
4823 92 127 -141 103 111 9 281 18 85 163 137 -228 -39 -128 11 87 -81 -323 -161 262 87 -85 -84 88 -77
4847 -77 78 239 153 -7 172 108 -51 -16 -102 118 147 123 -180 -127 -131 -120 34 17 -295 -9 -96 -269 198 9
4871 9 126 366 0 169 -92 -72 -135 90 33 -111 -214 254 -76 244 25 -31 -38 -124 12 -56 32 -291 68 100
4895 100 55 -125 113 -95 -29 -206 -185 -109 -41 -58 235 -19 81 388 -17 189 236 -74 -85 14 -47 65 68 187
4919 187 22 -153 198 218 86 -169 -60 -173 116 111 88 -23 150 95 -381 72 56 -173 -78 62 63 77 -139
4942 -139 39 84 -144 -110 -374 -85 -132 -52 -55 -88 -127 -321 366 -72 32 146 93 -198 387 -19 168 47 -198
4965 -198 -143 92 241 24 -42 221 -156 -100 11 159 -99 23 -216 -64 -31 43 -86 151 332 4 217 -120
4987 -120 -244 -484 -85 251 -88 194 -132 20 -145 -247 35 211 -50 80 -41 -273 -301 90 -105 159
$$ packed form
4823I2L5k68K44Qj02K72k63O7P8k6l65J89q9J39P6j68k42J62M23j75j72JJ72j65
4847g7J55J61q6j60J79o4j59L5q6K20K9k4l03N3mJ1J54j7l12K86q7j73M67j89
4871IJ17K40l66J69k61K0o3K25n7j44j03M68l30L20k19n6pq6J36o8Q8l23L59L2
4895A00m5j80K38k08O6j77K1P6O8j7K93k54J00L07m05K06M7l10j1R9o1J12LJ19
4919A87j65j75L51K0j32k55J09j13K89nk3j11J73n5m76M53j6k29R5J40JJ4k16
4942a39J78M5k28L4k64K89m7Q0ll3l9j94O87m38J04J14n3k91N85m06J87j21k45
4965a98N5K35J49k17o6K63l77N6J11J48k58J22k39J52L3P4j29K37J81l28K13l37
4987a20j24k40L99L36l39K82l26J52j65j02K82J76k61J30j21k32k8L91j95K64
$$ plain form
5007 159 122 -116 -111 -71 174 59 -324 153 -160 -158 18 370 21 -13 79 127 -79 -85 77 108 295 -216 -119 -17
5031 -17 -26 -116 -54 -188 187 -4 174 -10 287 -254 62 317 -168 109 -423 105 -251 231 -229 -303 243 -86
5053 -86 -106 7 113 162 254 63 -159 139 56 -11 -70 201 264 -52 78 148 84 282 -41 -14 324 67 -238 -61
5077 -61 240 -377 -209 -3 209 39 66 -60 -235 68 53 -225 -166 44 -19 -113 101 91 73 -55 256 -496 445
5100 445 205 -29 -145 -88 -136 -131 1 -70 -38 28 19 105 38 90 159 32 -307 -204 52 -177 -31 371 246 150 -70
5125 -70 191 115 -247 -124 -7 4 -16 150 77 -285 -207 -111 -31 45 -127 -87 110 78 -59 103 87 -206 12 76
5149 76 130 127 214 118 -24 -44 -336 37 -230 149 84 17 195 63 196 -181 -104 198 -4 -108 -239 209 -161
5172 -161 86 107 158 -220 -65 -100 -193 -31 179 -111 121 -101 -125 -311 -94 -119 72 -286 -192 -226 78 264 -144
$$ packed form
5007A59l7k38NM0K45j15l83M77l13KJ76L52l49l4R2M8k06oJ62L1J87n11R7J02
5031a7rr0O2j34L75j91J78j84K97n41L16K55m85K77n32N28l56M82m60p4N46l29
5053h6k0J13J06M9R2j91k22K98q3o7n9K71O3l16J30P0o4J98l23K7L38k57l05J77
5077f1L01o17J68K06K12j70K7j26j75L03j5k78N9K10o3r4K14j0j8j28L11p52R41
5100D45k40k34j16N7m8NJ32p1L2O6rQ6o7N2O9j27l39J03K56k29J46M02j25r6k20
5125g0K61p6l62J23J17J1k0J66p3l62P8R6Q0P6j72M0J97l2j37J62j6k93K18O4
5149G6N4lQ7r6j42k0k92L73k67L79o5o7J78j32J33l77P7L02k02j04j31M48l70
5172a61K47K1N1l78J55l5r3J62K10k90K32k22k4j86K17k5J91l58R4l4L04J86m08
$$ plain form
5195 -144 151 62 247 -30 -11 -1 65 107 -86 -305 -282 -34 110 -44 128 -141 210 206 -112 53 -138 -137 112
5218 112 86 -166 -278 129 -71 -60 199 -136 121 153 -138 30 -31 182 160 34 58 -273 -63 -32 183 434
5240 434 -110 -237 97 -90 162 92 173 187 161 38 211 -130 165 -111 -34 23 57 -92 -130 75 -255 232 -421
5263 -421 -94 -106 85 -3 -244 51 102 98 -133 203 329 176 123 -56 68 -111 260 -65 120 -128 41 -34
5285 -34 228 -42 -287 -145 -122 169 -74 144 97 180 292 -102 -159 -193 -55 -479 -116 235 -181 -105 -122 148 138
5308 138 -27 24 -192 219 5 -224 -343 -145 -144 220 379 227 -4 169 144 -2 -318 -56 -57 -38 174 -102
5330 -102 -191 294 109 125 -28 -25 107 -49 102 -71 150 -81 -195 186 -44 288 50 -3 -31 56 -134 91
5352 91 92 -429 48 119 125 -220 86 -290 118 210 114 78 -335 45 149 -19 -161 92 269 27 81 101 -18 -2
$$ packed form
5195a44K95q9J85k77J9J0O6M2j93k19K3K48J44j54J72k69L51ml18J65j91JK49
5218A12k6k52j12M07k00J1K59l35K57L2k91J68o1K13k2j26K4l31K10L1K15K51
5240D34n44j27L34j87K52p0Q1J4k6j23J73l41K95k76P7N7L4j49l8K05l30M87o53
5263d21L27j2J91q8k41K95N1mk31L36J26j53n3j79J24j79L71l25J85k48J69p5
5285c4K62k70k45J42K3K91k43K18m7Q3J12l94n7l4J38m24L63L51m16P6j7K70j0
5308A38j65N1k16M11k14k29j19J98JL64J59j52k31J73k5j46l16K62jJ9K12k76
5330a02q9M85j85J6j53LJ32j56J51j73K21k31j14L81k30L32k38n3k8Q7j90K25
5352I1Jn21M77P1Ol45L06l76M08R2r6l6m13L80J04j68j42K53J77k42N4K0j19J6
$$ plain form
5376 -2 184 126 5 199 134 -75 -230 248 236 -66 -178 -143 -148 309 271 -103 145 -82 -4 -399 180 -13 -138
5399 -138 83 21 -137 -107 15 -224 133 150 -149 -14 94 -188 95 59 19 167 -188 -242 125 -49 200 82
5421 82 -143 -161 -111 -115 323 179 -107 -8 -240 -203 94 -225 -125 49 -124 53 -28 60 -80 -208 -28 138 -313
5444 -313 -279 -111 -46 143 38 -154 -167 -38 148 -5 -245 -238 41 -91 -85 -69 -298 100 102 188 106 -128 -203 -108 179
5469 179 -194 -130 254 -72 191 -176 -258 -36 -100 -38 32 296 184 110 153 180 -71 -146 -203 -138 413 -163 -116 87
5493 87 -117 281 -49 5 -24 -93 82 -77 -62 58 -49 201 -176 -40 -175 -203 99 125 -183 -173 184 -110 192
5516 192 -133 43 53 -40 16 -54 25 44 -125 -83 -84 207 156 -193 -103 -138 268 246 -102 -64 -11 -183 -86 103 85 -68
5542 -68 199 -229 154 101 -85 -89 -40 -271 66 66 -274 -101 163 -223 -127 101 54 261 -58 -157 -109 -131 -39 -153
$$ packed form
5376bJ86n8j21J94o5k09j55M78j2l02j12L5nM57l8l74K48k27P8l95N79j93j25
5399a38K21o2j58L0J22k39L57J7k99J35J08k82K83l6m0J48l55n4L67j74K49j18
5421H2k25j8N0mM38j44k86R9k32L7K97l19J00J74j73J77q1Q8j40j28J80J66m51
5444c13L4J68O5J89j05j92j3J29J86j53k40PK79j32OJ6k29L98KQ6q2k34p5R5K87
5469A79l73O4L84l26K63l67q2K22o4O2P0K64j12p4M3K7k51p5n7O5N51n76M7K03
5493H7k04L98l30N4k9o9J75j59J5J20j07K50l77J36j35k8L02K6l08J0L57k94L02
5516A92l25J76J0r3N6p0P9J9j69M2jK91n1l49R0l5M06k2l48L8N3j72R7J89j8j53
5542f8K67m28L83n3j86mM9k31L37%l40J73K64l86R6K28m7K07l19r9M8k2R2j14
$$ plain form
5566 -153 -274 184 -54 12 -75 -25 -69 111 49 -194 -261 -183 262 26 134 -124 -56 109 -2 -36 -409 -305 173
5589 173 -50 -84 -18 11 -43 -272 325 51 -215 -276 -26 123 -27 -234 55 49 29 -403 -203 -36 -45 326 -135
5612 -135 -29 -210 -395 -133 15 -3 63 -273 53 52 76 -45 -92 294 -2 127 279 107 158 -30 15 3 27
5635 27 -147 207 -138 -14 130 -28 -109 -335 -242 -214 -214 -2 144 -286 34 -55 -158 -247 116 -30 213 227 2
5658 2 -172 -33 -98 -39 -22 75 15 40 -16 -158 213 44 -160 -133 -255 -54 179 53 68 -209 -48 -128 -126 71 87
5683 87 136 165 271 -167 15 111 -130 43 113 -76 198 -184 26 78 217 -161 -216 -124 -303 1 171 205 -251
5706 -251 139 88 8 -31 92 249 -78 -42 -213 -26 -15 -45 73 240 125 -176 137 -179 -185 -294 40 -173 -29
5729 -29 40 195 -83 -55 -267 -267 -100 235 61 161 -19 -343 161 21 94 289 59 136 -15 14 -70 -15 -207
$$ packed form
5566a53j21M58k38O6q7N0m4J80o2k43o7P8M45k36J08k58O8J65j11l4l73J04M78
5589A73k23l4O6K9n4k29N97k74k66o1K50J49j50k07K89ok0m32K00J67rL71m61
5612a35J06j81j85K62J48j8O6l36L26jK4j21m7L86k96J29J52j72N1j88M5j2K4
5635B7j74L54l45J24J44j58q1k26R3K8%K12J46m30L20q9j03q9L63j46K43J4k25
5658Bj74J39o5N9J7R7o0K5n6j42L71j69k04K7j22K01K33j26J5k77J61q0KJ97J6
5683H7M9K9J06m38J82R6k41J73P0j89K74l82K10N2J39l78n5R2j79L04J70L4m56
5706b51L90n1q0l9J23J57l27L6j71J87J1l0J18J67j15l01L13l16oj09L34k13J44
5729b9O9J55k78K8k12%J67L35j74J00j80l24N04j40P3J95k30P7j51K9q4N5j92
$$ plain form
5752 -207 230 -226 -95 64 136 248 2 -103 126 -62 -112 -76 178 180 -156 -32 99 243 50 211 10 -15
5774 -15 -52 101 -186 126 137 150 87 256 56 89 -10 169 -148 -123 148 407 -9 163 -74 -94 122 91 -168
5797 -168 -73 -131 116 189 108 37 51 92 -173 140 -235 53 -94 143 1 -66 96 222 -61 -49 5 -196 -135 -153
5821 -153 -127 -219 23 -150 -89 -94 -120 -143 65 -88 -7 -7 -365 7 -105 -196 -378 -8 -43 4 -160 -403 42 202
5845 202 39 -45 51 -37 -60 27 -67 -251 140 139 82 56 122 22 -126 3 -83 -121 -90 -245 236 -96 -218 125 55
5870 55 17 84 -14 -2 -100 176 -196 42 134 -326 297 -206 -243 -74 32 -24 -107 -50 75 120 48 9 64 117 67 -49
5896 -49 202 70 232 -65 150 -297 181 194 -37 100 -99 32 -343 -16 134 -23 184 15 -23 402 -91
5917 -91 -1 -279 -19 45 33 -48 177 142 -77 -18 -55 -76 18 259 -334 44 200 -45 -43 40 184 249 -55 -121 -28
$$ packed form
5752b07M37m56J31J59P2J12k46j05K29j88n0L6K54Kl36J24J31J44j93J61k01k5
5774a5l7J53k87L12J1J3o3J69k00L3r9J79l17K5K71K59m16J72k37k0K16l1k59
5797a68R5n8K47P3q1p1J4M1k65L13l75K88j47K37j42o7J62J26k83J2N4k01O1j8
5821a53K6r2K42j73O1nk6k3K08j53Q1%l58L72j12r1j82L70l5M7j64k43M45J60
5845B02j63q4R6q8k3Q7r4j84L91jn7k6O6j00j48J29q6l8L1j55M81l32j22L43p0
5870E5l8O7r8J2r8K76l72K38R2m60O23n03l7J69J06n6q3N7J25M5p2l9N5N3n0j16
5896d9K51j32J62k97K15m47M78J3k31J37j99J31l75L27J50j57K07j69l8M25m93
5917i1R0k78K60O4j2q1K25l5k19N9l7k1R4K41n93L78J56k45KQ3J44O5l04o6R3
$$ plain form
5942 -28 -235 6 58 -100 77 114 113 18 -228 -239 191 21 285 -66 128 -64 -400 47 -54 -159 83 215
5964 215 -29 -7 219 -82 63 96 -237 227 92 -155 77 -277 61 -28 -158 51 -142 -88 163 -234 129
5985 129 -52 -20 30 -209 -368 -88 -69 95 74 2 -186 -132 150 -47 -279 0 56 -153 92 -385 -28 -128
6007 -128 -40 -130 -199 137 161 -242 22 183 93 -140 -17 102 6 30 -31 -1 355 -154 -313 30 93 -101 117
6030 117 100 -153 148 -132 -129 -259 -51 6 106 -218 -76 -11 -96 -236 -93 71 -92 -116 -1 -145 -134 -131 257
6053 257 8 -105 228 208 -231 284 9 64 -201 22 17 321 280 -36 -318 -101 31 -391 -63 -25 -305 -63
6075 -63 360 -102 22 -169 265 100 96 -46 269 -87 -33 12 -47 -106 -62 35 75 -54 -2 121 126 83 -96 -50 -96
6100 -96 116 -159 187 -164 -47 -24 -171 76 12 15 147 29 311 -183 -147 -9 -29 19 101 201 125 -173 -184 454
$$ packed form
5942b8k07K41N2j58J77L7jr5k46j1M30j70K64l51J94j92l36M47j01j05K42J32
5964B15k44K2K26l01J45L3l33M64j35k47K32l54L38q9j30K09j93N4K51l97L63
5985A29j81L2N0k39j59K80J9J64k1p2j88N4K82j97k32K79N6k09K45m77L57j00
6007a28Q8r0o9L36K4m03K64J61r0k33J23J19r6K4o1L0L56n09j59L43O3j94K18
6030A17j7k53L01k80Lj30K08N7J00l24J42O5q5j40J43J64j63k4J15j44J1LL88
6053B57k49j13L33k0m39N15k75N5k65K23nL04m1l16k82K17J32m22L28L8k80K42
6075f3M23m62J24j91M34j65mj42L15l56N4M5n9n9M4R7M0j29N2J23Nm3j79M6m6
6100i6K12k75L46l51J17K3j47K47o4LJ32j18K82m94L6J38k0M8Q2J00p6k98j1O38
$$ plain form
6124 454 -298 -287 95 -107 205 -155 67 -62 -88 213 74 118 34 -173 -166 -7 72 -23 48 24 -110 41 329
6147 329 -154 248 203 -72 194 -158 -24 131 -174 65 -10 26 125 178 120 101 -8 -100 -66 -156 -77 -381 7 242
6171 242 163 88 272 -65 -83 174 20 73 54 73 -47 -140 -255 -254 -135 -142 219 2 -19 -102 80 -172 224 -2
6195 -2 -132 -112 -74 45 -195 20 53 212 -200 -194 197 99 -64 110 10 -221 -36 189 29 316 24 -191 -1
6218 -1 75 -110 -191 -118 203 99 -116 -154 123 -224 -10 267 -174 -63 6 127 17 -113 172 -47 -113 -58 -282
6241 -282 119 -237 -94 213 122 -188 53 63 -201 -323 -29 -186 26 -36 -84 -206 -6 -48 -48 134 195 -239 -81
6264 -81 7 -53 100 -156 -289 56 109 190 -459 -253 -137 -3 7 -58 42 102 -114 -47 49 65 41 -20 -244 -269 -67
6289 -67 -53 202 73 122 4 -111 -165 56 -179 -125 144 -52 -309 -287 -4 -20 57 36 -210 -207 -102 -48 18 -76 37
$$ packed form
6124D54p52J1L82k02L12l60K22j29k6L01j39M4q4k07PJ59P9r5P1k4j34J51K88
6147C29m83M02m5k75K66l52J34J55l05K39p5L6R9N3n8j9j09r2L4r0P9l04L88K35
6171B42p9p5J84l37j8K57j54N3j9J9j20r3j15JJ19pL61k17k1q3J82k52L96k26
6195bj30K0L8J19k40K15L3J59m12OL91r8j63J74j00k31J85K25j60K87k92k15J90
6218aP6j85q1P3L21j04k15l8K77l47K14K77m41J11O9J21j10j30K85k19o6N5k24
6241b82M01l56J43L07r1l10K41J0k64j22K94j57K12o2m8j22K00m2%J82O1m34J58
6264h1Q8o0J53k56j33L45N3Q1o49K06J16J34J0o5J00O0k16O7R6J6k4o1k24k5K02
6289f7J4K55j29M9j18j15n4K21k35N4K69j96k57K2K83j6P7k1k46LJ05N4O6r4J13
$$ plain form
6314 37 132 36 356 57 -106 201 -55 -181 107 146 -101 8 -145 -18 20 -106 83 -116 -51 42 389 269
6336 269 77 -90 -92 62 -93 134 -128 195 32 -258 111 0 102 -230 -115 161 119 26 -46 -69 -5 317
6358 317 17 287 -89 -63 115 -52 107 -293 17 82 -158 -18 309 258 9 88 -137 26 -89 -106 299 -58
6380 -58 -49 416 176 -89 -17 211 -29 137 -82 -84 116 48 143 -55 94 163 104 162 11 107 -320 -146 -37 -246
6404 -246 -248 5 4 -250 -94 372 -153 -23 182 -109 240 25 -49 141 166 60 170 -260 -51 30 -44 -88 122
6427 122 -212 -175 -109 -151 -303 -204 134 -116 -223 -206 -181 -102 -162 -28 -141 -5 -21 66 153 11 -4 93 -162 -37
6451 -37 124 -142 36 -369 -41 25 31 65 6 19 -81 77 -79 -124 88 -86 -81 -3 -140 -41 15 -4 0 -117 192
6476 192 -197 -147 -75 112 14 -197 -312 157 118 -125 -41 38 90 -46 87 21 173 81 116 126 -232 -122 -13 23
$$ packed form
6314C7R5r6L20k99j63L07k56j26K88L9k47J09j53J27L8j26J89j99O5R3L47j20
6336B69j92j67kJ54j55K27k62L23j63k90L69j11J02l32J15K76m2r3p2k3O4L22
6358C17l00K70l76K6J78j67J59m00L10O5k40J40L27n1k49P9k25J63j15j7M05l57
6380e8RM65k40k65P2K28k40J66k19kK00o8R5j98J49O9n9N8j51R6m27J74J09k09
6404b46kK53jk54J56M66n25J30K05k91L49k15p4J90K5j06J10m30K09Q1p4m4K10
6427A22l34L7O6m2j52R9L38k50j07J7K5P9o0J34j13J36j6Q7Q7j42j5R7k55J25
6451c7J61k66J78m05L28O6OL4n9J3j00J58j56m5K12j74NP8j37R9N6j9Mj17L09
6476A92l89N0P2J87r8k11j15M69l9k43Q4P9N2j36J33o6J52r2L5J0l58J10J09L6
$$ plain form
6500 23 -34 198 -61 -229 -20 -31 -54 202 -143 -211 -10 -272 167 80 3 7 80 105 249 164 -173 43 94 -132
6524 -132 -243 91 31 200 -1 -85 -154 44 -29 -177 230 -82 52 103 -74 -166 -300 222 -19 -233 -25 92
6546 92 253 223 32 38 172 -146 51 241 -67 60 -46 -248 -122 -198 -269 135 -112 -155 309 204 -98 -109 -143
6569 -143 -74 -210 -191 -24 111 219 -302 -146 47 329 130 74 -138 11 -125 125 137 -36 -65 -81 124 -52
6591 -52 21 207 -90 62 -91 124 204 70 10 180 -128 107 251 28 -65 -21 -186 -302 73 -32 70 -47
6613 -47 -10 2 307 -85 34 -136 -179 -86 142 97 100 -66 -85 -192 90 113 49 -97 134 149 -307 289 159 -144
6637 -144 102 -81 31 213 -35 -47 101 90 -295 -125 67 -188 -187 142 -80 71 130 -294 11 65 167 229
6659 229 77 -124 129 194 245 -205 -99 39 -117 57 -70 -37 60 -371 -39 -231 181 141 -169 167 41 -181
$$ packed form
6500B3n7K32k59j68K09j1k3K56l45o8K01k62M39q7p7MP3K5J44q5l37K16N1k26
6524a32j11L34o0J69k01q4o9J98p3j48M07l12J34N1j77r2j34N22k41k14K08J17
6546I2J61l0j91OJ34l18J97J90l08J27j06k02J26p6p1M04k47m3M64j05l02j1l4
6569a43O9j36J9J67J35J08n21J56J93K82j99n6k12J49j36K50J2j73k9j6K05j76
6591e2P3J86k97J52j53K15Q0j34o0J70l08K35J44k23r3M4j65j16L75j05J02j17
6613d7L7J2L05l92J19j70m3R3K28m5Lj66j9j07K82K3o4j46K31J5m56N96j30l03
6637a44K46j83J12J82k48j2J48j1l85J70J92k55JL29k22J51N9m24L05N4J02O2
6659B29j52k01K53O5N1m50J06J38j56J74j27L3R7m31L32j92M12m0l10L36j26k22
$$ plain form
6681 -181 -145 58 123 121 -8 -105 -260 85 -293 93 53 102 143 58 -208 -292 -77 90 -273 -337 10 94 -19 -94
6705 -94 108 76 -179 -84 203 334 64 -70 140 -59 -242 -180 192 -165 -39 -175 52 -22 -206 76 145 16
6727 16 -68 -45 -110 244 -88 -412 -185 -80 8 -138 141 79 183 -110 -73 -70 -217 345 -201 -92 -179 89 39 -68
6751 -68 131 -40 -96 97 -51 197 77 196 314 -33 -178 366 -100 47 -88 -12 -218 65 21 -76 95 116
6773 116 89 -28 -63 -21 143 -105 -34 68 -55 -77 135 -44 198 31 90 128 -70 -148 94 247 -87 -172 59
6796 59 -141 -252 191 9 -48 155 -541 18 88 199 69 38 -113 -76 -145 303 -5 -194 12 57 -110 46
6818 46 91 -292 140 34 195 -173 40 115 -221 -81 -284 14 143 66 199 -42 54 -99 -95 33 -217 -180 -68
6841 -68 -15 111 280 -10 -59 185 -18 12 36 37 -116 -80 -111 -127 -509 -290 -99 -22 -85 224 -145 120 54 52 -303
$$ packed form
6681a81L6K03O5kj29r7j55L45l78L86m0M9M1q5k66q4K15J67l63o4L47Q4j13p5
6705i4K02l2k55R5K87J31k70j34K10j99j83O2L72l57J26j36K27p4j84K82O9j29
6727A6q4K3o5L54l32l24K27J05Q8j46K79o2J04k93L7Lj47N62n46J09q7K68n0j07
6751f8J99j71n6J93j48K48j20J19J18l47j45N44m66J47j35P6k06K83m4r7J71K1
6773A16k7j17l5M2J64k48P1J02j23k2K12j79K42j67N9L8j98p8K42J53l34q5K31
6796E9k00j11M43j82n7K03o96N59P0J11j30l1j51L7o9M48l08j89K06M5j67J56
6818D6M5l83M32j06J61l68K13P5l36J40k03K98J29p7J33k41R6j53MJ28k50L7J12
6841f8N3J26J69k90m9K44k03L0K4Jj53L6l1j6l82K19J91P7o3L09l69K65o6kl55
$$ plain form
6866 -303 79 -215 -48 77 60 -4 182 258 -1 -230 -152 -213 -23 7 17 -196 -175 -180 -27 42 -123 -41 -167 412
6890 412 -60 -132 119 121 169 -14 -111 361 86 37 378 340 67 125 71 -160 -81 -109 123 -204 -48 -40 259 -109
6914 -109 -40 -160 -193 222 -36 -243 125 -64 238 -50 144 -357 52 184 -194 -256 -50 -220 -161 -82 54 -129
6936 -129 370 -150 -220 346 -112 -66 -85 47 11 11 155 -62 67 -181 -129 -27 -134 105 29 286 152 133 159
6959 159 -77 34 -46 139 -41 34 167 -142 158 -182 148 106 138 -121 87 -200 -10 24 34 43 27 84 -51
6982 -51 60 -121 -105 268 -455 -100 -40 99 215 59 -174 -168 -63 325 35 211 222 -102 72 -227 155 123
7004 123 -64 152 -103 -133 13 -214 20 132 -81 44 13 73 112 -87 143 88 -118 154 -249 -1 -141 -293
7026 -293 -311 -175 -151 -135 264 -10 -47 -34 32 95 14 22 -98 -132 7 46 9 -169 203 15 161 -43 -72 171 166
$$ packed form
6866c03L82k94J67J25j7o4J86P6k59k29P8o1J90L0J0k13K1nJ53O9j65Q2j26N79
6890D12m72p2K51KM8j83r7M72k75m9L41l8k73N8n4k31P9k8K32l27J56QK99l68
6914a09O9j20l3M15k58k07L68j89L02k88J94n01M09J32l78o2K06j70N9P9J36j83
6936a29M99n20p0N66m58M6j9J32l6%J44k17J29k48N2J02j07K39p6K57j34j9K6
6959A59k36J11q0J85j80P5J33l09L00l40L30m2L2k59K08k87J90L4J0Rj6N7j35
6982e1J11j81J6L73p23L55O0J39J16j56k33OJ05L88k90J76J1l24J74k99L82l2
7004A23j87K16k55l0J46k27K34J12k13J25l1O0L9j99K30n5k06K72m03K48j40j52
7026b93j8J36K4J6L99k74l7J3O6O3q1Qj20l4J39L9l7j78L72j88J46k04k9K43n
$$ plain form
7051 166 174 305 -5 201 177 332 -24 -366 142 175 -76 -29 54 -326 187 -184 -4 67 -61 25 -17 35 31 -299
7075 -299 57 207 -80 -313 -132 27 133 239 30 103 -209 -46 182 30 -347 -66 4 102 -67 42 -202
7096 -202 -7 42 -271 -297 -258 0 -65 -182 64 -157 -123 -227 -221 64 -18 -15 78 111 276 113 -110 -242 -126 75
7120 75 7 -49 -215 115 8 -51 -263 119 -20 127 -15 315 -345 170 -80 -12 54 -51 -44 -14 -98 124 -31
7143 -31 -391 -131 -5 -125 -111 208 144 68 224 169 -271 144 -174 -163 -255 -1 62 -134 -79 -21 41 162 -93 79
7167 79 -325 19 14 171 54 -46 86 18 116 130 -114 -183 -22 165 48 -212 57 105 -53 -58 -170 38 -51 -68
7191 -68 294 -46 -94 205 133 -240 451 -356 -182 63 -73 -169 -73 -129 328 -16 -128 -204 -96 236 87 3 26
7214 26 -178 -356 31 69 -22 8 105 -126 73 -60 109 120 42 -83 119 -67 39 -29 57 -147 -141 178 -226 89
$$ packed form
7051A66QJ31l10K06k4J55l56l42N08L3k51M7Q3l80N13l71J80P1j28Q6m2N2ml30
7075b99L56J50k87k33J81J59J06J06k09P3l12J63K28j52l77K81P0R8j69J09k44
7096b02J95M9l13k6L9K58o5j17K46k21L4j04OK85q2LR3L3J65j63k23j32J16K01
7120G5o8n6j66L30j07n9k12L82j39J47j42L30o60N15k50O8O6j05PL0q4K22j55
7143c1l60K60J26j20J4L19o4p6J56n5m40M15l18J1r2K54O3j96N5N8O2J21k55J72
7167G9m04L44nJ57j17j00J32o8R8J4k44o9J61J87j17k60K69M8j58nj12K08q9j7
7191f8L62l40m8K99p2l73O91q07J74K45j36r6R6n6M57l44j12p6J08L32j49q4K3
7214B6k04j78L87L8r1L0R7k31J99j33J69J1p8j25K02j86J06o8Q6k04OL19m04L15
$$ plain form
7238 89 -106 49 -255 -90 15 3 22 49 246 -42 88 75 107 72 244 -18 -260 48 163 -9 203 117 -173
7261 -173 -25 55 -44 133 -32 -20 -151 -182 -33 -127 -24 -38 192 97 186 -56 -247 120 -133 98 406 -207 -190
7284 -190 -7 116 -58 6 -318 -131 -53 8 -21 -126 -118 300 91 -213 39 -144 -14 -42 133 149 -99 -295 -346
7307 -346 231 97 -233 -46 14 -10 77 -380 106 41 -36 -59 -88 52 -110 -126 75 60 8 -18 175 -210 46 240
7331 240 41 88 -154 309 15 -184 168 35 -53 166 -107 418 -85 165 -272 -134 10 100 23 128 138 18
7353 18 13 -50 74 -164 188 -207 -39 -94 -56 -257 -216 77 -27 -75 -335 235 -20 -122 246 -449 -63 114 -280
7376 -280 268 -159 75 -78 -50 -38 -349 -155 17 -31 -52 -122 -80 102 47 16 -124 149 97 179 -255 -49 112
7399 112 245 -35 -68 -23 79 -124 -12 -318 261 -166 268 -238 -100 120 -184 -90 -216 126 -30 -171 50
$$ packed form
7238H9j95J55l04J65J05j2J9K7J97k88J30j3L2l5J72k62k42L08J15j72K12q6k90
7261a73J48Q0r9J77j65J2j31l1J49r4J03j4K30r5Q9k42j91L67k53K31L08o13J7
7284a90J83J23j74O4l24J87P8O1k9j05QM18k09l04K52j83J30k8J75J6k48j96n1
7307c46N77j34l30J87O0k4Q7m57M86o5p7k3k9J40j62j6K01j5n2k6J93l85K56J94
7331B40j99M7k42M63k94j99L52j33q8K19k73N25n03K50m37J38J44R0p7J05J0j20
7353A8no3J24k38L52l95J68n5L8k01M1K93j04m8k60N70k55j02L68o95L86J77l94
7376b80N48m27K34j53K8J2l11J94J72m8k1p0M2J82n5l1j40K73n2Q2m34K06J61
7399A12J33k80l3M5J02k03J12l06N79m27M34n06J38K20l04R4j26L42j56j41K21
$$ plain form
7420 50 -35 -483 -48 216 52 6 -106 24 240 -64 89 215 185 155 -77 -291 182 -52 133 140 18 -8 -241
7443 -241 126 165 282 166 -94 -280 -11 -218 252 -68 70 -131 91 -22 -70 70 76 -178 151 104 165 220
7465 220 -276 100 12 -40 233 93 -69 47 -24 137 61 -89 -86 -15 -124 251 172 71 -164 -71 -242 89 -69
7488 -69 -145 77 76 94 -166 -108 248 -83 9 153 23 246 -36 -105 226 28 18 -5 109 -279 -104 -8 -116 -25
7512 -25 -24 38 -238 235 27 32 -131 81 -59 2 -164 -20 -406 -146 -93 400 -52 -159 218 158 16 -59 205
7535 205 15 171 176 45 334 92 -190 -215 12 227 -219 -154 -122 -13 -54 20 62 98 62 175 273 -74 150 -52
7559 -52 -42 33 134 -91 359 106 -142 169 38 158 -179 -84 273 9 53 160 -80 -62 -144 -65 -72 94 -19
7582 -19 -166 282 -3 -185 -14 117 -123 70 -117 -217 96 67 -138 14 126 17 183 262 -120 -193 -316
$$ packed form
7420E0q5m48M35K64j64m6j12J30K16l04J53J26l0l0k32k14M73k34J85Pj22k6k33
7443b41L67L9J17j16k60j86K69k07M70l20J38k01K22j13m8J40Ok54L29m7O1N5
7465B20m96L76q8n2K73j40j62J16p1J61p6j50LP1j09L75p9j01k35R3j71L31j58
7488f9p6K22jJ8k60N8L56l31R2J44j30K23k82o9L31j98j0k3J14l88J75R6j08R1
7512b5JO2k76M73k08Nj63K12j40O1j66J44l86K60N3M93m52j07L77o0j42p5K64
7535B05j90J56Nj31K89k42k82k5K27K15m46O5L2J09m1P4M2L6l6J13R8l47K24k02
7559e2J0P5J01k25M50k53k48L11j31J20l37R5L57k64M4J07k40J8q2P9pJ66j13
7582a9j47M48k85j82J71J31k40J93j87j00L13k9k05J52J12j09J66P9l82p3j23
$$ plain form
7603 -316 272 246 -43 188 20 137 -86 59 138 -239 -21 -130 173 -181 393 -3 -87 74 -111 235 92
7624 92 17 11 -70 -54 -158 -259 7 221 -87 -227 25 109 1 -287 129 93 29 382 106 -380 -3 73 59 -74
7648 -74 -92 156 122 -57 -55 30 -125 93 -209 14 -52 -82 19 -112 19 -41 -410 -80 -36 -280 194 24 54 72
7672 72 -13 -95 -93 121 294 65 -116 261 -150 -190 164 -135 44 139 63 -227 122 181 94 -66 -113 74 -402 -136
7696 -136 -49 183 62 29 -282 171 135 62 13 -338 -33 67 -97 -140 -198 -57 38 156 -120 34 -86 162 -216
7719 -216 -108 -104 28 -46 -83 53 -28 3 -1 -57 342 -6 -89 -104 -51 31 -304 -31 169 18 40 -126 40 223 30
7744 30 -19 32 -186 189 -41 23 -110 -47 281 52 -100 -267 158 -90 46 -62 96 168 -230 27 -148 63
7766 63 -45 -48 149 80 -1 152 -16 226 128 45 83 -137 22 -161 175 -29 148 256 -24 -285 -45 -5 244
$$ packed form
7603c16N88k6k89K31j68J17k23J45P9l77K18j09L03l54N74l96q4J61j85L46j43
7624I2p5oq1J6j04j01K66K14l08j40K52Q4j08k88M16l6o4L53k76m86L77P6j4j33
7648g4j8K48l4j79KQ5j55K18l02K23o6l0J01j31J31o0l69L30M4k44M74j70L0J8
7672G2q5q2KK14J73k29j81L77m11m0L54k99J79R5p6k90L49N9q7j60m7J87m76K66
7696a36Q7K32j21l3l11M53l6p3m9l51L05J00j64m3n8J41R5J18k76J54j20K48l78
7719b16J08MJ32p4l7J36q1L1mn6L99l48q3j5N3Q2l35K73K00j51K2j66J66J83j93
7744C0m9N1k18L75k30O4j33O3L28k29j52j67M25k48J36j08J58P2l98K57j75K11
7766F3j08lJ97o9q1J53j68K42r8q3L8k20J59j83L36k04J77J08k80k61K40M0K49
$$ plain form
7789 244 -122 -18 -49 -244 -89 -90 -206 -336 51 216 187 -195 -461 112 -6 173 -201 -18 23 214 -94 42
7811 42 0 -443 98 -143 -19 80 226 -169 -322 -8 -306 58 130 117 -67 -210 101 -18 160 176 93 64 46
7834 46 -51 128 80 -149 -106 172 77 360 166 59 -198 -45 266 260 104 66 -170 -134 103 123 151 62 -31 -181
7858 -181 -12 23 20 -104 -44 -133 16 -72 -357 -41 155 136 26 25 -129 -275 -237 292 150 -67 74 -204 211
7881 211 175 -202 -28 14 -79 2 -99 107 138 -106 201 18 204 -187 -92 -100 -197 139 113 300 74 -24 -250 -43
7905 -43 -211 -85 58 57 302 36 -114 -148 207 27 -163 62 294 -79 -187 279 -47 107 -13 -109 193 -8
7927 -8 -221 -84 87 -332 -34 99 -54 121 -78 76 180 -14 37 -24 336 -15 41 83 46 -181 147 60 163
7950 163 -214 -95 59 -21 -65 305 -47 -134 -284 -40 65 -262 50 120 -35 -28 -366 -128 -36 75 -35 -133 105
$$ packed form
7789B44l66J04l1j95J55jj16j30L87J65k9l82k66N73j18J79l74J83M1J91l08J36
7811D2m2m43N41k41J24R9J46l95j53L14k98L64P2j3j84j43L11j19J78J6q3k9j8
7834D6r7J79m8k29M3K78r5K83j94j07k57J53L11oj56l8k36L6K37K0K8q9r3j50
7858a81J69L5lj24O0q9J49q8k85L16J96j9j10jj54j46L8N29j42k17J41k78M15
7881B11l6l77J74M2r3Q1j01K06L1k44L07j83J86l91R5qr7L36k6J87k26r8k26K07
7905d3j68J26J43jK45k66j50l4L55j80j90K25K32l73j08M66l26J54j20r6L02k01
7927hk13J37J71m19K98J33j53J75j99J54J04j94N1o1L60l51N6M2l7k27L28q7J03
7950A63l77J19J54q0m4L70l52q7j50K44J05l27L12P0j55Pl38K38R2J11j10r8K38
$$ plain form
7973 105 -19 -364 29 -190 -9 -152 -322 243 44 208 31 -11 32 81 95 -231 -97 25 94 249 4 -301
7995 -301 -7 -119 -83 -103 270 169 199 53 -141 136 -68 117 191 25 131 190 58 -98 -88 371 -54 -95
8017 -95 271 -112 -10 134 3 48 94 -4 167 -128 -35 162 236 -49 150 93 -19 28 221 123 66 194 -120
8040 -120 -29 -136 -93 65 -43 325 -77 -91 54 -21 222 141 -20 -70 -139 287 118 -159 97 -161 -117 -10 -276
8063 -276 169 -44 189 97 56 -83 -14 122 -150 266 -20 -133 -153 78 -51 -118 -51 326 258 -6 61 30 50
8086 50 -58 194 -98 136 32 -41 143 -61 59 55 -138 231 -106 -146 -168 126 89 -236 88 10 0 -85 0 105
8110 105 -28 -190 41 125 29 145 22 -188 -126 -41 -103 8 117 -219 90 164 -77 164 10 57 43 -145 -84
8133 -84 -216 -185 -63 -69 -97 84 -27 -66 -146 -157 -131 -59 -102 85 167 -123 -22 -28 -212 -14 216 -7 -164 78 -6
$$ packed form
7973A05j24l45L93k19J81j43j70N65j99J64j77m2M3M9J4l26J34J22O9J55k45l05
7995c01K94j12L6k0L73j01L0j46j94K77k04J85P4j66J06N9j32j56J0M59m25m1
8017i5L66l83J02J44j31M5M6r8J71k95R3J97P4k85J99n7j12M7J93r8n7J28l14
8040a20R1j07M3J58j08L68m02j4J45p5K43q1j61n0o9M26j69k77K56k58M4J07k66
8063b76M45k13K33r2m1j39O9J36k72M16k86j13k0K31j29o7O7L77o8k64O7l1K0
8086E0j08K52k92K34j04p3J84k04J20mj93L69l37m0k2K94l7l25L24p8j0q5Q5J05
8110A05j33j62K31Q4r6J16j23k10O2Q5o2J11J09l36L09P4k41K41j54M7j4j88O1
8133h4j32L1J22ok8J81j11l9q0j1K6P2m3J87Q2k90J01oj84J98K30k23j57K42q4
$$ plain form
8158 -6 -46 32 254 124 151 120 87 -16 82 75 19 -294 8 -101 -149 -52 -276 -84 58 100 13 155 -28 71 131 68
8184 68 -69 109 51 -72 62 58 84
$$ packed form
8158fm0P8K22j30K7l1l3j03R8pn6l13L02j09m8R7k24J92J42M2q7J42j83R9O0o3
8184F8j37J78n8j23J34mK6
8191H4
$$ Imaginary data points
##PAGE= N=2
##DATA TABLE= (X++(I..I)), XYDATA
$$ plain form
0 0 0 0 0 0 0 0 6 -8 8 -8 8 -16 16 -21 24 -32 32 -40 48 -56 68 -80 91 -105 122 -138 159 -182 205 -232
30 -232 261 -293 329 -368 409 -455 507 -563 625 -692 767 -849 940 -1043 1154 -1279 1423
47 1423 -1584 1772 -1989 2245 -2557 2934 -3417 4048 -4919 6198 -8278 12242 -22567 108112
61 108112 233103 33021 -100794 -117149 11492 104338 106714 19777 -38179 -40896 403 19774
73 19774 18495 2367 -3745 -14080 -15856 -6525 17046 18199 -11351 -47716 -37422 17296 63838
86 63838 43359 -22735 -63930 -33250 32480 64650 35809 -8646 -19583 3767 19150 11103
98 11103 569 13791 33417 28349 -1356 -21938 -8941 19013 26415 7984 -6811 4202 21337
111 21337 12431 -17771 -28644 1474 42352 45875 6625 -27886 -18592 17875 36733 23297 6625
$$ packed form
0@%%%%%%Oj4J6j6J6k4L2l7M5n6O4p2Q8j04J24j48J71j96K27k60K97l41L87m37
30b32M93n54O22o97P77q64R62j070J188j317J459j616J789j983K197k433K702
47A423l007L356l761M234m802N491o351P465q967J1117j4476K0520l4809J30679
61A08112J24991k00082j33815j6355J28641R2846K376q6937n7956k717M1299J9371
73A9774j279j6128o112j0335j776R331K3571J153k9550l6365J0294N4718M6542
86F3838k0479o6094m1195L0680O5730L2170k8841m4455j0937K3350J5383q047
98A1103j0534J3222J9626n068k9705k0582J2997K7954P402j8431j4795J1013J7135
111B1337q906l0202j0873L0118M0878L523l9250l4511R294L6467J8858j3436j6672
$$ plain form
124 6625 14072 32526 29493 3630 -10730 10894 47394 54388 23723 -7963 -5159 20022 29835
137 29835 13716 -980 9477 28835 22459 -10188 -32988 -17313 18195 30777 6524 -23757
149 -23757 -25741 -5793 3693 -9640 -20321 -6712 17035 16029 -12450 -35126 -21784 13473 30281
162 30281 13858 -8863 -8012 10246 16569 1214 -9947 5361 33597 36292 7096 -21164 -15656
175 -15656 15081 32497 18297 -4011 -4657 10777 14268 -4763 -20810 -7893 21933 31350 6162
188 6162 -24797 -25259 1804 21572 12969 -4812 -4060 12676 18340 336 -17761 -7685 22927
201 22927 38709 21640 -7559 -14231 5092 22124 16482 1565 2113 16657 20263 1079 -19985
214 -19985 -16634 8496 24399 12098 -12811 -22037 -10008 922 -4797 -15691 -12063 4453 9434
$$ packed form
124F625P447J8454l033k5863j4360K1624L6500O994l0665l1686K804K5181R813
137B9835j6119j4696J0457J9358o376l2647k2800J5675L5508J2582k4253l0281
149b3757j984J9948R486j3333j0681J3609K3747j006k8479k2676J3342L5257J6808
162C0281j6423k2721Q51J8258O323j5355j1161J5308K8236K695k9196k8260N508
175a5656L0737J7416j4200k2308o46J5434L491j9031j6047J2917K9826R417k5188
188F162l0959m62K7063J9768q603j7781P52J6736N664j8004j8097J0076L0612
201B2927J5782j7069k9199o672J9323J7032n642j4917N48J4544L606j9184k1064
214a9985L351K5130J5903j2301k4909r226J2029J0930n719j0894L628J6516M981
$$ plain form
227 9434 -8666 -29086 -26200 -1986 15650 8678 -9715 -13666 -1600 6624 -746 -10781 -2424
240 -2424 18221 25868 8220 -14775 -15454 6737 23553 17111 -641 -4443 6843 12074 -93
253 -93 -14974 -9657 12255 23352 7423 -18414 -24359 -6225 11202 7680 -7862 -10884 1380
266 1380 8749 -2827 -19304 -15986 6632 23221 13942 -9007 -17784 -3503 12770 12215 -406
279 -406 -2275 9661 16989 5323 -13414 -14566 4729 21372 15217 -5489 -16253 -7229 4430
292 4430 1819 -9543 -10724 1630 9821 -1422 -21171 -24624 -7143 10831 8315 -7572 -16159
305 -16159 -7723 2971 637 -9667 -8531 6541 18159 9807 -9547 -15789 -1149 17488 17763
318 17763 3978 -4416 1993 10716 6480 -5553 -7154 6040 18231 12018 -7493 -18036 -8746
$$ packed form
227I434j8100k0420K886K4214J7636o972j8393l951J2066Q224p370j0035Q357
240b424K0645P647j7648k2995o79K2191J6816o442j7752l802J1286N231j2167
253i3j4881N317K1912J1097j5929k5837n945J8134J7427l522j5542l022J2264
266A380P369j1576j6477L318K2618J6589r279k2949q777J4281J6273n55j2621
279d06j869J1936P328j1666j8737j152J9295J6643o155k0706j0764R024J1659
292D430k611j1362j181J2354Q191j1243j9749l453J7481J7974k516j5887q587
305a6159Q436J0694k334j0304J136J5072J1618q352j9354o242J4640J8637K75
318A7763j3785q394O409Q723m236j2033j601J3194J2191o213j9511j0543R290
$$ plain form
331 -8746 6415 9083 -1802 -9278 -4100 3198 -1630 -13357 -15027 -1647 12013 9549 -5775 -15319
345 -15319 -8078 4198 7372 842 -2088 4913 11265 5815 -6481 -9066 4147 17648 15694 1653
359 1653 -7480 -2276 6482 5757 -1923 -4022 4564 11139 3892 -11767 -16402 -5022 9434 8736 -4199
374 -4199 -12823 -7372 1297 342 -8395 -10096 871 11452 7081 -8281 -15499 -5620 9939 13858
388 13858 3458 -5348 -1283 7334 6927 -2600 -6434 3224 14943 13130 -1554 -12367 -7552 5593
402 5593 10348 2495 -5836 -3970 2805 2184 -7448 -12480 -4066 8102 9402 -2289 -12467 -9927 939
417 939 6156 1986 -2537 622 6725 6257 -2317 -6594 325 12496 15461 6020 -2868 -1855 5917
432 5917 8548 4143 693 4260 9884 7591 -2832 -9398 -4150 6557 9744 1594 -7289 -6786 -1347
$$ packed form
331h746J5161K668j0885p476N178P298m828j1727j670J3380J3660k464j5324r544
345a5319P241J2276L174o530k930P001O352n450j2296k585J3213J3501j954j4041
359A653r133N204Q758p25p680k099Q586O575p247j5659m635J1380J4456o98j2935
374d199q624N451Q669r55q737j701J0967J0581m371j5362p218R879J5559L919
388A3858j0400q806M065Q617m07r527l834R658J1719j813j4684j0813M815J3145
402E593M755p853q331J866O775o21r632n032Q414J2168J300j1691j0178K540J0866
417I39N217m170m523L159O103m68q574m277O919J2171K965r441q888J013P772
432E917K631m405l450L567N624k293j0423o566N248J0707L187q150q883N03N439
$$ plain form
447 -1347 232 -4824 -7730 -2525 4602 3501 -5792 -12934 -8962 1752 7190 2413 -4398 -4241 1243
462 1243 2637 -1662 -4429 880 9035 9631 1221 -6869 -5122 3217 8102 4666 -944 -846 2724 2215
478 2215 -3297 -6669 -1682 6084 7415 -433 -8523 -7517 -222 3675 908 -2114 -167 4003 3289
493 3289 -3201 -7120 -1538 7850 11100 4204 -3383 -3037 3703 6572 3732 -49 2379 7865 7582 -251
509 -251 -6962 -3835 4965 9462 3946 -4983 -6830 -2134 1231 -2279 -6634 -4985 965 2661 -3784
524 -3784 -11640 -11242 -3119 3295 1058 -5450 -7887 -4409 -966 -2274 -5121 -3506 2124 5293 1276
539 1276 -5474 -6479 -1042 4745 4881 1013 -877 165 1283 -903 -3271 -1453 3191 5467 1485
554 1485 -4234 -5490 -2122 1124 864 -1025 -1039 544 648 -3033 -5976 -3139 2309 5923 2114 -3002
$$ packed form
447a347J579n056k906N205P127j101r293p142L972J0714N438m777o811J57N484
462A243J394m299k767N309Q155N96q410q090J747Q339M885l436n610R8L570n09
478B215n512l372M987P766J331p848q090J006P295L897k767l022J947M170p14
493C289o490l919N582R388L250o896p587L46O740K869k840l781K428N486k83p833
509b51o711L127Q800M497n516q929j847M696L365l510m355J649N950J696o445
524c784p856L98Q123O414k237o508k437L478L443j308k847J615N630L169m017
539A276o750j005N437N787J36l868j890J042J118k186k368J818M644K276l982
554A485n719j256L368L246k60j889j4J583J04l681k943K837N448L614l809n116
$$ plain form
570 -3002 -4259 -884 2228 1462 -332 816 3844 4068 -510 -5016 -3537 2252 5754 3371 -2563 -4483
586 -4483 -2498 -261 -1706 -4188 -3534 -416 532 -3821 -8860 -9272 -4401 20 -738 -4881 -6921 -5621
602 -5621 -3508 -3936 -5757 -4585 -591 1964 -1075 -5564 -6127 -2421 2268 2663 153 -1138 -66 1712
618 1712 -125 -2327 -722 2831 5595 2953 -2030 -3830 -1168 2205 2556 188 -1092 790 786 -981
634 -981 -4213 -3911 455 3976 2297 -2184 -4926 -3219 216 1204 -467 -1159 295 1880 -77 -3400
650 -3400 -4027 -706 3018 3322 -404 -3599 -3341 -1351 -158 -1135 -1951 -1262 285 -1648 -4759 -6061 -3990
667 -3990 -1176 26 -1844 -4158 -4582 -4163 -3620 -3473 -2558 -1110 94 -1271 -3292 -4162 -2528 -126 1431
684 1431 1081 351 716 702 -916 -712 752 3414 4644 3077 208 -868 762 2366 2262 1419 1301
$$ packed form
570c002j257L375L112p66j794J148L028K24m578m506J479N789L502k383n934j920
586d483J985K237j445k482O54L118R48m353n039m12M871M421p58m143k040J300
602e621K113m28j821J172L994K555l039m489n63L706M689L95k510j291J072J778
618A712j837k202J605L553K764k642m983j800K662L373L51k368j280J882mj767
634i81l232L02M366L521j679m481k742J707L435R88j671o92J454J585j957l323
650c400o27L321L724L04l726l195K58J990J193r77q16O89J547j933l111j302K071
667c990K814J202j870k314m24M19N43J47R15J448J204j365k021q70J634K402J557
684A431l50p30L65j4j618K04J464K662J230j567k869j076J630J604j04q43j18
$$ plain form
701 1301 1898 1705 -482 -2826 -2264 940 3193 2034 -1586 -3796 -2148 -178 150 -920 -1393 120
717 120 970 -574 -3069 -3679 -1339 2118 2952 317 -2226 -2398 -561 786 -274 -801 115 965 509
734 509 -1898 -3555 -2073 200 1834 493 -1626 -2523 -2364 -1602 -1636 -1220 -343 240 64 -1705 -3184 -2317
752 -2317 -566 1055 1522 365 -178 -259 -452 -104 246 1875 3066 2738 921 -165 -480 1250 2548
769 2548 2185 2123 1355 1428 446 -412 -546 925 2230 2351 521 -1320 -1885 -874 -134 476 245 192 -335
788 -335 -860 -1604 -1795 -1226 164 1201 746 -592 -1798 -1606 -460 196 871 1384 634 -138 -1354 -1445 -419
807 -419 686 986 547 320 -604 -1210 -1577 -1456 -405 865 1387 16 -1716 -2208 -1287 29 387 -64
825 -64 17 -19 -37 -744 -1321 -550 1050 2552 2008 313 -1146 -730 1028 1945 1886 969 1179 1080 1177 -21 -711
$$ packed form
701A301N97j93k187k344N62L204K253j159l620k210J648J970L28j070m73J513
717A20Q50j544k495o10K340L457Q34k635k543j72J837J347j060n27R16Q50m56
734E09k407j657J482K273J634j341k119q97J59P62l4M16Q77N83j76j769j479Q67
752b317J751J621M67j157n43q1j93L48L50J629J191l28j817j086l15J730J298
769B548l63o2p68P3r82q58j34J471J305J21j830j841n65J011P40O10k31n3n27
788c35n25p44j91N69J390J037m55j338j206J92J146O56O75N13p50p72j216r1J026
807d19J105L00m39k27r24o06l67J21J051J270N22j371j732m92R21J316L58m51
825f4Q1l6j8p07n77P71J600J502n44j695j459M16J758R17n9r17K10r9R7j198o90
$$ plain form
846 -711 670 1728 2727 827 -874 -1331 -586 613 1036 322 -297 -529 -244 -911 -1462 -1532 -536 631 903
865 903 -139 -1592 -2012 -942 375 942 773 -171 -278 -462 -324 -268 207 623 1151 1092 66 -896 -835 -110
885 -110 599 1358 948 365 -708 -1000 -504 -31 61 603 519 339 -458 -1057 -1130 -331 593 949 671 -396 -922
906 -922 -669 -354 497 933 695 600 341 -363 -343 -228 757 1197 1297 668 -85 -799 -579 102 827 869 643
927 643 309 -490 -1005 -945 -403 554 509 332 -7 -514 -687 -589 7 421 868 662 244 -1058 -937 -324 447
948 447 621 812 167 83 -113 -127 -306 70 708 981 848 -377 -1449 -1242 -435 532 571 97 -716 -643 -445
969 -445 -791 -379 -642 234 426 108 -505 -1536 -1452 50 691 745 -16 -513 -535 -94 -43 104 362 503 1133
990 1133 505 -367 -897 -494 629 1854 1369 349 -583 -275 308 390 621 256 702 925 617 -139 -761
$$ packed form
846g11J381J058R99j900j701m57P45J199M23p14o19k32K85o67n51p0R96J167K72
865I03j042j453m20J070J317N67j69r44j07j84J38N6M75M16N28n9j026r62O1P25
885a10P09P59m10n83j073k92M96M73R2N42q4j80p97n99p3P99R24L56k78j067n26
906i22K53L15Q51M36k38r5k59p04K0J15R85M40J00o29p53p14K20O81P25M2k26
927F43l34p99n15O0N42R57m5j77l39n07j73R8N96M14M47k06m18j302J21O13P71
948D47J74J91o45q4j96j4j79L76O38K73j33j225j072K07Q07R67L9m74q13P3J98
969d45l46M12k63Q76J92l18o13j031Q4J502O41N4p61m97k2M41N1J47K58J41O30
990A133o28q72n30M03J123J225m85j020r32L08N83Q2K31l65M46K23l08p56o22
$$ plain form
1009 -761 5 919 1407 1031 -136 -703 -287 391 382 291 172 -68 312 -115 -940 -702 -299 491 924 141 -590
1030 -590 -1350 -912 -235 258 -91 -393 -90 -455 -354 -1008 -1096 -616 -31 377 -253 -1070 -1203 -930 -73 322
1050 322 155 -66 -151 -440 -332 -365 -130 355 897 646 236 -354 -655 330 868 1156 906 379 276 -23 275
1071 275 449 542 1064 943 587 277 -361 110 285 707 1043 487 116 -201 -430 -474 69 112 603 189 -261
1092 -261 -464 -798 -526 -105 -165 4 -16 -399 -589 -922 -944 -500 205 283 -623 -663 -899 -804 -426 -47 -221 -270
1114 -270 -168 -348 -683 -828 -659 137 579 486 -41 -646 -643 -110 350 321 222 313 248 254 -63 -451 141 728 1086
1137 1086 746 313 -535 -482 519 1014 1143 581 352 175 497 477 155 -72 460 936 637 14 -856 -559
1157 -559 289 706 487 -419 -500 -300 -244 -93 -893 -423 -330 447 5 -870 -1611 -1166 -115 365 300 -890 -1296
$$ packed form
1009g61P66R14M88l76j167n67M16O78rr1j19k40L80m27q25K38M03P90M33p83p31
1030e90p60M38O77M93l49l02L03l65J01o54q8M80N85M08o30q17j33K73Q57L95
1050C22j67k21q5k89J08l3K35M85N42k51m10n90l01R85N38K88k50n27j03k99K98
1071B75J74R3N22j21l56l10o38M71J75M22L36n56l71l17k29m4N43M3M91m14m50
1092b61k03l34K72M21o0J69k0l83j90l33k2M44P05P8r06m0k36R5L78L79j74m9
1114b70J02j80l35j45J69P96M42r3n27o05LN33M60k9r9R1o5Ol17l88N92N87L58
1137A086l40m33q48N3J001M95J29n62k29j77L22k0l22k27N32M76k99o23q70K97
1157e59Q48M17k19r06q1K00N6J51q00M70R3P77m42q75p41M45J051M80o5j190m06
$$ plain form
1178 -1296 -616 -466 -265 -589 -606 -1 232 -2 -1004 -986 -408 561 570 512 -147 -337 -118 160 29 99 163 932
1200 932 815 592 -87 -342 235 777 1296 455 222 -7 143 243 531 234 601 519 231 -2 -163 204
1220 204 225 385 831 545 -46 -486 -349 -422 63 -246 216 -100 -231 -473 -431 -184 -236 -399 190 -342 -536
1241 -536 -946 -998 -252 -152 -152 -208 -580 -837 -641 -352 -95 -173 58 -24 -289 -246 -317 -163 -8 289 92 203 29
1264 29 37 -258 105 496 745 499 -1 -93 102 548 518 783 411 532 635 139 17 -306 72 623 603 533
1286 533 -549 -439 76 487 131 -160 -53 101 300 -267 -788 -607 -108 503 598 -65 -1067 -469 -45 163
1306 163 -66 -100 -234 19 125 -189 -668 -442 224 247 61 -384 -846 -806 -191 299 -127 -372 -211 234 -254
1327 -254 -703 -799 -297 186 491 224 36 -268 -124 235 541 328 128 127 213 368 448 273 425 403 658 647
$$ packed form
1178a296O80J50K01l24j7O05K33k34j002J8N78R69Rn8o59j90K19K78j31P0O4P69
1200I32j17k23o79k55N77N42N19q41k33k29J50J00K88k97L67q2k88k33j61L67
1220B04K1J60M46k86n91m40J37p3M85l09M62l16j31k42M2K47n2j63N89n32j94
1241e36m10n2P46J00%n6l72k57J96K89K57p8K31q2k65M3p1J54J55K97j97J11j74
1264B9Qk95L63L91K49k46n00r2J95M46l0K65l72J21J03m96j22l23L78N51k0p0
1286E33j082J10N15M11l56k91J07J54J99n67n21J81M99O11R5o63j002N98M24K08
1306A63k29l4j34K53J06l14m79K26O66K3j86m45m62M0O15M90m26k45J61M45m88
1327b54m49r6N02M83L05k67j88l04J44L59L06k13k00jQ6J55Q0j75J52k2K55j1
$$ plain form
1349 647 201 17 -19 429 703 514 559 -205 14 76 -215 458 -54 -26 483 27 -334 -579 -427 64 201
1370 201 192 -92 -418 -179 -289 240 -367 -94 152 366 330 -192 -453 -53 371 760 -92 28 -137 -131 316 -49
1392 -49 58 -46 331 -133 -234 -645 -403 79 80 193 -313 19 -62 67 -88 191 330 615 340 -150 -421
1413 -421 342 504 611 381 76 42 190 265 261 -59 33 398 571 -40 -256 -105 153 162 22 180 -257 29
1435 29 203 44 -510 -451 -127 261 284 -547 -606 -753 273 333 175 -156 -500 -55 -83 -103 -271 75 197 274
1457 274 198 6 -519 -113 112 439 422 61 -159 -251 -59 22 -140 -89 -32 -52 -33 -16 -315 -268 -59 272 288 155
1481 155 -447 -641 -82 166 152 -127 -164 191 408 226 -240 -286 77 575 262 -230 -539 -356 52 540 56
1502 56 -191 2 0 407 -53 -195 -70 100 641 -65 -378 -779 -62 37 430 -5 -319 -180 219 -241 -104
$$ packed form
1349F47m46j84l6M48K74j89M5p64K19O2k91O73n12K8N09m56l61k45J52M91J37
1370B01rk84l26K39j10N29o07K73K46K14l6n22k61M00M24L89q52J20j65OM47l65
1392d9J07j04L77m64j01m11K42M82JJ13n06L32q1J29j55K79J39K85k75m90k71
1413d21P63J62J07k30l05l4J48P5ml20R2L65J73o11k16J51K58Rj40J58m37K86
1435B9J74j59n54N9L24L88K3q31n9j47J026O0j58l31l44M45k8k0j68L46J22P7
1457B74p6j92n25M06K25L27j7l61k20r2J92Q1j62N1N7k0J9J7k99M7K09L31J6j33
1481A55o02j94N59K48j4k79l7L55K17j82m66m6L63M98l13m92l09J83M08M88m84
1502E6k47J93kM07m60j42J25J70N41p06l13m01P17R9L93m35l14J39L99m60J37
$$ plain form
1523 -104 -8 65 453 605 218 -255 -238 -41 125 337 236 88 47 45 -252 142 321 -200 -120 -8 -246 -209 -105
1546 -105 -202 -120 -271 59 -27 -211 -275 -103 -216 44 134 -267 -138 -259 -308 160 -131 318 -190 284 371 325 217
1569 217 -281 277 408 394 103 64 -19 -157 123 377 53 225 123 26 118 36 39 185 150 -30 211 -360 -69
1592 -69 -180 251 181 405 -83 143 156 -91 1 28 36 141 480 117 -256 -437 -169 324 90 -182 -125 -155 106
1615 106 36 -10 -214 -184 46 137 21 -786 -262 76 -10 225 -184 -541 -41 -181 105 221 -309 126 177 613
1637 613 29 -185 -222 322 537 317 77 360 134 221 454 33 -45 372 466 392 187 -207 -202 182 238 168 49
1660 49 50 41 184 244 16 -10 -352 51 -10 126 -294 -187 -122 -33 -26 -240 -77 102 -141 290 217 -189 11 73 -92
1685 -92 -123 22 -379 -19 123 -91 -291 -289 -381 -43 126 277 -36 206 -42 -213 -221 288 122 241 449 225
$$ packed form
1523a04R6P3L88J52l87m73J7J97J66K12j01j48m1kk97L94J79n21Q0J12k38L7J04
1546a05r7Q2j51L30q6j84o4J72j13K60R0m01J29j21m9M68k91M49n08M74Q7m6j08
1569B17m98N58J31j4k91l9q3j38K80K54l24J72j02r7R2q2LJ46l5j80K41n71K91
1592f9j11M31p0K24m88K26J3k47R2K7QJ05L39l63l73j81K68M93k34k72N7l0K61
1615A06p0m6k04L0K30R1j16q07N24L38q6K35m09l57N00j40K86J16n30M35N1M36
1637F13n84k14l7N44K15k20k40K83k26Q7K33m21p8M17R4p4k05l94NL84N6p0j19
1660D9JrJ43O0k28k6l42M03o1J36m20J07O5Q9Pk14J63J79k43M31p3m06K00O2j65
1685i2l1J45m01L60J42k14k00Kr2L38J69J51l13K42k48j71qN09j66J19K08k24
$$ plain form
1707 225 -7 -321 71 161 242 326 422 212 298 242 145 30 439 172 47 281 -15 165 23 23 109 266 162
1730 162 324 -37 -143 23 36 519 -23 -291 -470 -341 -111 -68 217 4 135 -18 -15 -197 -331 -683 126
1751 126 39 -32 -185 -485 -82 152 -75 -79 -70 -7 -23 165 -44 -278 267 180 285 -2 -36 -185 -205 533 -39 7
1775 7 -39 86 351 -5 -34 -137 19 488 375 7 -152 -347 59 436 281 69 83 186 685 245 161 -340
1797 -340 80 359 295 89 -508 -182 2 -83 13 -56 -358 -118 -76 -87 14 -320 3 -236 151 -214 -341 -211
1819 -211 90 -196 -24 -298 -121 -139 23 439 -319 -452 131 66 323 -183 -190 -57 169 140 4 57 -248 286
1841 286 -1 97 -257 -286 129 18 362 44 102 -186 229 -172 74 344 -80 -94 73 -80 110 -163 367
1862 367 462 -49 76 -123 49 46 4 -34 158 -63 -130 130 -99 97 282 -208 -114 -93 -111 140 -253 -284 -307 -117
$$ packed form
1707B25k32l14L92R0Q1Q4R6k10Q6n6r7j15M09k67j25K34k96J80j42%Q6J57j04
1730A62J62l61j06J66J3M83n42k68j79J29K30M3K85k13J31j53Lj82j34l52Q09
1751A26q7p1j53l00M03K34k27mRO3j6J88k09k34N45q7J05k87l4j49k0P38n72M6
1775Gm6J25K65l56k9j03J56M69j13l68j59j95M06L77j55k12J4J03M99m40q4n01
1797c40M20K79o4k06n97L26J84q5R6o9l02K40M2j1J01l34L23k39L87l65j27J30
1819b11L01k86J72k74J77j8J62M16p58j33N83o5K57n06pJ33K26k9j36N3l05N34
1841B86k87R8l54k9M15j11L44l18N8k88M15m01K46K70m24j4J67j53J90k73N30
1862C67R5n11J25j99J72lm2l8J92k21o7K60k29J96J85m90R4K1j8K51l93l1k3J90
$$ plain form
1886 -117 -97 -150 -24 -438 -164 66 20 -61 -265 -149 -160 -145 -31 -165 -107 -304 -7 -145 228 -107 -39 301 291
1909 291 158 -326 -424 -73 150 152 -301 -296 -6 165 354 -178 -236 15 10 -162 184 117 -423 -42 357 48 -273
1932 -273 -30 -1 305 50 181 -362 -124 123 151 4 -45 -374 -15 347 255 -10 6 -283 104 -24 -20 38 -26
1955 -26 -133 186 72 -511 -415 -16 -14 279 -98 -48 -277 -72 35 -71 -370 -273 -109 320 326 -108 -152 -6 -37
1978 -37 179 129 -260 -103 -74 184 152 -151 -38 123 174 3 -22 132 265 -53 -40 -154 -162 211 62 176 51
2001 51 162 178 13 -271 101 -235 48 98 233 108 153 39 -48 -130 99 327 256 186 -130 -100 183 -51 142
2024 142 -387 78 -130 127 -42 -434 -106 94 -36 154 205 -178 -314 50 -124 161 89 -340 -14 189 -88
2045 -88 -342 153 15 -99 250 168 12 29 68 -51 -159 61 92 -252 -118 160 97 254 -190 -131 148 59 155
$$ packed form
1886a17K0n3J26m14K74K30m6q1k04J16j1J5J14j34N8j97K97j38L73l35O8L40j0
1909B91j33m84r8L51K23Km53NK90J71J89n32n8K51nj72L46o7n40L81L99l09l21
1932b73K43K9L06k55J31n43K38K47K8j47m9l29L59L62r2k65J6k89L87j28MN8o4
1955b6j07L19j14n83R6L99KK93l77N0k29K05J07j06k99R7J64M29Om34m4J46l1
1978c7K16n0l89J57K9K58l2l03J13J61N1j71k5J54J33l18J3j14qL73j49J14j25
2001E1J11J6j65k84L72l36K83N0J35j25M5j14q7q2K29K28p1p0l16L0K83k34J93
2024A42n29M65k08K57j69l92L28K00j30J90N1l83j36L64j74K85p2m29L26K03k77
2045h8k54M95j38j14L49q2j56J7L9j19j08K20L1l44J34K78o3J57m44N9K79q9R6
$$ plain form
2068 155 -231 -228 -64 167 342 -188 -135 117 63 153 135 -149 -295 256 219 -21 -236 -181 520 395 109 -91 -298
2091 -298 127 229 83 -7 -199 170 331 -29 6 36 88 205 121 -284 -440 -221 166 54 -107 -198 95 217
2113 217 76 -383 -290 -111 -88 110 -205 -199 -17 -47 -277 151 -42 -341 -212 -273 -292 -9 -231 110 -258 274
2135 274 -42 324 77 -222 -27 9 115 -54 -178 27 -197 94 315 217 -394 -175 -69 267 -177 -310 -83
2156 -83 125 619 -103 -229 -364 382 470 179 -270 -194 112 268 -36 -39 -252 396 230 156 -112 7 -192 295
2178 295 140 13 -175 59 241 174 10 -172 181 258 63 44 -95 -8 303 -53 -31 -382 109 428 -161 -497
2200 -497 -55 91 148 235 69 -69 248 479 239 -272 -100 -23 225 392 -209 -224 -95 439 308 -234 -368
2221 -368 -199 226 148 280 -147 247 343 186 123 -242 -37 337 301 100 -140 -275 80 317 -275 -346 259 147
$$ packed form
2068A55l86LJ64K31J75n30N3K52n4R0j8k84j46N51l7k40k15N5P01j25k86k00k07
2091b98M25J02j46r0j92L69J61l60L5L0N2J17q4m05j56K19L87j12j61r1K93J22
2113B17j41m59R3J79K3J98l15OJ82l0k30M28j93k99J29o1j9K83k22L41l68N32
2135B74l16L66k47k99J95L6J06j69j24K05k24K91K21r8o11K19J06L36m44j33K27
2156h3K08M94p22j26j35P46Q8k91m49P6L06J56l04lk13O48j66p4k68J19j99M87
2178B95j55j27j88K34J82o7j64j82L53P7j95j9j39Q7L11l56K2l51M91L19n89l36
2200d97M42J46N7Q7j66j38L17K31k40n11J72P7K48J67o01j5J29N34j31n42j34
2221c68J69M25p8J32m27L94R6j57o3l65K05L74l6k01k40j35L55K37n92p1O05j12
$$ plain form
2243 147 -104 -172 132 316 -42 -130 12 -230 -57 45 -163 -161 -169 115 70 286 -294 -89 76 211 -278 -285 -120
2266 -120 40 -44 -4 -197 -219 161 290 188 -135 -324 -42 230 143 -101 -426 39 567 29 -127 -289 188
2287 188 365 402 -403 -731 -66 208 219 -87 -585 -158 317 297 -380 -25 -190 563 458 -63 -545 102 286
2308 286 347 34 9 139 419 324 76 -298 -21 279 59 -451 -428 -123 2 276 -197 -398 40 331 -3
2329 -3 -81 -468 -298 402 77 -55 -416 -200 190 185 -398 -371 -244 169 272 -229 -374 -209 407 374 55 -364
2351 -364 -108 123 390 8 -371 2 323 54 -198 80 178 202 261 -112 117 50 253 121 -129 -549 -259
2372 -259 321 276 4 -122 -174 161 216 -67 -377 43 437 28 4 -550 -207 288 192 -289 -172 -294 269 -18
2394 -18 -219 -438 53 183 388 16 -340 -66 145 291 -106 -603 -250 595 353 -4 -546 -611 271 499 74
$$ packed form
2243A47k51o8L04J84l58q8J42k42J73J02k08KqK84m5K16n80K05J65J35m89pJ65
2266a20J60q4M0j93k2L80J29j02l23j89K82K72q7k44l25M65N28n38j56j62M77
2287A88J77L7q05l28O65K74J1l06m98M27M75k0o77L55j65P53j05n21m82O47J84
2308B86O1l13k5J30K80r5k48l74K77L00k20n10K3L05J25K74m73k01M38K91l34
2329cp8l87J70P00l25j32l61K16L90nn83K7J27M13J03n01j45J65O16l3l19m19
2351c64K56K31K67l82l79L73L21k69k52K78R8K4N9l73K29o7K03j32k50m20K90
2372b59N80m5k72j26n2L35N5k83l10M20L94m09k4n54L43M95r6m81J17j22N63k87
2394a8k01k19M91J30K05l72l56K74K11J46l97m97L53Q45k42l57n42o5Q82K28m25
$$ plain form
2415 74 -398 -595 99 536 129 -584 -444 309 465 341 -497 -249 297 551 291 -484 -220 259 257 274 -194
2436 -194 -129 433 410 80 -29 -484 -59 460 -60 -76 -112 479 451 35 -276 -294 277 6 -142 -351 -254 135
2458 135 90 90 -450 -78 307 184 -101 -421 -55 367 671 168 -418 -184 17 334 -247 -515 -435 57 154 236
2480 236 -535 -165 263 290 95 -663 -258 207 468 -87 -276 -83 341 538 32 -311 -224 301 341 120 -496
2501 -496 -335 -5 196 382 -598 -221 12 415 -13 -235 -291 351 546 -56 -146 -278 358 255 114 -455 -105
2522 -105 455 436 196 -646 -257 -23 179 188 -372 -203 43 336 87 -405 -481 70 513 213 -374 -336 -9 480
2544 480 272 -268 -405 12 535 -152 -48 -437 -115 413 -117 -466 -259 107 438 359 -5 -356 43 372
2564 372 251 -663 -243 -307 151 336 -141 -255 49 410 257 -110 -346 -2 632 203 -468 -362 -172 330
$$ packed form
2415G4m72j97O94M37m07p13J40P53J56j24q38K48N46K54k60p75K64M79kJ7m68
2436a94O5N62k3l30j09m55M25N19n20j6l6N91k8m16l11j8N71k71j48k09R7L89
2458A35m5%n40L72L85j23k85l20L66M22L04n03n86K34K01L17n81k68Q0M92R7Q2
2480B36p71L70M28K7j95p58M05M65K61n55j89J93M24J97n06l43Q7N25M0k21o16
2501d96J61L30K01J86r80L77K33M03m28k22n6O42J95o02r0j32O36j03j41n69L50
2522a05N60j9k40q42L89K34K02Rn60J69K46K93k49m92p6N51M43l00n87L8L27M89
2544D80k08n40j37M17N23o87J04l89L22N28n30l49K07L66L31p9l64l51L99L29
2564C72j21r14M20o4M58J85m77j14L04L61j53l67k36L44O34m29o71J06J90N02
$$ plain form
2584 330 47 -298 -460 290 129 -133 -452 -387 102 339 32 -339 -447 27 350 115 -426 -202 104 852
2604 852 82 -314 -308 -140 468 27 -320 -418 -73 469 349 -209 -337 -41 513 313 -285 -484 -283 494 560
2625 560 -69 -585 78 98 216 -29 -263 -99 319 177 23 -154 -281 386 273 -492 -521 -44 570 238 -332
2646 -332 -272 -55 530 201 -8 -230 41 225 322 -307 -332 -184 424 477 -387 -399 -218 383 203 -174 -330 -245
2668 -245 423 423 -280 -385 -17 283 115 -125 -493 -448 693 93 -253 -411 -415 183 258 -150 -248 118 112 399 -79
2691 -79 -180 3 277 550 1 -302 36 229 69 63 -113 -301 -155 195 -183 -348 219 380 270 -251 -393
2712 -393 -267 476 565 4 -330 -51 92 553 -243 -707 -82 192 -159 -119 -410 -63 520 320 -66 -552 -139
2733 -139 342 546 -59 -365 -82 450 395 -170 -402 -163 184 527 -31 -154 -15 266 -17 157 -438 -138
$$ packed form
2584C30k83l45j62P50j61k62l19O5M89K37l07l71j08M74L23k35n41K24L06P48
2604H52p70l96OJ68O08m41l47r8L45N42j20n58j28K96N54k00n98j99K01P77O6
2625E60o29n16O63K0J18k45k34J64M18j42j54j77j27O67j13p65k9M77O14l32n70
2646c32O0K17N85l29k09k22K71J84R7o29k5J48O08N3q64j2J81O01j80l77j56Q5
2668b45O68%p03j05L68L00j68k40l68M5J141o00l46j58mN98P5m08r8L66oK87m78
2691g9j01J83K74K73n49l03L38J93j60oj76j88J46L50l78j65N67J61j10n21j42
2712c93J26P43Q9n61l34K79J43M61p96m64O25K74l51M0k91L47N83k00l86m86M13
2733a39M81K04o05l06K83N32n5n65k32K39L47L43n58j23J39K81k83J74n95L00
$$ plain form
2753 -138 263 474 84 -445 -240 65 287 -211 -224 -415 39 202 2 -199 -499 177 347 22 -398 -465 -116
2774 -116 40 -172 -418 -516 135 326 66 -343 -198 162 195 271 -389 -278 292 164 -20 -548 -352 199 569
2795 569 -43 -285 12 90 342 36 -349 -361 -65 329 273 -441 -265 -60 434 201 -295 -205 213 519 80
2816 80 124 -135 81 76 -37 -325 -249 131 631 351 -113 -216 -52 81 -187 -314 -304 314 -9 130 -199 -220
2838 -220 357 146 -270 -361 -246 144 143 3 -375 -43 190 349 126 -342 -317 129 413 288 -297 -500 55
2859 55 369 81 -524 -351 211 543 102 -276 -319 57 182 148 -153 -201 302 108 416 -128 -283 122 106 66
2881 66 30 -361 62 395 237 -229 -365 78 221 297 -470 56 -71 325 311 -24 -232 -32 186 5 -158
2902 -158 -266 -16 252 107 -482 -380 -202 223 -42 -34 -239 -9 155 -53 -105 -163 43 295 61 -98 -99 344
$$ packed form
2753a38M01K11l90n29K05L05K22m98j3j91M54J63k00k01l00O76J70l25m20o7L49
2774a16J56k12k46r8O51J91k60m09J45L60L3P6o60J11N70j28j84n28J96N51L70
2795E69o12k42K97P8K52l06l85j2K96L94n6p14J76K05M94k33m96R0M18L06m39
2816H0M4k59K16nj13k88P6L80N00k80m64j03J64J33k68j27J0O18l23J39l29k1
2838b20N77k11m16r1J15L90jj40l78L32K33J59k23m68K5M46K84j25n85k03N55
2859E5L14k88o05J73N62L32m41l78m3L76J25l4l01m8N03j94L08n44j55M05j6m0
2881F6l6l91M23L33j58m66j36M43J43P6p67N26j27L96j4l35k08K00K18j81j63
2902a58j08K50K68j45n89J02J78M25k65Qk05K30J64k08n2n8K06K52k34j59jM43
$$ plain form
2924 344 331 126 -225 125 352 273 93 -72 -370 197 277 220 -209 -82 10 188 334 28 -601 -1 353 354
2946 354 -203 -170 75 354 65 87 -218 -164 366 177 -160 -198 -52 413 299 -156 -234 -90 395 171 -232 -314
2968 -314 -140 340 127 -53 -288 104 93 52 -337 -605 -107 88 75 -56 -161 -236 72 166 25 -364 236 410
2990 410 100 -59 -242 -323 186 90 -376 -226 224 297 377 118 -92 -353 434 163 -82 -322 90 372 200
3011 200 -36 -195 -114 181 -301 -52 141 65 441 215 -28 -120 -254 212 236 244 -295 -100 48 -120 97 -415
3033 -415 354 329 -47 -204 -237 57 245 191 -112 -280 -159 14 341 -236 -147 -4 451 99 -112 52 -131
3054 -131 206 145 -24 -263 -54 419 626 55 -290 -174 200 130 -85 -165 14 -131 137 -1 -384 33 235
3075 235 6 35 -39 -277 197 208 -82 -249 195 280 458 -21 -403 -108 208 114 30 -286 -111 97 314 90
$$ packed form
2924C44j3k05l51L50K27p9j80j65k98N67Q0n7m29J27R2J78J46l06o29O00L54J
2946C54n57L3K45K79k89K2l05N4N30j89l37l8J46M65j14m55p8J44M85k24m03q2
2968c14J74M80k13j80k35L92j1m1l89k68M98J95j3j31j05p5L08R4j41l89O00J74
2990D10l10j59j83q1N09r6m66J50M50P3Q0k59k10k61P87k71k45k40M12K82j72
3011B00k36j59Q1K95m82K49J93p6L76k26k43r2j34M66K4Qn39J95J48j68K17n12
3033d15P69k5l76j57l3K94J88n4l03j68J21J73L27n77Q9J43M55l52k11J64j83
3054a31L37o1j69k39K09M73K07n71l45J16L74p0k15q0J79j45K68j38l83M17K02
3075B35k29K9p4k38M74J1k90j67M44Q5J78m79l82K95L16r4q4l16J75K08K17k24
$$ plain form
3097 90 -118 -15 68 227 3 -259 -270 -20 162 149 -108 -236 -67 368 154 -78 -136 -338 202 -149 -278 -48
3119 -48 112 258 64 -162 -231 137 -25 -166 -53 90 124 144 -289 6 209 300 23 -102 -76 -17 142 -42
3141 -42 -233 -236 -62 268 155 258 -235 258 -139 88 -56 -163 67 84 254 -168 -196 -87 -12 -16 -104 -91 115
3164 115 191 -113 525 -242 30 -167 27 53 14 -52 196 171 -168 -402 -112 89 245 -164 -155 32 146 206 -263
3187 -263 -171 -28 54 -56 66 -102 -162 -156 293 81 -218 -78 23 248 -15 -216 176 159 237 90 -275 50
3209 50 23 68 -74 9 -27 -41 156 460 -98 -198 0 14 38 -36 7 -10 -159 -386 -168 126 20 -183 -88 -84 -171
3234 -171 -166 98 135 31 -32 -236 204 -244 -209 -70 26 138 -107 -274 -9 137 164 105 -136 219 69 96 -95
3257 -95 -19 -18 -192 -75 -5 95 -189 180 371 118 -200 2 -16 135 -94 -229 -166 -160 61 68 -185 -128 -197 34
$$ packed form
3097I0k08J03Q3J59k24k62j1K50J82j3k57j28J69M35k14k32n8k02N40l51j29K30
3119d8J60J46j94k26o9L68j62j41J13J43L4K0m33K95K03R1k77j25K6N9J59j84
3141d2j91lJ74L30j13J03m93M93l97K27j44j07K30J7J70m22k8J09P5mq8J3K06
3164A15P6l04O38p67K72j97J94K6l9o6K48k5l39k34K90K01J56m09RJ87J14O0m69
3187b63R2J43Q2j10J22j68o0OM49k12k99J40J01K25k63k01L92j7P8j47l65L25
3209E0k7M5j42Q3l6j4J97L04n58j00J98J4K4p4M3j7j49k27K18K94j06k03R5Mq7
3234a71NK64L7j04o3k04M40m48L5J39R6J12k45j67K65J46K7n9k41L55j50K7j91
3257i5P6Jj74J17P0J00k84L69J91k53l18K02j8J51k29j35O3OK21Pk53N7o9K31
$$ plain form
3281 34 355 -84 -106 -118 -195 -14 24 -121 -12 128 -123 -193 -169 -9 -71 153 -64 -165 -7 47 -61 18 -128
3304 -128 -57 304 21 52 -94 -145 238 86 108 -199 85 -119 -222 85 -236 -168 269 86 -192 -147 -95 68
3326 68 -110 21 58 261 121 -152 -297 -68 -208 194 168 -88 31 -69 -342 -46 -93 -21 -20 98 -23 144
3348 144 -176 -127 -156 -21 -23 56 172 -24 339 -80 112 136 74 -55 -65 -405 276 175 -165 -207 -82 -146 -146 49
3372 49 -43 -102 123 94 97 141 -220 -180 -5 125 -21 -75 -234 12 -68 152 162 -41 343 -48 -199 -40 -62 78
3396 78 -379 -144 -238 127 35 -31 -115 34 -190 -168 281 -34 -227 -112 108 -27 187 143 -47 -90 108 110 85 132
3420 132 4 -97 124 -110 175 -394 156 144 -225 13 215 -56 -53 -139 -115 94 82 -158 52 39 -150 38
3442 38 -20 11 39 249 87 -158 -76 -66 215 179 -99 99 -92 103 -84 279 48 275 204 127 -30 -45 167
$$ packed form
3281C4L21m39k2j2p7J81L8j45J09J40k51p0K4J60o2K24k17j01J58N4j08P9j46
3304a28P1L61k83L1j46n1L83j52K2l07K84k04j03L07l21O8M37j83k78M5N2J63
3326F8j78J31L7K03j40k73j45K29j40M02k6k56J19j00k73K96m7P2JJ18j21J67
3348A44l20M9k9J35kP9J16j96L63m19J92K4o2j29j0l40O81j01l40m2J25o4%J95
3372D9r2n9K25k9LM4l61M0J75J30j46n4j59K46q0K20J0k03L84l91j51J59k2J40
3396G8m57K35r4L65r2o6q4J49k24K2M49l15j93J15K20j35K14m4j90m3J98Kk5M7
3420A32j28j01K21k34K85n69N50j2l69K38K02k71Lq6K4K09j2k40K10j3j89J88
3442C8n8L1K8K10j62k45Q2J0K81l6k78J98j91J95j87L63k31K27p1p7j57j5K12
$$ plain form
3465 167 14 45 1 106 182 80 37 -71 0 -81 -327 -182 154 -313 86 -74 53 -153 287 34 -123 226
3487 226 -113 -79 -14 -40 -157 100 -28 -68 4 42 171 211 138 -116 186 21 139 -7 -47 -200 99 -135 289
3510 289 95 24 31 -221 97 -82 9 -275 -107 -111 142 195 161 -71 -184 111 -97 108 273 -122 -103 -73 219
3533 219 84 -173 0 44 257 -92 299 -129 -189 33 -20 144 212 -315 -54 141 -186 140 -37 173 -16
3554 -16 188 83 -198 132 99 -197 131 -10 -261 114 86 -35 -138 22 -76 40 15 -158 -103 -121 73 -75
3576 -75 -23 157 164 59 57 -4 -54 -67 -45 132 -65 206 -237 253 63 -143 -150 137 -18 119 235 -90 199 -1
3600 -1 -25 60 144 -156 33 -134 -263 -184 -343 -29 -119 -168 -80 -51 21 -178 88 64 -196 68 -176 -16 -212 89
3624 89 -68 309 -251 7 116 -200 -107 49 -68 -13 -65 -283 -20 26 224 -50 146 81 -93 212 -93 91
$$ packed form
3465A67j53L1m4J05P6j02m3j08P1q1k46J45L36m67L99j60J27k06M40k53j57L49
3487B26l39L4O5k6j17K57j28m0P2L8J29M0p3k54L02j65J18j46m0j53K99k34M24
3510B89j94p1Pk52L18j79R1k84J68mK53N3l4k32j13K95k08K05J65l95J9L0K92
3533B19j35k57J73M4K13l49L91m28o0K22n3J64O8n27K61J95l27L26j77K10j89
3554a6K04j05k81L30l3k96L28j41k51L75k8j21j03J60r8J16k5j73N5j8J94j48
3576g5N2J80Pj05ko1n0j3K2J77j97K71m43M90j90k06pK87j55J37J16l25K89k00
3600ak4Q5Q4l00J89j67j29P9j59L14r0m9Q8K9P2j99K66k4k60K64k44J60j96L01
3624H9j57L77n60K58J09l16R3J56j17N5n2k18K63M6J98k74J96o5j74L05l05J84
$$ plain form
3646 91 -21 24 1 -93 60 86 69 -153 -166 218 116 261 46 -3 44 -267 16 -57 113 232 28 57 314 9
3670 9 273 -110 47 -66 279 89 -56 -302 259 237 78 -153 -195 229 175 -244 -38 31 67 298 -97 -184 -168
3693 -168 149 -12 103 128 -294 -21 40 266 61 42 -30 -33 31 283 111 256 -76 94 15 -142 213 -44 -56
3716 -56 48 82 21 158 -228 10 -247 -2 -207 -149 170 -95 68 135 -9 51 194 -244 -87 55 196 3
3738 3 59 -11 172 -24 -90 201 17 107 22 173 -23 -43 -124 -90 46 -1 -195 60 97 -26 168 15 -43 100
3762 100 -66 53 125 -6 233 81 -150 -92 83 -81 -66 121 -365 14 33 328 -85 51 155 114 -178 -373
3784 -373 -328 -160 8 -22 198 -14 41 223 -69 167 -44 -171 -289 188 -74 -131 121 44 24 -198 -142 28
3806 28 -30 11 33 -9 74 -5 -133 417 41 -120 -51 -215 -112 101 -138 -24 -85 -28 5 150 -93 105 88 -349
$$ packed form
3646I1j12M5k3r4J53K6j7k22j3L84j02J45k15m9M7l11K83p3J70J19k04K9K57l05
3670IK64l83J57j13L45j90j45k46N61k2j59k31m2M24n4m19K06O9L6K31l95q7J6
3693a68L17j61J15K5m22K73O1K26k05j9p2lO4K52j72J45l32J70p9j57L55k57j2
3716e6J04L4o1J37l86K38k57K45k05N8L19k65J63O7j44O0J43m38J57J42J41j93
3738CN6p0J83j96o6K91j84R0q5J51j96k0q1L4J36m7j94K55L7j23J94j53n8J43
3762A00j66J19P2j31K39j52k31N8J75j64J5J87m86L79J9K95m13J36J04m1k92j95
3784c73M5J68J68l0K20k12N5J82k92K36k11j27j18M77k62n7K52p7k0k22N6J70
3806B8n8M1K2m2Q3p9j28N50l76j61O9j64J03K13k39J14o1N7L3J45k43J98j7m37
$$ plain form
3830 -349 145 -29 -10 364 -131 134 -89 -93 -145 -205 -119 -163 -249 -224 69 -111 218 310 -15 54 -88 -216 234 -146
3854 -146 69 -370 -32 -21 212 44 -101 216 203 163 38 69 94 197 103 -314 -7 -201 63 289 476 31
3876 31 -32 55 -38 29 -295 -143 -92 78 123 -74 112 219 -74 162 -106 81 321 -21 -91 200 -79 -25 -86
3899 -86 -89 199 142 19 4 311 39 76 -41 -245 71 -82 48 232 68 53 46 33 61 -3 129 346 55 -126
3923 -126 -5 41 139 58 75 3 56 10 170 -257 23 -97 -102 172 -150 97 -137 73 5 -6 -26 140 145 -8 -28
3948 -28 88 -61 -173 -31 -63 64 -5 158 -124 -92 92 213 -62 -92 198 -61 -48 116 -228 -249 -201 -72 -135
3971 -135 212 -5 -244 5 -214 0 -188 213 -57 -87 -290 31 41 76 117 -140 -280 -69 66 344 -74
3992 -74 27 11 -132 173 -92 -134 -440 168 357 -250 -76 97 -54 121 -46 -8 -261 -13 162 -50 -270
$$ packed form
3830c49M94j74J9L74m95K65k23mn2o0Q6m4q6K5K93j80L29R2l25O9j42j28M50l80
3854a46K15m39L38J1K33j68j45L17j3m0j25L1K5J03r4m17L07j94K64K26J87m45
3876C1o3Q7r3O7l24J52N1J70M5j97J86J07k93K36k68J87K40l42p0K91k79N4o1
3899h6lK88n7j23j5L07k72L7j17k04L16j53J30J84j64j5pj3K8o4J32K17k91j81
3923a26J21M6R8q1J7p2N3m6J60m27K80j20nK74l22K47k34K10o8j1k0J66Nj53k0
3948b8J16j49j12J42l2J27o9J63k82L2J84J21k75l0K90k59J3J64l44k1M8J29o3
3971a35L47k17k39K49k19K14j88M01k70l0k03L21J0L5M1k57j40K11J35K78m18
3992g4J01j6j43L05k65m2l06O08J89o07J74J73j51J75j67L8k53K48J75k12k20
$$ plain form
4013 -270 32 -75 138 24 -288 35 25 218 -27 -6 17 -106 124 -132 46 -200 -8 -90 153 42 -108
4034 -108 3 -12 139 110 169 4 14 42 103 -202 -163 190 79 164 -307 -196 -126 -89 -6 -19 378 32 -124 178
4058 178 -81 294 158 -68 -72 -4 115 114 240 -12 -74 -173 289 -198 -503 129 -22 38 -198 3 11 -23 -64 -178
4082 -178 -108 -110 51 -182 -93 -70 38 6 3 -71 -92 6 -215 -60 149 31 -179 11 -97 8 -208 -132 20 -43
4106 -43 16 -8 114 70 227 -118 203 306 72 120 -149 -29 60 -48 103 -217 150 -15 -167 89 -24 193
4128 193 166 76 -72 228 -119 11 162 184 97 6 156 -93 -62 108 80 66 -16 286 203 -132 90 34 151 -53
4152 -53 -77 -6 318 39 -15 -152 -11 -13 -191 -124 166 43 99 -139 4 141 24 -13 -238 -45 -55 70 167 146
4176 146 -210 -30 -10 -32 -71 -13 224 41 -3 50 194 148 -258 -192 14 107 300 101 141 117 -125 277 232 176
$$ packed form
4013b70L02j07K13j14l12L23j0J93k45K1K3j23K30k56J78k46J92q2K43j11j50
4034a08J11j5J51k9N9j65J0K8O1l05L9L53j11Q5m71J11P0L7Q3j3L97l46j56L02
4058A78k59L75j36k26mO8J19jJ26k52o2r9M62m87l05O32j51O0k36K01Ql4m1j14
4082a78P0kJ61k33Q9K3J08l2lp4k1R8k21J55K09j18k10J90j08J05k16P6J52o3
4106d3N9k4J22m4J57l45L21J03k34M8k69J20Q9j08J51l20L67j65j52K56j13K17
4128A93k7r0j48L00l47J30J51K2q7r1J50k49L1J70k8j4q2L02q3l35K22n6J17k04
4152e3k4P1L24k79n4j37J41kj78O7K90j23N6k38J43J37j17l7k25J93j0J25R7k1
4176A46l56J80K0k2l9N8K37j83m4N3J44m6m06O6K06R3J93j99M0k4k42M02m5n6
$$ plain form
4200 176 -26 -139 -80 109 -172 68 224 -108 -20 75 157 155 -153 -78 -20 -119 -85 -51 -137 89 -11 20 185 78
4224 78 3 -81 -437 -154 -123 -13 31 -61 -90 45 -118 67 111 -130 126 -46 -183 -255 -281 125 118 -140 251 136
4248 136 311 150 -98 6 -270 -55 46 96 -39 -22 127 -112 -18 -112 151 -50 -71 207 -26 19 212 -193
4270 -193 198 -267 -49 -150 148 37 304 142 -260 240 -96 -184 69 44 66 86 30 -115 94 211 56 6
4292 6 305 120 123 -199 208 160 -212 326 -162 -54 -47 -29 76 -52 246 -21 107 125 -191 -35 -426 -160 -61
4315 -61 236 208 126 92 100 -156 126 21 -275 26 85 -1 149 192 -146 -174 -283 90 91 230 -86 32 61 99 -63
4340 -63 180 -61 18 217 -295 237 17 -330 25 -61 145 191 -1 53 69 43 50 -287 142 82 -133 -87 -122 -223
4364 -223 -309 126 -103 -29 78 -89 130 -50 60 -241 252 -51 149 115 139 -67 -272 -108 114 228 -17
$$ packed form
4200A76k02j13N9J89k81K40J56l32Q8R5Q2kl08P5N8r9L4L4q6K26j00L1J65j07
4224G8p5q4l56K83L1J10M4r2k9J35j63J85M4k41K56j72j37p2k6M06pk58L91j15
4248A36J75j61k48J04k76K15J01N0j35J7J49k39R4r4K63k01k1K78k33M5J93m05
4270a93L91m65K18j01K98j11K67j62m02N00l36q8K53k5K2K0n6j45K09J17j55n0
4292FK99j85Ll22M07m8l72N38m88J08PJ8J05j28K98k67J28J8l16J56l91K66R9
4315f1K97k8q2l4Qk56K82j05k96L01N9q6J50M3l38k8j09L73JJ39l16J18K9L8j62
4340f3K43k41P9J99n12N32k20l47L55q6K06M6j92N4J6k6Pl37M29o0k15M6l5j01
4364b23q6M35k29P4J07j67K19j80J10l01M93l03K00l4K4k06k05J64K22J14k45
$$ plain form
4385 -17 0 -122 16 -162 244 80 -230 69 294 -123 225 113 -30 216 -144 17 -85 98 -125 -36 150
4406 150 -64 233 -184 128 -94 -18 274 -53 95 -69 -50 200 111 129 87 -57 -91 -25 193 -57 105 150 342
4429 342 107 12 22 46 69 16 -96 -266 123 49 -127 57 185 314 98 -311 -171 -4 -47 -271 254 20
4451 20 265 64 22 71 -112 188 307 -138 -30 121 50 185 86 35 -121 68 175 -46 331 108 -356 60
4473 60 157 111 143 287 66 -263 136 -208 85 6 198 -171 -172 6 23 -3 -190 151 -14 133 -92 92 51
4496 51 215 -127 -46 83 -255 34 13 120 -85 168 -82 -199 -246 145 -58 -222 74 -40 -78 204 -302 76
4518 76 -148 87 78 -104 67 -41 -4 114 197 63 -134 113 -117 114 66 256 8 -25 79 162 183 -38 211
4541 211 41 -4 -45 -19 149 -187 8 -305 275 -93 -20 -128 197 -263 -46 -120 -38 22 -97 94 -185 203
$$ packed form
4385a7J7j22J38j78M06j64l10K99K25m17L48j12j43K46l60J61j02J83k23Q9J86
4406A50k14K97m17L12k22P6K92l27J48j64J9K50q9J8m2j44l4O6K18k50J62M5J92
4429C42k35r5J0K4K3n3j12j70L89p4j76J84J28J29k16m09J40J67m3k24N25k34
4451B0K45k01m2M9j83L00J19m45J08J51p1J35r9n1j56J89J07k21L77k23m64M16
4473F0R7m6L2J44k21l29L99l44K93p9J92l69jJ78J7k6j87L41j65J47k25J84m1
4496E1J64l42Q1J29l38K89k1J07k05K53k50j17m7L91k03j64K96j14l8K82n06L78
4518G6k24K35rj82J71j08L7J18Q3j34j97K47k30K31m8J90k48l3J04Q3K1k21K49
4541B11j70m5m1K6J68l36J95l13N80l68P3j08L25m60K17p4Q2O0j19J91k79L88
$$ plain form
4563 203 -314 230 24 320 -10 -82 -326 -44 -277 -86 11 67 -291 -243 -14 -18 52 -245 183 -204 36 116 -243
4586 -243 -35 -290 -412 27 -80 -208 -131 24 61 308 -209 -221 -44 -89 35 201 -153 357 -97 -40 114 -45
4608 -45 263 19 10 -10 131 -167 69 26 -106 37 185 -71 -83 21 -220 -172 74 -135 149 24 -146 -162 27
4631 27 -298 -86 138 160 -273 164 -67 -84 156 45 113 142 -57 -312 87 -69 64 -43 12 2 -57 -39 75
4654 75 -97 -72 187 70 2 46 -24 102 -38 -47 26 -21 186 -46 -131 113 261 -318 67 -100 -45 80 -68 12
4678 12 -136 79 6 -92 -272 128 28 52 -30 -82 -31 8 -17 134 101 144 38 -96 -93 99 100 -99 285 35 291
4703 291 158 28 146 -304 52 165 -85 179 236 228 206 -243 254 263 137 -68 -409 44 -117 175 258 -121
4725 -121 64 167 220 -490 264 -132 -78 -1 80 -128 29 17 166 5 -14 -61 -289 289 311 -11 -17 -260 111
$$ packed form
4563B03n17N44k06K96l30p2k44K82k33J91R7N6l58M8K29mP0k97M28l87K40Q0l59
4586b43K08k55j22M39j07j28P7J55L7K47n17j2J77m5J24J66l54N10m54N7J54j59
4608d5L08k44rk0J41k98K36m3j32J43J48k56j2J04k41M8K46k09K84j25j70j6J89
4631B7l25K12K24K2m33M37k31j7K40j11O8K9j99k55L99j56J33j07N5j0n9J8J14
4654G5j72K5K59j17o8M4p0J26j40rP3m7K07k32q5K44J48n79L85j67N5J25j48Q0
4678A2j48K15p3r8j80M00j00K4q2n2N1L9k5J51l3M3j06j34LJ92Jj99L84k50K56
4703B91j33j30J18m50L56J13k50K64N7qk2m49M97Rj26k05l41M53j61K92Q3l79
4725a21J85J03N3p10P54l96N4P7Q1k08J57j2J49j61j9m7k28N78K2l22ok43L71
$$ plain form
4748 111 -275 157 53 280 -85 -129 -95 83 -54 108 80 -34 -243 -83 -174 16 5 -108 -95 41 -154 -2
4770 -2 20 -285 -206 150 -66 -18 69 -179 62 -72 135 240 2 -53 -267 -112 108 -207 -86 353 70 -312
4792 -312 244 2 -144 -413 265 -89 -173 217 -188 -60 439 -153 39 43 189 -119 -87 -4 -80 153 62 -244
4814 -244 -143 -178 -64 -227 28 -210 -73 -143 30 12 172 183 -11 -109 -276 136 17 45 -40 -127 272 -85 -103
4837 -103 221 73 6 -93 -195 137 6 69 32 -19 61 14 -314 14 13 -19 -187 412 266 333 259 -55 121 70
4861 70 -112 124 26 -5 32 -33 44 -19 13 -83 274 -133 -132 -197 -49 -208 -113 88 505 -287 108 -226 389 195
4885 195 177 90 105 139 -114 -44 27 122 126 179 2 7 -41 -65 29 196 207 58 277 228 -289 101 -224 -207 -56 168
4911 168 -49 156 -39 -74 -1 -92 -112 -81 449 100 -207 -126 -75 -263 79 93 108 -43 -55 -76 146 -5 96 -16
$$ packed form
4748A11l86M32j04K27l65m4L4J78j37J62k8j14k09J60r1J90j1j13J3J36j95J52
4770bK2l05P9L56k16M8Q7k48K41j34K07J05k38n5k14J55K20l15J21M39k83l82
4792c12N56k42j46k69O78l54q4L90m05J28M99n92J92MJ46l08L2Q3p6K33r1l06
4814b44J01l5J14j63K55k38J37p0J73j8J60J1j94r8j67M12j19K8q5q7L99l57j8
4837a03L24j48o7r9j02L32j31O3l7n1Q0m7l28L28jl2j68N99j46O7p4l14J76n1
4861G0j82K36r8l1L7o5P7o3L2r6L57m07Jo5J48j59R5K01M17p92L95l34O15j94
4885A95j8q7J5L4k53P0P1R5MN3j77Nm8k4R4J67J1j49K19m9n17L90l25J7J51K24
4911A68k17K05j95l5P3r1k0L1N30l49l07Q1N1j88L42J4J5j51j2k1K22j51J01j12
$$ plain form
4935 -16 166 74 225 -191 301 383 -32 -72 -108 92 -96 -221 -48 -84 -104 127 194 -56 -158 -157 65 6 71 -251
4959 -251 102 -73 -153 -68 45 148 -103 15 155 126 138 170 59 402 -78 55 -50 220 52 -8 17 29 309
4982 309 -242 -34 69 79 -100 344 207 -280 160 137 -29 -33 -57 -85 -280 63 -84 86 1 -123 -36 171 -139
5005 -139 158 179 -23 -219 -250 -26 12 -56 354 -1 153 39 -45 32 -2 -66 167 -228 -218 114 -101 45 159
5028 159 -194 -62 221 77 -269 -58 107 -71 83 186 -60 -337 -2 -17 41 252 -345 39 -186 114 62
5049 62 -14 106 -47 61 -157 116 139 -90 -215 -92 -120 47 90 -61 -179 120 -9 131 -11 -238 -8 88
5071 88 13 25 49 73 107 391 -167 -172 -199 148 36 138 87 224 -91 183 42 51 53 11 80 289 32 -75 -50 9
5097 9 159 -330 180 -26 -45 -120 -105 -194 -44 -148 113 -30 -119 -65 318 91 -8 -42 -129 18 104 59 -156 57
$$ packed form
4935a6J82r2J51m16M92Q2m15m0l6K00j88j25J73l6k0K31O7k50j02JK22n9O5l22
4959b51L53j75q0Q5J13J03k51J18J40k9J2L2j11L43m80J33j05K70j68o0K5J2K80
4982C09n51K08J03J0j79M44j37m87M40k3j66mk4k8j95L43j47J70q5j24Q7K07l10
5005a39K97K1k02j96l1K24L8o8M10l55J54j14q4P7l4o4K33l95J0L32k15J46J14
5028A59l53J32K83j44l46K11J65j78J54J03k46k77L35j5N8K11n97L84k25L00n2
5049F2p6J20j53J08k18K73K3k29j25J23k8J67M3j51j18K99j29J40j42k27K30R6
5071H8p5J2K4K4L4K84n58nk7L47j12J02n1J37l15K74j41RKm2O9K09k57j07K5N9
5097IJ50m89N10k06j9p5J5q9J50j04K61j43q9N4L83k27r9l4q7J47Q6m5k15K13
$$ plain form
5121 57 32 -185 198 139 44 -37 99 -69 -81 32 -32 378 3 -5 -98 440 194 266 -93 141 341 -119 153 -40
5145 -40 14 7 15 -70 -132 -69 -44 85 -9 49 30 -101 136 -219 41 36 -126 -181 -71 -97 53 143 -42 -252 73 222
5171 222 -189 219 -102 -204 -15 -79 300 -1 31 -7 103 -192 146 17 -202 -306 -45 266 -109 -19 136
5192 136 162 80 -63 -220 31 39 103 -221 -34 -25 280 -276 76 93 -37 17 66 -235 -138 150 200 224 124 -94
5216 -94 7 19 -3 124 124 83 91 -86 -22 81 244 -83 -30 -148 -39 -86 52 2 142 -52 121 31 -60 182 410
5241 410 160 -111 1 75 19 164 76 -198 42 140 -67 204 -57 71 -225 -48 384 -198 -112 65 35 -132
5263 -132 309 -120 131 33 76 108 -246 2 39 -48 172 -153 -67 198 -41 33 41 -227 118 95 -76 -242 -225 87
5287 87 251 -96 -418 30 -24 123 -149 69 205 9 207 44 96 209 -177 -269 36 -98 -25 -66 -28 57 -104
$$ packed form
5121E7k5k17L83n9r5q1J36j68j2J13o4M10l75qr3N38k46P2l59K34K00m60K72j93
5145d0N4pQq5o2O3K5J29r4N8j9j31K37l55K60nj62n5J10k6J50R0j85k10L25J49
5171B22m11M08l21j02J89o4L79l01L2l8J10k95L38j29k19j04K61L11l75R0J55
5192A36K6q2j43j57K51QO4l24J87RL05n56L52J7j30N4M9l01R7K88N0K4j00k18
5216i4J01J2k2J27%m1Qj77O4J03J63l27N3j18J09m7J38n0J40j94J73r0r1K42K28
5241D10k50k71J12P4n6J45q8k74K40R8k07K71k61J28k96J77M32n82Q6J77l0j67
5263a32M41m29K51r8M3L2l54K48L7q7K20l25Q6K65k39P4Qk68L45k3j71j66J7L12
5287H7J64l47l22M48n4J47k72K18J36j96J98j63N2J13l86r2L05j34P3m1L8Q5j61
$$ plain form
5310 -104 104 143 77 -371 -183 2 191 57 23 113 345 95 49 98 220 -205 44 -83 -53 264 191 -71 302
5333 302 -44 -102 -99 -268 -142 -101 353 -157 -70 -13 -253 47 -44 -117 73 -46 37 -49 31 106 146 207 -165 191 218
5358 218 -158 -208 -35 -182 13 85 42 -81 390 17 26 39 83 -284 -47 17 4 -192 143 122 -203 178 -120
5381 -120 253 15 71 -158 -149 195 -68 179 -298 126 37 -35 11 -31 -137 97 -17 156 133 -70 -50 -247 -80
5404 -80 140 -11 -184 36 -89 193 32 -258 150 -260 -54 17 37 69 16 -3 -138 272 270 78 14 -111 21
5427 21 -132 -180 148 34 -297 -125 -80 -65 -44 -51 93 -58 188 7 -375 72 -140 169 170 78 -7 -217 97 -160
5451 -160 159 29 180 191 -33 -13 -318 -100 -107 302 134 30 -41 -193 122 3 130 -132 260 315 215 120
5473 120 78 -19 72 -38 209 85 -13 28 -38 195 6 -36 -56 -166 -149 -289 180 85 -160 122 107 -324 -134 -184
$$ packed form
5310a04K08L9o6m48J88J85J89j34l4R0K32k50m6M9J22m25K49j27L0L17p3k62L73
5333C02l46n8Lj69J26M1M54n10Q7N7k40L00r1p3J90j19Q3q6Q0P5M0O1l72L56K7
5358B18l76n0J73j47J95P2m3j23M71l73RJ3M4l67K37O4j3j96L35k1l25L81k98
5381a20L73k38N6k29RL44k63K47m77M24q9p2M6m2j06K34j14J73k3k03K0j97J67
5404h0K20j51j73K20j25K82j61k90M08m10K06P1K0L2n3j9j35M10kj92o4j25J32
5427B1j53m8L28j14l31J72M5J5K1pJ44j51K46j81l82M47k12L09Jr2q5k10L14k57
5451a60L19j30J51J1k24K0l05K18pM09j68j04p1j52L15j19J27k62L92N5j00r5
5473A20m2r7R1j10K47j24r8M1o6K33j89m2k0j10J7j40M69r5k45K82j5m31J90n0
$$ plain form
5497 -184 -114 7 147 -12 92 -50 -10 70 -131 -49 -138 -163 -37 172 -225 -129 -35 -260 30 -248 147 -122 -185
5520 -185 113 -155 204 207 -20 -342 -9 -140 31 74 4 229 -19 155 -17 -299 263 -147 281 -182 68
5541 68 -87 35 -277 30 -99 12 226 18 -155 59 -5 112 74 223 -74 -92 -163 245 114 114 -128 168
5563 168 -157 -119 201 -161 65 -251 316 -140 46 -97 58 -40 -3 -171 -125 6 1 -57 174 13 -164 338
5585 338 206 -122 -147 -38 161 26 -40 -107 -218 -262 -80 14 -2 -174 -210 -347 239 -67 -239 -102 240 71
5607 71 -145 28 49 38 77 90 330 73 174 266 -5 136 107 -143 314 -12 -154 -87 26 -65 320 467 48
5630 48 22 -179 -51 -207 -105 36 100 -195 109 -30 284 42 57 6 -81 -132 -102 38 -190 231 89 390 -91
5653 -91 -77 -129 3 130 17 -77 157 -64 55 224 -84 44 15 -159 284 58 2 -8 -287 155 89 -138 281
$$ packed form
5497a84P0J21J40j59J04j42M0Q0k01Q2q9k5J26K09l97R6R4k25K90k78L95k69o3
5520a85K98k68L59Lk27l22L33j31J71M3p0K25k48J74j72k82N62m10M28m63K50
5541F8j55J22l12L07j29J11K14k08j73K14o4J17l8J49k97j8p1M08j31%k42K96
5563A68l25L8L20l62K26l16N67m56J86j43J55r8L7j68M6J31nn8K31j61j77N02
5585C38j32l28k5J09J99j35o6o7j11m4J82R4j6j72l6j37N86l06j72J37L42j69
5607G1k16J73K1j1L9J3K40k57J01R2k71J41k9k50M57l26j42O7J13r1L85J47m19
5630D8k6k01J28j56J02J41O4k95L04j39L14k42J5n1q7n1L0J40k28M21j42L01m81
5653i1J4n2J32J27j13r4K34k21J19J69l08J28k9j74M43k26n6j0k79M42o6k27M19
$$ plain form
5676 281 -90 99 178 1 57 7 -77 82 119 64 260 -9 258 172 49 50 351 -111 -211 66 56 328 -203
5699 -203 44 -295 51 13 11 96 -17 53 -73 -249 102 -196 -279 -105 10 -14 -43 -76 -143 0 -382 30 -160
5722 -160 -141 123 -497 -121 175 -439 46 103 60 116 -203 -51 27 -439 169 36 211 140 -310 46 -120 78
5744 78 36 -182 -180 87 -261 17 0 -108 -54 20 201 -163 106 -175 -281 -178 -243 153 -60 83 -403 -102 5
5767 5 29 108 119 368 -119 0 41 -52 16 -198 -77 197 -234 -72 108 -169 161 -84 120 -12 222 -101 -39
5790 -39 -100 224 270 52 66 -365 166 -176 341 74 -10 92 89 123 184 -83 -70 281 168 -196 -59 -103 85 204
5814 204 161 -273 41 174 221 -207 87 151 0 82 64 68 341 -117 -249 -152 -17 26 -80 349 104 -123 -160
5837 -160 -191 88 -88 59 114 54 95 160 -18 153 -173 32 166 132 133 151 149 18 -251 62 -37 150 -220 -180
$$ packed form
5676B81l71J89P9j77N6n0q4J59L7n5J96k69K67q6j23JL01m62j00K77j0K72n31
5699b03K47l39L46l8kQ5j13P0j26j76L51k98q3J74J15k4k9l3o7J43l82M12j90
5722a60J9K64o20L76K96o14M85N7m3N6l19J52P8m66O08j33J75p1m50L56j66J98
5744G8m2k18KK67l48K78j7j08N4P4J81l64K69k81j06J03o5L96k13J43m86L01J07
5767EK4P9J1K49m87J19M1r3O8k14J21K74m31J62J80k77L30k45K04j32K34l23O2
5790c9o1L24M6k18J4m31N31l42N17k67q4J02lL4O1k67J3L51j13l64J37m4J88J19
5814B04m3m34L14J33M7m28K94O4j51Q2j8MK73m58j32R7J35M3j06M29k45k27l7
5837a60l1K79j76J47N5o0M1O5j78J71l26K05J34l4JJ8kj31k69L13r9J87l70M0
$$ plain form
5861 -180 -152 -240 -5 -27 74 86 -143 -30 89 -203 -177 327 -7 -96 -15 4 -27 9 249 114 -28 -425 64
5884 64 -176 -42 132 24 -134 -45 228 -111 73 120 413 67 109 35 -263 -4 -79 331 388 132 26 -147
5906 -147 15 66 73 185 -277 -266 100 193 201 96 119 97 -96 -20 -119 -174 -4 101 -24 -149 -279 -37 -15 -45 50
5931 50 -199 23 -137 413 119 -183 -140 -149 258 64 237 -139 -117 -201 -157 87 -127 -182 205 -120 -197 -30 -172
5954 -172 -47 -117 -127 -192 26 148 -64 -459 61 1 -376 153 153 -24 76 72 -345 21 -163 12 71 -111 -115 53
5978 53 -329 -149 -115 23 -41 -100 -171 -33 -102 223 -146 4 -40 -215 -467 32 -56 46 -87 128 12 -391 -353
$$ packed form
5861a80K8q8K35k2J01J2k29J13J19k92K6N04l34q9Q1J9l1L6K40j35j42l97M89
5884F4k40J34J74j08j58Q9K73l39J84M7K93l46M2p4k98K59p5M10N7k56j06j73
5906a47J62N1PJ12m62J1L66R3Qj05K3k2j93P6r9n5J70J05j25j25j30K42K2l0R5
5931E0k49K22j60N50k94l02M3rM07j94J73l76K2q4M4K44k14n5L87l25p7J67j42
5954a72J25p0j0o5K18J22k12l95N20o0l77N29%j77J00mm17L66j84J75N9j82mJ68
5978E3l82J80L4J38o4n9p1J38o9L25l69J50m4j75k52M99q8J02j33K15j16m03L8
$$ [...]
8191A07
##END NTUPLES=NMR FID
##END=
