##TITLE=1H_CG-1122-1
 DMSO, 8 sc, 
 29.1.2020
##JCAMPDX= 6.0         $$ Bruker NMR JCAMP-DX V2.0
##DATA TYPE= NMR FID
##DATA CLASS= NTUPLES
##ORIGIN= UXNMR, Bruker Analytische Messtechnik GmbH
##OWNER= root
$$ XWIN-NMR		Version 3.5
$$ Wed Jan 29 14:12:43 2020 Russian Standard Time (UT+4h)  she@DPX200
##.OBSERVE FREQUENCY= 200.1315
##.OBSERVE NUCLEUS= ^1H
##.DELAY= (6, 6)
##.ACQUISITION MODE= SIMULTANEOUS
##.ACQUISITION SCHEME= undefined
##.AVERAGES= 8
##.DIGITISER RES= 18
##SPECTROMETER/DATA SYSTEM= spect
##.PULSE SEQUENCE= zg30
##.SOLVENT NAME= DMSO
##.SHIFT REFERENCE= (INTERNAL, DMSO, 0, 15.7039)
##AUDIT TRAIL= $$ (NUMBER, WHEN, WHO, WHERE, WHAT)
$$ ##TITLE= Audit trail, XWIN-NMR		Version 3.5
$$ ##JCAMPDX= 5.01
$$ ##ORIGIN= Bruker BioSpin GmbH
$$ ##OWNER= she
$$ F:/spectra/data/she/nmr/H-F/1/audita.txt
$$ ##AUDIT TRAIL=  $$ (NUMBER, WHEN, WHO, WHERE, WHAT)
(   1,<2020-01-29 14:11:54.06 +0400>,<she>,<DPX200>,
      <created by zg, POWCHK disabled, PULCHK disabled
       configuration hash MD5:
       00 E9 B6 7A A2 85 ED C7 34 08 36 98 17 FE 4E 26
       data hash MD5: 16K
       06 AF 71 4B 3E 9D 0B 09 15 C6 2A 5D 29 62 20 26>)
$$ ##END=
$$ 
$$ hash MD5
$$ A9 5F FC 4E CE 96 B7 50 94 6B 4D 96 37 30 6E 21
##$RELAX= 
##$RELAX= 
##$RELAX= 
##$RELAX= 
##$RELAX= 
##$RELAX= 
$$ Bruker specific parameters
$$ --------------------------
##$DU= <F:/spectra>
##$EXPNO= 1
##$NAME= <H-F>
##$PROCNO= 1
##$TYPE= <nmr>
##$USER= <she>
##$AMP= (0..31)
100 100 100 100 100 100 100 100 100 100 100 100 100 100 100 100 100 100 
100 100 100 100 100 100 100 100 100 100 100 100 100 100 
##$AQSEQ= 0
##$AQ_mod= 1
##$AUNM= <au_zg>
##$AUTOPOS= <>
##$BF1= 200.13
##$BF2= 200.13
##$BF3= 200.13
##$BF4= 200.13
##$BF5= 200.13
##$BF6= 200.13
##$BF7= 200.13
##$BF8= 200.13
##$BYTORDA= 1
##$CFDGTYP= 0
##$CFRGTYP= 5
##$CHEMSTR= <none>
##$CNST= (0..31)
1 1 145 1 1 1 1 1 1 1 1 1 1 1 1 1 1 1 1 1 1 1 1 1 1 1 1 1 1 1 1 1 
##$CPDPRG= <>
##$CPDPRG1= <>
##$CPDPRG2= <>
##$CPDPRG3= <>
##$CPDPRG4= <mlev>
##$CPDPRG5= <mlev>
##$CPDPRG6= <mlev>
##$CPDPRG7= <mlev>
##$CPDPRG8= <mlev>
##$CPDPRGB= <>
##$CPDPRGT= <>
##$D= (0..31)
0 1.2 0 0 0 0 0 0 0 0.06 0 0.03 0 0 0 0 0.0002 0 0 0 0 0 0 0 0 0 0 0 0 
0 0 0 
##$DATE= 1580292713
##$DBL= (0..7)
120 120 120 120 120 120 120 120 
##$DBP= (0..7)
150 150 150 150 150 150 150 150 
##$DBP07= 0
##$DBPNAM0= <>
##$DBPNAM1= <>
##$DBPNAM2= <>
##$DBPNAM3= <>
##$DBPNAM4= <>
##$DBPNAM5= <>
##$DBPNAM6= <>
##$DBPNAM7= <>
##$DBPOAL= (0..7)
0.5 0.5 0.5 0.5 0.5 0.5 0.5 0.5 
##$DBPOFFS= (0..7)
0 0 0 0 0 0 0 0 
##$DE= 6
##$DECBNUC= <off>
##$DECIM= 24
##$DECNUC= <off>
##$DECSTAT= 4
##$DIGMOD= 1
##$DIGTYP= 9
##$DL= (0..7)
0 120 120 120 120 120 120 120 
##$DP= (0..7)
150 150 150 150 150 150 150 150 
##$DP07= 0
##$DPNAME0= <>
##$DPNAME1= <>
##$DPNAME2= <>
##$DPNAME3= <>
##$DPNAME4= <>
##$DPNAME5= <>
##$DPNAME6= <>
##$DPNAME7= <>
##$DPOAL= (0..7)
0.5 0.5 0.5 0.5 0.5 0.5 0.5 0.5 
##$DPOFFS= (0..7)
0 0 0 0 0 0 0 0 
##$DQDMODE= 0
##$DR= 18
##$DS= 0
##$DSLIST= <SSSSSSSSSSSSSSS>
$$ [...]
##$SUBNAM2= <"">
##$SUBNAM3= <"">
##$SUBNAM4= <"">
##$SUBNAM5= <"">
##$SUBNAM6= <"">
##$SUBNAM7= <"">
##$SUBNAM8= <"">
##$SUBNAM9= <"">
##$SW= 24.9337058887773
##$SWIBOX= (0..15)
0 0 2 0 0 0 0 0 0 0 0 0 0 0 0 0 
##$SW_h= 4990.01996007984
##$TD= 16384
##$TD0= 1
##$TE= 0
##$TE2= 300
##$TE3= 300
##$TEG= 300
##$TL= (0..7)
0 120 120 120 120 120 120 120 
##$TP= (0..7)
150 150 150 150 150 150 150 150 
##$TP07= 0
##$TPNAME0= <>
##$TPNAME1= <>
##$TPNAME2= <>
##$TPNAME3= <>
##$TPNAME4= <>
##$TPNAME5= <>
##$TPNAME6= <>
##$TPNAME7= <>
##$TPOAL= (0..7)
0.5 0.5 0.5 0.5 0.5 0.5 0.5 0.5 
##$TPOFFS= (0..7)
0 0 0 0 0 0 0 0 
##$TUNHIN= 0
##$TUNHOUT= 0
##$TUNXOUT= 0
##$USERA1= <user>
##$USERA2= <user>
##$USERA3= <user>
##$USERA4= <user>
##$USERA5= <user>
##$V9= 5
##$VALIST= <valist>
##$VCLIST= <CCCCCCCCCCCCCCC>
##$VD= 0
##$VDLIST= <DDDDDDDDDDDDDDD>
##$VPLIST= <PPPPPPPPPPPPPPP>
##$VTLIST= <TTTTTTTTTTTTTTT>
##$WBST= 1024
##$WBSW= 4
##$XGAIN= (0..3)
0 0 0 0 
##$XL= 0
##$YL= 0
##$YMAX_a= 192327
##$YMIN_a= -161284
##$ZGOPTNS= <>
##$ZL1= 120
##$ZL2= 120
##$ZL3= 120
##$ZL4= 120
##$ABSF1= 10
##$ABSF2= 0
##$ABSG= 5
##$ABSL= 3
##$ALPHA= 0
##$AQORDER= 0
##$ASSFAC= 0
##$ASSFACI= 0
##$ASSFACX= 0
##$ASSWID= 0
##$AUNMP= <proc_1d>
##$AZFE= 0.1
##$AZFW= 0.1
##$BCFW= 1
##$BC_mod= 2
##$BYTORDP= 1
##$COROFFS= 0
##$CY= 11.3945322036743
##$DATMOD= 1
##$DC= 2
##$DFILT= <>
##$DTYPP= 0
##$F1P= 16.9975609425685
##$F2P= -3.02152046262296
##$FCOR= 0.5
##$FTSIZE= 0
##$FT_mod= 4
##$GAMMA= 1
##$GB= 0.15
##$INTBC= 1
##$INTSCL= 1
##$ISEN= 128
##$LB= 0.24
##$LEV0= 0
##$LPBIN= 0
##$MAXI= 10000
##$MC2= 0
##$MEAN= 0
##$ME_mod= 0
##$MI= 1.114404
##$NCOEF= 0
##$NC_proc= 0
##$NLEV= 6
##$NOISF1= 3.799351
##$NOISF2= 2.8
##$NSP= 1
##$NTH_PI= 0
##$NZP= 0
##$OFFSET= 15.70392
##$PC= 1
##$PHC0= -9792.528
##$PHC1= 16.40081
##$PH_mod= 1
##$PKNL= yes
##$PPARMOD= 0
##$PSCAL= 0
##$PSIGN= 0
##$REVERSE= no
##$SF= 200.130013532006
##$SI= 16384
##$SIGF1= 3
##$SIGF2= 2
##$SINO= 400
##$SIOLD= 16384
##$SREGLST= <1H.CDCl3>
##$SSB= 0
##$STSI= 0
##$STSR= 0
##$SW_p= 3612.71676300578
##$SYMM= 0
##$S_DEV= 0
##$TDeff= 0
##$TDoff= 0
##$TI= <>
##$TILT= no
##$TM1= 0
##$TM2= 0
##$TOPLEV= 0
##$USERP1= <user>
##$USERP2= <user>
##$USERP3= <user>
##$USERP4= <user>
##$USERP5= <user>
##$WDW= 1
##$XDIM= 8192
##$YMAX_p= 0
##$YMIN_p= 0
$$ End of Bruker specific parameters
$$ ---------------------------------
##NTUPLES= NMR FID
##VAR_NAME=  TIME,          FID/REAL,        FID/IMAG
##SYMBOL=    X,             R,               I
##VAR_TYPE=  INDEPENDENT,   DEPENDENT,       DEPENDENT
##VAR_FORM=  AFFN,          ASDF,            ASDF
##VAR_DIM=   8192,          8192,            8192
##UNITS=     SECONDS,       ARBITRARY UNITS, ARBITRARY UNITS
##FACTOR=    0.0002004,     1,               1
##FIRST=     0,             0,               0
##LAST=      1.6414764,     0,               0
##MIN=       0,             -161284,         0
##MAX=       1.6414764,     192327,          0
$$ Real data points
##PAGE= N=1
##DATA TABLE= (X++(R..R)), XYDATA
$$ [...]
2203a158j27N02J306O74P36k9j135j676l84R04J435J318p6n47o71r05p04k17P19
2222c5J576Q95K63j568j534n80O3O06N12Q24O78o1j102k146q23P40J652J010J30
2241A100q11m68j067o07n03K78J926J176J19j223j376q23RP99R48M17J054j21
2259H27p30j960n18P06J410J354j53L2m93r85m28j87N37J204J305L57r64j544
2277b30m16J57O81J111M32N82Q4j155j514p74K54J530J329M96r59q14o14q31l93
2296a044j0J939P18M94j327j648q09J73J064R2O39N79J63j049j780j119O06J577
2314g42J125Ll78p70o57l54m43J98J371J835q7q30j909l65L94J024N06N87P71
2333A279J20q83j000j563P29J618J646K38p56o34m70m80n60L49J428J512L37j381
$$ y = [-1158, -1285, -783, 523, 1197, 1933, 1904, 769, -907, -1291, -387, 1048, 2366, 2290, 1743, 1072, 167, -537, -754, -35, 1541, 2436, 2699, 1131, -403, -983, -920, -314, 198, 1022, 1700, 1639, 537, -1609, -2432, -1692, -40, 970, 1100, 289, -179, -1246, -1853, -2356, -2078, -152, 1024, 1143, -80, -1456, -2279, -2270, -1471, -523, -106, 948, 827, 97, -1863, -2381, -1675, -265, 1089, 936, 968, 475, -510, -938, -1125, -588, 616, 1921, 2278, 1314, -230, -646, -489, 192, 1303, 1735, 2317, 2401, 1246, -268, -1042, -788, 742, 2071, 2567, 1608, 794, 180, -651, -1044, -1054, 885, 1603, 2097, 770, -878, -1687, -1514, -450, -358, 281, 860, 1023, -26, -1806, -2925, -2319, -742, 383, 386, 8, -762, -1419, -1773, -2216, -2018, -647, 1188, 1101, 271, -1638, -2003, -1609, -585, -79, 508, 1279, 1399, 516, -484, -2047, -1318, 300, 1946, 2184, 1428, 794, 324, -156, -716, -367, 1061, 2573, 2910, 1529]
2351A529j782n86K48J338K36K18M73K21o71j701j017M75R94J629Q1o55q70n93
2369d33o99k95j62J066J614O78j282k053o63M61P51K80J82Q57L21o05j406j329
2387b717J83J741J477K11p22q82j67L0p68L73R29J689P96j298j801n91O32Q06
2405g9N92L98K22P74l93j371j515K60J787J548J66p41p48n34k85o17J06Q81J704
2424B155M37q62j719j525P05P57P22j41K78M16k94j486j646J61J400J931j21p12
2442D56o98p69q0o53k4O92J759R83r85j830j275O59Q50Q93l0P8R57o28j135j207
2462a987l60J830J911L48j132q24p7j58j29l45N61K107P02p21j911j095L83J172
2480B75P06L7J01O28n42j109j691KJ611J919J53q57j032m97j36l51p9L49J787
$$ y = [1529, -253, -839, -591, 747, 983, 1201, 1674, 1895, 1224, -477, -1494, -1019, -25, 1604, 1685, 1030, 160, -433, -1132, -1427, -1589, -523, 1091, 1769, 487, -1566, -2229, -1768, -1017, -737, -555, 302, 623, 18, -1388, -2717, -2534, -793, 684, 895, 173, -709, -876, -846, -1614, -1241, -312, 1377, 2173, 875, -926, -1517, -885, -79, 513, 911, 1133, 1907, 1514, 143, -1372, -1112, 675, 2223, 2389, 1648, 900, 366, 81, -536, -430, 451, 2155, 2592, 1730, 11, -1514, -809, -52, 670, 529, 807, 1223, 929, -557, -2203, -2042, -642, 1289, 1168, 456, -242, -1011, -1091, -1744, -1768, -1076, 683, 1666, 681, -1149, -2424, -1765, -915, -22, -52, 26, 983, 355, -780, -1987, -2347, -517, 1394, 1742, 610, -214, -291, -449, -578, -923, -362, 1745, 2447, 1726, -185, -1280, -897, 275, 981, 1018, 1119, 1747, 1205, 96, -1595, -1593, 18, 1937, 2090, 1233, 201, -296, -432, -783, -862, -513, 1274]
2499A274R49q02k006j161K4R58J023n2R5M51l18r78j414m05J554J998K75j114
2517C51q66n08J5k50j56K76J806R05l53k048j208L66J564P03k37j5L42L80r79
2536H8j723k09J592J602R07j055j185l52K37l13n19M57J435J314o02j718j555
2553a599K28J360P69N3K8M6L5p50j712k49J335J703P91q99j091n88K99m18l16
2572i75L05J773R60o51j712j762J25J641J093l58J40L58M2j019j343q11J068J937
2590H11Q06p38j037o62L7P6l02O8J792Q83j64j778j563j55J471Q06J72j20L1M67
2610I01o46j691n39J210J627R27m58j155q39J72R0n87N81Q34J228q9j555j497
2628a486j87J382P01R2O5J85J61n92j478m99P81K005O33m95j590l02M0M25n35
$$ y = [1274, 2223, 1421, -585, -1746, -1722, -764, 259, 207, 302, 753, 435, -543, -1957, -2362, -808, 1190, 1465, 351, -515, -1023, -1008, -1258, -1414, -1138, 668, 1573, 1220, -828, -2036, -1670, -106, 597, 360, 345, 687, 1067, 88, -1635, -1844, -252, 1350, 2257, 1202, 17, -335, -98, -411, -930, -473, 962, 2276, 1674, -44, -1599, -1371, -11, 758, 811, 839, 885, 920, 170, -1542, -1791, -456, 1247, 2038, 1139, 48, -540, -241, -659, -975, -670, 1103, 2063, 1412, -300, -2062, -1937, -296, 797, 439, 579, 937, 979, -40, -1383, -2194, -1126, 811, 1617, 879, -158, -820, -783, -707, -1009, -941, 851, 1734, 1570, -208, -1771, -1926, -455, 351, 523, 403, 434, 901, 255, -1436, -1975, -765, 862, 1789, 1331, 176, -663, -491, -401, -988, -407, 427, 1655, 1566, 11, -1486, -1673, -291, 410, 502, 567, 752, 913, 321, -1157, -1656, -875, 1130, 1763, 1268, -322, -624, -584, -159, -694]
2647f94J76J250J369m3j602j794k85J185J248J8n42J42K22k50j546r37R12J951
2665G80Q85m74j569n45K14j8k01r5J262J304k03j454j571j84R50J284L16o06L11
2684C86M9k48j524r33R12J798J416n30j655q21N47J45k01pP97J437M91j763j419
2703a123l63J231J365k2m12M7O4j43j058q68N89J644J251o71j338n05K4L59m10
2722c39j43Q59J288K79j518j658o42R00J810k86l17J9J78m05r67j065L94J773
2740A60J117j47j558o56k60O49j99qM33J130M23j074j479p13J139J118O53p65
2758c7K48M00k95j371m95L88J563J333k23j244r94N14J22J15j22L28J585J07q70
2777A052j661q41J039J415K74k14k45J73l40r22q40K34J373J435k06j537q81r1
$$ y = [-694, -518, 732, 2101, 2058, 456, -1338, -1623, -438, 810, 828, 286, 428, 650, 400, -1146, -2083, -1171, 780, 1665, 1191, -378, -923, -709, -727, -928, -1023, 239, 1543, 1340, -114, -1685, -1869, -919, 365, 681, 75, 386, 435, 187, -1337, -2270, -1358, 440, 1856, 1326, -329, -1150, -603, -458, -659, -666, 131, 1568, 2059, 296, -1123, -1486, -255, 1110, 1088, 676, 723, 787, 644, -414, -1282, -693, 951, 2202, 1531, 193, -312, -288, 71, -339, -482, 377, 1665, 1944, 426, -1232, -1874, -974, 836, 550, 233, 252, 430, 25, -942, -2007, -1613, 160, 1277, 1130, -428, -1084, -1344, -695, -894, -902, -469, 661, 1084, 10, -1469, -2182, -1043, 75, 728, -37, 211, 611, 316, -1055, -1550, -1162, 401, 1734, 1511, 267, -727, -213, -91, 24, -98, 230, 1815, 1922, 1052, -609, -1450, -411, 1004, 1278, 1064, 819, 992, 652, -270, -1110, -876, 497, 1932, 1726, 189, -692, -783]
2795g83N16jm01O16Q95P66j163j805p74O32J699M15n10l87K28l50n58j049J4J728
2815b72J082J19j156j174J3Q32K21k82N17J061M24q29j673o50R82J304N92j40
2833I71n90K30k7q51q42L76J241J395M93j288j637M06K05K44l84N21Q96M06n41
2852A224j502j239O34J481L59k88k06K70m22o56p37k06J123J076L17j205j069
2869a046j46L79K9j39M56J199M73j006j203j262O27J217P31l50k63J70k23k49
2887f06j032j99J240J951P7j282j301J55N90L57j9K37N71Q59m33j567m52K07J076
2906D29J101k86l77n9K6o73q70J96Q06J603Q8p97j482j65M30K02o3J76N23L47
2926A155k20j482j056P60Q66P71r2m23k73k14o30o49k04R94J571K30o73j534j98
$$ y = [-783, -267, -268, -669, -53, 842, 1608, 445, -1360, -2134, -1502, 197, 612, 102, -285, -57, -407, -965, -2014, -2000, -272, 810, 929, -227, -1401, -1388, -556, -335, -617, -100, 961, 1385, 556, -1117, -1767, -785, 519, 1111, 971, 381, 611, 584, -267, -1109, -733, 508, 1903, 2396, 1108, -529, -123, 82, 326, -58, 463, 1359, 1765, 1224, -278, -1517, -883, 598, 957, 669, 463, 733, 311, -345, -1082, -1288, -165, 911, 1228, 23, -1046, -1192, -813, -784, -923, -467, 732, 1205, 199, -1004, -2266, -1639, -422, 309, -41, -304, -134, -357, -606, -1638, -1837, -597, 1354, 1431, 149, -1152, -997, -407, -50, -69, 168, 739, 1598, 1165, -402, -854, -647, 429, 1530, 1244, 867, 808, 834, 161, -709, -513, 293, 1896, 1984, 1187, -295, -460, -30, 172, 109, 285, 808, 1155, 935, -547, -1603, -843, 23, 794, 702, 279, 6, -208, -838, -1487, -1691, -697, 874, 1104, 431, -1103, -1301]
2945a301N6N32J50j12Q43P31o18j227j029N02J176R11L69q56k29N9l78n48l21
2964a290J053J603M66j111r35n00M32J24M43Q0P02O19m93j239j174N01J185P20
2982A186J04n07k68l6o23m63Q0L80R96N54n21j250m42K93q4O07l69P99L87k8j213
3003d18j368J63J155Q83L1n61l24o9q2o29k68Q80J060L32l74r90n48L95J91O16
3023G5l28P41N87l51r37q06k39J387P33J63m19m58K30p56j41l41P00J321M90l27
3043A324j373n17K46N9L70R8O79K68k67j036r36q8J001J088L5l92m23r2n59l54
3063h69j29O29J102L10l69r61q03J60M30J91J58N93J80j70r03j151K36P58J185
3082E77Oj37k45l61j48l04n26O61Q04M61q7q44p01n9J98P90J16L21K62K71r86
$$ y = [-1301, -1245, -713, -563, -675, 168, 899, 281, -946, -1975, -1473, -297, 614, 983, 127, -102, -43, -421, -969, -1290, -237, 1366, 1832, 721, -214, -714, -282, -158, 285, 365, 1067, 1686, 1193, -46, -1220, -719, 466, 1186, 1290, 783, 515, 479, -144, -607, -527, -147, 849, 1403, 882, -368, -810, -517, -601, 6, -363, 436, 823, 795, -418, -1786, -1623, -468, 415, 446, -115, -439, -508, -590, -1219, -1487, -607, 453, 785, 411, -579, -1127, -732, -541, 75, -253, 488, 1075, 724, -213, -1019, -1258, 129, 862, 1025, 606, 148, 378, -378, -519, -860, -160, 1161, 1651, 1324, -49, -566, -320, -261, 109, 207, 886, 1154, 887, -149, -1085, -1173, -172, 916, 951, 559, 136, 44, -515, -869, -998, -369, 733, 1043, 674, -287, -1090, -930, -500, -309, -151, 442, 622, 452, -451, -1602, -1366, -608, 577, 583, 446, 201, -160, -308, -612, -1138, -477, 327, 788, 701, -143, -844, -903, -705, 85, 201, 522, 784, 1055, 69]
3103F9p90m11R55P17L41q2n19j47k13j93m03K25R22O26l66o52r43L86J39M97R9
3124B57N4K83l5m30q79l38O79R74L29m17k73n80N0l21m5M93P26P11o11q68l33
3145e74l89K74O82K2O92j27l3p76o85l99R11R43L74o8o06l12j07l40l02N72P39
3166D91Q10p80n49o58o7K94N84L2J08L09k7o33q75L1N80O08M84j08m43l46l36
3187d91j85p4O21N55N57k05o58o25j55J52L02M30Q9O42n57m42p47n9O79P65K30
3208H24M4n72k60q9l28l08M98O24N04j08p95p81P0J8O17K56j2L95j07o25n29k27
3230h91N89M29K26J68o67k05M5k76n59R41M13N16k26l77p09m89L27N06O43q6K08
3251E26m28k34p06l1R5Q65P38Mm82m48J40l36J04J84M06Q68q4o07p80o72L48N98
$$ y = [69, -721, -1132, -177, 540, 881, 799, 280, 133, -80, -273, -676, -451, 471, 1097, 731, 79, -864, -478, -339, 158, 257, 311, 594, 559, 129, -750, -1088, -409, 565, 894, 477, 204, -376, -326, -647, -692, -199, 527, 1238, 627, -241, -574, -963, -689, -7, 15, 707, 580, 547, -229, -914, -1313, -402, 541, 915, 847, 241, -71, -178, -518, -820, -248, 491, 1301, 521, -28, -686, -753, -459, 125, 157, 265, 574, 547, -86, -961, -930, -350, 258, 742, 634, 191, -155, -491, -676, -750, -129, 426, 983, 778, 120, -505, -660, -508, -206, 224, 313, 955, 398, -44, -791, -850, -171, 594, 824, 868, 296, 36, -53, -381, -689, -191, 433, 937, 829, 34, -747, -677, -659, -42, 214, 202, 597, 490, -135, -664, -891, -302, 127, 353, 521, -146, -351, -306, -582, -1141, -200, 213, 729, 503, 126, -583, -1072, -745, -239, 404, 318, 526, 98, -136, -842, -873, -778, 87, 825, 829, 347, -101, 39, -297, -193, -9, 397, 1265, 1181, 574, -206, -878, -530, 68]
3273F8L32L60J92l56k29p52o52O50O99O43j32l73k05l41m02j79K86Q22L93J36
3293I60p68j145o0L68J16M06M53N2N0k83j038k96L99N81M92L0l33l92l50m4KL88
3315d12M98O54L2r01n54r7J38N08L53K27K17n6n61n43r2K8Q73M57K56k43q04J15
3337I3n50J70N10N14J72J29p44m27m38K87L00L14N59p9m79k06m70l63K57L43R22
3358H14k02j50o34m15r7j62M05M64P57o30m5p74l80J98J25M87O30l63P3m92m50
3379h41j14j6Q22L57L63k29o72j56k41O4M72M49L16J01k06n79k58Q0L45J53N20
3400G30J05Q7p49j42m55J80N90K88N60l58l16n63j97K16j2O76L90q0n60m41o58
3421g09J25J94O27K26J42J0m72o30m91R1Q21M35K9k72k04n48l56L12K39J34N67
$$ y = [68, 400, 760, 952, 596, 367, -385, -1037, -387, 312, 955, 823, 450, 245, -96, -498, -677, -391, 431, 824, 960, 192, -953, -1013, -645, -529, -123, 330, 382, 432, 149, -889, -1185, -786, -205, 287, 317, -16, -408, -758, -802, -800, -412, 86, 740, 772, -129, -683, -780, -642, -134, 219, 446, 663, 607, 46, -497, -589, -561, 312, 769, 1025, 782, -22, 93, -457, -287, 223, 737, 909, 1038, 294, -133, -571, -284, 16, 330, 889, 810, 331, 125, -345, -708, -451, -108, 814, 612, 462, -172, -587, -684, -846, -441, 23, 780, 150, 105, -669, -1049, -851, -726, -239, 391, 28, 101, -391, -841, -955, -971, -149, 208, 571, 342, -330, -486, -727, -663, -191, 258, 574, 675, 469, -110, -368, -288, 57, 210, 730, 835, 922, 173, 31, -424, -244, 346, 634, 1194, 836, 520, -43, -240, -24, -36, 640, 1030, 950, 390, -51, -709, -584, -390, 237, 463, 605, 615, 143, -487, -978, -887, -66, 369, 398, 126, -78, -626, -982, -670, -431, -297, 270]
3442B70J35m23n90n67L78K95N34K50J58Jl38n91l14J81Q39K78K88j29n65n08J21
3463b97r1M30O36K15K7k25p54j98j12Q9Q95K39K5l7n53k45l42k38P61O00pn1l43
3486D24q21m0n1N26m2L83L00m08p24l99J28M21K36K47L7k05k91o31q7K82J10O65
3508F0L61j57m47l50k20K42J25K55O06j59k39m32k71r6P36O0M41K86l90r7o26
3529c12m28M41K73O08L42j82k92o46K23m15K20N35N72j61Nn01m86k49K77O54L30
3550H08J83m68j34p70L1O8M89K02j16J70l82m14j74q6K29L46K06L86m41l55l79
3571f01l46M64L42M10J51J5n31o97nJ36M48K79N31O1l27o32k74J02K86M70N06
3592G88l03%o86p6j57K35K79N35j56R6n36j75j90n4M29L60J75M0k92m28l02r0
$$ y = [270, 405, -18, -608, -1175, -797, -502, 32, 282, 440, 441, 103, -488, -802, -621, 218, 496, 784, 655, 90, -418, -297, -388, 42, 678, 893, 920, 695, -59, -257, -369, -280, 615, 854, 879, 842, 289, 44, -298, -536, 225, 825, 818, 767, 424, -397, -437, -488, 38, -4, 379, 679, 271, -453, -852, -724, -303, -67, 180, 217, 12, -279, -910, -997, -715, -605, 60, 421, 264, -183, -533, -753, -511, -386, -131, 475, 316, 77, -355, -626, -722, 14, 74, 515, 801, 411, 314, -312, -740, -299, -26, 582, 924, 742, 450, -196, 27, -388, -168, 367, 939, 778, 783, 282, -204, -453, -176, 478, 808, 991, 523, 389, -381, -350, -282, 207, 409, 293, 463, 81, -333, -507, -593, -364, -18, 188, 574, 133, -222, -601, -947, -483, -141, 269, 420, 435, -96, -793, -798, -662, -214, 65, 596, 657, 330, -302, -576, -474, -188, 282, 788, 485, 485, -201, -277, -434, -199, 80, 615, 459, 555, 19, -156, -346, -400, 29, 389, 564, 604, 312, -116, -418, -508]
3614e08M67K92N32%o59k1o22k61M71J67P63j7p9n46R0p04J57K45N49L47j8n34
3636A11o50j96k7O21M58L11p1l59n66m90K07L31M36J07J64N0m79m02m02J97N71
3657g8L34P32n42p0n23k47j35K68M69M39L05k58m78m17o5J63M39J93K66n9o41
3678I5r5k75o4L35M34q5K52k38p12M5m66L90O72J3L76l45m35j06k04J67K08M79
3700D41J39k17r6m84m40K31L27K95M10k44l3q49J19l8L73Q7L80L18k60m08m62
3721d11j41R4M51M07l8j4o15p8rN0M08j57M89J95l36o20r3j00J30L77N67K48m74
3744C30l17k00l73N27J02N55j10ql82l63j85K2J07L82L55m0m27j11l00k71J53
3765e54P97K68K51m28l61k17n2J63K74M73J43o16J47l51k87k69N38M85L13j35
$$ y = [-508, -41, 251, 783, 783, 124, 103, -519, -780, -309, -142, 621, 604, 525, -21, 69, -635, -478, -233, 316, 663, 645, 111, -539, -735, -762, -141, 317, 628, 557, 198, -368, -858, -651, -320, 116, 223, 387, 437, -42, -444, -846, -649, -78, 256, 988, 446, 376, -147, -394, -529, -261, 208, 647, 952, 694, 216, -201, -266, -103, 336, 529, 795, 736, 95, 0, -275, -339, -4, 430, 345, 597, 359, -353, -308, -774, -384, 288, 301, 677, 332, -103, -209, -413, -246, -38, 441, 580, 363, 267, -217, -657, -426, -99, 196, 606, 362, 329, -520, -401, -439, -66, 21, 401, 719, 459, 51, -411, -552, -458, -7, 400, 362, 348, -267, -345, -354, -304, 104, -53, 436, 631, 295, -325, -418, -518, -388, -11, 556, 804, 330, 13, -187, -560, -33, 69, 624, 514, 506, 124, -239, -424, -402, -295, 87, 442, 402, -25, -136, -436, -707, -554, 243, 511, 762, 334, -27, -244, -296, -133, 141, 614, 757, 141, 288, -63, -350, -619, -81, 404, 717, 582]
3785E82k74m66l04q3L62N47O4K93l68K4p72j79r8M25M39L14l62j13m19j21K0L05
3807a84K8O26M4m4o25m35P5K61J49N36J91j12m25l45j21P8L88J93K82P0n91k5
3829A4k59j47N53q2L15L8k8m53l64P9L91QN29m6J08o10l52k39J91M63J28K99J17
3852F53j6r82m6j07L41K30K99J76k12n08p0j87R5M35Q1K47j88m24k14o00Q9Q07
3874a01K95J16j58q1m43o2M0M11K49M31j22j72l33l30j02J37Q87m9p9n8k26n8
3896A92l20O7O7M57K12o2l41l03j42l6p8O18J70K97k25k75p50K21J84J12M72L11
3918H48n07n21Lk55RL85M01J82m18m2l84k03j56N00K01O9L99n22k67m42jM32L14
3941B5K0L41M2n26n18J57Q3J81N89K1J22o05k08J89j36J04J85N93m5J7n22k05
$$ y = [582, 308, -158, -462, -545, -183, 364, 428, 721, 353, 377, -395, -574, -672, -247, 192, 506, 144, 31, -388, -509, -489, -184, -156, 470, 514, 470, -155, -590, -515, -254, -105, 431, 622, 510, 85, -260, -381, -303, 85, 278, 560, 630, 39, 14, -245, -392, 161, 79, 394, 432, 404, -49, -413, -334, 57, 65, 594, 548, 656, 46, -306, -545, -354, 109, 237, 536, 653, 637, -345, -391, -498, -157, 73, 372, 548, 336, -172, -242, -429, -334, 101, 182, 429, 241, -183, -397, -997, -908, -101, 194, 310, 152, 71, -372, -434, -394, 17, 266, 697, 575, 403, 70, -260, -362, -225, 662, 613, 534, 476, 250, 192, -128, -61, 6, 463, 675, 613, 272, -31, -173, -209, -287, 331, 501, 798, 573, 298, -452, -231, -47, 65, 537, 848, 341, -180, -177, -432, -423, -38, 363, 545, 127, 85, -299, -502, -658, -158, 43, 112, 511, -11, -278, -720, -721, -289, 25, 45, 386, 428, -98, -616, -459, -376, -195, 394, 415, 537, -68, -276, -87, -223, -119, 66, 659, 614, 631, 109, -96]
3963i6k25K67J61O41j01j70p2k55j83m4K2L05J83j78k9j87l33j21K48L20L49K12
3985G14m36m62k32j94J46J00O65O0l10j82j25m27j61N02O29j4K02m57j57o73K37
4006e75K15K07L73K35l96k72l62J1k78J038K9K60n19J01m60K19k35J61M92J49
4026C93K7l74r8k44L2J99L47K02K35k20n89k08j50M81j7K24M12l77j62l35k47
4047d69j93O04J36K79k16l4m33j38l61L11O52J47l87R5j87m63pr9L90J36J98m7
4069h6k17k73r3K74J52J85JM36l68k99k57K95k62M59K22K49j58m66l10j83J65
4090e34N75K59r0R2n31K8K8k87M09P6M29J23k52l51j37k4J81J29K12J72l94p8
4112C5m84J43J30K16Q6M0J26j4m91o58O40j18K63J81M30m30l59o15j64K52R02
$$ y = [-96, -321, -54, 107, 748, 647, 477, 405, 150, -33, -77, -55, 250, 433, 255, 226, 39, -294, -415, -167, 153, 502, 714, 278, -184, -416, -610, -464, -364, 301, 361, 51, -131, -256, -683, -844, -342, 287, 273, 475, 18, -139, -812, -575, -360, -153, 220, 455, 59, -213, -575, -564, -842, 196, 225, 485, -34, 67, -393, -174, -409, -248, 244, 393, 420, 46, -52, -296, -264, -65, 282, 484, 719, 499, -90, -298, -448, 33, 16, 240, 652, 275, 113, -222, -469, -662, -58, 78, 357, 141, 107, -326, -464, -825, -514, 138, 285, -102, -7, -194, -657, -664, -763, -373, -237, -39, -86, -303, -576, -669, -395, -243, -58, -57, 379, 11, -288, -545, -250, -512, -53, 169, 418, 260, -206, -516, -699, -534, 41, 300, 210, 302, -229, -201, -173, -460, -51, 25, 454, 577, 325, -26, -163, -187, -6, 123, 335, 507, 113, 35, -449, -306, -176, 40, 126, 166, 292, 278, -213, -871, -231, -349, -86, 95, 525, 95, -264, -879, -1043, -791, 111]
4133A11J36K0k27m12p3Rk13L42M16J03P9k68l53n49M19L58L47n9L04l46k47l56
4155d59L57N2J92L90k87P7n46k39k44K60L03k6N21p2j86k79j7j62m4N85L14m05
4177H5J12l51l04QL2N77J83O1m0j40q95M50J28P7K70L52l45l79j54j48j65K41
4199c45L77K36J59m63n8l94j88oL88M26J48k77L12o85l14M12L3J73L67K22m28
4220I5l30n6J3O1O95m24K66k96k74J56j59J24N22J61o1k53p0m81j37J16K37K46
4242A51J54j81J69m58j67l9K28K37K68n4l57K05m79j3QL43K35J4j35P7m20l78
4264e92K26L47J26P2L2l11j00j66k2o9K67N37j97j21k84k9j12m8M48J09N8q8j84
4287a01j74j3j21K79N87P2J3p59j53j20J62kK61J24J75k26k56m74N90m00P06K29
$$ y = [111, 247, 267, 40, -372, -445, -436, -649, -307, 109, 212, 291, 23, -330, -879, -460, -102, 245, 186, 490, 144, -103, -459, -102, -50, 142, 532, 245, 322, -224, -463, -707, -447, -144, -170, 351, 279, 93, -186, -203, -365, -409, 176, 490, 85, 197, -154, -458, -450, -418, 159, 342, 403, 363, 223, -672, -222, -94, -17, 253, 605, 260, -119, -273, -421, -586, -345, 32, 268, 427, -36, -94, -488, -676, -682, -294, 132, 280, 3, 315, -370, -684, -272, -239, -66, 301, 523, 95, -235, -291, -278, -217, 478, 54, 320, 24, -250, -94, -253, -129, 393, 554, 493, 240, 170, -311, -448, -332, -95, 151, 305, 124, 293, -165, -332, -371, -143, 94, 362, 308, -49, 156, -323, -336, -328, 15, 250, 264, 129, 206, -214, -592, -366, -19, 107, 179, 211, -100, -200, -366, -388, -457, -190, 347, 150, 29, -255, -284, -396, -444, 4, 113, 171, 83, -101, -275, -288, -409, -130, 457, 529, 542, -217, -370, -490, -328, -330, -69, 55, 230, 4, -252, -726, -136, -536, 170, 399]
4309C99o1m0m10L9l66k3M14K13K04j51l4o25J08K5Q6K2M65k2O8k95l31Q0j7L43
4333I1j2L42k8l79l34J05K2K59jJ35M51m11m63j21J00K31N5L63l00N6k14l45p2
4356d70K21K26k01M71k21j70k36pl2L52K04P7N4l80p4j95p9J22L23L04L7k71Q6
4379A41l48m0j6L57J99K51m49l65l6l74M72J47J24K85j48j94j89j06l11L9N94
4400C3L62P2j40k84m15M3R8j16P54Q4j07m92j40k25R6R7L70O0J2k83k80J11K1
4423b69j58L83L75j51Kk13n60J7P2J00J66M18M1l16k80j05J74j79N65M41o0l96
4445F7l10k32J66R3M58r5M37m33l3k85j75k4N89kJ1K6k38j00k44N1J23K12K04
4468B66p5k20j38j46l06K39N55L46l62J72k04k50j28J67K9L0K22K2j8n25l65L33
$$ y = [399, 338, 298, -112, -73, -439, -462, -48, 165, 369, 218, 184, -441, -333, -308, -222, -200, 265, 243, 311, 16, -315, -235, -252, 91, 79, 421, 393, 14, -320, -215, -193, 66, 65, 200, 651, 240, -223, -344, -244, -13, 42, 405, 105, 161, -53, -398, -470, -249, -23, -224, 247, 26, -144, -380, -387, -419, -67, 137, 214, 268, -112, -186, -381, -460, -338, -15, 289, 326, 55, 141, -207, -247, -263, 94, 293, 544, 95, -270, -306, -680, -208, -61, 63, 348, 200, 6, -183, -289, -600, -561, 33, 395, 467, 327, 43, -372, -329, -231, -347, 407, 491, 384, -108, -248, -473, -377, -280, 90, 150, 162, -121, -401, -290, -269, -427, -44, 331, 180, 182, -31, -591, -574, -502, -402, -236, 182, 223, -93, -373, -478, -304, -483, 82, 523, 463, 67, -243, -475, -309, -216, 242, 147, 584, 151, 118, -167, -342, -366, 223, 221, 232, 258, 20, -80, -324, -273, -150, 62, 266, 191, -29, -167, -313, -619, -380, 175, 521, 159, 331, 127, -123, -251, -84, -55, -25, 197, 219, 201, -324, -689, -356]
4490c56J74L65k08K23K31q00L85o45L56K50r5J45K14o26l8L5k7L97R3L86l08l62
4512b11k24po9L59J62L05m2j70j45j15n7L3L04L51J0qj94l75rl73P04j12J98o3
4536B52j72k74k42M02L1K80L1m5O4l64l11j98L65o7N83l54J28J99o74KL9M09K4
4559A08K46k19l48N7j94k52L21M39j07J67j94J74n15j83L61K22N4r8r8Ol58j55
4581e66M59J8J97J59j54r9k40j7p2J39L21P5l6L52j21n62L2R4P7J17J95N0q5l62
4605b9%j78L36J27K4m2P0k51p6l12M76j9K13mk71o1l41o7J97J66L29K09l08j20
4629F8n21K49J15L36l21L12p4n6k96l56O00R5J49N4j94k88M2Q5k88n7L28L81J72
4652E35l68J10l17L5j25K19j56K78O3J08o7m67j14K66j38N10Q8k99R5l52k7K6
$$ y = [-356, -182, 183, -25, 198, 429, -371, 14, -631, -275, -25, -120, 25, 239, -387, -425, -390, -417, -20, 73, 459, 151, -211, -435, -442, -511, -152, 10, 315, 273, 103, -42, -157, -214, -181, 123, 474, 484, 476, 282, -93, -102, -475, 229, 117, 315, 252, 80, -194, -436, -34, -3, 277, 308, 263, 327, -37, -348, -546, -181, -248, 335, -19, 109, 308, -366, -364, -325, 84, 108, 354, 135, -213, -156, -350, -602, -281, 158, 51, 218, 24, 198, -317, -500, -139, 83, 137, 39, -59, -53, -411, -566, -107, -89, 108, 267, 113, 14, -226, -243, -315, -176, 145, 220, 184, 536, 415, -147, -115, -21, 56, 173, 368, 418, 333, -29, -29, -207, 129, 256, 280, 238, 308, 57, -19, -331, 145, 126, 339, 335, 64, 3, -338, -405, -208, -42, 287, 496, 188, 68, -453, -204, -89, 247, -74, 238, 164, 108, -188, -544, 56, 151, 300, 354, 160, -128, -86, -1, -289, -346, -18, 363, 535, 167, 277, -40, -5, -130, 89, -67, 211, 274, 382, 315, -152, -266, 0, -138, 372, 460, 161, 256, -96, -123, -97]
4674i7L73j7K14j31l76q7l52J5O34LN0K75k68j61l43k49L69j0J31J23L9l43O1
4697a47m2l9L46J69o7k9j95k0k37m6J40K49L20J83m16j32r8m53M96K69J93oJ45
4720E83o12J02k87J99ML40J55N4m50k70L1J03j01K86L9J41K32m23l97J53k11L90
4742F1L01k16J44m50J18l66M8L39K32L13m2l33m30p7K1M69l59O58m26J17k26n1
4764a55l18K83K39M27k27L4l57j01l1J8J64J22J36n0R3k17k40j69M54o7N01l03
4786B36n7%m13P9k07L91L10J74m89K34l40J30k35J90K49j14K63j68m68M07k58
4807h6R0R7K43j34Q3m27R9k11R3L57O6J47j17l15J26n22J91m5M39j23N55l44m84
4830b22R5j15K69r5J56M8n5k38l43J92K09l8L73k1k28m8j10j12j68L82J93L6J43
$$ y = [-97, 276, 259, 473, 342, -34, -121, -473, -458, 176, 179, 229, 504, 236, 75, -268, -517, -148, -158, -27, 96, 135, -208, -147, -189, -228, 118, 287, 220, 191, -4, -24, -261, -307, -167, 82, 402, 585, 169, 37, -61, -514, -18, 251, 444, 438, 583, -29, 73, -214, -15, -11, 329, 484, 538, 88, -182, -151, -48, -149, 137, 176, 317, 549, 126, -271, -118, -329, 61, 362, 146, 290, -160, -42, -408, -360, -21, 211, 524, 482, 149, -281, -358, -337, 132, -227, 431, 5, 122, -104, -155, -473, -190, 49, 476, 249, 283, -74, -175, -206, -188, -24, 98, 234, 184, 277, 60, -180, -349, 105, 38, 539, 236, 179, 179, -234, -155, -362, 29, 339, 513, 24, 258, -82, 48, -187, 3, 252, 138, 401, 233, -235, 172, -86, 4, 101, 344, 210, 293, -134, -35, -246, -153, 204, 270, 417, 300, -15, 111, -411, -220, -265, 174, 51, 606, 262, -222, -127, -242, 27, -68, 88, 136, 81, -157, -500, -308, -99, -137, 236, 215, -13, -61, -171, -283, -451, -69, 124, 160, 303]
4853C03n70L69l91P8J77P9r6Q2Q1j39j78j76R9L93K97j28j69j00l01K28j89L50
4875I9P1q0J62n4m77mj16K37M34m49L73K23l64k47j0O7L72o6O6J00k48k67j65
4898c43J11N6M82N4k25m1j76l90K88J38J92k56K22R3k4k10l36K22K63L15r5l08
4920C2K19j31p00M06J65j51L93k30j23m9k91Q4M47p9J20J1r6P9m40K7J21J21K91
4943B26J72r9m91J57l59k5K81J44L35J7Q4o67kJ51k68N99k95L81k26K68m89l43
4965d49J21M01J41j3J40l61j4J56l74J35M65k57j23j76j69M6L02l7J99k00L45
4986B78k01j83J29l89J96K77N1K2J65o31N68n39o1J20M19L3M0o4m21j75K05J53
5008hk02L27K90k36l88K37l35r6M89L23k09k7mj6j80J25m83M82J65j00J57o15
$$ y = [303, -267, 102, -289, -211, -34, 45, -51, 31, 112, -27, -205, -381, -282, 111, 408, 280, 111, 11, -290, -62, -251, 99, 170, 90, 252, 198, -279, -283, -399, -162, 272, -177, 196, 419, 55, -192, -202, -135, 237, 171, 237, 337, 89, -178, -343, -232, -176, 306, 360, 135, 94, -82, -472, -184, -46, 146, -110, 112, 205, 181, -29, -365, -143, 120, 435, 340, 32, 251, 120, -580, -174, -9, -160, 233, 3, -120, -169, -460, -376, 71, -8, 112, 123, 27, 106, -334, -307, -186, -65, 226, 398, 299, -192, -35, -394, -419, -138, 6, 341, 358, 442, -225, -227, -76, -344, 255, -40, 341, 115, 383, -106, -449, -328, 73, 214, 201, 341, -20, -34, 122, -252, -117, 348, 91, -32, -208, -377, -331, -29, -66, 133, -67, 278, 77, -106, 23, -366, -170, 107, 158, 180, 345, -286, 282, -257, -318, -198, 221, 254, 294, 230, -191, -366, -161, -8, -210, 117, 407, 171, -217, 20, -315, -411, 78, 401, 192, 165, 161, 145, -35, 90, -393, 89, 254, 154, 311, -304]
5030c04m9j01N80j58K55j69J03k78k22L19k14J8K95K15r7j21l54J06M7rK60k3
5052I9j73K68o2o93M9J70L15R8j30K12j63j57k20J96M6J80P0P4l61K82l20K80
5074F0k83M20J65j38j72j22l1j72J43K74k38M28O3k20l80k44J95K62J73K48j66
5095B65l32M1l09J84J51L7P2K37j09j44o22k04M91J27J21K91l93m4Q4l43M3K03
5117a53M32p8k35m14K32n5J71k63L20K44k5J27l59m42J78j2O11k43M4j08R6j65
5139i7k76J6O29j48J97k77k0k04J33J04l83N30nK72j75n32j94J93K11J81K8N9
5161B42P1j68Rk20r2m6J55K19j54J47j72j17j7l4J91M43rk70l64j72r7L14K36
5184I5L79j37L4m48J83j76l75N12K26l8k11o2r2J64r3q2J8M19m8r8j06l28J82
$$ y = [-304, -353, -454, 126, -32, 223, 54, 157, -121, -343, -24, -238, -220, 75, 290, 193, 72, -282, -176, -129, -138, 122, 99, -74, 194, 132, -561, -512, -342, -27, 71, -59, 153, -10, -167, -387, -191, -145, 35, 105, 179, -182, 100, -220, 60, -223, 197, 362, 224, 52, -70, -101, -273, -130, 144, -94, 334, 397, 177, -203, -447, -252, 10, 183, 431, 265, -67, -26, -335, -151, 0, 37, 109, 346, 237, 93, -529, -733, -242, -115, 6, 297, -96, -140, -56, -399, -356, -153, 279, 201, -34, -448, -216, -271, -100, -363, -43, 201, 176, 303, -56, -498, -320, -332, 279, 36, 80, -28, 68, -97, -373, -357, 272, 124, 321, 44, 24, -180, -47, 57, -326, 204, 199, 471, 296, -236, -430, -237, -26, 155, 183, 242, 313, 145, 154, -66, -158, -204, -49, 170, 16, 163, -9, -126, -143, -177, 14, 457, 448, 178, -186, -358, -455, -141, 95, 474, 337, 371, -77, 106, -70, -445, 67, 293, 255, 44, -18, -110, 54, -39, -121, -103, 316, 268, 170, 64, -264, -82]
5207h2r3K43R6J71k28N5k20r9j48L22J40P5J94l51q3k34P0J4K90P5l4J45m72j48
5231c02j98M29q8K21M0k18J60L5p9k59j4P24J11k02m84J41R6J8k28J1J34O61l13
5254C96n47K8P3K8K97l44L34k2r4K59m91r3J12O53j35m4o36J01J06L7K30k28j24
5277a04N31j63l64k3k42L85j47K42j78K68j64M1K9j26J59J56l6K59l32o47M68
5298A2k54K01J49K06j97K14j79k33o5K68J74k20j20L24k14L16l60j73k2K25L67
5319D19k36l00J49k08j94M36J16j5J32O4m34k16K61j63L85m1q1J0lLK3n83J61
5342c15M47L06j49j59j05k39K22K49j53n9K38p4k14m59j24O95J35l18J49J64k67
5363c0j6Pk29L36K72K3j98m08Q5lJ31j06L48M5j01J32j11l77m9j0J30K83j37k01
$$ y = [-82, -175, 68, 164, 335, 107, 162, -58, -157, -305, 17, 157, 232, 426, 75, -8, -242, -172, -158, 132, 207, 173, 318, -154, -302, -500, -71, -159, 62, 102, -116, 44, 79, 0, -259, -273, 451, 562, 360, -124, 17, 113, 131, -97, -86, 48, 709, 396, -151, -123, -50, -22, 275, -69, 265, 243, 149, 408, -83, -176, -64, 589, 454, 410, -226, -125, -19, 18, 248, 20, -104, 427, 264, -100, -123, -365, 20, -127, 115, -63, 205, 41, 82, 111, -15, 144, 300, 264, 523, 191, -456, 12, -242, -41, 108, 314, 117, 331, 152, -81, -146, 122, 296, 76, -44, 280, 66, 382, 22, -151, -173, 52, 419, 183, -117, 32, -176, -370, 66, 182, 167, 299, 363, -71, -287, -26, -189, 196, 155, 74, 84, 81, 84, 107, -476, -315, 132, 438, 289, 130, 25, -214, 8, 257, 104, 45, 283, 209, -5, -464, -588, 107, 242, -76, 73, 237, -30, -46, -39, -268, 68, 340, 363, 165, -243, -158, -161, -30, -136, 212, 257, 156, 288, 177, -200, -249, -259, -129, 154, 17, -184]
5387a84K84Nl25p7K16N3N22k23n2l37q2j25O27j28k24K95o6j19l87j98P56k25
5409FrP3m8l5n1O3lr7K99l38N30n20K7j04K16o0J09K39q6j2j78p1N6j40L58mj56
5436F4J75k22n3P7j95J36J8J73K1k61J5j14J02l4Q2p9L93r8j3L7l59O0K28L54
5460E07m01P7n6k50j08l90M30J90N25j45k99j32p5o6OL14J01J06Ok82m03K93j94
5483b46M28p6K0P5j51q7L41m18k7K72L62l60J56l74j27j12M73k7o2O1J37r4l97
5506b33nj65K20N26k79Q8p2O7j35k59K78k10K16K00l13p6J14p4K5J58R4j1L0j5
5530A69k20j4j34O64K2l41N9k08l5K55k1l49K29R2M64n95o1j21L30l22L64J4n6
5553A85n9m8k56J42j65j32P45q7j90L1k67K43l05K21k03L92K12k35j61n8j49J33
$$ y = [-184, 100, 105, -220, -297, -81, -28, 494, 271, 219, -118, -200, -325, 302, 174, -50, 245, 179, 60, -327, -525, 231, 6, -3, 70, 22, -13, -64, -1, -4, -101, 198, -140, 390, -130, -103, -207, 9, -51, 58, 297, 211, 199, 21, -50, 6, -134, 224, 220, 64, 239, 17, -36, 41, -154, -18, 0, 173, 194, -67, -52, -166, -64, -98, -16, -95, 298, 200, 187, 224, -135, -75, 153, 507, 106, 183, 127, -123, -231, -621, -191, -1, 524, 379, 80, -52, -127, -193, -187, 127, 228, 334, 340, 58, -345, -52, -246, 182, 106, 126, 201, 50, -37, 304, -114, -141, 131, 493, 133, 289, -85, -212, -324, 149, 122, 60, 121, 258, 164, -233, -238, -403, -183, 343, 64, 152, 80, 147, 12, -247, 31, -179, 37, 237, -76, -152, -38, -112, -87, 71, 165, 154, 184, 169, -51, -65, -199, 465, 487, 146, 205, -3, -38, 217, 196, -153, 76, 168, 632, 37, -24, -145, 185, -137, 227, 241, 185, 126, 78, -178, -36, -201, -333, 412, 325, 135, 166, -101, 142, -163, 58, -145, 247, 459, 224, 63, 5, -144, -11]
5575a1K12R3J74k03q2Jm17J62KK86L41k29k72j49K15k52j55K05M36K4j51m03K39
5598F6M3j00j2PO7J29ql51L9q1K33M05j6k16j98K16k03kq3J7K61ml02k5M7k3L9
5625e5L25j12J54J59m56j24O3J51j28M57j13j77j36J41l91J44j22K57K13j15j55
5646b0j2r4k4qM36k42j31LO9n9k52L04m0L15O5r7Ok27j78J10j08K65K03J5K1k47
5672G3Q0l54J1K23Q2j49L17k08p0l07j39N26J87k59k16J10K24K5j21K7l26M62
5694A98J85k22J91l45J04Ok28O7R1R2j65J32k75K08l38M97J61l92J11j10j27K96
5716A37k89K28k00M73R0l77j20m6L41k51J54J14j52J84n77K61m10M30P7N4J69
5737B90k44k23J11R1k82L54j41O3K3n1mk15J63J36J58l17N17l29k95k14J44K09
$$ y = [-11, 201, 294, 468, 265, 183, 184, -233, -71, -69, 217, 558, 329, 57, -92, 123, -129, -284, -79, 357, 381, 230, -173, 66, 109, 9, -3, 4, 71, 200, 192, -159, -120, -201, 32, 437, 421, 205, 7, 223, 20, 18, -65, -48, 213, 209, -93, -118, -71, -94, -55, 270, 158, 312, 471, 15, -109, -46, 105, -23, 434, 321, 144, 8, 149, -242, -98, -220, 37, 250, 135, -20, -32, -126, -150, -158, 278, 36, -95, -92, -23, -82, -334, -30, -70, 245, 310, 213, 219, -8, -186, -76, -184, 81, 284, 299, 320, 73, 153, -201, -190, 33, 115, -34, 283, 75, 5, -302, -441, 85, 272, 13, -203, -93, 131, 156, 35, 62, -264, 198, 383, 161, 352, 7, 111, 117, -111, -44, 47, 139, -26, 106, -169, 39, -299, 198, 359, -33, 78, -32, -159, 137, -152, 76, -124, 349, 439, 62, -58, -104, 237, -14, 140, 254, 102, 286, -291, -30, -440, -10, 67, 121, 290, 46, -177, -66, 25, -257, 97, -44, 19, 42, -9, -13, -228, -65, 71, 229, -88, 429, 100, -195, -409, -265, -56]
5759e6P1L3K28l48r7m6J41j31m7K37L57j53l76K7j11K85j07j27J9K67J92m55Q4
5782a13j44n0M74r9j13K03k27k96K12R9K36j27J57O4k50m59M34n02O07k6Om5J01
5805A42k94j4J39K7K3J17k66J14j56J10j44j9J40K16m0j57L12k79k6j53L39k98
5827a67L90l46L46n11j17n3L73J75o0J74l21j72J5J33j7k32M89L02m90R3j22l52
5849d70L15K6J04n6M92m45O8j65J5Kk1M83m81K29o3p1l64K11K68k27J78k10J22
5872f0j70l2o8L94j3r5J28j01K04n26q0L1L91K5J04o9q8l99L39n0l8J97K10k13
5896B1mN3k10M7j12K7K34r6Oj45J98L2O4j30J97l39K66q2k67k3M9q0O61l07L11
5921C71k68L9n44K62J00K13p2j1J2j40k02r2J69O60l22j92O7k21K23j11q8K29
$$ y = [-56, 15, 48, 276, -72, -169, -215, -74, -205, -252, -15, 342, 189, -187, -160, -271, 14, -93, -220, -201, 66, 258, -197, -113, -257, -307, 167, 68, -45, 158, -69, -365, -153, -54, 182, 55, 212, 276, 26, -433, 1, -501, 106, 80, 86, 41, 142, -152, -166, -27, 0, 23, 140, -126, -12, -168, -58, -202, -221, -81, 135, 95, -62, 250, -29, -55, -208, 131, -167, 223, -123, 223, -288, -405, -458, -85, 90, 30, 204, -117, -289, -274, -141, -158, -390, 99, 401, -89, 4, -118, -470, -155, -129, -25, -81, 411, -34, 34, -131, -116, -114, -135, 348, -133, 96, 33, -38, -402, -191, 77, -150, 28, -182, -60, -230, -262, -330, 64, 51, -44, 84, -17, 187, -339, -419, -388, 3, 28, 132, 63, -25, -424, -85, -135, -173, 24, 234, 21, 17, 70, -140, -93, -205, -178, 56, -40, -34, -179, 19, 51, 115, -15, 182, -157, 109, 27, -240, -263, -214, -294, 367, 60, 371, 103, 142, -402, -140, -40, 173, 101, 90, 102, -38, -240, -332, -163, 497, 175, -17, 50, -171, 52, -59, -147, 82]
5943H2K41k37j78J22k12M6l5j03L79j21Ll8K46k09j49j46N92k86J13m09K94k53
5965b58J08J26j9j31J0N21l13j90j12O7M49o04M56L05l46o0qMo0K06j05n1L61
5988C56k46k52k2K94r9M2L2R8J4l45J33l11J94K46k21o0R4k16L39N1l17J61N8
6011B3L65m51K4o8o5K09j32J06Q3l2j83j05K54k84J18M80k57j52Q0J8K0l95K27
6034a17J09K48j94n9l1L2ql03O30m37O16k23l70p0O4kj23K83K15q0k89j15J60
6057f4j18m7j11K93%k86M78m33K8J59J41k6J27l5Q1j01l43L0Q9K47J51q9k94K40
6081A17k20r8K37j33M04l44J68l95qJ17n1K11r6K08j07j36K14k24k5L05j9J16
6103B41l03K5K82k02k13J14k53K65L21K5n14K55J7r1l05K09K50M5l13Q9K34m73
$$ y = [82, 323, 86, -92, 30, -182, -136, -171, -274, 105, -16, -13, -51, 195, -14, -163, -309, 283, -3, 110, -299, -5, -258, -150, -24, -43, -174, -164, 357, 44, -146, -258, -191, 258, -346, 110, 415, 69, 9, 1, 5, -55, 151, 46, -5, 356, 110, -142, -164, 130, 31, 73, 105, 203, 217, -128, 5, -306, -112, 134, -87, -147, -53, -269, 70, 121, -196, -35, 23, 388, -63, -39, -107, -172, 37, -95, 11, 94, 62, -121, -226, 28, -256, -138, 342, 85, -67, 13, 31, 51, -344, -117, -8, 240, 46, -13, -44, -12, -20, -323, 307, -130, 486, 263, -107, -177, -113, -115, -238, 45, 260, 180, -109, -224, -64, -182, -229, -340, -47, -47, -333, 145, -288, -260, -101, 40, 14, 141, 106, 187, 86, -257, -227, -138, 109, 260, 171, -123, 117, -103, -201, 36, -97, 307, -37, 131, -264, -272, -155, -206, 5, -91, 117, 10, -126, 88, -136, -161, 144, 125, 241, -62, -37, 245, 43, -170, -56, -309, -44, 277, 302, -212, 43, 60, -31, -336, -127, 123, 168, -145, -56, 178, -295]
6125b95QJ90j25P8K55O6m32N33n31M33O8j46j17P4k13K2l3J53L5Q2J26m01L08
6148A38k73o2Q2L78j68n5P9j25l0j16J5J15N3K43l35q4j31q4O0L66p6K45j11j90
6172f6K51k91J22k27K62J31k31K19k23l10j0K75P5J38J7j98R4K7m24K22J18j34
6194a63J19K25k04P3r2j49J8O8K49l6M7k00L7j57L9M47l33QK74n10K89l48K68
6217c1J09j16K17l49L44m51oK73nJ3J27j30Rj38Q9k77M11Qp5r3L1k4M0o6k00J34
6243a56K25J51j01J9l04K20j20N1k3J86k57N9p2K6k02L44J23r3r4O8J11m08L95
6266A48k83J63lJ76k11J07K2k77R4j20K26K17j83l7k02J37j84L25k75Q7pJ13p6
6289d3L6o47P63l23K94mJ7l12q9N06n23O72k41P7O5l52J49J14n15L56J67kJ25
$$ y = [-295, -287, -97, -222, -144, 111, 177, -255, 278, -253, 180, 248, 102, -15, 59, -154, -132, -165, -12, 23, 105, 231, -170, 138, -135, -197, -115, 263, 95, 40, 119, -6, -36, -152, -137, -22, 31, 274, -61, -145, -276, -360, -300, 66, -10, 235, 124, -66, 185, -106, 16, -211, 51, 182, -49, 170, -53, -363, -373, -98, -23, 115, 132, -66, 28, 55, -369, -147, -29, -163, -44, 181, -23, 50, -42, -191, -173, -105, 144, 108, 155, -45, -8, -165, -126, 321, -12, -4, 270, -240, 49, -299, -31, 78, -38, 179, -170, 174, -277, -283, -10, -15, -2, 125, -5, 4, -134, -45, -322, 89, 97, 22, -71, -40, -64, -24, -90, -290, -156, 69, 220, 119, 138, -166, 54, -66, -15, -38, 148, -109, -50, -122, -96, -298, 46, 169, 76, -18, 50, 161, -247, 148, -135, 28, 25, 201, -10, 97, 119, -158, -64, -184, 42, 259, 76, 39, -163, -26, -210, 115, -160, -73, -80, 33, -43, -7, -654, 109, -214, 80, 76, 93, -219, -308, 198, -325, 347, 106, 183, 248, -104, 45, 159, -356, 0, 167, 165, 290]
6312B90k38j29L29k43k34J82K83q3j83J20J2j34J10k94L70k61M34r9k67%j06J53
6334A2m9R8J64J65l21j59R3P4j18J29Lm4k4q2Po9P7J31J92j69q8r1M0q7o6J38
6360d4K31J41j12l03q8Q6j48K0M70J56k02k63K15K7k28J92J6p0N5k70j36K89J59
6383A93l70L05kK5j39j58J40J38o2j45J14N8L15q1l07r7j36L46k72K82oR8l1l62
6407a54J2J64k0L3o7J29P2l38J99r3n9K49J95K11p67R8O9mj78P0L41j00J85m9
6431A98j00m17L40m9J68o5p9Q2k32OJ99j7M17j5k80K7r6j21lJ33r8R2k2n6N7l96
6457c27J97K29O0j74M32j17k50k83M62l82K14O4K89k75P4k38q2m49N81k1K96l55
6479e5J29rlm18L45J90j33N2J36j23Rj17n9n7N3q7O3K6k50L71k84K09j38K75J35
$$ y = [290, 52, -77, 252, 9, -225, -43, 240, 157, -26, 94, 106, -28, 82, -212, 158, -103, 331, 232, -35, -35, -141, 12, -37, 61, 225, 390, 69, -90, 3, 77, -41, 88, 91, 47, 23, -59, -52, -121, -44, 87, 279, 110, 22, -69, -29, -116, -182, -44, 187, 328, 216, -87, -175, -89, -237, -217, 253, 409, 207, -56, 159, 186, -42, 150, 166, 96, 151, -119, -255, 34, 193, -177, 128, 126, 151, 12, -146, -6, 132, 70, -75, 39, 97, 412, 331, 24, -73, -209, 137, -135, 147, 141, 239, 208, -154, -142, 22, 2, 35, -32, 97, 169, -169, 30, -63, -122, 127, 322, 533, -234, -136, -67, -71, -249, -179, 162, 62, 247, 198, 98, -319, 21, -28, 140, 75, -4, 78, -154, -148, 51, 34, 451, 436, 156, 183, 87, -34, -37, 96, -2, 90, 68, 12, 69, -327, -130, 99, 159, -15, 417, 300, 50, -233, 229, -153, 61, 125, 414, 139, 213, -25, -107, -556, 25, 4, 300, -55, 74, 65, 62, -356, -11, 179, 46, 98, 234, 111, 120, 3, -56, -113, -60, -147, -84, -58, -308, 63, -221, -12, -150, 125, 260]
6504B60k96k0j76K42j22K00j97K18k36K17j7k00K0J92L1k6K12n22K97NJ3l22K31
6527D%J97j53K45l39j9J02M3k8no2J91j41j29K17j26m2K03J33n0j89l49L01o9
6551f5J17O4q3L33k93j91N0J89k07P1M5L13k83l53J51P6j31M21l61n5M81k94k28
6574b33lO9J52R7K03l54J3R2k18K84j5j50J99j2k50L52m1m15K33K53j41j33Qj42
6598a52K76j61n7K81j94Q9j55K13j21m39J67L3J20K46j16P8n5l82K22J52j10K65
6620B00j99K8r4j4L36m12M81j42j8j52k40J95k61K01J37Q5k1JJ12j08n0r3j23
6643a51L42j14j7k56P3l0M1J07J94j41j60M4j31n8J53j9o7L4O6J32n9L48m29k07
6667c05Q7J01K62KJ98r8n37M29q5k91N47m16M02l55j37j28J77N20m10j42J58r9
$$ y = [260, -36, -56, -232, 10, -112, 88, -109, 109, -127, 90, 73, -127, -107, 85, 116, 90, 302, -220, 77, 82, 95, -227, 4, 4, 201, 48, 293, -46, -65, 37, 80, 52, 47, -15, 176, 35, -94, 123, -3, -45, 158, 291, 241, 52, -297, 4, -65, 52, 116, 33, 366, 73, -118, -68, 121, -86, -15, 30, 343, 60, -293, -142, -66, -197, 224, -137, -192, 289, -5, -233, -236, -167, -15, 82, 285, -69, -56, 36, -182, 102, 87, -63, 136, 124, -126, 226, 185, -230, 3, 256, 115, -18, -10, -152, 124, -37, -94, 187, -7, 82, -73, 140, 19, -420, -253, -220, -100, 146, 30, 108, 53, -329, -107, 45, -65, 200, 1, 29, -65, -79, 257, -155, 326, 184, 166, 14, -226, -31, -292, -91, 46, 131, 110, 111, 223, 115, 65, -28, -151, 191, 77, 60, -196, -123, -153, -112, -5, 189, 48, -112, -68, -199, -257, -104, -123, -190, -156, -90, 42, -17, 331, -98, -305, -218, -117, 145, 147, 345, 247, -290, 139, 54, -237, 310, -106, 296, -59, -196, -324, -147, 373, -37, -179, -21, -120]
6689a20JK48l43L0M15j31R6l96L15P1j43P1j38J99J49m09J54m8j13k7Np2J29L44
6713B87n06%k08J38K91j72M15l96M6K45n3k66P5K00J60k21M0J80m82M75l67J37
6735A8k8n5J44J75k17j75J9j22J06J97K97k29r2j87L13j97q2L22P4P2k21k07j96
6758b71K51M4K02j71m1l9J3j9j66J95q1O5K50k66K3jm27K02J44P6rM8k06p5J57
6783a02l13L68J59K32o63J81L02m7O2m27NK50K6J79j5n58J10M41p0j52k05M93
6805B56m0m14m7L93r6k97M32o4l6N1J04m23M01j1J53l00l8k1k5n4j07K49j10K64
6829B20j58j38J19j42K57m5j69P2k50M14k71k40K29J14l34M33K0j78o1M9k6J47
6851F2J22j08K04j86j76j9J36q5O6l0j67K94N8k9j93m7L84j95P1K6l0j86K26k95
$$ y = [-120, -119, 129, -214, -184, 231, 100, 196, -200, 115, 186, 43, 114, -24, 175, 324, -85, 69, 21, -92, -119, -114, -186, -57, 287, -219, -219, -427, -289, 2, -170, 245, -151, -105, 140, 87, -179, -104, 96, 256, 35, 75, 255, -227, 248, -119, 18, -10, -65, 79, 254, 37, -138, -119, -241, -135, 62, 359, 130, 38, -149, 164, -33, -115, 207, 281, 353, 132, -75, -271, -20, 24, 226, 55, 14, -25, -12, -31, -197, -2, -83, -18, 232, -34, -11, -12, -439, -237, -93, -17, -26, 22, -184, -259, -102, -415, -47, 112, 344, -319, -138, 164, 117, 179, -248, -243, 7, 33, 212, 197, -361, -251, 190, 120, -32, -237, 256, 216, -198, -245, 148, 52, -245, 187, 123, 87, 138, 242, -181, 220, 209, 362, 62, 24, 3, -22, -76, -183, 66, -44, 220, 62, -76, 43, -99, 158, 113, -56, 16, -234, 180, -91, -331, -102, 12, -322, 111, 131, -47, -108, -59, -85, 62, 184, 76, 280, 94, -82, -101, 35, -50, 16, -14, -181, 113, 171, 142, -51, -98, 286, 91, 162, 188, 158, -28, 198, -97]
6875i7O5j59M65M8K25k21l90L3k13L60l3k0J31K2j62j34q7M4K75J9p9j53J56j67
6899g2q5J73J95j77lL65n54K58j61R9K2n4J34m4o6j11j09J77k15R9k8j11M04k6
6923A10j39J45k43j69N76l80j00L60j82n8p6O1L01j50J94j27m6k01n9J28j24K28
6945D9j6Q3L7k30Q1k08L29K17j29l31N0L2Mj59K00J67j58r8O1m51M49k30K1M35
6969B05k18L1k87J74j77L20k32J58k49J52j3M2J79l16K64M2k39L94m5k83K51k05
6991e2j86O6M8L46J71m36j84L8J56L6L8j16L94l92J60J12j58p1n7j06R6K42k11
7014f6L19l4m04LJ99J39k21P2N7k77n9J3K34j08J10j09J28j51r7L17Q9j04K48
7037B98q5k16M0j68k54L26o2J30J73r6N0l31J40J75j57j41K54j16L56j36j58n1
$$ y = [-97, -32, -191, 274, 322, 547, 326, -64, -31, -244, 116, 83, 63, 194, 216, 54, -80, -167, -123, 152, 171, 92, -61, 95, -72, -157, 16, 211, 34, 31, 396, -158, 100, -61, 38, 60, 6, 140, 96, 30, -81, -190, -13, -228, -129, -157, -268, 136, 110, -29, 116, -127, -296, 280, -100, -200, 160, -22, -80, -156, -95, 206, 56, 250, 123, 77, -124, -183, -55, -179, 49, 33, 116, 153, -77, 4, -204, 125, 342, 213, -118, -68, -36, -32, -191, 9, 176, 18, -80, -19, -470, -21, -251, -230, 205, -13, 18, -269, -95, -272, 48, -184, -26, -275, -123, -136, -94, 85, -231, 33, 75, -164, 230, 185, -98, 153, -52, -238, -172, -124, 222, 393, -43, -227, -189, -33, 3, 41, -75, 319, -73, 87, 199, 41, -30, -87, -193, -97, 145, -66, 253, 219, -185, -182, 17, 156, -65, 7, 64, -213, -272, -259, -25, -133, -23, -132, -4, -155, -252, 65, 154, 50, 298, 213, -3, 37, -131, -385, -59, -121, 9, 182, 86, 136, -195, -55, 120, -37, -178, 76, -40, 316, 180, 22, -29]
7059b9p4L80j22m05L85P5j90Q2j4k7j50K25j17j75J83K3l37M96j48j50j58L01
7081E4k37J60j94L30Q0j67K2K88j99j06j42j56L24J18K59j52j45k17J15l65M56
7102A26q4K10j22k42j33J69m1l9J05J67j8k13J84p4l36Q5K09J52j27K94p0l80
7124a78K16j18K23J26J24m09L8l2k38L06j75K89q6n2K45l20p8L67k07j01Q1N8
7146G9J33j34j82O3J0J5l0n6M16o2k80j16Q1J78k48L17j34L36m5k56J28m35L99
7169A77l6q5k56K06K8m5n3J6L27n04L59k87j28M85k72L29l78J59J66J21k40K41
7191C30m94QJ89j40K74j83q1K45m97L49pl0J12j84K5R6K61k41J54m48K36j3P9
7214D0l00J51K2K09m5o5n1l7L11k18k68J08K79j93O4k57M76Q3l01k59JL28nj10
$$ y = [-29, -103, 277, 155, -250, 135, 210, 20, 102, 88, 61, -89, 136, 19, -156, 27, 50, -287, 209, 61, -89, -247, 54, -183, -23, -217, 113, 193, 26, 48, 336, 137, 31, -111, -267, 57, 175, 434, 282, 137, -80, 35, -330, 126, 42, 252, 130, -112, -245, -76, -117, -156, -51, 116, 98, -115, 69, -5, -341, -256, -47, 105, -22, 272, 202, -178, 38, -80, 143, 269, 393, -16, 22, -10, -248, 58, -117, 172, 86, 34, 279, -41, -119, 248, 41, -60, 21, 79, 212, 78, -104, -41, -31, -16, -46, -102, 314, 252, -28, -144, -63, 115, -133, 184, 50, 386, 341, 85, 213, -222, 177, 141, 56, -200, 6, 34, -11, -64, -48, 279, -225, 134, -153, -281, 204, -68, 261, -117, 42, 208, 329, 89, 330, -164, -156, 33, -107, 167, -16, -97, 148, -349, 0, -7, -37, 75, -109, -84, 12, 273, 32, 186, -262, -26, -39, 40, -260, -109, -87, 122, 77, 12, -39, -76, 235, 17, -251, -143, 136, -57, 7, -250, 226, 309, 8, -251, -250, 78, 73, -37]
7238c7Q3j51J3O1j01R8L14m43J81J3J51ll76L59k33K83l41J17l42K65j72K16P9
7261C4N7l1J47l3j74k23n6L32k77K93j37J89o4j01P5L1J27j83N4Qk12j60K30K
7285g2N1J91j66J54M3l02L73k65k17Q6K88J07k84r2Q4k91L99K0K0j84M11m76N7
7308f5J26j70K5r2J45O4M2J88m70M16j83K23j95p1J64l60L67L8l16K02j79J87
7330H6q0J5p1n1j20L19o6K09r6j69j65N6m7K22j46K7K20j91J16j81o5J03J93J93
7354C11k85J82l21k51K80Q2k33R1K62P1kk77j75M39l62K05Q7j7J16m18J47q7J74
7377A9k05J09J20k07J87J39l25k1j2J82M0l1L56m35J34n2k75K28j95J97L2k66
7399b81j1j2Q9K28J37m12J62rJ81p6l70J60K1J6J90L27l35L7N5J15p9k95K3Q1
$$ y = [-37, 46, -105, -92, -31, -132, -34, 280, -163, 18, 31, 182, 179, -197, 162, -71, 212, -129, -12, -354, -89, -261, -45, 34, 91, 60, 207, 174, 0, -223, -279, 53, -224, 69, -68, 121, 57, -44, 31, 62, 189, 6, 60, 68, -144, -304, -74, -72, -21, 170, 4, 158, 201, -101, 272, 7, -210, -124, 164, 271, -13, -105, -21, -312, 87, 107, 127, -57, 354, -122, -65, 61, -109, -84, -176, -31, 33, 75, 263, -207, 209, 26, 249, 54, -17, 147, -213, 154, 192, -124, 78, -101, 86, 6, 21, -50, -101, -221, 98, 32, 241, 145, -24, -189, -133, -180, 42, -104, -77, 143, -48, 68, -113, -178, -75, 118, 311, 26, 208, -113, -364, -84, -2, -235, -144, 118, 189, 187, -90, -265, 174, -188, 17, 104, 87, 203, -215, -68, -155, 19, -186, -77, 43, -164, 23, 162, -163, -184, -196, -14, 26, -5, 351, -84, 50, -2, -277, -49, -244, -47, -15, -281, -292, -304, -215, 13, 150, -262, -100, -109, 72, -4, -374, -214, -193, -177, 13, 340, 5, 42, 97, 212, 133, -162, -139, -58]
7423e8m3K86o1k89J18M56l36p0j21J03j72K04O8J9j88J44L8R2l51J83j05J6M21
7446C54p32N47qk92P1K71n93M84l16jJ53m5J06o8K70m40K22K57k05Nj30L01m32
7469b21K94J08j84j07K69j8n64j4M43n6o3J86l04K54k52L08P8k4j29J9j39K0R0
7492fm1o4P5k57J84M3Q0N8m2q6J42N4k63J79J39k08kK21k10J6K15k14R1J0j48
7517c4J2J12J44k36j39J30L64m07j62Q0K60j12oN2J39j90j16Q5k06k3kL61o90
7540e84N76K0l08J08O1J60l40J63L36p0k95o4j5J36qK51j87J65k17L16j67j30
7562i3R3R2k3j73M32n52O01m03O0P1NJ30l46J37k48L11r8J76l8m2k54J16K37k3
7586A68k02J02j6k07J19J87P6m18K67p4P7p3p4Q0J12l09L00k02J09k7m2j97j33
$$ y = [-58, -101, 185, 124, -165, -47, 409, 73, 3, -118, -15, -187, 17, 85, 104, -84, 60, 98, 190, -161, 22, -83, -67, 354, -378, 169, 161, -131, -60, 211, -382, 102, -214, -215, -62, -107, -1, -69, 201, -239, -17, 240, 35, 40, -90, 211, -221, 73, 181, -3, -110, 159, 141, -423, -437, 6, -50, -113, 73, -231, 23, -229, 79, 157, 133, 4, 23, -116, -96, -6, -47, -111, -36, -293, -109, -66, 14, 72, 30, -56, 86, 140, -123, 56, 195, -13, -15, 206, -4, 12, 227, 13, 104, 114, -34, -22, 90, 234, -2, -141, -11, 353, -54, -216, -136, 124, 12, 6, 58, 197, 7, -109, -24, -230, -253, -255, 106, -584, -8, 12, -296, -188, -127, 33, -307, -144, 192, 122, -173, -237, -252, -116, -124, 127, -60, 105, -112, 204, 37, -93, 0, 92, 69, -104, 328, -224, 377, -26, 34, 105, 110, 240, -106, 31, -217, 94, -4, 172, 134, 92, -162, -46, 191, 168, -34, 68, 52, -155, -36, 151, 227, -191, 76, 2, 79, 6, -68, 12, 124, -185, 115, -87, 22, -5, -47, -244, -377]
7609c77L84pL00l84J75k16J79j54j90K69M8o5J60j84K72n63K87o3J46p1J60L2
7631A38J13n58R0L85l61L8L49k95J61pk29J4o1pK66j61J10J24j21j46L3J10j39
7654a54M06p7k03Q6q9n7K99l17J06K2j91J88n8j35J41K24l21L28k54K6O9p8k12
7677b51nK77J34l4l80J52r6J47R5J98l96j58P40l84k14K86J41j71K52k82j20J03
7699C4L35n69K38K02m47L23j55K65m13j42n7N20j76M14l21q1J78j61N9K5Q4N9
7721B14j74jJ46k17N8l09N24k71R5o0j12%L20m17J98q7P6J71k07P6k36K17Pj88
7745a77K55K3J79p3l69J47r1K70l07J60J75j98j06J9o6k21K32L79k32J32j34N6
7767E3k93K38ko6Oj49q5L71k16O7M9K1j76M88l78q9L5m7K73j27K35j11j42K47
$$ y = [-377, 7, 0, 300, -84, 91, -125, 54, -100, -290, -21, 27, -38, 122, -62, 210, -353, -66, -129, 17, -54, 106, 138, 251, -307, -217, 168, -193, -155, 194, -101, 60, 53, -176, -162, -223, -230, 36, -125, -15, 109, -12, -158, -125, -15, -154, 252, 175, -28, 58, -31, -88, 211, -106, 0, 22, -169, 19, -39, -174, -33, 191, -130, 198, -56, -30, 39, -39, -251, -256, 21, 155, 121, -259, -107, -203, -56, 39, 237, -159, -317, 423, 39, -175, 111, 252, 81, 333, 51, -69, 34, 369, -200, 38, 240, -207, 116, -39, 226, -187, -329, -386, 134, -42, 372, 51, -30, 148, -13, 46, 71, 155, 214, 40, 39, 185, -32, 26, -283, 241, -30, 65, 5, -107, -107, 213, -204, -6, -93, -17, 154, -53, 23, -213, 4, 11, -177, 78, 101, 280, 207, -162, -15, -106, 164, -143, 17, 192, -6, -112, -93, -159, -380, -148, 231, -1, 131, -3, 53, -240, -2, -4, -70, -64, -213, -298, 73, -143, -76, -27, -6, -182, 306, -72, -161, -126, -173, 100, -27, 208, 97, -45, 202]
7791B02q8P8J00k49o0K10j05O0j08K90j65l16L95k49k09L17j42M7k38K01K65P5
7813C11l21Q3Q4P7k80P0j35L00j00k58J18J4j47K53n3P8K8Q2l70J84m9N9k82K30
7837b4J58l86K81O4j26J26j06J27L3M9j36l02M33k14r5N1k8K08L00l24qk24J75
7860C2l60L54j26J45j2j87J89Q5k72K03K20k71L56l23j12k65L14O9Q0m37O36k88
7882C0j61K23k79J73J49l4j11Rj73J9J45J67L4m8j86j50Q2Q2M67l05l11l6J29
7905h5J01R5m0m4j26O8J9J03l94J12K53q5k77M34Jj52J29j84J0k23J89L34M0m24
7929a46K42j02J08l3k48L11j00l74M09Q6L9j58J39k19j54K81J90j78K5k82j4N74
7951C96o69L47j00J04Rj25j97M8K10j25J32O2k76J44l05M20j65k73K25J65j00
$$ y = [202, 114, 192, 292, 43, -17, 193, 88, 148, 40, 330, 165, -151, 244, -5, -214, 103, -39, 8, -230, -29, 236, 311, -10, 73, 157, 234, -46, 24, -111, 189, 89, -169, -51, -37, -184, 69, 16, 94, 122, 204, -166, 18, -31, 28, -254, -24, 134, -252, 29, 93, -33, 93, -13, 114, 147, 196, 60, -242, 191, -23, -118, -67, -95, 113, 413, 89, 81, -143, 32, -328, 26, -100, 45, 33, -154, 35, 120, -152, 51, 271, 0, 356, 33, -79, -344, -30, 39, 119, -318, 318, 30, -131, 92, -187, -14, 135, 101, -10, -1, -174, -155, -10, 157, 191, 143, -43, -193, -111, -29, 438, 133, -178, -214, -85, 16, 111, 71, 27, -99, -31, -12, 91, -303, -191, 62, -23, -300, 134, 135, -17, 112, -72, -62, -285, -96, 238, 278, -146, 96, -6, 102, 69, -179, 132, 32, -342, 67, 153, 192, 34, 173, -46, -200, 81, 271, 93, 118, -164, -178, 396, -273, 74, -26, 78, 87, -38, -235, -187, 23, -102, 30, 92, -184, -40, -345, 75, -90, -363, -138, 27, -73]
7972g3L24l71J5K84m47K20J23k66K88j88MpNJ73M6k3k49J86RNj21Kk5K50l17J52
7998aK08j37P4j47K01k01n5j65K10m4J94j43L3l3k4K93j13k99N8n8K7j45L3L88
8022A54k01L6P0q6l6N9p8j7n6m4J37n4J59K72k77J42j88lj70J41j78L96n4pp0
8047D7j71K10j38j00J17k51K26R6K64j65N1j54j36k1K66q9L1P8m71R7L11K67j11
8070B54j00lk41K17Q7j00o4J82p3k72K48k15J64rj21l03J65P5j18M17m25L34k03
8093a04J66O5k1n5j38n0K66m09L01p7K77n00J51K95j30j65M2K60q1j45j79J20
8115a11j6K22p7N5q9l5K52k46j99K36q7K72J87l13l1kj30Q9m2R7q0P5OO5k87O
8141a83J89K44m47j09N0M31%p4k40J18K3j12J66J36p1p2j46j95J51J88r0l06M76
$$ y = [-73, 251, -120, -105, 179, -268, -48, 75, -191, 97, -91, -87, -94, -89, 84, 130, 107, -142, 44, 53, 58, -63, -61, -86, 164, -153, -1, 207, 70, 144, -3, 198, -3, -58, -223, -13, -57, 137, -6, 27, -6, -30, 263, 150, -149, -91, -149, -122, -267, -234, 154, -47, -11, 59, -27, -63, -4, -82, -99, -155, -199, -62, -116, 43, 315, 38, 180, -8, -11, -181, -40, -218, 178, 124, 117, 47, -124, 86, -52, -152, -35, -286, -60, 36, 300, 135, 186, 32, -104, -125, 141, 52, 83, 161, -310, -213, 98, 365, 254, 154, 151, -90, 127, 214, 114, 50, 232, 159, -113, 135, -80, 84, 75, -46, -349, -184, -109, -227, 190, -235, 99, -104, 62, 127, 106, 51, -87, -137, 129, -280, 21, -56, 221, -279, -128, 167, 37, -128, -86, 174, 93, -52, -231, -111, -127, 95, 18, 73, -16, -51, 201, -45, -244, -8, -95, 177, 364, 51, 20, 18, -112, -23, -65, 32, -48, 27, 33, 98, -189, -183, 6, 250, -197, -306, -256, 175, 175, 101, -139, -21, 2, -110, 56, 192, 121, 49, -97, -292, -141, 47, -43, -349, 127]
8164A27m81K96R3O8k36J70J70l89J43O9N6l05J74j95N35k49k25K70k97K20J8K2
8186E4M8m04M77j01m1
$$ y = [127, -354, -58, 35, 103, -133, 37, 207, -182, -39, 30, 86, -219, -45, -240, 295, 46, -179, 91, -206, 14, 32, 54, 102, -302, 175, 74, 33]
8191C3
$$ Imaginary data points
##PAGE= N=2
##DATA TABLE= (X++(I..I)), XYDATA
0@%%%%%%%qJ6j6J6j6K4l2L8m6N6o5P3q8J04j23J46j68J94k24K54k90L30l70M18
31B23m73N28n92O61p34Q20r14J012j122J244j377J525j687J868k074K303k561
48a350K859l203L607m090M678n411O358p632R457j2312J7439k9548J11318J00157
62A92327j69334j13680j5522J11859R0065J3395q1153p7145k0922N8591O6219
73E4700J7133o1156p7287k5802O3870R4272M1176o4555j14731o2121N8765J28571
85E2835Q2173m6032j25779q2243M3616J18525P0669m5429j02196m4974N5414Q9387
97F5966K8993n7280q1687l0390M4371P8439N0148k0394q0250p9005q465P7251
109a2303R9623K6299p6646j04718k6127P8870R7172J0525q2744p8875J4633R0921
$$ y = [0, 0, 0, 0, 0, 0, 0, 0, -8, 8, -8, 8, -8, 16, -16, 22, -24, 32, -33, 40, -48, 56, -67, 79, -89, 105, -119, 135, -155, 175, -195, 223, -250, 278, -314, 347, -387, 433, -481, 531, -591, 653, -724, 801, -886, 982, -1092, 1211, -1350, 1509, -1694, 1913, -2177, 2501, -2910, 3448, -4184, 5273, -7039, 10400, -19148, 92170, 192327, 22993, -90687, -106209, 5650, 95715, 109110, 27957, -49188, -70110, -11519, 54700, 71833, 10677, -66610, -92412, -28542, 65730, 106906, 42351, -72380, -134501, -75736, 52835, 135008, 88976, -36803, -119046, -75430, 43095, 113764, 68335, -33861, -78835, -23421, 65966, 94959, 37679, -44008, -74398, -30027, 48412, 98560, 78166, -2084, -81089, -89554, -12303, 87320, 113619, 36973, -67745, -93872, -15002, 82170, 92695, 9951, -68924, -54291, 36630]
121C6630O8961k3732q7815o3262J8785Q0080O9594M483n9316p3416l0884L5240
133b4652P2942M8961k1528p5517n7751J7684P2760M6855l5148q3799m1266M8824
145c1635Q9585L2508o3493r8526l5863N8851R1675L8445m0592p4174m1372J8318
157e6273N4070M4697L723l5805m2448q490L9028N0212Q298n0075n8723P70P2037
170B1021P3261m639q3979q1447L425Q1803P7465N40o7689o4597o331M4447M4462
183C7742N913k9534l3186p454K1962L3023J4090k4643m8214k5712L2234O9811
195D6032M1875l4332q2900n0669L3856Q4999N1061k8629p2388l9772K6584N4507
207C0224K2402k7872m2178j3599K5106L5190J2778k1994m1819l0374O565M4226
$$ y = [36630, 105591, 81859, -5956, -69218, -50433, 29647, 99241, 103724, 44408, -29008, -59892, -24652, 48290, 97251, 75723, 206, -57545, -39861, 32899, 79754, 44606, -39193, -80459, -31635, 57950, 90458, 26965, -71561, -107424, -48573, 43102, 81547, 40955, -33219, -74591, -56273, -2203, 42494, 46217, 10412, -32036, -40526, -1498, 48714, 57012, 6937, -51786, -51016, 21021, 94282, 89643, 5664, -75783, -72358, 9445, 86910, 87450, 19761, -44836, -51167, -6720, 37742, 43655, 14121, -19065, -26519, -4557, 28466, 42556, 17913, -30301, -56013, -23779, 46032, 87907, 53575, -29325, -79994, -46138, 38861, 89922, 61293, -11095, -50867, -24283, 30224, 52626, 24754, -17424, -31023, -5917, 29273, 42051, 20057, -21762, -52136, -45571, -1345]
219a345M9018O858m9439o5737k0830M8346O9340K0822m5758n9569r077M7186M7745
232C7560l605m6146l4399J6158N0359L4904j1612m3534l6646j416L3371M4349
244C9343K2478j7199m7435l8813N173M5591M2748n142m7383l8317J2472M7335
256B0851K5469k9586n4096j8807L8397N6438J7499l7910n4175k1945K4363M3919
268A0417K9042l778k8875l0659j0450J9705L2679J6646j6632l3137j1515K7348
280G91L7925K611m2851m5494K643N2433M9667m532n4053n0886j595M0717L9900
293B7276N816k5323k8292j0283J0055J7826J1200m782j7368j2487J0291K9351
305A3280J9021j6380m2049k5544K3632N6309L4699k1328n5726l4645J8132M7363
$$ y = [-1345, 47673, 54531, 5092, -60645, -81475, -33129, 36211, 57033, 11275, -48294, -57371, -10185, 37560, 33955, -12191, -46590, -30432, 19927, 54831, 43219, -315, -36961, -38377, -5006, 39343, 61821, 44622, -2813, -41626, -36453, 9138, 51886, 46744, -639, -38956, -26484, 20851, 46320, 16734, -37362, -56169, -17772, 38666, 56165, 18255, -35920, -57865, -33502, 10417, 39459, 35681, 6806, -23853, -34303, -14598, 18081, 34727, 18095, -15042, -26557, 791, 38716, 41327, -1524, -47018, -44375, 8058, 57725, 53193, -860, -51746, -53341, -12624, 27276, 33092, 7769, -20523, -30806, -20751, -2925, 8275, 3493, -13875, -26362, -16071, 13280, 32301, 15921, -26128, -51672, -28040, 28269, 62968, 41640, -14086, -48731, -30599, 16764]
317A6764K8126j3112l2023j6652J0656J9186O402j1625j6737q086P807J9861J6141
330B6708l770k8559l3649o761L2958M5032J4455l2664m8097j6106K9760M1905
342B1212J0708k5178k7912J206K6463J9748q002k5766j5502R779K5221K0555J157
355C3689j9127k7868j7154R557L1851K9162k646l4296l3861j547L0085K6844o183
368A8506k9721j7816J5022L0289Q420k4388l2262p261K4922L2813J3142j4298
380A7368k7467j8664R67K0257K5444J2057j0222k4159j5820R537K3786J1787j4667
393A0204k3045k575K5040K5052m583l4538k9756M346L3637L0572k41k7378k7155
406b0420p230J3356J8830J0856j983j1244j1517j586R964J1719j379j4950j1113
$$ y = [16764, 44890, 31778, -245, -16897, -6241, 12945, 19347, 7722, -9015, -17101, -9294, 10567, 26708, 22938, -5621, -39270, -46031, -13073, 31959, 46414, 13750, -34347, -50453, -20693, 21212, 31920, 6742, -21170, -19964, 6499, 26247, 18245, -7521, -23023, -13244, 11977, 32532, 33689, 14562, -13306, -30460, -20903, 10948, 40110, 37464, 3168, -30693, -32240, -2155, 24689, 18506, -11215, -29031, -14009, 16280, 24700, 312, -31950, -39211, -14289, 18524, 31666, 17368, -10099, -28763, -27796, -7539, 17905, 29962, 19740, -4419, -20239, -10702, 13084, 24871, 10204, -12841, -15416, 9624, 34676, 30093, -4445, -34201, -29855, 3782, 34354, 34113, 6735, -20420, -27650, -14294, 4536, 15392, 13409, 2165, -9352, -10938, -974, 10745, 9366, -5584, -16697]
419a6697J0785K7187J6273j5404l5558j9752J6786L8356K2016j2111l1109j9385
431a8613N042J8377J1316k028j0194o358Q35M944L312l651j1038j0709J123J7195
445d47K0220K616k3360l0802q256K3957L3709J2271j9051k7270q184J4427J8704
458H534L356j0693q297M911J2615P285m744j3029j0740l23J2340J8741J1036q115
472B2877k4113k1177J937K3725K3580R71k1074k0389K59J6927J1112p692j5677
485h734l718J3795J6953K425j5124j8537o494R858J8686J3826J144j3333j9245
498h498j0068Q091J9618J3459n302j6976j0505O521J3220J771j4551j3910L822
511a3308J9319J5074n846k3042j9674K86J7122J8302O044q047j4440j0994j070
$$ y = [-16697, -5912, 21275, 37548, 22144, -13414, -33166, -16380, 21976, 43992, 31881, 772, -18613, -13571, 4806, 16122, 14094, 3900, -2458, -1623, 3321, 6633, 2982, -8056, -18765, -17642, -447, 19773, 22389, -971, -31773, -40029, -16072, 17637, 29908, 10857, -16413, -24597, -10170, 8534, 11890, 1197, -7100, -2189, 10426, 17711, 12967, -62, -10802, -11125, 1215, 19956, 30992, 22877, -1236, -22413, -20476, 3249, 26829, 27800, 6726, -13663, -13404, 3523, 14635, 6943, -8734, -12452, 1343, 18296, 20721, 5597, -12940, -19434, -9576, 9110, 22936, 24080, 10747, -8498, -18566, -10475, 9143, 22602, 17300, 324, -10181, -3660, 9560, 11331, -3220, -17130, -13308, 6011, 21085, 15239, -7803, -27477, -27191, -10069, 8233, 14277, 6230, -8210, -19204, -20274]
524b0274R513J2514M870n311q581j32R308P650n061j4258o857J2613K3037J1215
538C0246j1702k4128j3859P941K0571J4620j709j2280j1097k903L783N128K265
551F876j465l251j485L867M875j499j1226j3187k1J5999J9344L585j7456k2062
565a7106p883J3099J9230Q249p327j2010m450L635M688n09m110k406K780O418
579B298N367l48q953j2791o807O815J7089J3577l501j8286j7673j295J4145J4926
593D563K082r447p633K536O799K457o329o872M62R916J1621M510o392j1834q968
608a2529O03J1713J5404P309o566j5205j0721L338J1950Q310k853q309k972N489
622D961N710l777j1697q225L266J3170J1278j573j2720j3825o026N161J1685R845
$$ y = [-20274, -10761, 1753, 6623, 1312, -7269, -7401, 1907, 9557, 4496, -9762, -16619, -4006, 19031, 30246, 18544, -5584, -19443, -11502, 9069, 23689, 21980, 9700, -1397, -4300, -517, 4611, 6876, 5411, 2160, 675, 4542, 9417, 7918, -3308, -16495, -16516, -517, 18827, 22412, 4956, -17106, -24989, -11890, 7340, 15589, 8262, -3748, -8198, -4563, 125, -384, -4494, -6900, -4120, 2298, 7665, 7317, -1636, -14427, -21234, -14419, 2670, 16247, 12746, -5540, -23213, -24508, -10363, 4563, 6645, -2802, -10435, -7899, -1100, 1357, -4972, -11844, -11382, -1466, 10155, 14665, 8273, -3561, -12529, -11926, -213, 15191, 22500, 15934, 729, -9992, -6654, 5296, 13606, 10753, 2444, -528, 4961, 10671, 6894, -4803, -13028, -9762, 3408, 14686, 13113, 393, -13432, -19458, -14297, -2612, 7233]
636G233R85q000j0827m290L793P575K540l580l794L499P621K832p922j3256m291
651a9882Q718J6369Q936n540j4047j1449r5Q241J0039M540k192o011m694q36K756
666e147K327r01k432J587P192O378j497j0835j1287l49J2699J5569N320q291j3818
681c485o641L935Q867O137N74l232k400j57j94p50l298l201O24N528P202K439
697A1948p071j3067r166K899J2905J1279J60j0687j1317l811N251O438K168k332
711d403j563K002K655m67m971n619j117N306R342P158r39r133j0850l614O680
726i533J2519P942k434q746o949K08M871K748j268j946J643N278L190l537q028
741d042o524J226Q513R489M186m564r855q010k64P366Q934M205l418n758l658
$$ y = [7233, 8218, 218, -10609, -14899, -11106, -3531, -991, -4571, -8365, -4866, 2755, 5587, -2335, -15591, -19882, -11164, 5205, 14141, 8601, -5446, -16895, -16990, -8749, 1290, 5830, 3638, -2373, -7067, -7903, -5147, -2820, -3721, -6153, -4566, 2626, 9004, 7507, -3328, -14615, -14964, -2265, 13304, 18624, 10333, -3485, -10126, -6191, 2676, 8813, 9387, 6155, 3755, 3598, 3404, 2654, -644, -3845, -3221, 2307, 9509, 11948, 4877, -8190, -17356, -14457, -1552, 9727, 9887, -800, -12117, -15928, -10677, -4239, -2071, -4403, -5966, -3964, -1309, -1776, -6747, -12366, -13483, -8177, 1165, 8323, 7384, -1749, -12599, -16213, -9533, 2986, 10928, 8494, -252, -7201, -6993, -2122, 626, -642, -2588, -945, 4333, 7523, 3986, -4042, -10566, -9340, -827, 8662, 12848, 8284, -1571, -9581, -9845, -2479, 6455, 10660, 7242, 1484, -2174]
756b174J478K392q74k510k07M703O419R90o833j0204n601L843R802Q541K23p330
772B658r604m712J340N935N321R86k689k962p10Q26j247l174j837K683P952O358
788G124j022q558r591k427P221J0507O379j631o831n961j511K595M131K204O39
803C268l0N20L14j382m015m059m98N403Q337M688m749r523q230L45P350Q510L072
820I321l341n597l820LJ909R54K54O78K849K126K09l750o376m008K031P820P945
837I207J701o402r182n418J586P166N806J150l189l692j747j00n37j475L6K755
853b335M915K849j317o220o767k046M611Q513O207o76o036p320k781L177N428
868B02L758j22j081q28j1r24k746k640N48M578O065K534l336p548o403k03N560
$$ y = [-2174, -696, 1696, 822, -1688, -1895, 2808, 9227, 10217, 3384, -6820, -12421, -8578, 1224, 9765, 9988, 2658, -6946, -11658, -10318, -4383, 938, 1924, -765, -3727, -4437, -3611, -4858, -8032, -9869, -7186, 766, 7124, 6102, -2456, -12047, -14474, -7253, 3254, 9633, 8002, 1171, -4790, -6301, -3706, 425, 2629, 3268, 3238, 3758, 4072, 2690, -1325, -5384, -5882, -479, 7858, 12546, 7797, -1726, -9956, -9611, -2261, 6249, 9321, 5980, 383, -3437, -3434, -1525, -571, -317, 361, 3210, 5336, 5545, 1795, -4581, -8589, -6558, 1262, 9207, 10908, 4506, -4676, -10094, -8508, -1342, 4464, 5614, 2425, -1267, -3014, -3114, -3651, -5126, -5090, -2335, 2580, 5429, 4112, -2108, -8875, -10921, -6310, 2203, 8410, 7734, 1698, -5622, -8403, -5226, 202, 3960, 3838, 2757, 1929, 1918, 994, -1752, -4392, -3844, 734, 6799, 9333, 5997, -1551, -7954, -8157, -2597]
885b597P549L817k107n965n153j320K439K895J662N90L14P62k49k626m458k634
901g081K190O488O477J087n405p524m816J599O698N808K003k423m810k960m62
916c131Q55R45R40J342K359J720j664m551n197j896L807P141N092n96n867o795
932e496l112K371N452L923R74k286j883j403j546l75k40Q47L019M393J171k525
948C284o097n150J88M943O828L858j812n853n218j308K262M206K489N52k88j020
964A864j015j968k375q94K072M851M548L71m093o459l595J031N917N662K006k172
980E751n185l714l85J901J933J731J074P73L82j828l855l431j039L472N248M273
996G101j010n529o004k997K386N061M327J002k606l694k339m23M46P08J138K590
$$ y = [-2597, 4952, 8769, 6662, 697, -4456, -5776, -3337, -442, 1220, 1810, 2124, 2886, 2637, 11, -4447, -7081, -4891, 1597, 8074, 9161, 3756, -3768, -8584, -6985, -287, 5521, 7524, 5101, 291, -2669, -3131, -2276, -1331, -391, 951, 3310, 5030, 3366, -1185, -6382, -8278, -4471, 2670, 7762, 7166, 1299, -5496, -8608, -6237, -785, 3138, 4112, 1826, -57, -1460, -3006, -3381, -3621, -2774, 245, 4638, 5809, 3284, -2813, -7963, -7775, -2832, 3996, 7854, 6042, 189, -5029, -6337, -4075, 131, 2620, 3172, 2884, 1864, 849, -1119, -3494, -4388, -2316, 2535, 7083, 7454, 3361, -3098, -6693, -5662, 255, 5917, 7923, 5751, 566, -3148, -3533, -1632, 301, 2032, 3106, 3879, 4261, 2433, -1422, -4853, -5892, -2420, 2828, 7101, 6091, 562, -5442, -8439, -6053, -992, 3335, 4337, 1731, -1963, -4302, -4725, -4279, -3571, -2433, 157]
1012A57K117N04k454m255l746K67M275O120L347j979m757n462j046K950M268L337
1028C643Q34j696j618j716n85j117l6K472L619K770K15l680n159k927J583N122
1044A724N029J972k639m938m024m57K309K609K217P22p22j068j800k546k308K19
1060c701K778L863K848r53m852n275k675K019M965M226J081k906m090k483p82
1075e937J590J278J963J342P70k22k182l271k570P98M185M838K574j628m519m474
1091e465j563L044M572L740L75j643k800j556m46L97J330J894K393J955n26k853
1107B848l924k443J642M348M615J746k496m639l933q93K614L374K367k31j481
1122C514k140j522k168n22L46K270K959J866j614m098m416j757J811M141L903
$$ y = [157, 2274, 2778, 324, -3931, -7677, -7410, -3135, 2985, 6332, 4353, -404, -5866, -6912, -3962, 306, 3643, 4477, 2781, 1163, -553, -1138, -2255, -2291, 181, 3800, 6570, 6785, 3105, -2054, -4981, -3398, 1724, 6753, 8725, 6086, 1148, -2876, -3333, -1024, 1585, 3802, 4524, 3802, 2734, 934, -1612, -3920, -3701, -923, 2940, 5788, 4835, -17, -5292, -7967, -5948, -983, 3243, 4324, 1418, -2672, -5155, -5937, -4347, -3069, -1106, 236, 1006, 784, -1398, -4669, -7239, -6441, -2256, 2582, 5156, 3528, -991, -5465, -7028, -3984, 588, 4328, 4703, 3060, 260, -1296, -1742, -1345, -15, 1879, 4272, 6227, 5701, 2848, -1076, -3519, -1877, 2471, 7086, 8832, 6336, 1697, -2236, -3129, -515, 2859, 5226, 4995, 3514, 1374, -148, -2316, -2838, -2492, -222, 2737, 4603, 2989, -1109, -5525, -7282, -5471, -1330, 2573]
1137B573P10k530m092l118j98J805K615K059R31l42j315j919j817j745J608L148
1153a627L930K006j999l672l951n94K989M513L034L74k140l032k001j40J271K010
1169I71K412J280J17n95k809k484j398J403L913L903R91k337m659l493k7K397
1185d15L684K042j33j819k447j814j602N6J083K196K034K82j584l223l758j414
1201f832J957L629L681M00l324m014k789K82K432K847J959J98j024j750j620j451
1217e419J79J693K797L100P99k055k951k721o92K666M246L040O84k666l551j771
1233b622J87K192K272J642O73k77j319k668j972k04J602L452K771O20k506m062
1249b19k819j76K320L478K539l23k472l357j669Q3P24J565K115N09P0j668k816
$$ y = [2573, 3283, 753, -3339, -6457, -6655, -4850, -2235, -176, 755, 413, -902, -2821, -4638, -6383, -4775, -1627, 2303, 4309, 2310, -1362, -5313, -5907, -2918, 1595, 4629, 5003, 2863, -169, -2170, -2310, -1039, 971, 3383, 4663, 4780, 4185, 1376, -1108, -2506, -1103, 2810, 6713, 7704, 5367, 708, -2785, -2812, -415, 3269, 5311, 5178, 3359, 912, -902, -2504, -2448, -1365, 831, 2865, 3147, 1563, -1660, -5418, -6832, -4875, -1246, 2435, 2835, -489, -4503, -7292, -7010, -4578, -1731, 228, 426, -598, -2348, -3968, -5419, -5240, -3547, -750, 2350, 3149, 1094, -1857, -4578, -5270, -2604, 1642, 4682, 5366, 2700, -851, -2622, -2435, -243, 2029, 3671, 4344, 4067, 2748, 80, -1892, -2096, -494, 2958, 5729, 6349, 3843, -219, -3038, -3214, -894, 2584, 5123, 4800, 2328, -1029, -2698, -2615, -1891, -326, 1789, 2298, 2368, 700, -2116]
1266b116k666p36J918L400K855k59k975l465k424K93K245K883K028k18j672k531
1282c440j102n92O83J962K102K130L07j488k693k632O1K977L869K847p04k538
1298A749k816j723L66K222K656J796L47j224j848k341o34J25J882K417J751k60
1314D465k046k820l217J89K627L491J779p15k651k976j420L30J145J488K020O59
1330B348r21j954k491j321M05K129K574K026k39k576l124k316K49K609L434J698
1346B530j166k014k549r71n3J493J801J478J538m08k299k451j448P44K568L034
1362A827K459q53k394k886j848J083K388L113J608p28j905j680j297n23N50J927
1378H41K278J378l60k630l021j895R77K301K830J402j036k659k818j164MK470
$$ y = [-2116, -4782, -5518, -3600, -200, 2655, 2396, -579, -4044, -6468, -6175, -3930, -1047, 981, 763, -909, -3440, -4542, -5134, -4451, -2489, -387, 1743, 2050, 562, -2131, -4763, -4702, -1725, 2144, 4991, 4287, 1749, -1067, -2790, -2424, -202, 2454, 4250, 4597, 3373, 1525, -816, -1450, -1325, 557, 2974, 4725, 4465, 2419, -401, -3618, -3429, -802, 2689, 4468, 3753, 1102, -1874, -3294, -2964, -1819, -331, 1689, 2348, 1427, -527, -3018, -4339, -3934, -1805, 769, 2795, 2556, -20, -3144, -5460, -5211, -2602, 832, 2530, 1364, -650, -3199, -4170, -4223, -2730, -929, 549, 2087, 1679, -620, -3071, -4519, -3775, -1207, 1827, 4286, 3433, 1039, -1847, -3695, -2612, -224, 2889, 4497, 3769, 1864, 184, -1113, -1636, -1086, 841, 3119, 4497, 4137, 1507, -1514, -3409, -2432, -131, 2699, 4101, 3065, 406, -2412, -3576, -3572, -1102]
1394a102K096J659n69j262j894j817p62Q47J712K176J981o15k356l100j443Q72
1410c577K932K608J116p75k300k039j302L00J603K266J722k03j063j875j861j248
1426c696O98K469K326J685p30k832k982j081J315K844K245R33p53j747j840j297
1442b443N5J429K100J992L21r90j794k216j038M73K419K668J205j160k573l005
1458b557j126J560K123K024O65n45j130k455j534j46J142K095K344P04j164k650
1474f50j831j236J247K582K345J056q82k385k758q11J231K036J754J067l34j218
1490A213k055j627l99J144J904K042Q95j451k703k264n58J061K138K488J059j136
1506A751k270k371m77N46J957J680J148n0j309j209j864p12R04K754K808M38j792
$$ y = [-1102, 994, 2653, 2084, 822, -1072, -2889, -3651, -2804, -1092, 1084, 3065, 2450, 94, -3006, -4449, -3577, -645, 1963, 3079, 2304, 4, -2035, -3337, -3037, -1434, 832, 2554, 2351, 1288, -587, -2448, -3696, -2998, -529, 1797, 3482, 2752, -80, -3062, -4143, -2828, 16, 2261, 3194, 2441, 694, -1146, -2443, -2388, -959, 1141, 3133, 3454, 2464, 670, -1546, -2584, -2111, 308, 2976, 4181, 3021, 448, -2557, -3683, -2123, 0, 2024, 2689, 2144, 1014, -1441, -2975, -3121, -1979, 116, 2460, 3164, 2000, -650, -2481, -3717, -2470, 112, 2457, 3513, 2631, 246, -2512, -3323, -2092, -56, 1698, 2765, 2431, 1213, -842, -2469, -2868, -1724, 180, 2222, 3117, 1666, -1037, -3301, -3859, -2798, -660, 1828, 2887, 1751, -519, -2890, -3367, -2821, -864, 816, 1964, 1914, 605, -604, -2468, -3180, -2276, 478, 3286, 3724, 1932]
1523A932j983k052q52J672J825K160R49q84j985k282r17N43J619J724J295J2r18
1540A858k160k010q39J524K610K089L20j420k408k268j69Q59K261J646P91o18
1556B066j743j910j449L76J529K296R22J1j012k464k316l76J344K629J938m3j563
1573B35k210j447m69Q50J693J687J056l73j366j583j401L5J698K542J103M59j272
1590A237j834j925k53J641K804J831K52j399k240j157m09Q73J362J557J418l62
1606C396j604j932j798q9J774J961J350n8j247k610j771%R00K428J513L21j378
1623A156k069j734m41Q75Q83J566J368k83j501k283j708K70J763K260J470K56
1639A848j769j977j729k24J045J889K068K14q57j630j459q18N48J520J879J476
$$ y = [1932, -51, -2103, -2955, -1283, 542, 2702, 3651, 2767, 782, -1500, -2417, -1874, -255, 1469, 2764, 2776, 1858, -302, -2312, -3151, -1627, 983, 3072, 3392, 1972, -436, -2704, -2873, -2014, 247, 1893, 2684, 2066, 323, -1587, -3036, -2660, -1131, 1165, 2087, 2098, 1086, -1378, -3694, -4070, -2726, -97, 1841, 1798, 235, -1975, -3422, -3891, -3041, -1348, 339, 1395, 1022, -344, -1927, -3328, -3293, -1595, 947, 2050, 2509, 1237, -597, -2522, -2775, -1134, 1670, 3501, 3753, 2354, 114, -1043, -1452, -579, 783, 2340, 3758, 3396, 1792, -140, -1938, -2027, -253, 1708, 3058, 3000, 1753, -857, -2628, -2628, -1728, 700, 2213, 2534, 1156, -913, -2647, -3088, -2213, -1330, 236, 1604, 1321, -180, -2463, -4171, -3901, -2138, 122, 1592, 1848, 79, -1898, -3627, -3851, -2806, -917, 1151, 1365, 508, -1122, -2581, -3399, -2851, -1331, 548, 2024]
1655B024n7j400k145j055j3J924K522J332J59j197j739j711j09J696J604J538
1671C373M37r09j513j656q12M90J310J559J494m10j648k451j648J71J534J789
1687A110J175k97j199k018j778p91J478J465J400Q21j268j303k090o90P94J150
1703b041K123R82P4j752j968j131K98J559J814J435J11j251j740j199j48M78K100
1720b56J582Q32n10j254j996p53O19J677K031R85P9j587j607j656P48J731J591
1737B256J195L26r61j595j427n88O98J354J910N55p23j591k223r19L82J462J583
1754A694J207q23j505j999j330k16J556J564P92J44p75j917j610n53N41J693J724
1771A87R77m86j582k383k55L57J654J710J139K17j435j498p77k13J337J761J599
$$ y = [2024, 1967, 567, -1578, -2633, -2646, -722, 1800, 3132, 3291, 2094, 355, -1356, -1465, 231, 1835, 3373, 3810, 2901, 1388, -268, -1080, -590, 720, 2279, 3773, 3363, 1715, -736, -2384, -2213, -679, 1110, 2285, 1988, 789, -1229, -3007, -3798, -2320, -855, 545, 1366, 98, -1205, -3295, -3985, -3191, -2041, 82, 1064, 1138, -614, -2582, -3713, -3415, -1856, -42, 1393, 1504, 253, -1487, -2686, -2834, -2356, -256, 1326, 2158, 1648, 394, -1602, -2355, -1736, -59, 1972, 2957, 3036, 1449, -158, -1814, -1066, 665, 2256, 3451, 3777, 2816, 1221, -206, -794, -96, 1258, 3168, 3723, 3000, 1409, -814, -1733, -1351, 111, 1694, 2901, 2078, 573, -1426, -2756, -2972, -1416, 148, 940, 1084, 309, -1608, -3218, -3771, -3230, -1537, 187, 1164, 678, -904, -3287, -3542, -3185, -1531, 179, 1318, 1535, 100, -1398, -2175, -2388, -1051, 710, 2309]
1788B309l1n76j559j185o49P83J873J561R89l28k003j388r58M05J336J947J028
1805C554k34j277j541j234k50J199J669J120N84j043j658j746q61Q89J301J888
1821B360M92q18j576k045q58N18J206J302J078k01j524j573j731L35Q77J436J403
1838F81M09o78j842j655j91O95J736J838O65o67j439j782l01N92J456J580J315
1855B412j15j034j468j029j14J083J548J602K48n81j959j181o87Q32J640J426
1871B623P83p27j473j535p91J88J260J367R47l9j174j633j008l61N47J655J332
1888A961N37j139j544j631p01J104J106J348Q97p91j329j366r27Q3Q78J625R35
1905A046p6p16j702j341k79J104J687J479L28q03j294j076o77O66J235J877O99
$$ y = [2309, 2278, 1702, 143, -1042, -1691, -908, 965, 2526, 3515, 3187, 1184, -204, -1162, -757, 579, 2526, 3554, 3320, 2043, 502, -732, -982, 217, 1886, 3006, 3590, 2547, 889, -857, -1718, -829, 472, 2360, 2852, 2034, 458, -1587, -2445, -1927, -721, 581, 1659, 1458, -66, -1639, -3370, -3035, -2158, -722, 681, 1090, 412, -1430, -3085, -3276, -2581, -845, 993, 1658, 991, -448, -2230, -2531, -1939, -483, 1097, 2412, 2297, 1263, -205, -1234, -1348, -265, 1283, 2885, 3133, 2552, 593, -588, -1275, -443, 1197, 2623, 3406, 2679, 1206, -329, -1120, -932, 328, 1695, 2642, 2603, 1429, -204, -1212, -1573, -1026, 629, 1961, 2498, 1359, -185, -1816, -2517, -1413, -307, 1041, 1938, 1147, -182, -1548, -2475, -2392, -1514, 111, 1046, 970, 254, -1448, -2789, -3068, -1964, -277, 1202, 1530, 727, -567, -1643, -2320, -1654, -419, 1458, 2157]
1922B157m89j262j287o01J83J359J326J202K23j059j279j588k95J329J463J193
1938B575K68m93j849j418o26P33J597R48K53oj094j640r04M4J254J214J157j75
1956A838n45j893j304k57M54K144J020L40o48j902r65m63L90J345J462R53m78
1973A491j474j226q86l2R27J685J125L09r70j544j192m00R77J347J417J66n35
1990A185j473r55p00M79J211J597P98k97r67j611j087K90J266J338J164j17q41
2007A280j471j283l16R12J740J036J43o62j393j119m68j82J567J412J066m79j347
2024D36j687q08J58R97J916O23j21p26j353j165l76Q01J731J256J30o14j128j209
2042a139o95K22J352J160J181k17j383j573r83RJ569J316O01J41p67j232j356
$$ y = [2157, 1668, 406, -881, -1482, -1299, 60, 1386, 2588, 2811, 1752, 473, -1115, -1410, -81, 1382, 2575, 2843, 2350, 501, -917, -1543, -810, 787, 1735, 1988, 1982, 888, -752, -1656, -1612, -358, 856, 2013, 1838, 1293, -600, -1904, -2161, -1707, 437, 1457, 1797, 1149, -753, -1718, -2181, -1791, -446, 1016, 1969, 1491, 17, -1209, -2095, -2127, -1200, 485, 1610, 1919, 949, -595, -1787, -2187, -1210, 137, 1554, 1720, 1185, -288, -1243, -1943, -1464, -253, 1344, 2142, 1845, 878, -733, -1820, -1530, -264, 1074, 2238, 2121, 1280, -191, -1474, -1790, -878, 862, 1898, 2041, 1379, -14, -1133, -1601, -1783, -216, 1196, 2262, 1783, 436, -1251, -2059, -1901, -904, 1012, 1635, 1514, 788, -565, -1730, -2106, -1305, 426, 1682, 1812, 1198, 70, -1139, -1834, -1612, -260, 900, 2081, 1864, 481, -1092, -2075, -2066, -497, 819, 1420, 1561, 794, -438, -1794]
2059a794k82P37J110J310P21j061r90j242n14J92J266J341J055k91r16k018n18
2076a894L55Q07J270P70N40n72j378j303l80N30J620J500M76n45j728p87p99J54
2094a364J005J443J154k0j464j686p73N56Q17J348P71Q4o44j222r40o95L93J520
2112B83J261L24n33j002j268l82k69J288J164N64K62j294j640r08M05N50J288
2129I3P19N54o29j511j132o69O55R29J946L81p80j226p39l44L2Q23J361R99L84
2148A846j311j461j105N64J206Q28R42K03l87p62j467n41O74J295J811L10q63
2165A782j192q10m90J12P90J145J019L4j223j637o08K2P77J393K52L51p44r92
2183a9j126n40O2J389J749J66r34j463p97l21m6P29J034J117L13j051j832q34
$$ y = [-1794, -2076, -1339, -229, 1081, 1802, 741, -249, -1491, -2005, -1813, -547, 794, 1849, 1558, 642, -1376, -1894, -1539, -732, 538, 1308, 1848, 1276, -102, -1405, -1785, -1255, 365, 1865, 2341, 1796, 68, -719, -1518, -1364, -359, 1084, 2238, 2218, 754, -932, -1705, -1149, -332, 1016, 1787, 1871, 1227, 5, -935, -1630, -1237, 283, 1544, 1868, 1335, 333, -935, -1317, -1586, -298, 866, 1430, 1692, 398, -1242, -2150, -1745, -1195, 93, 812, 1366, 737, -774, -1906, -2575, -1920, -991, 955, 1336, 556, -670, -1409, -1753, -1721, -898, 463, 1462, 1846, 535, -926, -2031, -1467, -261, 567, 1509, 1712, 1325, 563, -904, -1445, -771, 524, 2335, 2645, 1782, 590, -220, -710, -598, 192, 1337, 2356, 2390, 1167, -470, -1078, -1056, -279, 1114, 1366, 1717, 973, -19, -1145, -1685, -1623, -234, 1515, 1681, 747, -716, -1513, -1834, -1880, -1151, -117, 1000, 1313, 262, -1570, -2404]
2201b404l33J251J081J079j18l83p28j219p41M75J589J722M36q72j039o53n44
2218a401L80P16J003J406J90r85j365j011K2J321J279O20K09j19j108j248r69
2235a060L92J262J577L66p66j156p01l50oJ07R23J222J84j083j651r91N7P77Q86
2254a1O47J68m9r93r33j305J82J614J588K77p71j371r11k72K83J16J182J180O67
2273A288q36j407j581N11R24J497O56j51j22p34r70r36L84J147K106M43q61q66
2291D92r72k40P19J38Q47J530O00j099k026j035K03J398Q14N32J93n41k50j913
2309f10l70n19J823J400N43p12j654m87o58R8J42M42J447N10r57j793j013j64
2327b532J556O47P02k91Q2n54p54j387N2J325J633R55j001j443p17k2K42L74Q38
$$ y = [-2404, -2737, -1486, -405, 674, 556, 173, -555, -1774, -2515, -2040, -451, 1271, 1707, 835, -204, -857, -1401, -1021, -305, 698, 2104, 2294, 1309, -56, -1067, -1045, 276, 1555, 2175, 2384, 2265, 1157, -91, -1060, -668, 594, 2171, 2537, 1771, 615, -86, -436, -442, -335, 588, 1810, 1994, 911, -740, -1731, -1674, -897, -11, 636, 804, 755, -238, -1171, -2476, -2294, -680, 908, 1185, 414, -957, -1868, -2140, -1857, -1741, -559, 621, 1288, 452, -955, -2536, -2025, -1101, 396, 1052, 901, 779, 45, -925, -1861, -1477, -330, 1776, 2219, 1358, 492, -480, -720, -1, 137, 984, 2514, 3114, 2015, -11, -1046, -843, 555, 1369, 1901, 2094, 1553, 1303, -610, -980, -1499, 324, 1724, 2267, 1555, -99, -586, -1244, -1146, -1004, -562, 885, 1395, 438, -1355, -2368, -2532, -976, -329, 373, 82, 164, -390, -1144, -2531, -2479, -1154, 479, 1434, 433, -1010, -1727, -1749, -1507, -1133, -295]
2346b95J257O44m97j630j745N54J672Q10O16j70J09l23o87j318j01J472J753P75
2364B896q76j557j056J95J27N84M98J177R19q44j992j289r4J373Q96L89j01k13
2382A032l64j008j338j68Q12J853R76r06j489j135N1K96Q6L63J043R32m75j638
2400a077j296j22J161J580L82n13l80L89r66r38k42R79K169P67q18j446n71R8
2418h44K68K31N24R63R64k93j292j939O5J317J119P32m70k52K23q01j020o90J147
2437d8J986L02l20j870o73K0K22M32PP16J202l70j827j359j53J094J363J9p3m31
2457B39l42k51j384l02N40K050J171o15j948p24J97j76P07OJ044R01o9j392k159
2476b507K72J381J491K13m22j41j27o27m69p16Q38J671J127q9j877r87J90O56
$$ y = [-295, 962, 1606, 1109, -521, -2266, -1712, -40, 770, 1386, 1216, 1325, 1002, 315, -1003, -1104, 368, 2121, 2896, 2020, 463, -593, -398, -271, 313, 811, 1988, 2907, 2063, 71, -1218, -1312, 61, 957, 1346, 1245, 1032, 668, -340, -1678, -1846, -1034, 819, 1795, 889, -600, -1735, -1684, -1388, -1302, -939, 104, 1036, 561, -1077, -2373, -2495, -1334, 246, 628, 115, -265, 124, -842, -1780, -2022, -1043, 1126, 1893, 1075, -371, -942, -844, -576, -345, 179, 1142, 2106, 1813, 521, -1418, -1353, -36, 1083, 1815, 1345, 1093, 1316, 515, -505, -1195, -48, 1938, 2240, 1920, 50, -623, -603, -381, 51, 58, 774, 1976, 1606, -221, -1580, -1733, -639, 724, 743, 670, 239, -103, -354, -1738, -2040, -1500, 550, 1721, 1106, -842, -1566, -1369, -1545, -838, -832, 212, 1113, 1044, -348, -2507, -2235, -854, 637, 850, 428, 287, 160, -467, -936, -1652, -814, 857, 1984, 1895, 18, -969, -779, -123]
2494a23J77K47N34J075Q0j586j639l56J169J406O72m15m83qn61r44q10Q10J798
2513A043Q80k69j762j167k01P31M12N2O47P40K17j324j576o57J269J467P97q06
2531D93o04K48m07j021n26M34J777J318o10j606q15m5P85L20j4P78N23L74j007
2550C95j974m07J079J704P26m04j150L77j14o28j190M75J700J441l4j976r24j7
2568i21O89J90k11M93J089L99j013k194m80R65K145L69m59o58l6k28r02o87L00
2587a150J538J774n35j723j069J69Q19J89k3M6J208R6r13j625p92Q31J878Q80
2605A598q49o03K7j58p17m77p0J263J781q8j705j299L9M46P47j93M77Q44J17p74
2625D06j706p82R85J607J024q29m18k38r0q47o67K91J355J683j3j700j246j71
$$ y = [-123, 54, 301, 835, 1910, 1990, 404, -1235, -1591, -422, 984, 1656, 1241, 758, 750, 189, -755, -1565, -755, 1043, 1923, 1654, -108, -1275, -1476, -745, -333, -281, 366, 1106, 1323, -1, -1577, -2234, -965, 502, 1299, 493, -111, 137, -270, -1291, -1817, -1383, 394, 1712, 1102, -504, -1319, -1364, -579, -259, -273, 505, 1028, 1402, 395, -1579, -1986, -907, 797, 1523, 1119, -31, 346, 232, -396, -1586, -1111, 589, 2030, 1996, 20, -904, -921, -232, -42, -253, 240, 1329, 1728, 715, -1479, -1959, -994, 1151, 1520, 1061, 403, 367, 139, -763, -1450, -1150, 388, 2162, 1627, -96, -1165, -996, -177, 12, -11, 35, 1243, 1339, 426, -1199, -1991, -1160, 718, 1598, 749, 146, 173, 15, -702, -1179, -1249, 14, 1795, 1707, 2, -1297, -1258, -812, -65, -258, 219, 1063, 1180, 406, -1300, -2082, -1097, 510, 1534, 705, 287, 49, -41, -888, -1555, -1264, 91, 1774, 1761, 61, -1185, -1356]
2643a356Q56P28l31K22J015M85r48j534j145J013J676J184p44o86m41J95m67q49
2661a127L71J292J518J39j625j510j90J004N88j11k37J133L38p90j624j152R22
2678a061J393J071n90j057K62o0n39q22K71O93J820K56j360j886l56R19Q88j87
2696c45k58J366L84p40j624j147O13J807J039k54j077l52L54l34q67J94R97K042
2714A798K56j336j738P8O84M91L37k20O46P41n78j541q22J91J586J104k19r59
2732D99m71L04k37j025K09J091J286L74j234j771l71Q12J080o58K83J40P63m30
2750F44j451j373O50J419J401n02j356rL43n76n64l53Q87J839L99j009j951k94
2768a856M31J303J32l83M26O91L32j688j470O18J502J875o35o50p45J76j57m96
$$ y = [-1356, -500, 228, -103, 119, 1134, 1619, 671, -863, -2008, -995, 681, 1865, 1121, 435, -6, 189, -278, -1127, -756, 536, 2054, 2193, 568, -942, -1132, -128, 460, 349, 112, 1245, 1583, 793, -831, -1983, -1061, 332, 1403, 813, -244, 18, -42, -581, -1403, -1132, -439, 1381, 1637, 277, -1609, -1965, -1046, -158, -345, -603, 763, 1147, 407, -1217, -2364, -1751, 56, 1095, 841, -236, -588, -234, -568, -1435, -1241, -244, 1798, 2054, 718, -1020, -942, -258, 233, 570, 350, 996, 1737, 1159, -382, -1204, -1013, 573, 1677, 1458, 499, 28, 332, 95, -930, -721, 370, 1656, 2030, 796, -975, -1346, -534, 546, -112, 171, 311, 1074, 644, -807, -2180, -1530, -111, 1290, 788, -568, -577, -234, -810, -1374, -1727, -840, 999, 1398, 389, -1562, -1856, -1425, -122, 10, -373, 53, 744, 1076, -612, -2082, -1464, 38, 1913, 1278, 628, -117, 59, -98, -594]
2786e94l6N60J782K18q12j602o17Q75M95L03K66o4Q15l48j221j331K02J599R61
2805A451J51q68n23p3l25n05l02N76J548M86p74j893q20Q91M50N78m56L11J46
2824D9L00j148j589L31J404J503k16p12m07m07J90m69j83O68J589J79j95j724
2842h37n53L48P37N11l51O29N54r7q82j326K36J444J131L04j045o27L46j04m79
2861f1n59P65J622K91n83j210j015O2J117N36k25j2N82j94j022j216l00J419J361
2880A358o1r57o69l17n5O8o62N93R69R87o17j628j170M79J048M29J65o9J34K45
2900B70j023j138J52J023J429O04j074q45K42k35j63j73P17R66P28n10j390p63
2918a183P00N34N41K54K75J01J06p46j232k46J005J294L59m94j108r0j45k50l3
$$ y = [-594, -630, -70, 1712, 1930, 1118, -484, -1101, -226, 269, 572, 838, 774, 1589, 1241, 20, -1311, -1109, 490, 1451, 1602, 734, 211, 138, -187, -692, -994, -418, 1130, 1616, 842, -1051, -1871, -980, -530, 48, -408, -97, 49, 349, -799, -2388, -2057, -653, 850, 634, -78, -485, -892, -702, -1171, -1354, -686, 903, 1082, 887, -837, -1390, -1042, -305, 206, -145, 484, 1038, 941, 59, -1267, -1031, 413, 1544, 1848, 803, 176, 522, 418, -61, -620, 145, 1767, 2058, 1475, 265, -750, -688, 429, 965, 740, 728, 1310, 1116, 94, -1122, -1422, -3, 1358, 1297, 340, -329, -646, -701, -633, -1295, -702, 267, 1254, 637, -991, -2161, -1682, -634, -205, -40, -109, 25, 270, -753, -1891, -1739, -716, 713, 1317, 243, -602, -360, -595, -758, -931, -214, 752, 1480, 970, -420, -1183, -483, 51, 592, 846, 1121, 1222, 1328, 582, -650, -896, 109, 1403, 1762, 1268, 160, 70, -75, -325, -358]
2937c58K63J338K99l56q60j272O2P68N63r9k18L62L27j071j206p5Q78J116P03
2956A164o38j086k71p9j16j18L00Q17R12m37r62r71P1Q02N49J00L78p9L29r00
2976b35r28k27R01J383N53o63m53p55M52l05N0K33Q99J115m62j001j418r7J163
2995B05O35Q6k5j67K50n68r40n57R33R92Q33p95q90n23L9J08l15K62Q39P96k34
3016I64j068j289l29J416K92Q4J04J40N6q81q28k07O08J158O66m87o64n69K98
3035e36Jm51J93R54P96J39j253r76R1P15M93M56p6p4J57l98n62j033J164R79O44
3056A423k29q96j79k08j07j94M27P34L01K17j116q64k34L26J130K75J45m13R8
3075F36p74p33m93M71J340P83l60o22o95k69Lk85N90K49Q64J84o20j546J17N27
$$ y = [-358, -95, 1243, 1542, 1186, 326, -946, -884, -116, 447, 348, 130, 492, 819, -252, -1458, -1533, -655, 461, 1164, 526, -560, -831, -910, -1026, -1144, -844, -27, 885, 448, -514, -1485, -1414, -612, -63, 37, 415, 336, 665, -235, -1163, -1390, -489, 894, 1447, 784, 331, -424, 28, -277, -227, 6, 905, 2020, 1558, 557, -861, -958, 205, 840, 926, 901, 734, 984, 416, -524, -1081, -148, 844, 1677, 882, -8, -531, -492, -384, -699, -437, 402, 1198, 964, -104, -1393, -1722, -306, -14, 70, 174, 314, 370, -511, -1339, -1546, -938, 220, 886, 399, -265, -834, -536, -535, -986, -793, 161, 957, 1096, -157, -1133, -1042, -327, 166, 622, 546, 472, 629, 231, -331, -1364, -200, 779, 1423, 1194, 298, 119, -89, -196, -390, 37, 771, 1072, 1289, 173, -691, -925, -599, 531, 806, 951, 538, 636, -138, -871, -1364, -893, 447, 1230, 870, 248, -447, -716, -713, -998, -408, -159, 705, 889, 269, -1277, -1160, -633]
3095f33Q51K65p6J66l97m61l37m64M02P70J107o61n93m22O5j80n3P36L36R19p8
3116A262j001r19m09O55M74Q20l37M7o8j22o37p60L17J010P55l08q50j77l74K41
3136c81P1J40M47O71L37q51j176j86L64P62L11j36L16m19j58p13o14L59J287N90
3156A021l03p40k63l32J00k3K41M52O90j00m79j081o2J23N66O21Nk08J88l82m15
3177c81o04N06O82O22P6n46j085J71K2L7J15O25M88K90p74q14m81O18L86N74O3
3198E90p9j35m01m84o51P36L91R36q1k85r61k40J59L58j60M12O18L00m47r61n18
3219i03L10M43Q10M0L5l63k44o19l81L18J066N84j80n20n14n05K01M47k34N16
3239C07M42J88n12r36o83N95O82N16j98R9m95k66l40m64K15Q97O46r7Jq89k52
$$ y = [-633, 218, 483, 407, 573, 176, -285, -622, -1086, -684, 86, 1193, 532, -61, -483, -418, -598, -651, 85, 421, 1340, 1262, 261, -658, -1067, -412, 62, 882, 545, 592, 524, 402, -235, -995, -678, 332, 1087, 779, -71, -248, -622, -381, -310, -170, 277, 948, 1285, 434, -742, -928, -564, 198, 509, 373, 689, 270, 112, -601, -1215, -856, 431, 1021, 718, -22, -285, -617, -517, -540, -299, 153, 843, 743, 264, -817, -879, -756, -190, 431, 436, 228, 416, 34, -381, -985, -479, 203, 825, 901, 355, -730, -559, -537, -500, -385, 240, 728, 1018, 244, -570, -1051, -433, -47, 527, 590, 511, 376, -25, -509, -1160, -424, -33, 903, 822, 537, -424, -664, -505, -147, -307, 105, 723, 1023, 576, -385, -903, -593, -150, 660, 700, 735, 372, 128, -491, -872, -554, 512, 1096, 916, 396, -118, -623, -422, 25, -209, 307, 749, 937, 425, -511, -1194, -599, 83, 599, 401, 500, 5, -261, -601, -1065, -850, 47, 693, 596, 597, -292, -544]
3260e44j07j79L61P04M08j77m77m93q08O84N15O86J00j55k34k44l47m72J47R70
3280C38K49M36j02r10k81j63L1N41M14L79J52k85q42n09O3Q39O0R6J89k64k97
3301A34k68l58j57R59M94L8k77n67o25j04j1O90M02K9K72k99j259k52K81K58O99
3322G9J91j08j30l66n58k5O4M91P00K57n15l49k05m87M63L24M31M26K68m05p16
3343a70l59J76L3J086j92K75m26l21l45o06L54P70O41K53m59n00k41j44M41j76
3363I0P77J00n2o59o38k53K26K94O49J45o0k03l44o55l11R1K50Q58K51L8q32o24
3385h62M6K8K54M18N4N35q21m40l64J82J44N99M05M27m68l66l80j73J44K85O33
3406B80N63k97o62l40K2K86J10K86M80r0Q0n96o90J88M34O51J48P2n88O7m72j53
$$ y = [-544, -651, -830, -469, 235, 643, 466, -11, -504, -1312, -628, -113, 573, 673, 518, 284, 40, -307, -779, -632, 338, 587, 1023, 921, 11, -270, -433, -402, 139, 553, 932, 1084, 799, -43, -552, -489, 350, 410, 506, 695, 431, 134, -134, -492, -649, 310, 804, 842, 565, -2, -627, -731, -742, -52, 350, 379, 651, 352, -907, -1159, -878, -620, 79, 270, 162, 32, -334, -892, -917, -853, -362, 338, 595, 80, -269, -474, -961, -498, -174, 257, 683, 951, 546, -170, -529, -353, -320, 766, 574, 849, 423, 102, -243, -849, -495, 275, 916, 1169, 710, 210, -31, -175, 266, 90, 867, 967, 915, 256, -382, -635, -409, -115, 534, 679, 619, 416, 72, -583, -894, -803, -553, 305, 556, 594, -238, -862, -816, -788, -534, -116, -62, 473, -348, -788, -1152, -970, -826, -227, 178, 605, 137, -229, -609, -782, -638, -353, 280, 843, 546, -116, -456, -434, -148, -38, 248, 728, 638, 718, 122, -568, -380, 54, 705, 853, 925, 337, 404, -68, -221]
3428b21j89O02O09J38m01n44k96J99J3J7K87L07m7k04o33k73j31K77P51Q4O8k24
3450A89p34k92j11R3M35P15q5j31r0q12k82L87L38L75L56K38n82m36j85k14J79
3471f49R66L09l7l09j92l74j01N2L65O35L94l50l68m49k48J56L27L52L51J32l37
3492F25k51p28j65N55L07L43K31m61j96n17m40L96K73M45J89Qo64m08k8j95M88
3513a93J72J62K01n36m03r9l54O10O29O7k60J06m35m32j65K8O42N99j7J53o51
3534a76l16n1j01L81M19M76r9m50j80k58k01Q0N05O59K12m89o6o26j29R3L75Q02
3556H60k43k4j54l98q0m21K31M38O20j47m21j24o10J7j95P80M2N28l64l09p59
3577g33l6K56q5Q05M32j52p11m33m27M11N73l5P13j89n29k16k00l6K15L00L62
$$ y = [-221, -410, 192, 801, 939, 538, -6, -302, -103, -90, -73, 214, 521, 474, 270, -363, -636, -767, -490, 261, 345, 413, 189, -545, -837, -948, -855, -420, 295, 210, 79, -11, -823, -1105, -718, -380, -5, 351, 589, 7, -429, -614, -828, -649, 317, 626, 589, 280, 88, -286, -387, -335, 30, 665, 1059, 709, 341, -108, -356, -200, 127, 479, 830, 962, 625, 374, -354, -519, 36, 343, 686, 917, 456, 260, -257, -697, -301, -28, 417, 606, 614, -50, -458, -486, -681, -193, -21, 141, 342, -194, -597, -696, -1050, -440, 189, 256, -4, 102, -333, -765, -930, -902, -260, 339, 322, 475, -176, -492, -543, -644, -263, 156, 632, 533, 83, -97, -355, -556, -476, 29, 688, 900, 411, 345, -281, -410, -317, 58, 860, 617, 593, 439, 41, -39, -460, -229, 209, 829, 682, 261, 137, -473, -456, -651, 129, 171, 699, 335, 26, -733, -769, -513, -598, 207, 639, 487, -224, -657, -1084, -673, -100, -135, 578, 389, -140, -356, -556, -592, -377, -77, 285]
3598B85j9r5l03k05j89j79O18M33M39k45m33l28l19L77q3O98K39j68n33n2k86
3619c48k03L39M37K68L13r9n83j47l11j19K15O60L31R9m97k89n46k25N91L58K35
3640D79K15l94n51l61OL13J57N46J1m3k38r96M56K0J81L22L89L7p85j53j36m1
3662e66M16r6N48j40q2p3o50K54m2M78M90J78n10j12l30m11O62M3L52K06Km87
3684A30l44l70J45P4P35p2J05j61o59K25k05L39J00L07oO8k93m19m04P8O51L49
3706C73M38k56l55o43J07k68K97N02J62J31po59j47k55N4O01L74M3k01l16m31
3727d56k32L75K28J93O79j29m66p77Q2q3J60L07O26m12k70O5l55m5o2K25O79K00
3749E32j26l23k19m49rL16M14J85L6k85j44l69q3L42L49M38k01N7m25l83j79Q1
$$ y = [285, 266, 171, -132, -337, -526, -705, -87, 346, 785, 540, 107, -221, -540, -163, -246, 452, 691, 523, -10, -62, -348, -551, -212, 225, 493, 806, 707, 124, -23, -334, -453, -238, 422, 753, 852, 355, 66, -480, -705, -114, 244, 479, 694, 300, -251, -612, -606, -293, -136, 410, 421, 378, 140, -856, -400, -380, -199, 123, 512, 549, -236, -389, -525, -566, -150, -246, 302, 162, 80, 7, -643, -389, -431, 47, 537, 715, 205, 93, -237, -648, 14, 57, 409, 615, 617, 130, -214, -584, -439, -365, 370, 298, 403, 242, -417, -192, -397, -58, 42, 349, 343, 411, 118, -301, -705, -627, 24, 373, 811, 555, 200, -443, -336, -604, -307, 195, 357, 488, 481, -178, -325, -580, -526, 75, 449, 492, 291, -25, -456, -688, -313, -85, 108, 787, 658, 192, -585, -503, -586, -426, -119, 507, 95, -175, -110, -465, -510, -572, -347, 332, 532, 406, 83, -136, -585, -594, -278, 136, 321, 357, 72, -72, -441, -524, -182, 167, 605, 404, 461, 36, -347, -526, -445]
3771d45M17N48J34k80k81n80J21J55J52K79Q07o39j62k47l73R0M06J41N11n2l92
3792C10l13l87k39L11M91J42M4K98o08m81j38K7J53N82J70k02m2k20k31l44K44
3813d33N91j40K81j42l57p35L44R8L76L07N06k80j25n05k22j8N23L01Q3n2k61
3834A40k78l28k18M94J46O74Q4n92k27k74%j28M53M77jJ35j76m97k14j76M86K33
3856B13K61J01k12k31p68L39K16J47L68M04o75j58n98p3M47J39Q1N96n51j72j79
3877c05m42K97J95M5N93l13J7k48n28PK15K57M32Lk04J4p43q4K02L84M77J65j2
3900D24n46J5k56j27L61K66L51r1jl40n11K3Q7N10K51Pr4l28j74o56P80l1K52
3923A72K45j55q0n83J11k77L78M39K36l14l3n01K9j1o4K20P05j57j33l82j29l85
$$ y = [-445, -28, 520, 654, 374, 93, -487, -366, -211, -59, 220, 1027, 388, 226, -21, -394, -304, 102, 243, 754, 702, 310, -3, -390, -629, -318, 173, 315, 359, 657, 49, -432, -570, -543, -390, 192, 362, 160, 118, -102, -333, -677, -433, 158, 18, 299, 157, -200, -935, -591, -493, -117, 190, 696, 416, 291, -214, -436, -454, 69, 370, 453, 401, 140, -138, -466, -684, -190, -44, 630, 714, 122, -105, -379, -379, -507, -54, 423, 422, 557, 381, -116, -330, -506, -20, 213, 474, 575, 363, 132, -636, -297, -81, 66, 434, 838, 163, 5, -593, -666, -219, -80, 1, 597, 46, -126, -305, -747, -450, -255, -210, 383, 70, 87, -161, -689, -682, -467, -210, 222, 225, 21, 35, -708, -792, -590, -206, 271, 436, 424, -122, -107, -363, -490, -129, 137, 488, 397, 396, 56, -455, -432, -345, 165, 416, 423, 329, 1, -173, -829, -49, -80, 172, 417, 262, 182, -401, -290, -567, -189, 250, 486, 172, 139, -362, -333, -344, -408, -188, 517, 360, 227, -155, -284, -669]
3945f69%K94M98L08l99k48m13R9m59M31O85L46m28m1l12m20K29j17N64K16j81
3966a7J66j74n84J79J06L87L76j22J70l79j88L8l39L88K20K20q8J93o48n8M5n0
3988a59O30l1L12n80j3o85N3j50L00M54K49j41p28J43l03lM98L47j35K10r0k17
4010c9l40j83J27L22K08j3M2k94m74p4J40J45K09M27j24j79m55j34j4K68L44M9
4032d2J25l64j77k76J96J94J24Q32O4k68l41j82P0k49M23K51j57J80j90l92j34
4053c13n4K75K92L28j21j15k76o29Q1L8L27J24L1M16n12l81j71L03M99j16K51
4074B77k27k36Nj44l72J14M70M65j00q6o44J35l38K64K08L50J1K50n10j33j11
4095c52Q0M35J89j62k43l9j60j39qQ1Q1P12k40po9m81K7j71N24N57K3j53j53o38
$$ y = [-669, -669, -375, 123, 431, 32, -216, -629, -530, -989, -558, 127, 473, 45, 4, -308, -728, -499, -616, -52, 164, -17, 149, -25, -609, -430, -324, 63, 439, 317, 487, 108, -80, -42, -381, 7, 227, 447, 359, 552, -96, -154, -109, -159, 471, 440, 752, 172, 159, -526, -473, -623, -323, 131, 380, 239, -489, -346, -649, -652, -154, 193, 58, 268, 178, -39, -379, -562, -435, -113, 95, 82, 124, -170, -644, -718, -578, -433, -224, 203, 79, -100, -555, -689, -703, -435, -91, -42, 83, -281, -458, -734, -538, -344, -220, 612, 676, 408, 67, -115, -45, -294, 129, 380, 223, 403, 213, -179, -313, -367, -92, 200, 528, 407, 292, 16, -613, -532, -494, -167, -43, -12, 404, -108, -489, -660, -357, 142, 26, 277, 50, -186, -181, -325, -697, -583, -113, 352, 252, 166, -478, -343, -681, -417, -209, 141, 152, 402, -108, -241, -352, -272, 163, 352, 190, -53, -92, -252, -391, -399, -318, -237, 475, 235, 228, 159, -322, -295, -466, 58, 615, 638, 485, 332, -306]
4119c06j46K23L44L25p7L48k43m21p13K49k6O40rM84m50l88P7l28mM52K89j78
4141A42n6m5j77m54J69L3L86J32J51k71k96k86K49K0K41K54K0Q%m62k13K14M02
4164A61N2J31J55n21j93j23P3M61j79L87M6k84l46j24l05N25J86L75l8r6Mn22
4186a75n5L06J36K02l4j74M2k71j2l94L68K74J66j3k09j86l45N9k9L49M68P3p2
4209D74m85l25k77L5P25j5J57Rk90j69K3n29M24L04L59j88j07k75k14K23l19P62
4231C02N7K61k12n08k08pK30J43J2M29kk30m39l13J21r6M03L90K37l00n02l10
4253e42K19J61L59L14j59k18n5l28j53m0M91q1L42J50l66m8k56j69R7N51K88l69
4275A88J80l94l28rN7J39L05J85Jk42l65k95J85L42J14P8K7j75l63j21R8j5L28
$$ y = [-306, -452, -229, 115, 440, 363, 711, 468, 47, -666, -417, -443, 197, 188, 672, 222, -166, -89, -417, -421, 31, 320, 142, 86, 41, -136, -590, -421, -388, -2, 130, 281, 10, -286, -572, -323, -303, -62, 192, 212, 220, 220, -242, -455, -241, 161, 213, 344, 499, -22, -215, -338, -265, 196, 17, 404, 450, 166, -180, -304, -609, -84, 102, 477, 439, 343, 347, -175, -230, 76, 212, 414, 380, 206, 248, -23, -35, -429, -61, 213, 379, 366, 157, -29, -374, -315, -344, 5, 473, 546, 474, -11, -336, -613, -578, 147, 132, 289, 298, 8, -161, -138, -667, -243, 61, 420, 232, 125, -150, -364, -141, -460, 302, 359, 620, 408, -100, -308, -315, -85, 58, 70, 499, 497, 267, -172, -485, -364, -460, -57, 333, 570, 270, -232, -542, -323, -162, 197, 511, 352, 134, 79, -249, -402, -442, 49, -32, 310, 460, 94, 46, -210, -379, -282, 269, 557, 188, 368, -26, -354, -363, -306, -167, 138, 323, 324, 82, -283, -578, -393, -51, 63, 141, 168, -7, -370, -491, -393, -408, -80]
4298h0M94J18n19j41l33N8K30Q3L34n0l5k7m73m7J82L40L75k2j33k69k18n3j41
4321c27L56j3n0L28m30j78k78P2L78K11J42J3l34O7j10mj63L98Q2M49l64J14k04
4344A55m45j0M67L2j70O05n0n86m83J02j89L83L25J98j42j03o02k97J48N76K69
4365A83M94l01k26o98N7J49K10L39o7R7j70j66r6o2l7N78j78J67P5k40k83k40
4387d15j03O50J02j85J39k49j15j23j62L6M04L17p4J8k83k00N4l3J49L15Oj63
4409H5Mm69L30O5j03M37K91k91k03l92J37M5rL22K08j06k8m25j75M3l8L42P2Q4
4433B26q8j78j80j83K24N9M12j20j13j55o9k89k4L31K19K03J70n3k53l82r8K03
4455a38L01j2L01j23j04l14p8jJ24L11Q7j77j30K9m97M73n6L1M62j15l14R8m43
$$ y = [-80, 414, 532, 13, -128, -461, -403, -173, -90, 244, 194, 159, 132, -341, -388, -206, 134, 509, 487, 354, 85, -133, -186, -327, 29, 16, -34, 294, -136, -314, -592, -520, -142, 69, 211, 224, -110, -43, -153, -157, -320, 78, 160, 609, 245, 359, 155, -290, -300, 167, 199, 29, 634, 584, -2, -485, -383, -572, -189, 136, 334, 192, 89, -513, -810, -662, -86, 183, 677, 376, 150, -548, -491, -342, -132, 207, 140, 237, 67, -99, -195, -257, -294, 284, 106, 273, 348, 108, -175, -415, -518, 132, 234, 49, 188, -61, -176, -299, -461, -425, -21, 296, 222, 240, -43, -243, -189, -222, -73, 242, 248, 85, 89, -380, -50, 15, -88, 349, 640, 349, 146, -246, -109, -64, -73, 249, 457, 351, 323, -102, -277, -234, -272, 70, 142, 226, 138, -40, -220, -403, -179, -120, 292, 172, 59, -96, -165, -454, -478, -147, 72, 275, 445, 392, 139, -243, -341, -138, 163, 151, 452, 329, 225, -89, -167, -168, -44, 267, 354, 177, 47, 76, -421, 52, -4, 27, 489, 374, 60, 158, -285]
4478b85J47r0P1K61L70k0k08n7k80J67J07J02J51M6l10k06r6L52m32L32N24l61
4500B85k47L86p82J99k8L80j36J28M3l04k22r2J5J29M36J50k6l57k23r7K00j90
4522c53N02O36l73j06k39l40K36J26K68j30L9L65k19k73n26N46J17J6J15j8j43
4543B46k22j39j97N55rL06k84O2n06j29K28K52k26K77K03J39m68j79Q5q5J88J80
4565B77M9R0q6j73k97P2q5K11K84n8M6j72m83J52j73J24M02M9rl61k9j60K1L40
4589C1L58J3k74K5k96J13j4k45N26p5M00O9o90J63l36L0M54M8J84j2k9k91p0j06
4613b4J79K49L08K06p11k60lj05K69j94M90j67R0k96j66j37j67M01J88K21q5J54
4635D40k70j55l45M0J94M36J06l89J07n38K68n8J40K25J69j85l7j07k70k47O34
$$ y = [-285, -138, -228, -157, 104, 474, 454, 246, 189, -91, 76, 183, 285, 436, 482, 172, -34, -130, 222, -210, 122, 646, 285, 38, 424, -358, -159, -187, 193, 57, 185, 228, -76, -298, -390, -375, -246, 190, 340, 314, -43, -266, -363, -163, -353, 149, 785, 412, 306, 67, -273, -37, 89, 357, 227, 266, 631, 412, 139, -387, 159, 276, 292, 407, 389, 246, 24, -115, -312, 243, 234, 540, 256, 318, -188, -317, -89, 163, -63, 214, 417, 556, 88, -91, -6, -91, 97, 277, 326, 416, 330, 157, -140, -68, -153, 58, 342, 284, 330, 158, -325, -173, -346, -222, 180, 229, 220, -141, -170, -330, -309, 31, 389, 402, 128, 153, -143, -30, -44, -289, 237, 162, 562, 631, -59, 104, -232, -202, 252, 300, 484, 472, 443, 152, 82, -24, 155, 404, 712, 918, 207, -53, -56, -161, 108, -86, 404, 237, 327, 31, -135, -272, -439, -38, 150, 371, 286, 440, 170, 15, -330, -290, -96, 340, 446, 57, 164, -374, -106, -164, -24, 201, 370, 185, 148, 41, -229, -476, 158]
4656A58M0L8l7q2q5k45l20L65K76K01K5Q8k40l11O4l34N22K43J72l04M5o38J31
4679b28K6l6P66NN1p4p01j38P5J14J46K51P3L6m04l0o7o9M44m1L03j90j29n71
4703c88r5J12K93L70k43m4M4j35m40P5J2M73J07p7l6P9m80P8K2K92J51r6K35o4
4727B45m20m7K6J93K53K8Q3r6n81J09q8K92K24J4K73l95M1j61r0R9Q1J4L34l8
4751C93k13m13n3j02L17K53J69r6j23k51l11Q1K76K23j78J54l10k0j62m7j16J38
4773c91M83M5K30m37q1j60J01K63J86k11L5L1l79k04K99o5L57K26l38K30n00R2
4795a88j79K42J55J21J84n3k61k16k72K79O3K54L13j09k02j95l46O3J26J41K73
4816A93Oj64k51O0k61J65M4O48j26k35k20j29p9J2K11M38K60j96j81j66k04j01
$$ y = [158, 198, 236, 199, 117, 32, -213, -533, -168, 108, 309, 334, 422, 182, -129, -65, -399, 123, 366, 538, 234, 279, -359, -228, -202, -238, 528, 533, 584, 510, -191, -329, -254, -140, 6, 257, 330, 366, -38, -68, -135, -204, 240, 199, 502, 312, 183, -388, -483, -371, -78, 292, 49, 5, 49, -86, -526, -451, -439, 34, 141, 64, 28, 107, -373, -295, -273, 19, 170, 74, 309, 245, -175, -222, -196, -3, 250, 278, 361, 265, -316, -207, -295, -3, 221, 235, 508, 113, 154, -7, -97, 2, 83, 97, 431, 393, 180, -233, -286, -388, -71, 182, 351, 255, 132, -119, -430, -349, -73, 150, -28, 126, -184, -204, -366, -413, -529, -391, 92, 137, 367, -70, -151, -311, -210, 53, 239, 28, 63, 94, -285, -489, -190, -255, 102, 328, -10, 220, -280, -188, -367, -125, 30, 151, 335, 282, 21, -195, -467, -188, -125, 129, 442, 333, 131, -64, -410, -347, -221, -80, 193, 199, 35, -216, -156, -417, -252, -208, 440, 314, 79, -141, -270, -349, -337, -126, 312, 572, 376, 195, 29, -175, -276]
4838b76o4L74K58K87n35Jj09k67p6K70K86J34K33n44k93N1L4L28j64L53j70q4
4860B7j54j44q6L05J94QR9k50m21J09J2J86J66J42l0l2j47j54k15J86o7K00L31
4883B65k10j39J00J0k77K00l0L96p0p4l8n2k64J12J47L81j46l67J09j16k6m2j05
4906b36M80J9j08R5jl45k31J22J79K80j61L8j45P8m44P2K25J01P0K24l00l04j61
4929d53J06q1N35J59r8Jm46j43l6L03J15L23j92J96k76l80J54p7J36O5J61K79
4951C51m82Lk02O2J25M02m9J1rj68N5j66m3J89L40L2J4o21k04J59p8L68K04k12
4975H1R3j27q8j48k40K88Q9K59J5o6l20K52k32k01N44r0J85k33j59j99J57mJ95
4998E1l33M01J9l73J93m64j5N21J9Q9M5k38kk4r0N1j26M1O50Mn15j34j72Q5L66
$$ y = [-276, -340, 34, 292, 579, 44, 45, -64, -331, -407, -137, 149, 283, 516, -28, -321, -270, -236, 92, -72, 281, 111, 27, -127, -271, -357, -52, 142, 150, 249, -1, -422, -313, -301, -115, 51, 193, 163, 131, -16, -170, -385, -199, -266, -66, 265, 55, -84, 16, 26, -251, -51, -81, 315, 245, 171, 133, 81, -183, -71, 76, 457, 311, -56, 53, -63, -89, -131, -236, 244, 263, 155, 250, 249, -96, -327, -205, -26, 254, 93, 131, -14, 64, -380, -308, -83, 18, 88, 312, 12, -292, -453, -347, -428, 107, 266, 168, 169, -277, -420, -456, -153, -38, 285, 93, 289, 13, -367, -213, -290, -154, -89, 72, 351, -131, -128, -330, -268, -143, 259, 210, 221, 212, 44, 99, -67, -110, 79, 419, 451, 465, -156, -360, -201, -279, 89, 293, 81, 174, 47, -41, -189, -429, -141, -52, 207, 222, 156, -164, 88, -144, -345, 199, 109, 294, 61, -98, -297, -140, -144, 51, -282, 119, 138, -235, -42, -506, -521, 0, 19, 108, 153, -85, -87, -111, -201, -150, -276, -235, 415, 419, -96, -230, -402, -317, 49]
5023D9l84J80L03l14J10j91J61K15j91L13j21j69M6j9J0l67L48M20mk34j26O3
5045I8k10k25K23K55J94j11k0k08l72K1P5M42L82l51r7j89j02q5l8L84J75K13
5067D54k64L8m78pJ07j01L72J50J50l41k26l33J08Q5L80K39m59K74Q0m42l3J2
5089b35N4M76l0K49l94l83K99K97l93K24l05N21j87j42k34j13J45N10L2k98L62
5110D55k08P5m02L5j34O85O1k13n15l2m8J30q9K88P9L93n17J5l42j75L44L44R8
$$ y = [49, -335, -155, 148, -166, -56, -247, -86, 129, -62, 251, 130, -39, 7, -12, -2, -369, -21, 399, 395, 161, 35, 98, -112, -337, -114, 141, 335, 224, 204, -4, -376, -355, -280, 162, 544, 193, 96, -93, -195, -280, -318, 66, 241, 454, 190, 228, -250, -257, -150, -251, 121, 271, 421, 80, -146, -479, -371, -286, 94, 333, -126, 148, 228, -214, -247, -235, -181, 295, 265, 514, 120, -263, 36, 333, -60, 164, -141, 380, 193, 51, -183, -296, -151, 359, 391, 93, 455, 247, 322, -80, -45, -179, 506, 567, 354, -161, -193, -241, -111, -200, 88, 167, 560, 43, 58, -284, -459, -115, 229, 327]
$$ [...]
8191G2
##END NTUPLES=NMR FID
##END=
