##TITLE=1H_CG-1121
 DMSO, 8 sc, 
 27.9.2019
##JCAMPDX= 6.0         $$ Bruker NMR JCAMP-DX V2.0
##DATA TYPE= NMR FID
##DATA CLASS= NTUPLES
##ORIGIN= UXNMR, Bruker Analytische Messtechnik GmbH
##OWNER= root
$$ XWIN-NMR		Version 3.5
$$ Fri Sep 27 14:20:07 2019 Russian Standard Time (UT+4h)  she@DPX200
##.OBSERVE FREQUENCY= 200.1315
##.OBSERVE NUCLEUS= ^1H
##.DELAY= (6, 6)
##.ACQUISITION MODE= SIMULTANEOUS
##.ACQUISITION SCHEME= undefined
##.AVERAGES= 8
##.DIGITISER RES= 18
##SPECTROMETER/DATA SYSTEM= spect
##.PULSE SEQUENCE= zg30
##.SOLVENT NAME= Acetone
##.SHIFT REFERENCE= (INTERNAL, Acetone, 0, 15.7039)
##AUDIT TRAIL= $$ (NUMBER, WHEN, WHO, WHERE, WHAT)
$$ ##TITLE= Audit trail, XWIN-NMR		Version 3.5
$$ ##JCAMPDX= 5.01
$$ ##ORIGIN= Bruker BioSpin GmbH
$$ ##OWNER= she
$$ F:/spectra/data/she/nmr/H-F/1/audita.txt
$$ ##AUDIT TRAIL=  $$ (NUMBER, WHEN, WHO, WHERE, WHAT)
(   1,<2019-09-27 14:19:06.65 +0400>,<she>,<DPX200>,
      <created by zg, POWCHK disabled, PULCHK disabled
       configuration hash MD5:
       00 E9 B6 7A A2 85 ED C7 34 08 36 98 17 FE 4E 26
       data hash MD5: 16K
       DC 37 F7 CC 3B 1D 35 38 81 E5 B5 4C C9 14 6C 64>)
$$ ##END=
$$ 
$$ hash MD5
$$ 02 C8 C1 5C DD E5 4C 56 9E EB DE 72 24 FB 48 94
##$RELAX= 
##$RELAX= 
##$RELAX= 
##$RELAX= 
##$RELAX= 
##$RELAX= 
$$ Bruker specific parameters
$$ --------------------------
##$DU= <F:/spectra>
##$EXPNO= 1
##$NAME= <H-F>
##$PROCNO= 1
##$TYPE= <nmr>
##$USER= <she>
##$AMP= (0..31)
100 100 100 100 100 100 100 100 100 100 100 100 100 100 100 100 100 100 
100 100 100 100 100 100 100 100 100 100 100 100 100 100 
##$AQSEQ= 0
##$AQ_mod= 1
##$AUNM= <au_zg>
##$AUTOPOS= <>
##$BF1= 200.13
##$BF2= 200.13
##$BF3= 200.13
##$BF4= 200.13
##$BF5= 200.13
##$BF6= 200.13
##$BF7= 200.13
##$BF8= 200.13
##$BYTORDA= 1
##$CFDGTYP= 0
##$CFRGTYP= 5
##$CHEMSTR= <none>
##$CNST= (0..31)
1 1 145 1 1 1 1 1 1 1 1 1 1 1 1 1 1 1 1 1 1 1 1 1 1 1 1 1 1 1 1 1 
##$CPDPRG= <>
##$CPDPRG1= <>
##$CPDPRG2= <>
##$CPDPRG3= <>
##$CPDPRG4= <mlev>
##$CPDPRG5= <mlev>
##$CPDPRG6= <mlev>
##$CPDPRG7= <mlev>
##$CPDPRG8= <mlev>
##$CPDPRGB= <>
##$CPDPRGT= <>
##$D= (0..31)
0 1.2 0 0 0 0 0 0 0 0.06 0 0.03 0 0 0 0 0.0002 0 0 0 0 0 0 0 0 0 0 0 0 
0 0 0 
##$DATE= 1569579545
##$DBL= (0..7)
120 120 120 120 120 120 120 120 
##$DBP= (0..7)
150 150 150 150 150 150 150 150 
##$DBP07= 0
##$DBPNAM0= <>
##$DBPNAM1= <>
##$DBPNAM2= <>
##$DBPNAM3= <>
##$DBPNAM4= <>
##$DBPNAM5= <>
##$DBPNAM6= <>
##$DBPNAM7= <>
##$DBPOAL= (0..7)
0.5 0.5 0.5 0.5 0.5 0.5 0.5 0.5 
##$DBPOFFS= (0..7)
0 0 0 0 0 0 0 0 
##$DE= 6
##$DECBNUC= <off>
##$DECIM= 24
##$DECNUC= <off>
##$DECSTAT= 4
##$DIGMOD= 1
##$DIGTYP= 9
##$DL= (0..7)
0 120 120 120 120 120 120 120 
##$DP= (0..7)
150 150 150 150 150 150 150 150 
##$DP07= 0
##$DPNAME0= <>
##$DPNAME1= <>
##$DPNAME2= <>
##$DPNAME3= <>
##$DPNAME4= <>
##$DPNAME5= <>
##$DPNAME6= <>
##$DPNAME7= <>
##$DPOAL= (0..7)
0.5 0.5 0.5 0.5 0.5 0.5 0.5 0.5 
##$DPOFFS= (0..7)
0 0 0 0 0 0 0 0 
##$DQDMODE= 0
##$DR= 18
##$DS= 0
##$DSLIST= <SSSSSSSSSSSSSSS>
$$ [...]
##$SUBNAM2= <"">
##$SUBNAM3= <"">
##$SUBNAM4= <"">
##$SUBNAM5= <"">
##$SUBNAM6= <"">
##$SUBNAM7= <"">
##$SUBNAM8= <"">
##$SUBNAM9= <"">
##$SW= 24.0689530833862
##$SWIBOX= (0..15)
0 0 2 0 0 0 0 0 0 0 0 0 0 0 0 0 
##$SW_h= 4816.95568400771
##$TD= 16384
##$TD0= 1
##$TE= 0
##$TE2= 300
##$TE3= 300
##$TEG= 300
##$TL= (0..7)
0 120 120 120 120 120 120 120 
##$TP= (0..7)
150 150 150 150 150 150 150 150 
##$TP07= 0
##$TPNAME0= <>
##$TPNAME1= <>
##$TPNAME2= <>
##$TPNAME3= <>
##$TPNAME4= <>
##$TPNAME5= <>
##$TPNAME6= <>
##$TPNAME7= <>
##$TPOAL= (0..7)
0.5 0.5 0.5 0.5 0.5 0.5 0.5 0.5 
##$TPOFFS= (0..7)
0 0 0 0 0 0 0 0 
##$TUNHIN= 0
##$TUNHOUT= 0
##$TUNXOUT= 0
##$USERA1= <user>
##$USERA2= <user>
##$USERA3= <user>
##$USERA4= <user>
##$USERA5= <user>
##$V9= 5
##$VALIST= <valist>
##$VCLIST= <CCCCCCCCCCCCCCC>
##$VD= 0
##$VDLIST= <DDDDDDDDDDDDDDD>
##$VPLIST= <PPPPPPPPPPPPPPP>
##$VTLIST= <TTTTTTTTTTTTTTT>
##$WBST= 1024
##$WBSW= 4
##$XGAIN= (0..3)
0 0 0 0 
##$XL= 0
##$YL= 0
##$YMAX_a= 72756
##$YMIN_a= -98487
##$ZGOPTNS= <>
##$ZL1= 120
##$ZL2= 120
##$ZL3= 120
##$ZL4= 120
##$ABSF1= 10
##$ABSF2= 0
##$ABSG= 5
##$ABSL= 3
##$ALPHA= 0
##$AQORDER= 0
##$ASSFAC= 0
##$ASSFACI= 0
##$ASSFACX= 0
##$ASSWID= 0
##$AUNMP= <proc_1d>
##$AZFE= 0.1
##$AZFW= 0.1
##$BCFW= 1
##$BC_mod= 2
##$BYTORDP= 1
##$COROFFS= 0
##$CY= 11.3945322036743
##$DATMOD= 1
##$DC= 2
##$DFILT= <>
##$DTYPP= 0
##$F1P= 20.1720416913024
##$F2P= 0.152960286110954
##$FCOR= 0.5
##$FTSIZE= 0
##$FT_mod= 4
##$GAMMA= 1
##$GB= 0.15
##$INTBC= 1
##$INTSCL= 1
##$ISEN= 128
##$LB= 0.24
##$LEV0= 0
##$LPBIN= 0
##$MAXI= 10000
##$MC2= 0
##$MEAN= 0
##$ME_mod= 0
##$MI= 1.114404
##$NCOEF= 0
##$NC_proc= 0
##$NLEV= 6
##$NOISF1= 3.799351
##$NOISF2= 2.8
##$NSP= 1
##$NTH_PI= 0
##$NZP= 0
##$OFFSET= 15.70392
##$PC= 1
##$PHC0= -9576.231
##$PHC1= 16.60095
##$PH_mod= 1
##$PKNL= yes
##$PPARMOD= 0
##$PSCAL= 0
##$PSIGN= 0
##$REVERSE= no
##$SF= 200.130013532006
##$SI= 16384
##$SIGF1= 3
##$SIGF2= 2
##$SINO= 400
##$SIOLD= 16384
##$SREGLST= <1H.CDCl3>
##$SSB= 0
##$STSI= 0
##$STSR= 0
##$SW_p= 3612.71676300578
##$SYMM= 0
##$S_DEV= 0
##$TDeff= 0
##$TDoff= 0
##$TI= <>
##$TILT= no
##$TM1= 0
##$TM2= 0
##$TOPLEV= 0
##$USERP1= <user>
##$USERP2= <user>
##$USERP3= <user>
##$USERP4= <user>
##$USERP5= <user>
##$WDW= 1
##$XDIM= 8192
##$YMAX_p= 0
##$YMIN_p= 0
$$ End of Bruker specific parameters
$$ ---------------------------------
##NTUPLES= NMR FID
##VAR_NAME=  TIME,          FID/REAL,        FID/IMAG
##SYMBOL=    X,             R,               I
##VAR_TYPE=  INDEPENDENT,   DEPENDENT,       DEPENDENT
##VAR_FORM=  AFFN,          ASDF,            ASDF
##VAR_DIM=   8192,          8192,            8192
##UNITS=     SECONDS,       ARBITRARY UNITS, ARBITRARY UNITS
##FACTOR=    0.0002076,     1,               1
##FIRST=     0,             0,               0
##LAST=      1.7004516,     0,               0
##MIN=       0,             -98487,          0
##MAX=       1.7004516,     72756,           0
$$ Real data points
##PAGE= N=1
##DATA TABLE= (X++(R..R)), XYDATA
$$ [...]
2150A494j006j347n81J352J034m37q7k75j582k6K167O22j702j178k13J852K362
$$ 1494 488 -859 -1440 -88 946 509 422 147 -1435 -1461 706 1328 -374 -1552 -1765 87 2449
2167B449j437l619j67K820J531j61j771k047O12K322K64p80j86o00o06J304J263
$$ 2449 1012 -2607 -2774 46 1577 1416 -355 -2402 -1790 532 796 16 -170 -770 -1376 -72 1191
2184A191q17j084m28L42K049J073k580k149J081K372J094o35k025j304J337J851
$$ 1191 374 -710 -1138 -796 1253 2326 -254 -2403 -1322 1050 2144 1509 -516 -1820 -483 1368
2200A368k39m10l68j024K28J500L64j134q39l30J287K178o62l098j012J995K108
$$ 1368 1129 719 351 -673 -445 1055 1419 285 -554 -884 403 2581 1919 -1179 -2191 -196 1912
2217A912N23j675k803L52K364P47j128k85k60m01O41L23k77q3p88o01J683J784
$$ 1912 2435 760 -2043 -1691 673 1420 292 7 -253 -654 -13 310 33 -50 -838 -1439 244 2028
2235B028j406l015k50K024K396N95l077k625J534K947k38j188p86L0J056P50j079
$$ 2028 622 -2393 -2643 -619 1777 2372 -705 -3330 -1796 1151 913 -275 -1061 -1031 25 775 -304
2252c04q95P42J49k30J342L63j428j751M51J582K307j66l221j512K004K129j89
$$ -304 -1199 -457 -308 -538 804 1167 -261 -2012 -1561 21 2328 2162 -1059 -2571 -567 1562 1373
2269A373j098j075N8J846M87j569m81M03J08Q97J019r49k047o07J313J942J397
$$ 1373 275 -800 -742 1104 1591 22 -459 -56 52 949 1968 1019 -1028 -1635 -322 1620 3017
2286C017k013l193M90K506Q28q67j186n43J048J246j230j042N89L66k24J012Q19
$$ 3017 1004 -2189 -1699 807 1635 768 -418 -961 87 1333 103 -939 -350 16 -208 804 1623
2303A623j516j780n44J345K984L95l110k754J817K679J32j564j587N09K415K56
$$ 1623 107 -1673 -2217 -872 2112 2507 -603 -3357 -1540 1139 1271 -293 -1880 -1371 1044 1300
2319A300k326p04J174M87M55K75n98q55n37l71J458K597l92l213j326J775J926
$$ 1300 -1026 -1730 -556 -69 386 661 63 -792 -1329 -1700 -242 2355 1963 -1250 -2576 -801 1125
2336A125P60j646j909J283K129k23k062p39O93J004J554m81j723q55J30P65J811
$$ 1125 1885 239 -1670 -387 1742 1519 -543 -1282 -589 415 1969 1488 -235 -1090 -960 -195 1616
2353A616Q56j736k363Q21J258P49q8j228r22J671O96q76j302R7J46J121J215q63
$$ 1616 2472 736 -1627 -806 452 1201 1113 -115 -1037 634 1330 454 -848 -751 -605 516 1731 868
2371H68j653q11J62J242K128k86k547j187R79J468P03r44j795L89K435J61j963
$$ 868 -785 -1596 -1434 -192 1936 1650 -897 -2084 -1105 363 1066 122 -1673 -1284 1151 1312 -651
2388f51j118N63J233J467k53j791q35L66L03R26J201p12j577m93O57J019R42r78
$$ -651 -1769 -1206 27 1494 1241 -550 -1385 -1019 -716 210 1411 699 -878 -1371 -714 305 1247 269
2406B69j921P59K255K19j848j418J85K372K087j588k608l02J072J254P61n73j279
$$ 269 -1652 -893 1362 1581 -267 -1685 -1500 872 2959 1371 -1237 -1539 -467 787 1548 975 -304
2423c04k03N05j92Q14M15j073n58Q46R36m08r41j409K20K707J425k323j989j51
$$ -304 -507 -2 -194 620 1035 -38 -596 250 1186 778 -163 -1572 -1352 1355 2780 457 -1532 -1683
2441a683J034J703P38j566j131J20O18q4R85o25j075L59J484J69j034j260n83
$$ -1683 -649 1054 1792 226 -905 -785 -167 -251 734 109 -966 -607 877 1046 12 -1248 -1831
2458a831J638K311p32k411o47N31J181Q73j41j007j55j44l8L58J228r26j249O40
$$ -1831 -193 2118 1386 -1025 -1672 -1141 40 913 772 -235 -390 -534 -572 -214 1014 88 -1161 -521
2476e21J467L44j126k163k28L291J987j855l006k75J643J769J12j752o18R49M24
$$ -521 946 1290 164 -1999 -2227 1064 3051 1196 -1810 -2085 -442 1327 1439 -313 -931 18 442
2493D42p39K55M87m16k97M53L31L24q86j779M03K972R01j931k187m33J772K041
$$ 442 -297 -42 445 29 -268 185 516 840 -46 -1825 -1422 1550 2451 520 -1667 -2100 -328 1713
2511A713k86k052m76J011N41m0Or46k04Q85P63k72m38j017j025J923J890p51j568
$$ 1713 1427 -625 -1101 -90 451 411 417 -529 -733 152 915 643 205 -812 -1837 86 1976 1225 -343
2530c43j199L26J597J042q97j464M92L07J7M58j00q21k7Q27M92R7q56j831L50
$$ -343 -1542 -1216 381 1423 526 -938 -446 -139 -122 336 236 -585 -612 215 707 804 -52 -1883 -1533
2549a533K773J000j513j952m80J011K326k49k141o72J426M69j47l79o03J37R08
$$ -1533 1240 2240 727 -1225 -1705 -694 1632 1383 -758 -1430 -4 465 318 -61 -664 -527 381
2566C81k53j44L74n18j410N20K136M29r36j750r41J573K613o67k450m05J409Q92
$$ 381 128 -16 358 -160 -1570 -1050 1086 1515 579 -1171 -2112 -539 2074 1407 -1043 -1448 -39 853
2584H53K39j224j298J061J669m58p77k29o99J91J153O72m78l77j148o70J993J203
$$ 853 1092 -132 -1430 -369 1300 842 65 -164 -863 -672 481 1153 675 298 -850 -1520 473 1676
2602A676j127j349J4Q16P89L43j607p72R07J334j07m49j026j125J108J812k2r58
$$ 1676 549 -800 -786 30 819 1162 -445 -1217 -310 1024 917 468 -558 -1683 -575 1237 1215 257
2620B57j061p60J040K004l12j952m51P73Q99N80j138j171N74J154L14p66j61o01
$$ 257 -804 -1564 -524 1480 1168 -784 -1235 -462 437 1017 -121 -1292 -718 436 750 -16 -177 -778
2638g78l93R79P14P1k2j499r46J780J958j053j684o20R85J988K37k344j429J748
$$ -778 -1171 -192 522 593 571 -928 -1874 -94 1864 811 -873 -1493 -508 1480 1717 -627 -2056 -308
2656c08J480j90p57j009j25J213M89l43k30K04q69k21J356M46o42o29q86P94J814
$$ -308 1172 982 225 -784 -909 304 793 450 220 424 -445 -666 690 1136 494 -135 -1021 -227 1587
2675A587N9k459p32J475J174P4q14j744J79J901O57p96o21n68j71J110J051r16
$$ 1587 1646 -813 -1545 -70 1104 1178 364 -1380 -1201 700 1357 561 -60 -628 -799 311 1362 446
2693D46r83k04m5J200Q55j325j450N54J283L99m00p95r85R11J004m5l77k18p70
$$ 446 -537 -741 -786 414 1269 -56 -1506 -952 331 730 330 -465 -1450 -539 465 420 43 -175 -945
2712i45j33J418L60m99o95q21O40J964K69k387r54J465J143O34j229j707J23J980
$$ -945 -1078 340 700 201 -494 -1315 -675 1289 1558 -829 -1783 -318 825 1459 230 -1477 -1354 626
2730F26N58r82l68q0q7N17M70k94J11k44q99N73J784m44j740o69J063J295O78
$$ 626 1184 202 -166 -246 -333 184 654 360 471 227 -672 -99 1685 1241 -499 -1168 -105 1190 1868
2749A868j406k421R88K321K17j237j057j4P95J075m60r82Q6j4r0Q61L90j278o08
$$ 1868 462 -1959 -971 1350 1567 330 -727 -741 54 1129 669 -313 -227 -241 -331 530 920 -358 -966
2768i66K11N02R45K23j573j169J319J130m8n60j051l14J148J053p05o85r3k66
$$ -966 -755 -253 692 915 -658 -1827 -508 622 574 14 -1037 -1351 -203 850 145 -540 -633 -899
2786h99N17J537o14j567k34N29J238P91j011j913O60J734K94o08p42m89O94R05
$$ -899 -382 1155 541 -1026 -1260 -731 507 1298 287 -1626 -966 768 1062 454 -288 -777 -83 822
2804H22j0r12P9k6l30M83R41l64j017l57J75J323J047j758j852J076J918K92j038
$$ 822 812 -100 -21 -47 -377 106 1047 683 -334 -691 -516 807 1854 96 -1756 -680 1238 1530 492
2823D92j457l55J659J336j159j423N57L94K03M21n07n33J77r5R1J096M7j467j017
$$ 492 -965 -1320 339 1675 516 -907 -350 44 247 668 161 -372 -195 -290 -199 897 944 -523 -1540
2842a540J104J130K98o42j709n5K038M56j292n19k30O84R49L3j018q65O41K54
$$ -1540 -436 694 992 350 -1359 -1414 624 1080 -212 -731 -961 -277 672 705 -313 -1178 -537 -283
2860b83O18N05q41j118L42J125N37k37r65r76J118J207k58r75O8n56O66R18k58
$$ -283 335 840 -1 -1119 -777 348 885 648 -317 -1293 -175 1032 774 -201 -133 -689 -23 895 637
2879F37j032LK2L75Q82L56j469j021Q21R19Q84n83j769m77K053J100j119j235
$$ 637 -395 -392 -370 5 887 1243 -226 -1247 -426 493 1377 794 -975 -1452 601 1701 582 -653
2897f53L8O23R28J17j459l09P17p1L03M51k98q85o4L6R01O61p88j483J31J737
$$ -653 -615 8 936 1053 -406 -715 2 -69 234 685 387 -498 -562 -526 375 1036 248 -1235 -1104 633
2917F33M98j103r49m77J367J258n35j711j79Q45O82J39Nj148q2O30m2N25L15r02
$$ 633 1131 28 -921 -1398 -31 1227 692 -1019 -1198 -353 329 468 473 -675 -757 -127 -169 356 671 -231
2937b31j035R50R98k81n05o41j90J465P28j151j013J74M82Q36L49o18r17Q8M34
$$ -231 -1266 -316 682 401 -104 -745 -935 530 1258 107 -906 -732 -250 586 935 317 -600 -512 -78
2956g8N00P43l99j633j76J648L69n77r77m62P47J731k93j812k54P80L39O32k99
$$ -78 422 1165 766 -867 -1043 605 974 397 -580 -1042 -295 1436 1143 -669 -923 -143 196 828 529
2975E29q59j98K12j0M56P57n19j227J82J064L33l58j147m66J577J430j280j315
$$ 529 -330 -528 -316 -326 130 887 368 -859 -677 387 720 362 -785 -1251 326 1756 476 -839
2993h39m74P12J204M66j058j153O72M88Q8J53O9o95k47P79n7J48n0j163N8J606
$$ -839 -1313 -601 603 1069 11 -1142 -470 18 106 259 328 -367 -614 165 108 256 206 -957 -899 707
3013G07O81j423r38j70Q79J450J30j669p15N26O30K46L49q47m97N89O65l10l1
$$ 707 1388 -35 -973 -1143 -264 1186 1316 -353 -1068 -542 88 334 683 -164 -661 -72 593 283 252
3032B52q74k57J069R88k41j330n45R4J228J104q67j483Q2P29J78L61j82o20M0
$$ 252 -622 -879 190 1178 937 -393 -938 -844 384 1488 621 -862 -780 -51 127 488 306 -314 -274
3051b74M86Nj71J82p10k82J057R95p64j222n26L75J857L69j481j019N17Q65K53
$$ -274 212 217 46 228 -482 -764 293 1288 524 -698 -1224 -849 1008 1377 -104 -1123 -606 259 512
3070E12j29p99k04Q69J90q09K36O8o25Q6R92M16p09o00j092J081J959M7j793j042
$$ 512 383 -416 -620 249 439 -370 -134 -66 -691 -605 387 803 94 -506 -1598 -517 1442 1489 -304 -1346
3090a346Q82P41K73l24j004L96R93k34m48k05o8j95Q04L52j81o69o72l63J563
$$ -1346 -464 277 550 226 -778 -382 611 377 -71 -276 -344 -539 265 617 436 -233 -905 -1268 295
3109B95J046o58j501j00O67Q49p0r49k20Q63N10n81k96On14L34J029J65o69o11
$$ 295 1341 683 -818 -918 -251 598 528 -421 -641 222 732 151 -145 -139 -653 -319 710 875 206 -405
3129d05p51M47J932J70j568o57J13J063N57l88j372M45J063j55n78p0j80p2N27
$$ -405 -1156 -709 1223 1393 -175 -832 -719 344 901 513 -859 -414 649 494 -84 -154 -334 -406 121
3148A21P10k42m42p18o86J245J282k84j337o20K30J127O42j162r71J066O01j16
$$ 121 831 589 147 -571 -1257 -12 1270 986 -351 -971 -741 386 1028 -134 -1105 -39 562 446
3166D46o23l60m36N74J134j64l33m86p30J25J141P54q12n23m28K17J284j31j305
$$ 446 -177 -537 -973 -399 735 571 238 -248 -978 -853 288 1042 230 -293 -721 -504 780 649 -656
3185f56j67J015L92j40m78p09j03J122O32l55m66m31o08P32J342k59p49m29o1
$$ -656 -823 192 584 444 -34 -743 -846 276 908 553 87 -344 -952 -220 1122 863 114 -315 -376
3204c76N66O98k92j268K61J004p2rr06n48M76J333K0n75m23n83j4J116O02n65
$$ -376 190 888 596 -672 -411 593 521 512 -394 -942 -466 867 887 312 -111 -694 -708 408 1010 445
3224D45o95p1k76R98K75j023m56N41N56N02m88j193n26J546R55n70p76m48k61
$$ 445 -250 -321 -597 401 676 -347 -803 -262 294 796 308 -885 -1411 135 1090 520 -256 -704 -965
3243i65P05Q37k55j99j00n54L3P96J71r05j33N33M26O05r69j514L33J682N61q36
$$ -965 -260 577 322 123 23 -531 -498 298 469 -436 -569 -36 390 995 26 -1488 -1155 527 1088 252
3263B52m86o50L39J158K9n37m0j05k96M41N48o10n21J95N75N27L06j420j008J077
$$ 252 -234 -884 -545 613 642 105 65 -40 -336 105 653 43 -478 -283 292 819 1125 -295 -1303 -226
3283b26J138J79p97r04k81R34P77m91k96K07n63J3O26K54o46l40L8N46O19l07
$$ -226 912 1091 294 -610 -891 43 820 329 33 240 -323 -310 316 570 -76 -416 -378 168 787 480
3303D80j597N7J031R00k26p53q73K01J206N4p24l0K20m07J58M60k21m23R4l8P26
$$ 480 -1117 -1060 -29 871 645 -108 -981 -780 426 480 -244 -274 -54 -461 -303 157 -64 -487 -393 -431 295
3324B95M80q52j163N64J143L66m03r29p05R09J048j87r46J27L64k2M01k20m05
$$ 295 775 -77 -1240 -676 467 833 430 -499 -1204 -295 753 566 -380 -253 111 89 490 270 -135
3343a35j23P6L31M10J88j399l42Q95Q22K88n50j134l66J427N75n53n91M3J38K64
$$ -135 -258 -182 149 559 747 -652 -994 -99 723 1011 461 -673 -1039 388 963 410 -181 -138 0 264
3363B64K28n49j91n8L21J33O52o14j102J22Q07P43L7j112o77N88J031j25p78k09
$$ 264 492 -57 -248 -306 15 148 800 186 -916 -794 13 756 793 -319 -996 -408 623 498 -280 -489
3383d89k35N28O71k55q79J07K70J09O04N4q01p33O13M73N76J84j338q60J233J086
$$ -489 -724 -196 475 220 -659 -552 -282 -173 431 485 -316 -1049 -436 37 613 797 -541 -1401 -168 918
3403I18n40n37k66j2P24M07o07n54L15J63K08L62k83p13q6L99M99L49k98j233
$$ 918 378 -159 -425 -437 287 694 87 -467 -152 11 219 581 298 -415 -501 -102 397 746 448 -785
3423g85R5J120L86l75p22k59M19J143k42r64l36M43J19M77N7n39m93K81L36J73
$$ -785 -690 430 816 441 -281 -540 -121 1022 780 -184 -520 -77 42 519 576 37 -456 -175 161 334
3443C34K77p29q41O64R53j01m68p76l2R14P22q99q56M04J93N34J95m25q89M88
$$ 334 611 -118 -959 -295 658 557 89 -687 -719 195 917 18 -838 -434 -241 293 488 63 -826 -338
3463c38J14L15N71k44j144k61R31N11R9o24p53M43J163K2r08p73M59N39O19k97
$$ -338 -224 91 662 418 -726 -987 -56 455 554 -70 -823 -380 783 805 -103 -876 -417 122 741 444
3483D44p36l76N69K12Q0L94n28o96M15N57K05K71q97q29Q35J000m03q77k02J48
$$ 444 -292 -668 -99 113 193 587 59 -637 -222 335 540 811 -86 -915 -80 920 517 -360 -562 -414
3503d14P74N67o07r63L60M22Q9K98j02p35p0M06K91J99k45p92k78J142O70q77
$$ -414 360 927 320 -643 -283 139 228 526 424 -311 -381 25 316 515 270 -522 -800 342 1012 135
3523A35n81l00N38Q04L69j242n84O06L27J54l1l53o08M73N84n3J90o86m81K27
$$ 135 -446 -746 -208 596 965 -277 -861 -255 72 226 195 -158 -766 -293 291 238 428 -258 -739 -512
3543e12J109K48r26p82R8R34Q54n00j005k03Q58K27R1k55m96k27O89K23k92L86
$$ -512 597 845 -81 -863 -765 169 1023 523 -482 -685 173 400 491 236 -260 -487 202 425 133 519
3563E19q23m68Q37P09l78m28o17r8J239M30q53q69L64L98N44j09n86m21M64M11
$$ 519 -304 -772 65 774 396 -32 -649 -747 492 922 69 -800 -436 -38 506 397 -189 -610 -146 265
3583B65k28J46r2p18K31P83J12j88o11l16L50J025m8r99l35M17M40L23k66q28
$$ 265 37 183 91 -627 -396 387 499 311 -300 -616 -266 759 711 -288 -623 -206 234 557 291 -537
3603e37J65O92J24j96j37l36l51M99M59L0l80n12k66Q15R81p28q17k61N59N75
$$ -537 -372 320 444 248 111 -225 -576 -77 382 412 32 -480 -746 69 1050 322 -495 -756 -197 378
3623C78M13p25p63M29O86r4j72j35o64K15P00O8l0k81n89J6J268N3q11o54K30
$$ 378 791 66 -697 -268 418 324 152 17 -647 -432 268 336 306 25 -564 -548 720 773 -38 -692 -462
3644d62M98N50j54r84k79R32L46k0m47l13k62P04O7j44M8l57j67M41P86j99q74
$$ -462 36 586 432 -552 -831 101 447 427 -20 -333 -595 109 176 32 80 -277 -444 -3 783 584 -290
3665b90j43j26R38O50o75j045J54R97K8j07l84m72K86P61j48l75J24n92j21Q90
$$ -290 -433 -559 379 1029 354 -691 -537 460 488 381 -3 -475 -189 572 424 49 173 -419 -540 350
3685C50M46o12n41j34j3J152L21j205m68L98N50J27j29p05j50P34O43n47j76j42
$$ 350 796 184 -357 -491 -504 648 969 -236 -704 -306 244 371 242 -463 -613 121 764 217 41 -101
3705a01n07M90P15j54m93l50j64O09P67j30j079r2M84L48K00o45n46L32N96N5
$$ -101 -608 -118 597 443 -50 -400 -564 45 812 682 -397 -489 -5 343 543 -102 -648 -316 280 335
3725C35k76k47j51j58P93K55j93m99n28J44P18P03q17n61K64J71N56l2p83l36
$$ 335 59 -188 -339 -497 296 551 358 -141 -669 -525 193 896 79 -482 -218 -47 509 477 -306 -642
3745f42Q44M65l88k62k73l39N05M67K21n27j49l68J53P83J33r30j08J42N39K63
$$ -642 202 667 279 17 -256 -595 -90 377 598 71 -78 -446 -293 490 623 -307 -415 -273 266 529
3765E29l50q69j25J091M00n71l99l57M3R58Pk45k43l09M1N52J56J4p67m6K82M47
$$ 529 179 -690 -815 276 676 105 -294 -651 -608 350 357 112 -131 -440 -399 153 309 323 -444 -490 -208 239
3787B39J37o32n12L45Q67K15m75o00j39L27P85k68k49R9n75K62M46K91m16k88
$$ 239 376 -256 -768 -423 444 659 184 -416 -555 -228 557 289 40 139 -436 -174 272 563 147 -141
3807a41j18N04K11q4o84m68Q46N92l7o22n72m3R42M56l72m08j45k45L44M64l54
$$ -141 -259 245 456 372 -312 -780 66 658 621 -1 -573 -616 326 782 410 2 -143 -388 -44 420 66
3828F6m8j99N8J29O38n92n41J07Q90R3k23n98p38M84R38K35q00j50k62J90N20
$$ 66 18 -181 -123 6 644 52 -489 -382 508 601 378 -220 -958 -474 464 699 -101 -251 -513 -323 197
3849A97k2p20J25M45j11K29k1m58m13N20O48J02k74r59j43P84O22l29k56k00p7
$$ 197 175 -545 -420 25 -86 143 122 -336 -749 -229 419 521 247 -712 -855 -71 551 222 -34 -234 -311
3870c11M21J62k62l52K94O4P8K28j95o83m9O06N91J05l88j116N1J116M42m92n36
$$ -311 110 272 10 -342 -48 16 94 322 127 -556 -605 1 592 697 309 -807 -756 360 802 310 -226
3891b26r1R4O89j11n92J63P2q2J59J89l06m87K97M13L15L5q35p27P25Q84K2o42
$$ -226 -317 -223 466 355 -237 -74 -2 -84 75 264 -42 -529 -232 181 496 531 -304 -1031 -306 578 600 -42
3913d2k41q5M11M35m91o02O29j59K04J22k71m00NL97L2N96l07q72l16P46Q63k95
$$ -42 -283 -368 43 478 -13 -615 14 -145 59 181 -90 -490 -485 -88 -56 540 233 -639 -955 -209 654 359
3935C59k91o05J86O81k19k79k64M50J18J27Q2n05k04K91J19L66J49m77o31Q3Q82
$$ 359 68 -537 -351 330 111 -168 -432 18 136 263 345 -160 -364 -73 46 412 561 84 -547 -464 418
3956D18J72k52o53k89N52P11m93p80N12P4P0L46j67o76N0M20K34K53R5q55n03
$$ 418 590 338 -315 -604 -52 659 166 -614 -102 -28 42 388 221 -455 -405 15 249 502 597 -258 -761
3977g61N98M88J44m34m82O1N55L63o99k89L13K10K69J91o69n93N88J49J20K94
$$ -761 -163 325 469 35 -447 -386 169 532 -167 -456 -143 67 336 527 -142 -735 -147 2 122 416
3997D16k88p80J84N56O1K87l77o10J70P49N0p70p2K11M33M19l84p75J72L16K77
$$ 416 128 -652 -468 88 149 436 59 -551 -381 368 418 -352 -424 -213 220 639 255 -520 -348 -32 245
4018B45K82qp46l72M71M15J87k67k94m60P63L43m05l61k21J78Q07J50p61o61N46
$$ 245 527 519 -227 -599 -128 287 474 207 -87 -547 216 559 154 -207 -428 -250 557 707 -54 -715 -169
4039a69L59J35J57l58p38L98L09N8M42l48p45K11M62J63o24L9j34M37O89j71j016
$$ -169 190 325 482 124 -614 -216 93 151 593 245 -500 -289 173 336 -288 -249 -383 54 743 572 -444
4060d44j56N02J72M02K1o89l66O25q6P9K46m34l69M58M50l06k63j59j59P58M74
$$ -444 -600 -98 74 476 497 -192 -558 67 -19 60 306 -128 -497 -39 411 105 -158 -317 -476 282 756
4081G56n77o34n7N25L70Q2m53l51o1O01j09K8J72n39k2M21K38k63j56k68J76Q85
$$ 756 179 -455 -512 13 383 465 12 -339 -400 201 92 120 292 -247 -269 152 390 127 -29 -297 -121 764
4103G64M9r09n30K67M47L62jo75l08P03J29j88R3l00k61K68M03n0j97k42l38M36
$$ 764 813 -96 -626 -359 88 450 449 -226 -534 169 298 110 203 -97 -358 -90 313 263 66 -176 -514 -78
4125g8Q03k07r53j79L78N46K37k97p95K93K80J18p6j4l71J26M70o9j88l8j03k31
$$ -78 725 518 -435 -614 -236 310 547 250 -545 -252 28 146 70 56 -315 -189 281 212 24 -14 -117 -348
4147c48O68K55n20n15L1K96N06K10p81n80O42M51k8k24l52O1K85K63p4k69j89
$$ -348 320 575 55 -460 -429 -133 373 583 -198 -778 -136 315 287 63 -289 -228 57 320 246 -23 -212
4168b12j17J23P74k12o02l0P9K78O11k28r02r1O61K27j86j3n72L39L43r7l30J28
$$ -212 -329 -206 568 356 -246 -276 -197 81 692 464 -438 -529 132 359 173 160 -412 -73 270 173 -157 -29
4190b9k79r6M44M64k93m86o6j8N92K61l15q13L10N12L6J1j94n17O34K87l19j70
$$ -29 -308 -404 40 504 211 -275 -341 -359 233 494 179 -634 -324 188 224 235 41 -476 158 445 126 -44
4212d4K3k24J55L28K23o30N0k56J83P51j45q63K1K39K42L36m47k93k29R71ol67
$$ -44 -21 -245 -90 238 461 -169 -119 -375 -192 559 414 -449 -428 -189 53 389 -58 -351 -580 391 385 18
4234A8R5k94j64M98L56l93l37o9r7N94N68n46o48J30L23L68L7o44k71N53M35k11
$$ 18 113 -181 -345 153 509 116 -221 -290 -387 207 775 229 -419 -289 34 402 439 -205 -476 77 512 301
4256C01l34N3k42o5M48P9k07j60r8l8M70L47p24j89K19L40K58j85n58j68M46N80
$$ 301 -33 20 -222 -287 161 240 33 -127 -225 -263 207 554 -170 -359 -140 200 458 273 -285 -453 -7 573
4278E73m29k01k16P6M85P5k00l09J63k94K69O13l01n95P8J5M74K74n45m40M2P39
$$ 573 144 -57 -273 -197 288 363 163 -146 17 -277 -8 605 304 -291 -213 -198 276 550 5 -435 -393 346
4300C46Q0l06j38m08L24L47ml00o3k6R4L06J77p43J06j70K34M36J49q04k74O64
$$ 346 426 120 -18 -426 -102 245 241 -59 -122 -148 -54 252 429 -314 -208 -378 -144 292 441 -363 -637 27
4322B7K17J00k32l95p7M64M81m13l80P0o6J31N36l70j58q3n0k9O17k17m56Q4L05
$$ 27 244 344 112 -283 -360 104 585 172 -208 -138 -204 -73 463 93 -65 -148 -198 -227 390 173 -283 -199 106
4345A06K57r3l13m85K62O14n2m55O8l3j3K48K79l72k17N8OK85K57l50m62K50K28
$$ 106 363 270 -43 -528 -266 348 296 -159 -91 -124 -137 111 390 18 -199 -141 -135 150 407 57 -405 -155 73
4368G3L09j10m40m69O65N01k06o88K71j87J25N93l51l72R0q4M0M73N3m92l38M58
$$ 73 382 272 -168 -637 28 529 323 -365 -94 -281 -156 437 86 -286 -196 -280 -240 233 286 -206 -544 -86
4390h6J81K55k92o07R6O84K21n42k49O3Q7P70l79n59K06J02pJ11L17k64l62J16
$$ -86 95 350 58 -549 -453 231 452 -90 -339 -276 -189 581 202 -357 -151 -49 -56 55 372 108 -254 -138
4412a38J63K54J99n72p04O23O63j20m22k25k06L59P30l36n21K40m7J04K92p3k88
$$ -138 25 279 478 -94 -798 -175 488 368 -54 -279 -485 -126 604 268 -253 -13 -60 44 336 263 -25
4433b5k05K53J4N8P0m23n28R36J61j96k28l72K09M46K83n34k52L51o0J26K36m44
$$ -25 -230 23 37 95 165 -258 -786 150 311 115 -113 -485 -276 170 453 -81 -333 18 -42 84 320 -124
4455a24k65K04K20N0K34l69l95J49M79K40j31m53m19L82N14k15k39j42K37J03
$$ -124 -389 -185 35 85 319 -50 -445 -296 183 423 292 -161 -580 -198 316 101 -138 -280 -43 60
4475F0K6K85o78J40J90j9K50j43k00l58L66N52j5m27l71j28O46L44l89n35K98
$$ 60 86 371 -307 -167 23 4 254 111 -89 -447 -81 471 456 29 -342 -470 176 520 131 -404 -106
4496a06K20P9R8k88m67M07K41q5M5J70p72J27L53K67J37l07m79jO08l7l52j43
$$ -106 114 193 291 3 -464 -57 184 99 144 314 -458 -331 22 289 426 119 -360 -361 247 210 -142 -285
4518b85j7M22L37k89n08m1M48J5J00J07n14l56M40L41p5R9k66o13N67L64j05l53
$$ -285 -302 120 457 168 -340 -381 67 82 182 289 -225 -581 -141 200 125 224 -42 -655 -88 276 171 -182
4540a82j2n1N07J72o45l1NL99N6Q3l84l30K95N6L09j06p7l04q6L46L47j88l19
$$ -182 -194 -245 262 434 -211 -242 -237 162 218 301 -83 -413 -118 -62 247 141 64 -240 -326 20 367 179 -140
4563a40jN8N54j12m01l85O00J02r3o1k81j88L65J76k3J55k97n50L42L68J03j36
$$ -140 -141 -83 471 359 -42 -427 173 275 182 121 -160 -348 17 193 170 325 28 -522 -180 188 291 155
4585A55k09k09L66M14k69o39P1M50Q7J11l02l54J48K24l0L33j07k67j72L52J12
$$ 155 -54 -263 103 517 248 -391 -320 130 217 328 26 -328 -180 44 14 347 240 -27 -199 153 265
4606B65l84p1j69J20L20L02m59k23J47J48K32M9n07l60N94N5jJ48Mm89J82J60
$$ 265 -119 -190 -359 -239 81 383 -76 -299 -152 -4 228 277 -230 -590 4 59 58 206 210 -279 -97 63
4628F3p5j14k2j25L10M73j0q64j09M13K59K59m10l15j02M48N6J8J61n15k17M05
$$ 63 -12 -126 -148 -273 37 510 500 -364 -473 -60 199 458 48 -267 -369 79 135 153 314 -201 -418 -13
4650a3M6pp1L7j45M04J37j19o88J10K03N48Q7o74l68J68N25P8k04j02o9P4M1J47
$$ -13 33 26 -45 -8 -153 251 388 269 -419 -309 -106 442 529 -145 -513 -345 180 258 54 -48 -117 -43 -2 145
4674A45j6r5k17J15K28O8j83l03J19O7N04j81k96m08L95Q3R1P2k99j76M15K6j93
$$ 145 129 34 -183 -68 160 228 45 -258 -139 -72 432 251 -45 -453 -58 25 116 188 -111 -287 128 154 -39
4697c9P0j29j0K15J39j30k05j78R5N00J87l47n67K90L15l7R3q4n17L45K42k89
$$ -39 31 -98 -108 107 246 116 -89 -267 -172 328 515 168 -399 -109 206 169 262 178 -339 6 248 -41
4719d1R0o8L0j50M76p1l92L2k28J28M63K90o34m94L60K20J63r6k22j01M65j56
$$ -41 49 -19 11 -139 337 266 -126 -94 -322 -194 269 559 -75 -569 -209 11 174 78 -144 -245 220 64
4741F4k04N1M3j47K35K32j82j98L9k84L27M38r9o13j49L34L24P2k63k27R0L88
$$ 64 -140 -89 -46 -193 42 274 92 -106 -67 -351 -24 414 315 -298 -447 -113 211 283 20 -207 -117 271
4763B71j13j82j58n7J01K74R9l43P6j65J52M11j67k62k61K03R5K12J63m96lK4
$$ 271 158 -24 -182 -239 -138 136 235 -108 -32 -197 -45 366 199 -63 -324 -121 -26 186 349 -147 -150 -126
4785a26K58k02K4m0j08M02J97j67m58k2P7J86N02k30m48l2K7K00K70j33n70J9
$$ -126 132 -70 -46 -86 -194 208 405 238 -220 -242 -165 21 523 293 -155 -187 -160 40 310 177 -393 -374
4807c74N20K37l45k1k29M7L52m8k53L2r6j56M57J73k95j00k21M3L92L30m50k77
$$ -374 146 383 38 17 -212 -165 187 139 -114 -82 -178 -334 123 296 1 -99 -320 -277 115 445 -5 -282
4829b82L4N01k04R6k78k35N29R9q7m89P1L63j91K29J1n21J43N9M5J77K49p48J96
$$ -282 -248 253 49 145 -133 -368 161 260 173 -316 -245 118 -73 156 167 -354 -211 -152 -107 70 319 -429 -233
4852b33L42J8P7k47l15K17L08K30l58o4j72l1L26K58m24p9n5L7K95L08m77k48
$$ -233 109 127 204 -43 -358 -141 167 397 39 -25 -197 -228 98 356 -68 -147 -202 -165 130 438 -39 -287
4874b87J26K78K53l51o6j72J72L30j19l21r8j2J79L82p7k83j04K8M3M53r7n68
$$ -287 -161 117 370 19 -47 -219 -47 283 164 -157 -255 -267 -88 294 217 -66 -170 -142 -99 354 257 -311
4896c11j48L09K98%J36n79j59N31K43l23j80q6N3K73K17k67k27K40j82k0L10J
$$ -311 -459 -150 148 148 284 -295 -454 77 320 -3 -183 -269 -216 57 274 7 -220 20 -162 -182 128 129
4918A29j38j26K83L1J57m12k02J8N38J30k99l12r9L34L20%o55M5L22k98M05Q3
$$ 129 -9 -135 148 179 336 -76 -278 -260 278 408 109 -203 -302 32 352 352 -303 -258 64 -234 171 254
4940B54l88J55j09K15K6K83l75l22K40L68l12o7l9j90M87K10l52l06J75q4J93
$$ 254 -134 21 -88 127 153 436 61 -261 -21 347 35 -32 -71 -261 226 436 84 -222 -47 -131 62
4961F2K91j03k32P3j19J25K88l18l93J87L19K41l39k50J09R1K97m5l42o5M3P8
$$ 62 353 250 18 91 -28 97 385 67 -326 -139 180 421 82 -168 -59 32 329 284 -58 -123 -80 -2
4983bJ46q4k63M5M2J51J11n9j50k39K24L56j41j21k65j36L47M06l11k05o5K64
$$ -2 144 60 -203 -158 -116 35 146 87 -63 -302 -78 278 137 16 -249 -385 -38 368 57 -148 -213 51
5005E1K05k71j22l13M53J23L4N5q2l46J72J96j3o9Q4m23Q0K26L26l77l1j42J61
$$ 51 256 -15 -137 -450 3 126 160 215 133 -213 -41 155 142 73 157 -266 -186 40 366 -11 -42 -184 -23
5028b3J14J48l50j80K74M9J22m4j02l80M68M8J15J0k71k51J88M07j52l41%M4L56
$$ -23 91 239 -111 -291 -17 32 154 110 8 -372 96 144 259 269 -2 -253 -65 342 190 -151 -151 -107 249
5051B49J5k66j06j03K75K10p3k09k89J85P9j2J00o2n90L86K48M82m16k52j91K47
$$ 249 264 -2 -108 -211 64 274 201 -8 -297 -112 -33 -45 55 -7 -597 -211 37 519 103 -149 -340 -93
5073i3N58o2n62j05K69L0Q3j44q8j59K25J67j88q0J78j95K75J54m4l22K4o8kL38
$$ -93 465 403 -159 -264 5 35 118 -26 -114 -273 -48 119 -69 -149 29 -166 109 263 219 -103 -79 -147 -149 189
5097A89M9l79k66L51P6Nj14k73K43L86k80j1J33k17j38L47l6J61mm05P2K17J93
$$ 189 238 -141 -407 -56 20 25 -89 -362 -119 267 -13 -24 109 -108 -246 101 65 226 222 -183 -111 106 299
5120B99l56k09O6J02K22N4r9m25L77P2j06qJ4j61l2K56J52j51k27j18M03K26k07
$$ 299 -57 -266 -200 -98 124 178 79 -346 31 103 -3 -11 3 -158 -190 66 218 67 -160 -278 125 351 144
5143A44k90o2R3K07q4P6j86k49M53o3O2K5k50k7K41j96J59%k41k45N37J40j18
$$ 144 -146 -208 -115 92 8 84 -102 -351 102 39 101 126 -124 -151 90 -106 53 53 -188 -433 104 244 126
5166A26l40n8L50L02m2l28l89L68J95j43M6k24k15L80J89j87j06J46j86k37L29
$$ 126 -214 -272 78 380 338 10 -379 -11 184 41 87 -137 -352 28 217 30 -76 70 -116 -353 -24
5187b4J04q9k22J88k0K81j36j39k14L49J18o2J1k62l18M31K9Q8k08j32K12lK51
$$ -24 80 -9 -231 -43 -63 218 82 -57 -271 78 196 134 145 -117 -435 -4 25 113 -95 -227 -15 -18 233
5210B33k62l39K04o2L78Ok32k35J37O7K20L2j9j44p9L15k40n9K99k78j4L63j68
$$ 233 -29 -368 -164 -226 152 158 -74 -309 -172 -105 115 147 128 -16 -95 220 -20 -79 220 -58 -72 291 123
5233A23q6j77R8l8L56M7n43k61L96J80P8j31k43j67L87P4M9k63J30j58K09J47
$$ 123 37 -140 -42 -80 276 323 -220 -481 -85 95 173 42 -201 -368 19 93 142 -121 9 -149 60 207
5255B07m39K50j22p0K13J48j87j80J19P4rJ96k26j97R7N5J04K2p7j01j38N09m6
$$ 207 -232 18 -104 -174 39 187 0 -180 -61 13 4 200 -26 -223 -126 -71 33 55 -22 -123 -261 248 202
5278B02k26mJJ7J24J83l56r5M8K58o3J48m26j46M18J6m2Oj60k72M94L9k27NP9
$$ 202 -24 -28 -27 -10 114 297 -59 -154 -106 152 89 237 -189 -335 83 99 57 63 -97 -369 125 164 -63 -58 21
5303B1k42J00L53o0l19m0Q4K17P0J4m95m5M59M3ll09K6J17K00p8k76k0K15j67
$$ 21 -221 -121 232 172 -147 -187 -103 114 184 198 -297 -342 117 160 157 -152 -126 -9 191 113 -163 -183 32 -135
5327a35K58o9k5j18k48R8L11J21q0l44J69K02K2j35l72JM63nj8k17o8O0M4J2K03
$$ -135 123 54 29 -89 -337 -239 72 193 113 -231 -62 140 162 27 -345 -344 119 114 96 -121 -189 -129 -85 -73 130
5352A30p8j64j00J55L07%m16m8J79J03M4j57j27M2L01o0R9l31j6R3N5K28j64k94
$$ 130 52 -112 -212 -57 250 250 -166 -214 -35 68 112 -45 -172 -130 171 111 210 -121 -137 -44 11 239 75 -219
5376b19J29J9P4K55k79j07K8K01j4K8l64R0Q8L92k40j04o3K2M9K65j25k24R2j61
$$ -219 -90 -71 3 258 -21 -128 -100 101 87 115 -249 -159 -71 321 81 -23 -86 -64 -15 250 125 -99 -7 -168
5400a68R6L07j05l78J16J29j0N0K83m60j63N57J6l47j61j2J27K18N7j72j30M6
$$ -168 -72 235 130 -248 -132 -3 -13 37 320 -140 -303 254 270 -77 -238 -250 -123 95 152 -20 -150 -104
5422a04J16L8J41j39k15k2K49R3p5M3k94R6M85o8k77k27m4R2N53p7o12L0K33M0
$$ -104 12 50 191 52 -163 -185 64 157 82 125 -169 -73 412 344 67 -160 -204 -112 441 364 -248 -218 15 55
5446E5j05K08k00j08J00J12J14j94j81j69L91J50P2l60K6N4L09r1k30L2Q9j44
$$ 55 -50 158 -42 -150 -50 62 176 -18 -199 -368 23 173 245 -115 -89 -35 274 183 -47 -15 74 -70
5468g0J36J60k06k52L14L9k6R9j08k04o6L88j5j22j14k62J52L34J1k99q1K25j45
$$ -70 66 226 20 -232 82 121 95 194 86 -118 -184 204 189 67 -47 -309 -157 177 188 -111 -192 33 -112
5491a12R3J88k20j36K65k5j33rk8l1q1L49q1k5j88P1J76L25j93l39k29L60O8r5
$$ -112 -19 169 -51 -187 78 53 -80 -89 -117 -148 -229 120 39 14 -174 -103 73 398 205 -134 -363 -3 65 -30
5515c0R4j22pJ55Q1m3j7q8o3P7J60j24j78j81L3L76O6k23j28j26K75J79K1k50
$$ -30 64 -58 -65 90 171 128 111 23 -40 37 197 73 -105 -286 -253 123 189 -34 -162 -288 -13 166 187 -63
5539f3j69M02o1K7p6p2k8R1K3j06K63k76n4J25K33j15l79J06J40K61j50J2k85
$$ -63 -232 170 109 136 60 -12 -40 51 74 -32 231 -45 -99 26 259 144 -235 -129 11 272 122 134 -151
5562a51Q5P6J09j70J42k48n5J55MK39l20J93m56L84L25k75n3k75K01K11J90k63
$$ -151 -66 10 119 -51 91 -157 -212 -57 -53 186 -134 59 -397 -13 312 37 -16 -291 -90 121 311 48
5584D8l44K36R3j31m4J48j76M50k56MK8j25j62p4N48n8j57P8l05KL72j80k24Q4
$$ 48 -296 -60 33 -98 -142 6 -170 280 24 28 56 -69 -231 -305 243 185 28 106 -199 -197 175 -5 -229 -145
5608a45J87j3J84j52j90R0M7j8j0j4JL2M4K61m09K14j96q5K01J89k40k45L49j53
$$ -145 42 29 213 61 -129 -39 8 -10 -20 -34 -33 -1 43 304 -105 109 -87 -172 29 218 -22 -267 82 -71
5632g1Q2J31k88J9J94j07M5O5q1j03j84L13J64j86j14k7n8L29K3k79J49o7J21
$$ -71 11 142 -146 -127 67 -40 5 70 -11 -114 -298 15 179 -7 -121 -148 -206 123 146 -133 16 -51 70
5655G0j8J21m84P3L56n5j09J28k39j63R8L34j98L45k41j41R9R1j04k15K44J2j30
$$ 70 52 173 -311 -238 118 63 -46 82 -157 -320 -222 112 -86 259 18 -123 -24 67 -37 -252 -8 4 -126
5678a26K72kl05J51J10Nj79N6j04J65J19j00J1j49oj5KJ80o8j18q5J44Q1K20l82
$$ -126 146 144 -161 -10 100 105 -74 -18 -122 43 162 62 73 -76 -82 -97 -95 85 17 -101 -186 -42 39 259 -123
5703a23N9J65J22j32j38o8k28M35L5p9rM8j92J73K92k76m7j82K51r3K87m20j15
$$ -123 -64 101 223 91 -47 -115 -343 92 127 48 39 87 -105 68 360 84 37 -145 106 13 300 -120 -235
5726b35J58J75J10j59J02l42J13L15j89n8k0q7J15rJ03l31K7R4n9L57J00m75Q9
$$ -235 -77 98 208 49 151 -191 -78 237 48 -10 -30 -117 -2 -11 92 -239 -212 -118 -177 180 280 -195 -106
5749a06J38J01j52N4o1j77R0K56j70L1n9j29K31O9q4Jq9J04k25M77k57k52J29
$$ -106 32 133 -19 35 -26 -203 -113 143 -27 4 -55 -184 47 116 32 33 -56 48 -177 300 43 -209 -80
5772h0p4K99j02Jk83K33M7J01r3j43p0k2L26j51m1l8K1j16J45J01j5j29J35p6
$$ -80 -154 145 43 44 -239 -6 41 142 49 -94 -164 -186 140 -11 -52 -90 -69 -185 -40 61 46 -83 52 -24
5796b4O6J23k15J9J14J42j76j09l3O6J85J74m94J86R0n4k24L23k35l4MJ03rK34
$$ -24 42 165 -50 -31 83 225 49 -60 -93 -27 158 332 -162 24 114 60 -164 159 -76 -110 -106 -3 -12 222
5820B22pm53m4K90K3j38J69j16p3K65jj51lJ74k06J34j03J24m7j37J8O6J39j77
$$ 222 215 -238 -282 8 31 -107 62 -54 -127 138 137 -14 -17 157 -49 85 -18 106 59 -78 -60 6 145 -32
5844c2j6q8K60n0oj5l63M14L85m00l51J41J31L5J1l1j03p2L27j30J29j27j53N0
$$ -32 -48 -136 124 74 68 53 -310 104 489 89 -262 -121 10 45 56 25 -78 -150 177 47 176 49 -104 -54
5868e4J28l1j17l5mk8J64P7j79J82r2j27M1K05j93j13K04mr1J92J3j94j9J17Q9
$$ -54 74 43 -74 -109 -113 -141 23 100 -79 103 11 -116 -75 130 -63 -176 28 24 -67 125 138 -56 -75 42 131
5893A31m7k63N6O6J73o5p3j35JJ97N7j28o6l6J75q4l9J71j01n1J37n0J8J24l97
$$ 131 84 -179 -123 -57 116 51 -22 -157 -156 41 98 -30 -96 -132 43 -41 -80 91 -10 -61 76 26 44 168 -229
5918b29q8M43J39l66j04Q9lJ00K83l08j83J46J20k28K73R3k62J42j00j2M13m78
$$ -229 -317 126 265 -101 -205 -116 -119 -19 264 -44 -227 -81 39 -189 84 177 -85 57 -43 -55 358 -120
5940a20J8k9L62k12o6l9K0m3K67J31l35RMj28K63J06k81j23K89Mj39J83j96k64
$$ -120 -102 -131 231 19 -47 -86 -66 -109 158 289 -46 -37 -33 -161 102 208 -73 -196 93 97 -42 141 -55 -319
5964c19L54L3l09L38k46J94P5l8r5r7K6J32R4r6l6m7J50r5j4L1L0j27K8J95N6
$$ -319 35 68 -241 97 -149 45 120 82 -13 -110 -84 48 142 46 10 -37 113 18 4 35 65 -62 -34 161 217
5989B17Jk12j77j4L64Mj66k63K66q5J36M8q4m6K10j02j5J95j53o1n3O6Rp0n4o6
$$ 217 218 6 -171 -185 179 183 17 -246 20 -65 71 119 35 -11 199 97 82 277 124 63 10 76 85 15 -39 -105
6015a05k0K84K1k90P7l0J00J45o6k71K01j78N5K46m4j91PR2J60j66J9O9j52K17
$$ -105 -125 159 180 -110 -33 -63 37 182 116 -155 46 -132 -77 169 125 -66 -59 33 193 27 46 115 -37 180
6039A80j4j31l1O9n8K47k12k30J36J17NJ5J83k41j07Q0M4J75k94J02k54K14K11
$$ 180 166 35 4 73 15 262 50 -180 -44 73 78 93 276 35 -72 8 52 227 -67 35 -219 -5 206
6062B06j43k53J45N0R2M6M3j88j78K65P7qq8o1j49J81K37l43J63l59J19N5K07
$$ 206 63 -190 -45 5 97 143 186 -2 -180 85 162 154 66 5 -144 37 274 -69 94 -265 -146 -91 116
6085A16o9j32k0R2j18K41r0j94K72J80k40n1N6k62J97N8J61p1k43M4l9K17m6j91
$$ 116 47 -85 -105 -13 -131 110 20 -174 98 278 38 -13 43 -219 -22 36 197 126 -117 -73 -112 105 59 -132
6109a32J92k61J40J19J81m64K13K6r0R5J21k77R2J46j38q8J21N4j86J43J68J2
$$ -132 60 -201 -61 58 239 -225 -12 14 -76 19 140 -137 -45 101 -37 -125 -4 50 -136 7 175 187
6131A87k26R7k89J69K19j15j18j09K84q5M4j20O7JO6om3j96m3K06m4R5j11M4j11
$$ 187 -39 58 -231 -62 157 42 -76 -185 99 14 58 -62 5 6 72 66 23 -173 -216 -10 -54 41 -70 -26 -137
6156a37j1L42j72p1o7J40j64K83j93m0J57J9j12k0J32k02j23K67LJ12k25J32l67
$$ -137 -148 194 22 -49 -116 24 -140 143 -50 -90 67 86 -26 -46 86 -116 -239 28 31 143 -82 50 -317
6179c17J73K50j28J7Pqn6J69p6r7j97L41jM1j30R2k23L63k05r1J66j32QJ04J27
$$ -317 -144 106 -22 -5 2 -6 -62 107 31 -66 -263 78 77 118 -12 80 -143 220 15 -76 90 -42 -34 70 197
6204A97k26l4n2n6K60nj62j04L06J15l13J02j81P8J86P3k13ql2p6K00o9J31l21
$$ 197 -29 -63 -115 -171 89 84 -78 -182 124 239 -74 28 -153 -75 111 184 -29 -37 -69 -145 55 -14 117 -204
6228b04J97j97N3K90m7l68J13K30l0R3j28L2k23L31k3j42P1p7k43L91R6j42J3
$$ -204 -7 -204 -151 139 92 -276 -163 67 37 130 2 34 -189 142 119 -23 48 -29 -272 119 215 73 86
6251H6j29L5m9K54j83j37JL27n2r6j35RK2J89j14n9P8j45K86j25n2q7P4R1j62
$$ 86 -43 -8 -57 197 14 -123 -122 205 153 57 -78 -69 -47 142 28 -31 47 -98 188 63 11 -76 -2 89 -73
6276g3J38J45k19k10K67q1o8K72k33o2J08J60j26p4J27k07K07j33K1q8J95j35
$$ -73 65 210 -9 -219 48 -33 -101 171 -62 -124 -16 144 18 -56 71 -136 71 -62 -41 -129 66 -69
6298f9M2P8K9m32K77J5k1J74k18j66L42l8J42k69J29l47J7N07j76k20K51j09q5
$$ -69 -27 51 80 -352 -75 -60 -81 93 -125 -291 51 13 155 -114 15 -332 -315 192 16 -204 47 -62 -147
6321a47J45j55O7O0J2N2J01r9j3k09K57J56m4p0j45N0p2J06O9j72K26j82Oq1O1
$$ -147 -2 -157 -90 -30 -18 34 135 36 23 -186 71 227 183 113 -32 18 -54 52 121 -51 175 -7 -1 -82 -21
6346b1j5p7L4J68J5j88L3M3J40j41J6J92l13J91L8j49LM1j92M5K23J21k41Q5j4
$$ -21 -36 -113 -79 89 104 -84 -51 -8 132 -9 7 199 -114 77 115 -34 -31 10 -182 -137 86 207 -34 51 37
6371C7P1j32R7Qk70O7L63j51k26J45l50M17l2Mj9j62N5J31j57J14k06K99j32l4
$$ 37 108 -24 73 81 -189 -122 241 90 -136 9 -341 76 44 48 29 -133 -78 53 -104 10 -196 103 -29 -63
6395f3N3k6m9R2J40P8j91K3l16J12L22j0k06K1J75j26Q5k01l1Q1K58k31m8K60
$$ -63 -10 -36 -85 7 147 225 34 57 -259 -147 175 165 -41 -20 155 29 114 -87 -118 -37 221 -10 -58 202
6419B02m69J38J32R8m8P5j51j94L41o7j34j70J89j01J42K99l33L5j59J82M7j60
$$ 202 -267 -129 3 101 53 128 -23 -217 124 57 -77 -247 -58 -159 -17 282 -51 -16 -175 7 54 -106
6441a06J18j94O3L20j79j29L19j83p9J49j8j33O9r8r4R4J48j78j59J80J28k48
$$ -106 12 -182 -119 201 22 -107 212 29 -50 99 81 -52 17 -81 -175 -81 67 -111 -270 -90 38 -210
6463b10J76M1rr2J57L0q8J20l82K09J90n5l58J81j49J36L84k13j63J37j4k20J31
$$ -210 -34 7 -2 -94 63 93 5 125 -257 -48 142 87 -271 -90 -239 -103 281 68 -95 42 28 -192 -61
6486f1K17l27J00J13j05q5P1R4j48J48M6p0j84M6PK27Oj28k52L70l3j10N3j09
$$ -61 156 -171 -71 42 -63 -148 -77 17 -131 17 63 -7 -191 -145 -138 89 95 -33 -285 85 52 -58 -5 -114
6510a14J87j00Oj15K10K2j61j40L03j1j22o7n9J36R9r9p4k08O3J44J21m3j1n2
$$ -114 73 -27 -21 -136 74 96 -65 -205 98 87 -35 -102 -161 -25 74 -25 -99 -307 -244 -100 21 -22 -33 -85
6534h5Q9q0J7J27j31J81J0jk11M4J52k21K04Q5l19PJ14l7N7R3j49p3J59m0J52
$$ -85 4 -76 -59 68 -63 118 128 127 -84 -40 112 -109 95 180 -139 -132 -18 -55 2 95 -54 -127 32 -8 144
6559A44j19J7O6j43J03k34K06K27k40k03J18L11j96n8p7P2J67j24n5Q3o6J29l44
$$ 144 25 42 108 -35 68 -166 40 267 27 -176 -58 253 57 -1 -78 -6 161 37 -18 65 -1 128 -216
6582b16K74j23p6K50J05j19NJ02l95L01J8j00j28m4O1l1K66k89J19J63n6n3O8
$$ -216 58 -65 -141 109 214 95 100 202 -193 108 126 26 -102 -146 -85 -116 150 -139 -20 143 87 34 102
6605A02L8k13N1j3J53j23J20p9k31J93M4j82J52Q3k12K50r1n3l5J6N7p3N7N6l19
$$ 102 140 -73 -22 -35 118 -5 115 36 -195 -2 42 -140 12 95 -117 133 42 -11 -46 -30 27 -46 11 67 -252
6630b52L69K1k87L14j13l04J61M3P7n2J07j48K5N3r9K11j04O9r9K67k87m5J87
$$ -252 117 138 -149 165 52 -252 -91 -48 29 -23 84 -64 -39 14 -85 126 22 91 -8 259 -28 -73 114
6653A14Q5o2j19n7p7j44L18r9j07J13q0M7J45J21k28pL0J06l0N6o8j50M8J89j33
$$ 114 199 137 18 -39 -116 -260 58 -41 -148 -35 -115 -68 77 198 -30 -37 -7 99 69 125 57 -93 -45 144 11
6678A1M2O7l02J01K37j77N9j90K17j06Q0N6j89J1J65j09J37m6K2q8r5LP5J13j36
$$ 11 53 120 -182 -81 156 -21 38 -152 65 -41 39 95 -94 -83 82 -27 110 64 86 -2 -97 -94 -19 94 -42
6703d2J21M8o4j34J76l7j05N7J06j83j16K82j06O6j72J05M0J65j47j55L03j21
$$ -42 79 127 63 -71 105 68 -37 20 126 -57 -173 109 3 69 -103 2 42 207 60 -95 208 87
6725H7q5J14l01J31Q8r0O2k17K93M4k87P4K16r1J7JP6k62J48km2O0j52O8K95j18
$$ 87 2 116 -185 -54 34 -56 6 -211 82 126 -161 -87 129 38 55 56 132 -130 18 16 -26 34 -118 -50 245 127
6751A27k52L36Ll05K58o3j80M3J68k38O9J02q3jRJ37k3o4Kj64J5J38p0K4P4m5
$$ 127 -125 211 214 -91 167 104 -76 -33 135 -103 -34 68 -15 -16 -7 130 107 43 45 -119 -104 34 -36 -12 62 17
6777A7R5j32O3r8R5j89P0P4K5j52L2J19o5J17P2k38J15q1J5o5J65J42k80J75o7
$$ 17 112 -20 43 -55 40 -149 -79 -5 20 -132 -100 19 -46 71 143 -95 20 -61 -46 -111 54 196 -84 91 24
6802B4l7j12R1nR7K36k53k71j5K34J49o3M8j21j28L46j16J7m7j61Q7J07j75q1
$$ 24 -13 -125 -34 -39 58 294 41 -230 -245 -11 138 75 123 2 -126 220 104 121 74 -87 0 107 -68 -149
6826a49J77J26l03M6J68n1k19K33M8k05J00Q3l63K81J78l55L02m9j15K6K31k42
$$ -149 28 154 -149 -103 65 14 -205 28 76 -129 -29 54 -309 -28 150 -205 97 48 -67 -41 190 -52
6848e2L2J71j15N8J0j49J18j14J0p2N6N1j87L1J09Q6k79J74J74k26K25n2j17L12
$$ -52 -20 151 36 94 104 -45 73 -41 -31 -103 -47 4 -183 -152 -43 43 -236 -62 112 -114 111 59 -58 254
6872B54k01k41J00K27j14r4J57j70J62L8o1k60L43J20l03J42k21J33jK83l53p2
$$ 254 53 -188 -88 139 25 -69 88 -82 80 118 57 -203 140 260 -43 99 -122 11 10 293 -60 -132
6894a32J20j72J56l5J12k43J14J22m0p1K17k84N2Q9l5Q3K6j52q1J30P7L2m9j07
$$ -132 -12 -184 -28 -63 49 -194 -80 42 2 -69 148 -136 -84 5 -30 53 79 -73 -154 -24 53 85 36 -71
6918g1N6j24P6R2j22J34J21j81j5p9K29k22P4J08j01O0r3mK64j13r9L0J7j44K66
$$ -71 -15 -139 -63 29 -93 41 162 -19 -34 -113 116 -106 -32 76 -25 35 -58 -62 202 89 -10 20 37 -107 159
6943A59j92J33p2N4k47J55J72l95O2K67Mk9M3k65O5Q6M4O0j61J21l9L8j92J85
$$ 159 -33 100 28 82 -165 -10 162 -233 -171 96 100 71 114 -151 -86 0 44 104 -57 64 25 63 -129 56
6967E6k16L78k14j64L76k22j72K04j29J62R9j58j49N4N6R4k76K85j07o2K47J29
$$ 56 -160 218 4 -160 216 -6 -178 26 -103 59 158 0 -149 -95 -39 55 -221 64 -43 -105 142 271
6989B71l42J42o3j51J59M7j62n4J62j06J36Q7l5k76L55pl01J41j39j34K55J51
$$ 271 -71 71 8 -143 16 63 -99 -153 9 -97 39 126 91 -185 170 163 -138 3 -136 -270 -15 136
7011A36r2k31K07k1K7L60l67j20K28j4k10Q2Q8p9r9J56Q7k80K37o6k59M32j82
$$ 136 44 -187 20 -1 26 386 19 -101 127 113 -97 -15 73 -6 -105 51 138 -142 95 29 -230 202 20
7034B0j14J88j73J65m6J40j33j48R7o3j28L00K1k46J26j3j54J90J3j19R0j69J78
$$ 20 -94 94 -79 86 40 180 47 -101 -4 -67 -195 105 126 -120 6 -7 -161 29 42 -77 13 -156 22
7057B2j44J93%rpk01J79J20j11p6j25J29J15k04L30k36J3r5K06j04n6J38j85L10
$$ 22 -122 71 71 62 55 -146 33 153 42 -34 -159 -30 85 -119 211 -25 -12 -107 99 -5 -61 77 -108 202
7081B02k66k4K07j16p1n7LK16mQ2l75O2R4L80n19L54j29N3J02k54o4K85l56K64
$$ 202 -64 -88 119 3 -68 -125 -122 94 90 172 -203 -141 -47 333 -186 168 39 92 194 -60 -124 161 -195 69
7105F9j21j5K76l36r7L82m7jn6j40J6J15O5p6J3k58K00L9J04j85%K4J5j3Q9j39
$$ 69 -52 -67 209 -127 -224 158 111 110 54 -86 -70 45 110 34 47 -211 -11 28 132 -53 -53 -29 -14 -27 62 -77
7131g7l7K7K67j09K2p2j28J75n0j8J14Q9j98m6J23J7j81P5j9m0L87j24l99J67
$$ -77 -114 -87 180 71 93 21 -107 68 18 0 114 203 5 -41 82 99 -82 -7 -26 -66 321 197 -202 -35
7155c5KM8M8K9l8Np8J48l1j6j76k4R4Q5J6p4K60l72J66r8r0MK1Q8J26oj5j97O3
$$ -35 -33 15 63 92 54 59 -19 129 98 82 -94 -118 -24 61 77 3 263 -109 57 -41 -131 -127 -106 -18 108 102 87 -110 -47
7184d7J24K4K9j86O5j7O3Q1o8lP0m40M91j33j54K0K20k07L8J83j74q2K05j26L8
$$ -47 77 101 130 -56 9 -8 55 136 68 65 135 -305 186 53 -101 -81 139 -68 -30 153 -21 -103 102 -24 14
7209A4J05p3j81K47R7j21j12J8N4K14k91o9K9K3j7K7K29j49j6oL4j69R0j9j45
$$ 14 119 46 -135 112 209 88 -24 -6 48 262 -29 -98 -69 -46 -63 -36 193 44 28 22 56 -113 -23 -42 -187
7234a87J13J22j2r4J56j56K3n0M4L2Mj14q4L15k1%k62J25R5j20L30k36L3j8m4
$$ -187 -74 48 36 -58 98 -58 -35 -85 -41 -9 -5 -119 -203 112 91 91 -171 -46 49 -71 259 23 56 38 -6
7259fj09K23k86O1J77L5O5r4j50J83p6N2j73j09M03o0l82J84k5J15J1K3o7K5O7
$$ -6 -115 108 -178 -117 60 95 160 66 -84 99 23 75 -98 -207 196 136 -246 -62 -87 28 39 62 -5 20 87
7284H7k23J76L7p0J2J2J06j33J49l4l84M53k46J46j60J02P2k67K96j66j22K58
$$ 87 -136 40 77 7 19 31 137 4 153 119 -265 188 -58 88 -72 30 102 -165 131 -35 -157 101
7306A01l3k69K60R0r9j21J16p6k1J87j65Q3P7j39M8L3k8j83O3J61r6NK09k58M4
$$ 101 68 -201 59 149 50 -71 45 -31 -52 135 -30 53 130 -9 39 72 44 -139 -76 85 -11 -6 203 -55 -11
7331a1J76O1k94J36N8k46Q8L7Kj06K78Jk51J13n1J2O0pp7O2o2K3O5J18k41j97
$$ -11 165 226 -68 68 126 -120 -32 5 7 -99 179 180 -71 42 -9 3 63 56 -21 41 -21 2 67 185 -56 -253
7357b53L46M8l79L87j1j49J87l63K13J60j79m9R9M2j26k6L53k17j09l1m5M2J04
$$ -253 93 141 -238 149 138 -11 176 -187 26 186 7 -42 57 99 -27 -53 300 83 -26 -57 -102 -60 44
7380D4mj48J00L4J54k83J40K0q3K35j72j45R0O7j58J76o5r8L12q3j78p5R7j6K5
$$ 44 40 -108 -8 26 180 -103 37 57 -26 209 37 -108 -18 49 -109 67 2 -96 216 133 -45 -120 -23 -39 -14
7405a4J03k93L70l26K69j67K49k30j42P9Q8O3J2L8k08p7J93M3j73l7J93k22K64
$$ -14 89 -204 166 -160 109 -58 191 -39 -181 -102 -14 49 61 99 -109 -186 7 50 -123 -160 33 -189 75
7428G5k27L32j86R9L9l05K91M3p0k05qJ72J18j53j72K59m0p8J13j57j25Q0K02
$$ 75 -152 180 -6 93 132 -173 118 161 91 -114 -122 50 168 15 -157 102 62 -16 97 -60 -185 -105 97
7451I7p7l6N7K8k19K3K07Jj61J35j96J84k8j01K0J6K04l2m7P3j29r5K06j97j17
$$ 97 20 -16 41 69 -150 -127 80 81 -80 55 -141 43 15 -86 -66 -50 154 122 75 148 19 -76 130 -67 -184
7476a84J35J87k19J31O1j21l9n7J5K13j6k04J12K28k00n5J26p3q9J65o0j59J60
$$ -184 -49 138 -81 50 111 -10 -49 -106 -91 122 106 -98 14 242 42 -13 113 40 -49 116 56 -103 57
7499E7l6p7J31L7j78J55o1k21Q6N5K11j38j30J98j35q6R0j18J27O1l0KJ42o1j20
$$ 57 21 -56 75 112 -66 89 28 -193 -107 -52 159 21 -109 89 -46 -132 -42 -160 -33 28 -2 0 142 81 -39
7524c9J31n5k7J20l6q7p3J46k6j37J67o3l5J2j02L69j49r1lK8P1j13j09N9L8j08
$$ -39 92 37 10 130 94 7 -66 80 54 -83 84 21 -14 -2 -104 265 116 25 22 50 121 8 -101 -42 -4 -112
7550a12J96j50j4PJ00j8j0J00k4k4q5j54J15P5J6O2q8J2O3K12k13j78J61j07o1
$$ -112 84 -66 -80 -73 27 9 -1 99 75 51 -34 -188 -73 2 18 80 -8 4 67 279 66 -112 49 -58 -119
7575a19n8J13K0K7R7j47j48K44J20k10J33J13l08K2j6J15J00k57K42j70N0J18
$$ -119 -177 -64 -44 -17 80 -67 -215 29 149 -61 72 185 -123 -101 -117 -2 98 -159 83 -87 -37 81
7597H1q9J15k09K09j84Rj3k1K7k9O0K92j08j45K3j6N8r8QK1J06J76k99J08k1j32
$$ 81 -8 107 -102 107 -77 -68 -81 -102 -75 -104 -44 248 140 -5 18 2 60 -38 -30 -9 97 273 -26 82 61 -71
7623g1j09R6J00n6J84j82J11J62k8l61K58Q8l51Q6K9k2N9J04P5k97O3p8j2K49
$$ -71 -180 -84 16 -40 144 -38 73 235 207 -154 104 192 -159 -73 -44 -66 -7 97 172 -125 -62 -140 -152 97
7647I7P6j04k77J67o1M1J09q3n0J37m2K0J31m1j25M2Q2j30o1J14M4k40L35l21
$$ 97 173 69 -208 -41 -102 -61 48 -35 -85 52 10 30 161 120 -5 37 119 -11 -72 42 86 -154 181 -140
7671a40j0K93k98J01j2O0j29J45j04J55r0j14J65k39K17J41o2j15m1J78j37J80
$$ -140 -150 143 -155 -54 -66 -6 -135 10 -94 61 -29 -143 22 -217 0 141 79 -36 -77 101 -36 144
7693A44k36R5M1j14O8j8j39K05kk59J53P6j29l7K43o4n9l5J89j46j76K74J54k43
$$ 144 -92 3 44 -70 -2 -20 -159 46 44 -215 -62 14 -115 -152 91 27 -32 -67 122 -24 -200 74 228 -15
7717a5J63j40P6M6K7j94j20J01n1K57m8j3j14k5R9j84P5O8O4j52J74k05J06p4
$$ -15 148 8 84 130 157 -37 -157 -56 -107 150 102 89 -25 -50 49 -135 -60 8 72 -80 94 -111 -5 -79
7741g9k80J38J65K30k7m2j38j07K60p9pJ13n3k34P3K18j02j96K98j80J30r0J84
$$ -79 -359 -221 -56 174 147 105 -33 -140 120 41 34 147 94 -140 -67 151 49 -147 151 -29 101 11 195
7764A95k55N0J38j16J50k16K4j05J65j29o6N8J59k13J85Nlk11K68j25N7j01Q0
$$ 195 -60 -10 128 12 162 -54 -30 -135 30 -99 -165 -107 52 -161 24 29 26 -185 83 -42 15 -86 -6
7787fj37K57n4q2n6j05L34k33J59j25N0j01j32J02J97j05J18o1p6O2J08j85K3
$$ -6 -143 114 60 -22 -78 -183 151 -82 77 -48 2 -99 -231 -129 68 -37 81 20 -56 6 114 -71 -48
7810d8p3K15k19J94o4n5lJ84j89J21j35N0q6K1M0j5j08M28k73j4K38j39mp8j11
$$ -48 -121 94 -125 69 5 -50 -53 131 -58 63 -72 -22 -108 -87 -47 -62 -170 258 -15 -29 209 70 66 -12 -123
7835a23O6k6K8j33J60O3l19L39j17J03J1n2j43K54j50j4O4J88j45q9R2L0k40p7
$$ -123 -57 -83 -55 -188 -28 35 -284 55 -62 41 52 0 -143 111 -39 -53 11 199 54 -35 57 87 -153 -230
7859b30L31Jk43J33p4pL05l30J94k32J62j16J4J12J38j00j22j34K79j14K36k62
$$ -230 101 102 -141 -8 -82 -89 216 -114 80 -152 10 -106 -92 20 158 58 -64 -198 81 -33 203 -59
7881e9M7p9J52j16l0N2N8j48K13N9j00j75J3J28P8k58J39RJ4N3R1j14r6k8LK33
$$ -59 -12 -91 61 -55 -85 -33 25 -123 90 149 49 -126 -113 15 93 -165 -26 -17 -3 50 141 27 -69 -97 -94 139
7907A39j34J03j06O5j41P2j56%k5K58l7j9J19j29j35J9J39p7Q1M0l5qr2k1n0L7
$$ 139 5 108 2 67 -74 -2 -158 -158 -183 75 38 19 138 9 -126 -107 32 -45 36 76 41 33 -59 -80 -130 -93
7933i3K27k25o3J98j55P3j1R7j20J28m5l4pn6%O7J54k17J20P1K2j92K48j18k1
$$ -93 134 -91 -154 44 -111 -38 -49 48 -72 56 11 -23 -30 -86 -86 -19 135 -82 38 109 131 -61 187 69 48
7958D8j00M7l2j07J85r3J53M5j66m2lJ23q5J0K45l47K24M9j65J77j49K8L4N8j48
$$ 48 -52 -5 -37 -144 41 -52 101 146 -20 -62 -65 58 -27 -17 228 -119 105 154 -11 166 17 45 79 137 -11
7983a1p5J9J7n7O2n4L9J64k4j52P5M3j09r9M43l50l0L8l5O8K4M6K1l14K33N2j48
$$ -11 -86 -67 -50 -107 -45 -99 -60 104 80 -72 3 46 -63 -162 281 -69 -99 -61 -96 -28 -4 42 63 -251 -18 34 -114
8010a14K86j43j6J58j23q4J19j87O1q1K54j96J4J75l69J37L34l51J20k1Rn9J59
$$ -114 172 29 13 171 48 -36 83 -104 -43 -124 130 -66 -52 123 -246 -109 225 -126 -6 -27 -18 -77 82
8033H2j07L3Ljj26lM0K5J80j91j1O4J71l03K77j12P1k07j5L2M6R3j34P0j42K66
$$ 82 -25 8 11 10 -116 -119 -79 -54 126 -65 -76 -12 159 -144 133 21 92 -115 -130 -98 -52 41 -93 -23 -165 101
8059A01j32k23L61J2O2j13M9l33K92n6n7pJ29r6j04K30j60j11J88j92Q1q8J47
$$ 101 -31 -254 107 119 181 68 117 -216 76 20 -37 -44 85 -11 -115 115 -45 -156 32 -160 -79 -167 -20
8082b0Ql1J42l56K34P5q7K5J41r1Pj3J80k93M9K6L3j66L21k58J54p4J55r3j70
$$ -20 -12 -43 99 -257 -23 52 -35 -10 131 40 47 34 214 -79 -30 -4 29 -137 184 -74 80 6 161 68 -102
8107a02P7N8Q8j31q8R5O1j40j0J37N7j94N8N4j26J6K78k32J1N8J83j90J08j45
$$ -102 -25 33 121 -10 -98 -3 58 -82 -92 45 102 -92 -34 20 -106 -90 188 -44 -33 25 208 18 126 -19
8131a9o1m0J17l8K31q8j76J56j5O5j79L6QO3j19q9K3N8K55k66J28k7j50J58j6
$$ -19 -80 -120 -3 -41 190 102 -74 82 67 132 -47 -11 -3 60 -59 -148 -125 -67 188 -78 50 23 -127 31 15
8156A5k1o5J52j27n1J64J2j39K3j09LL98k79k75L68m0k2j23J49k73K92M2j21K25
$$ 15 -6 -71 81 -46 -97 67 79 -60 -37 -146 -143 255 -24 -299 69 29 7 -116 33 -240 52 94 -27 198
8180A98l57O6qJ97j72R8n2K9OP4o4
$$ 198 -159 -93 -101 96 -76 22 -30 -1 5 79 15
8191A5
$$ Imaginary data points
##PAGE= N=2
##DATA TABLE= (X++(I..I)), XYDATA
0@%%%%%%%%%%%%%Qj6J6j6J6j6K4l2L2l6M4n0N8o6P4q5R5j08J23j38J55j72J89
$$ 0 0 0 0 0 0 0 0 0 0 0 0 0 0 8 -8 8 -8 8 -8 16 -16 16 -20 24 -26 32 -34 40 -45 50 -58 65 -73 82 -90 99
36I9k10K33k58K85l14L49l88M31m78N29n87O54p31Q20r25J052j207J403j660K013
$$ 99 -111 122 -136 149 -165 184 -204 227 -251 278 -309 345 -386 434 -491 561 -646 757 -903 1110
56A110k527L352m893Q718l4095p0152O8112P6154L362n1615k8275J8962L5285
$$ 1110 -1417 1935 -2958 5760 -28335 -98487 -30375 45779 49141 -2474 -30749 -11787 23498
69B3498r802k9877R713L1971n649k0716J981J4235l386k3504j8672L1685N4232
$$ 23498 13696 -16181 -6468 25503 19854 -862 1119 15354 11968 -11536 -30208 1477 55709
82E5709j0617p2943l3056L8716N0285R675l2348l5168O080K5985j553j3206M963
$$ 55709 45092 -27851 -60907 -22191 28094 37769 5421 -29747 -23667 2318 765 -12441 -7478
95g478M330l646O684N920j0038j4814q342J1414L6784J7568l7666m2474Q019L4546
$$ -7478 -3148 -6794 -110 5810 -4228 -19042 -27384 -15970 20814 38382 716 -41758 -33739 807
109H07J8717o603k0462p461J1758j801j5538P489J8710o901j4404M082Q505l194
$$ 807 19524 12921 -7541 -15002 -3244 -5045 -20583 -13094 5616 -1285 -15689 -11607 -3102 -6296
123f296j6558j6475J7203M5213M939n1141l5066K1539M3396J7349k4732l1968
$$ -6296 -22854 -39329 -22126 23087 28026 -23115 -58181 -36642 6754 24103 -629 -32597
135c2597J0960L3192m032k8537q20K3147J6186j452j7937j2568J1535R213r632
$$ -32597 -21637 11555 7523 -21014 -21834 1313 17499 16047 -1890 -14458 -2923 6290 -3342
148c342M312K2847J016k6602k2074M628L0771K4124k1160l7333M041K9263M276
$$ -3342 970 23817 24833 -1769 -23843 -19215 11556 35680 14520 -22813 -18772 10491 14767
161A4767k0561j6993N372K7882J4574k6187l0083L966J9817J2553N900p941j5659
$$ 14767 -5794 -22787 -17415 10467 25041 -1146 -31229 -27263 -7446 5107 11007 3066 -12593
174a2593m773K756M311J5139Q487j6434j3673J1115J1444l342q586p761O416K1238
$$ -12593 -17366 -14610 -10299 4840 13327 -3107 -16780 -5665 5779 2437 -6149 -13910 -7494 13744
188A3744M847k1590j6227J192P937J6701J3310j1999k3827j0484O740K1324J8645
$$ 13744 18591 -2999 -19226 -18034 -10097 6604 19914 7915 -15912 -26396 -19656 1668 20313
201B0313j6097l2157L316L0485R652j9938k3002K475L2286K1918k2774l0587N106
$$ 20313 4216 -27941 -24625 5860 15512 -4426 -27428 -24953 7333 29251 6477 -24110 -19004
214a9004J9779O545N25J053j12l404j3904p915K4773K8379j6878l6654j207L1055
$$ -19004 775 7320 7845 8898 8786 5382 -8522 -16437 8336 36715 19837 -16817 -18024 13031
228A3031K0152j7716l8378l817M4421K6242l2197l9329R18K6745K0302n617k1918
$$ 13031 33183 15467 -22911 -26728 17693 43935 11738 -27591 -26673 72 20374 14757 -7161
241g161o072J1155k130q352J1290J3254r543j5573j521J4099J5534q707k6898
$$ -7161 -13233 -2078 -4208 -12560 -1270 11984 2441 -13132 -14653 -554 14980 6273 -20625
254b0625P29L2996J4499k0783k3698l329J7909K3465m31k0668r537L506L297Q458
$$ -20625 -19896 13100 27599 6816 -16882 -20211 -2302 21163 20732 64 -9473 -5967 -2670 5788
268E788Q700r402j4884Q41J0936Q813l440j9440j0271K1795K1461j1781k2818
$$ 5788 14488 5086 -9798 -8957 1979 10792 7352 -12088 -22359 -564 20897 9116 -13702
281a3702n399J0437J4201M044j0273m921O162m111p047J2343J4250p542j5847
$$ -13702 -19101 -8664 5537 9581 -692 -5613 549 -3562 -10609 1734 15984 8442 -7405
294g405l592J3937J9489n392l1401p200L3509K2950j8781l0902p203K3645K5888
$$ -7405 -10997 2940 22429 17037 -14364 -21564 11945 34895 16114 -14788 -21991 1654 27542
307B7542q675l0051l230J9692M167j0480m150L603N031j820j0845O88J6920n49
$$ 27542 18867 -11184 -14414 5278 9445 -1035 -5185 -1582 3449 1629 -9216 -8528 8392 7843
321G843k2509m845K1890J6689q665k5105j2218K3351K9185q295k8887n832J5873
$$ 7843 -14666 -19511 2379 19068 10403 -14702 -26920 -3569 25616 17321 -11566 -17398 -1525
334a525J4356R81j2822j0387Q230J0324k748k972J030o965n359Q969R336o94r620
$$ -1525 12831 13812 990 -9397 -1167 9157 6409 3437 4467 -2498 -7857 1112 10448 9754 134
349A34j3998n25K0133J0561j5618j4593K418Q043P251P87r531n603M982K986K521
$$ 134 -13864 -14389 5744 16305 687 -13906 -11488 -3445 3806 4593 -4938 -10541 -5559 -2573 -52
364e2O658m214j5988n27J7866J2599m996j9597j3489J7205K8173m355k7437q831
$$ -52 6606 2392 -13596 -14123 3743 16342 11346 -8251 -21740 -4535 23638 19283 -8154 -16985
378a6985J5211J5491P03j4922j0567R908J0541p382m778O807l75r573l484P955
$$ -16985 -1774 13717 14420 -502 -11069 -1161 9380 1998 -2780 4027 3652 -5921 -9405 -1450
392a450J2743J407k1746j6524J9337K8344n604k7437j2482J5114K5300L624k5364
$$ -1450 11293 12700 -9046 -25570 -6233 22111 16507 -10930 -23412 -8298 17002 20626 -4738
405d738j5349J6175J7674k765r407m652P27O036J561k524M296K130j3475o776
$$ -4738 -20087 -3912 13762 10997 1590 -3062 -2335 3701 5262 2738 7034 9164 -4311 -11087
419a1087J4682J3030o885j6245q681J0086J9933p97k2002r276J1456J1075J112
$$ -11087 3595 16625 9740 -6505 -15186 -5100 14833 14036 -7966 -17242 -5786 5289 6401
432F401n954j0041k216Q692M845L69M68p760r770Q493J6488O92j3210j0438K842
$$ 6401 447 -9594 -11810 -3118 1727 2096 2564 -5196 -14966 -6473 10015 10707 -2503 -12941 -10099
447a0099J7374J0977j4464j6343O491J3856K449m252n536k900M353K916k501L865
$$ -10099 7275 18252 3788 -12555 -6064 7792 10241 5989 453 -2447 1906 4822 2321 6186
461F186L926j1123r730J0035J5167l87j4720j5096O169K5447O219k4340j6728
$$ 6186 10112 -1011 -10741 -706 14461 14074 -646 -15742 -9573 15874 22093 -2247 -18975
474a8975J2621J8898L649j2879j4421M354J6365J459j0003m34M147l365k486L957
$$ -18975 -6354 12544 16193 3314 -11107 -6753 9612 11071 1068 634 4781 1416 -1070 2887
488B887N811K563q942j3185O356K0877J232k0467j1670Q865J6696N715j5622j7337
$$ 2887 8698 11261 2319 -10866 -4510 16367 17599 -2868 -14538 -5673 11023 16738 1116 -16221
502a6221O291J7232J485q796n587k193K299O072J306j726j032o511l978J1845
$$ -16221 -9930 7302 8787 -9 -5596 -7789 -5490 582 1888 162 -870 -7381 -11359 486
516D86J1034q379j3207r06J0664J2120q25j5830p744J2433J1083k291m946l657
$$ 486 11520 3141 -10066 -10972 -308 11812 10987 -4843 -12587 -154 10929 8638 3692 35
530C5k810M143N502R61L12m143j0017J745J6523M516j4544j2376L201J5597J0843
$$ 35 -2775 1368 6870 7831 8143 4000 -6017 -4272 12251 16767 2223 -10153 -6952 8645 19488
545A9488j1723k0903J432J9357O768q545r014k533N364O381k502l073M398j647
$$ 19488 7765 -13138 -11706 7651 14419 5874 -3140 -5673 -309 6072 3570 497 4895 3248
559C248q940K622J1808J991r973j0266J675J6684J0281j6414k0146N802J9458
$$ 3248 -5692 -3070 8738 10729 756 -9510 -7835 8849 19130 2716 -17430 -11628 7830
572G830O847r454j4732l548J2281Q330o912o350K511j4k018L176K586j576m183
$$ 7830 14677 5223 -9509 -13057 -776 7554 642 -5708 -3197 -3211 -5229 -2053 533 -1043 -5226
587e226n259L338J3891K974j6406j0827R307J5125M920q734j3982J88J4067N872
$$ -5226 -10485 -7147 6744 9718 -6688 -17515 -8208 6917 11837 3103 -10879 -10691 3376 9248
601I248o575l401L55l96L354L819j973l040k952k131Q371J0703o981j7395k432
$$ 9248 2673 -728 -373 -769 2585 6404 4431 1391 -1561 -3692 4679 15382 8401 -8994 -11426
616a1426J3273J1916o55j4633j1077Q692J2919k642q256q58J825J317J657k064
$$ -11426 1847 13763 13108 -1525 -12602 -3910 9009 6367 -1889 -2747 -922 395 2052 -12
630a2j339J243l611k251R967P880j0760j4911R77J4261J3276m637j9994p371J5683
$$ -12 -1351 -108 -3719 -5970 3997 11877 1117 -13794 -12817 1444 14720 10083 -9911 -17282 -1599
645a599J1635o803r919j075N511O003k474q366LN463k021r29P004J707r891q450
$$ -1599 10036 3233 -6686 -7761 -2250 3753 1279 -7087 -7084 -1621 -3642 -4571 2433 4140 -5751 -14201
661a4201K150J3401J1568q270j9628r88J6662P942o666r129q03Q608P743n821
$$ -14201 -12051 1350 12918 4648 -14980 -15968 694 8636 1970 -7159 -7962 646 8389 2568
675B568r252K157N259O76L508L248m921q130l146N718J3073N652j4534j4374O587
$$ 2568 -6684 -4527 732 1408 4916 8164 3243 -4887 -8033 -2315 10758 16410 1876 -12498 -5911
690e911J3651J680q102o961J720J0141K397j0512n836M523L368J149L778n42o972
$$ -5911 7740 9420 1318 -5643 -3923 6218 8615 -1897 -7733 -3210 158 1307 5085 4543 -2429
705b429o565r81P975J3765j119j7757q203J1313J1041j562r504n796P255J1369
$$ -2429 -8994 -9975 -2000 11765 10646 -7111 -15314 -4001 7040 5478 -4026 -9822 -2567 8802
719H802l848j2693k107O677M399K538J07m702m753k782J85R067J0302o390j5114
$$ 8802 4954 -7739 -9846 -3169 1230 3768 3875 -827 -5580 -8362 -8177 890 11192 4802 -10312
734a0312k011J0384P486j765r583m233J0432R364p242j1431m58O676P649M084
$$ -10312 -12323 -1939 5547 3782 -5801 -10034 398 9762 2520 -8911 -9369 -2693 4956 9040
748I040n185p762j588J047L294Q807L548r046q576J867O994M995k374q858m69
$$ 9040 3855 -3907 -5495 -4448 -1154 7653 11201 2155 -6421 -4554 2440 7435 5061 -3797 -4266
763d266J1002L933r434q611J62P140R501J322j0366p189J109K503M714N901j986
$$ -4266 6736 10669 1235 -7376 -7214 -74 9427 10749 383 -6806 -5697 -3194 1520 7421 5435
778E435q366l242K014M623M209m117p652L696J0589o45r812p167J477J1106J0020
$$ 5435 -2931 -6173 -4159 464 4673 556 -7096 -3400 7189 6544 -3268 -10435 -8958 2148 12168
793A2168n366j2771k818M462L768M004J732l768l744j323m02M696M071n583o126
$$ 12168 6802 -5969 -8787 -4325 -557 3447 5179 1411 -2333 -3656 -4058 638 4709 -874 -7000
808g000O399Q451k667j0305p373M738J5950O497j2573j2318J767P185M600J068
$$ -7000 -601 7850 5183 -5122 -12495 -7757 8193 14690 2117 -10201 -8434 -1249 3351 4419
822D419k681k032P67k357j633N629K968o489k567P137N581m088j0587o251R584
$$ 4419 1738 -294 473 -1884 -3517 2112 5080 -1409 -3976 3161 8742 4654 -5933 -12184 -2600
837b600J6948m42j6004q642N211P988L492k581m411J364J874m932o64N767j11
$$ -2600 14348 13906 -2098 -10740 -5529 2459 5951 3370 -1041 323 2197 -2735 -3399 2368 2257
852B257n695R01O579K666n381j1274k492J4941J3450p958j5930l119P699Q043
$$ 2257 -3438 -2537 4042 6708 1327 -9947 -12439 2502 15952 7994 -7936 -11055 -3356 4687
866D687J103n941k297M375j78n338J334M913k169l411K909M850R23p313j0929
$$ 4687 5790 -151 -2448 1927 1749 -3589 -2255 2658 489 -2922 -13 4837 5760 -1553 -12482
881a2482L490J7651O613j2828j2834O55R304P252k964p410Q50N330k225m180K345
$$ -12482 -8992 8659 15272 2444 -10390 -9735 -431 6821 3857 -3553 -2703 2627 402 -3778 -1433
896a433J847j890L54K739K858q33q989p321R414J5106l06j3577q383L093R976
$$ -1433 414 -1476 -1122 1617 4475 3642 -5347 -12668 -3254 11852 11546 -2031 -10414 -7321 2655
911B655N198n818o560L644M569l132k369J005m97R65K460R59R52k788q434k198
$$ 2655 7853 2035 -4525 -881 3688 556 -1813 -808 -1305 -340 2120 3079 4031 1243 -7191 -9389
927i389J2089R887n355j1415n384M816J0148K545q567l970N182L214k305k114
$$ -9389 2700 12587 7232 -4183 -9567 -4751 5397 7942 -625 -4595 587 3801 1496 -618
941f18j862L18M268K093j286n30l994o262K910J1188L778o568r011l670O962R778
$$ -618 -2480 -2162 2106 4199 2913 2383 -1611 -7873 -4963 6225 10003 3435 -5576 -9246 -2284 7494
957G494j796r377j172N277K708j388m407l557L600O193j97k714j590m081k540
$$ 7494 5698 -3679 -4851 426 3134 1746 -2661 -6218 -2618 3575 3378 664 -926 -5007 -7547
972g547N852P504J13n604p493j704R175P381n305q200J413N493L474k294o889
$$ -7547 -1695 5809 5922 318 -7175 -8879 296 7677 2372 -5828 -4415 1078 4552 2258 -4631
987d631k417P480N749k434l497k332k322J293N965K928q36m489o790J215R928
$$ -4631 -7048 432 6181 3747 250 -2082 -4404 -3111 2854 5782 4946 457 -6333 -5118 4810
1002D810L729p444n916K328O229L467n036q484J512R533K972m466l986k484n3
$$ 4810 8539 1095 -4821 -2493 3736 7203 2167 -6317 -4805 4728 7700 3234 -752 -3236 -3289
1017c289M225K958K71o52m919n419M118Q994n35p945l569L279O746K109q874o991
$$ -3289 936 3894 4165 3513 -1406 -6825 -2707 6287 5752 -2193 -5762 -2483 4263 6372 -2502 -9493
1033i493N671R166j36n001m701j560L384M146L5p17k49m927k684O343N705l229
$$ -9493 -3822 5344 5208 207 -4494 -6054 -2670 1476 1511 794 545 -4382 -7066 -723 4982 1753
1049A753o045k016M592P259r24j0656l703R011O976j578n758m828J329O191K345
$$ 1753 -4292 -6308 -1716 5543 4619 -6037 -9740 -729 6247 4669 -1089 -5917 -4588 1603 3948
1064C948k632k92l47m269Q76N887K151l815m276j004O103O367n024j0043P60R431
$$ 3948 1316 1024 677 -3592 -2716 3171 5322 1507 -2769 -3773 2330 8697 3673 -6370 -5610 3821
1080C821M781l151p054m276M549O833j142l431k31j172j741K505L446p83k920
$$ 3821 8602 5451 -1603 -5879 -1330 5503 4361 930 699 -473 -2214 291 3737 2954 34
1095C4l688K42O952L397p992p401L912Q003K916m453q202j696P969M782l726l619
$$ 34 -3654 -3412 3540 6937 -1055 -8456 -4544 3459 6375 1922 -6280 -7976 -7 4775 1049 -2570
1111b570q9m75J285K384q0r94j507k904J973P298j72q552l824N529O704J985o318
$$ -2570 -2659 -3134 -1849 535 455 -539 -2046 -4950 -2977 4321 4149 -4403 -8227 -2698 4006 5991 -327
1128c27p892K460R278J690m999k784j50J570L116J00j808L38j445j810L996N045
$$ -327 -8219 -5759 3519 5209 210 -2574 -2724 -1154 1962 2062 254 592 -853 -2663 1333 6378
1144F378l305o958n36N285O240R1q386o132O527Q080j159n530l207N87M430K411
$$ 6378 3073 -3885 -4421 864 7104 7195 -1191 -7323 -796 7284 6125 595 -2612 -2025 2405 4816
1160D816k976k302J042j018n27M115J527m429m321L65M762N570k590r571k229
$$ 4816 1840 -462 580 -438 -965 3150 4677 248 -4073 -3708 1054 6624 4034 -5537 -7766
1175g766Q096N312k882n733l037K883N766J93m975j117J413m79J556K678r40l658
$$ -7766 330 5642 2760 -2973 -6010 -3127 2639 2832 -2143 -3260 -1847 -2326 -770 1908 968 -2690
1191b690j661R90N013M096n090q006J807Q312K811l731n675j958N584N703l089
$$ -2690 -4351 -3361 1652 5748 658 -7348 -5541 2771 5582 1851 -3824 -5782 -198 5505 2416
1206B416m815M50J445O96K239L90k433j698n65J123N450J628p221n019M721O567
$$ 2416 -2399 -1949 -504 192 2431 2821 388 -1310 -1875 -752 4698 6326 -895 -5914 -1193 5374
1222E374J050m586o186M18P939L378n791m008J108K100K359M84k490j692J93p38
$$ 5374 6424 1838 -4348 -3930 4009 7387 1596 -2412 -1304 796 3155 3639 1149 -543 -350 -1088
1238a088J592M483j358o850j965N018M774kn640o148L596Q411J7o638l002J407
$$ -1088 504 4987 3629 -3221 -5186 -168 4606 4604 -1036 -7184 -3588 4823 4840 -1798 -4800 -3393
1254c393L527K806k015l953M38J182m08K447K443l378m586J009M459L414o61o640
$$ -3393 134 2940 925 -3028 -2590 -1408 -1816 631 3074 -304 -4890 -3881 578 3992 3331 -3309
1270c309l766O572O446k719n661j809K392M940J514m500k920K013J155M11K150
$$ -3309 -7075 -503 5943 3224 -2437 -4246 -1854 3086 4600 100 -2820 -807 348 759 2909
1285B909j48l715j935J745L447K970k733o906j86P693L207m214n090j182M556
$$ 2909 2761 -954 -2889 -1144 2303 5273 2540 -4366 -4552 3141 6348 2134 -2956 -4138 418
1300D18N257j284o399j034L383Q10N24J224k194k525K04J013K893K341m383n915
$$ 418 5675 4391 -2008 -3042 341 1151 1675 2899 705 -1820 -1616 -603 2290 4631 248 -5667
1316e667L027O812P61m914m777R6O068M602m958n836J181L453J352M11j531k368
$$ -5667 -2640 4172 4933 19 -4758 -4662 1406 6008 1050 -4786 -3605 -152 1200 1611 80 -2288
1332b288Q3O69N10K856R48n160k934M384M707q90m143m234K102P586J592o607
$$ -2288 -2205 -1536 -1026 1830 2778 -2382 -5316 -932 3775 2885 -1258 -5492 -3390 4196 5788 -819
1348h19m079K330L417K218k99l523j432J837K45O37K573j476m482J28M469K107
$$ -819 -4898 -2568 849 3067 2768 -755 -2187 -350 -105 532 3105 1629 -2853 -2725 1744 3851
1364C851j657m367l139M899O610k175o740k083L000M006J886k801l951R53K245
$$ 3851 2194 -2173 -5312 -413 6197 4022 -2718 -4801 -1801 2205 4091 1290 -2661 -1708 537
1379E37n19J004J167k475k396J869K720J045j591n043j034O857M489m589o063
$$ 537 18 1022 2189 -286 -2682 -813 1907 2952 1361 -3682 -4716 2141 6630 2041 -4022
1394d022q62L892M840M17n333k764K931J567n08M45k62k049M08J425O04P95j921
$$ -4022 -4884 -992 3848 4265 -1068 -3832 -901 666 158 603 341 -1708 -1300 125 729 1524 -397
1411c97m164J545O738J519n242m895L0M808N588j873o468p62L667J378m03m75
$$ -397 -4561 -3016 3722 5241 -1 -4896 -4866 -58 5530 3657 -2811 -3573 94 1472 1069 594
1427E94j638N9J706J82l61M82k618k442L760N115j113m835l994Q44O406L870m470
$$ 594 -1044 -985 721 903 542 1024 -1594 -4036 -276 4839 3726 -1109 -5103 -4259 2147 6017 1547
1444A547n784J379L476J179r46j858j006K395J572j896R2K7k717r4M710K827k245
$$ 1547 -4237 -2858 618 1797 851 -1007 -2013 382 1954 58 150 177 -2540 -2634 2076 4903 2658
1461B658m944l089L017P214J327o831l373K916L104N57k016k655J014L950q54
$$ 2658 -2286 -5375 -2358 4856 6183 -648 -4021 -1105 1999 2556 540 -2115 -1101 2849 1995
1476A995k586M16n55j730J596L707J160k984m213k546M801P164k213o796j394
$$ 1995 -591 -175 -730 -2460 -864 2843 4003 1019 -3194 -5740 -939 6225 4012 -2784 -4178
1491d178L369K973M4l566k173L437L527k400k145N6o37k19K815J996n91k688m211
$$ -4178 -809 2164 2208 -1358 -3531 -94 3433 1033 -1112 -1056 -1693 -1912 903 2899 2308 -380 -4591
1508d591k88O575M056m520n006K90L404K813j511m443o8M833J581k842j653q88
$$ -4591 -4879 1696 5752 1232 -3774 -3484 -80 2733 1222 -3221 -3289 1544 3125 283 -1370 -2258
1524b258m35K382K621N12j340l093l415K668O725N83n008k592R04L109J955k719
$$ -2258 -2693 -311 2310 2822 1482 -1611 -5026 -2358 4367 4950 -58 -2650 -1746 1363 3318 599
1540E99l680K224M713n34k696j933j100J295L079J358p20j481l478k064M485M443
$$ 599 -3081 -857 3856 3322 626 -1307 -2407 -1112 1967 3325 2605 1124 -2354 -4418 67 4510
1556D510j562l983j556Q49L440R00m347k321M013L316j117k830k710n32L479L268
$$ 4510 2948 -1035 -2591 -1742 1698 2598 -1749 -4070 -57 3259 2142 -688 -3398 -3930 -451 2817
1572B817n82j730j922k568P71M328J706k358k309q68J268L329o85m245k30L919
$$ 2817 2235 505 -1417 -3985 -3214 1114 2820 462 -1847 -2715 -1447 1882 1197 -3048 -3278 641
1588F41K070q63l407l387J231N521J571j962k099j780r62K862K612l71j135j265
$$ 641 2711 1848 -1559 -4946 -3715 1806 3377 1415 -684 -2464 -3426 -564 2048 1677 542 -723
1604g23j082J894K789k275l271J120L893J593j188m758k869M218N196p7l157j927
$$ -723 -1805 89 2878 603 -2668 -1548 2345 3938 2750 -2008 -4877 -659 4537 4460 1303 -624
1620f24j423J153K452L68o73k39j344j210K597J372k959k122J832L009J677l149
$$ -624 -2047 -894 1558 1926 1253 1014 -330 -1540 1057 2429 -530 -2652 -820 2189 3866 717
1636G17n760o22O399L712k319l354j795J52K504J183j233L34J12j874l94K728
$$ 717 -5043 -5665 734 4446 2127 -1227 -3022 -2870 -366 817 -416 -82 30 -1844 -2238 490
1652D90j30k614o45K100L127J075m637n453K644O774J743l422l531q60K249K405
$$ 490 360 -2254 -2899 -799 2328 3403 -1234 -6687 -4043 2731 4474 1052 -2479 -3339 -1090 1315
1668A315r39j238J663j67j818R65J674j299j757J96K425L125o13o020l207N016
$$ 1315 376 -862 801 634 -1184 -219 1455 156 -1601 -1405 1020 4145 3532 -2488 -5695 -679
1684f79N523m81l598l071M53L412J176k382k05J426p65j009J175K85j627p26O15
$$ -679 4844 4363 765 -2306 -1853 1559 2735 353 148 1574 809 -200 975 1260 -367 -1093 -478
1701d78K364K597l002o094L1N752L332j795m002k617J999L658p23k647O04J018
$$ -478 1886 4483 1481 -4613 -4582 1170 4502 2707 -1295 -3912 -1913 1745 1022 -1625 -1021 -3
1717co25L53K34j067o02L0Q56K616J108m325m290K447N238J688k247m072j363
$$ -3 -628 -275 -41 -1108 -1710 -1680 -824 1792 2900 -1425 -5715 -3268 1970 3658 1411 -2661 -4024
1734d024L609K790k080j832Q60O92O60J22p95j243N47N46J228K142p26m721j656
$$ -4024 -415 2375 295 -1537 -677 15 675 797 2 -1241 -694 -148 1080 3222 2496 -2225 -3881
1751c881L411L663P72k672m066M41M406J113k779j125Q26R28J121m99k297l97
$$ -3881 -470 3193 3965 1293 -2773 -2332 2074 3187 408 -717 109 1037 2158 1659 -638 -1035
1767a035J338L09J318J336k549l287K09L030K524O6l589l474K249L877l18k791
$$ -1035 303 612 1930 3266 717 -2570 -2361 669 3193 3259 -330 -3804 -1555 2322 2004 -787
1783g87j059O05K013J280k248k595R31J631N64J149n97k846j346J604K074K097
$$ -787 -1846 -1241 772 2052 -196 -2791 -1860 -229 335 1484 887 -1959 -3305 -1701 373 2470
1799B470o09l924j842L398L018j537k030j410J547L275Q9l748j567K016J704Q35
$$ 2470 1861 -2063 -3905 -507 2511 974 -1056 -2466 -919 2356 2445 -1303 -2870 -854 850 1685
1815A685J17j638j926M92J125J534J817k094l619K55L966J218j650k552r20K910
$$ 1685 1802 164 -1762 -1270 -145 1389 3206 1112 -2507 -2252 1714 2932 1282 -1270 -2190 720
1831G20L013j711l890j87K435J318Q10j216k325j89Q41O12J471P48k663k366J688
$$ 720 3733 2022 -1868 -2055 380 1698 2508 1292 -1033 -1222 -381 231 1702 2450 -213 -2579 -891
1848h91K795K54j808k728Q0L909J983l491k952P33K384J582j67k347j663J097
$$ -891 1904 2158 350 -2378 -2298 1611 3594 103 -2849 -2116 268 1850 1683 -664 -2327 -1230
1864a230R70J93J317l36k734p18K240J770k38k257k209J708M209j84l901j670
$$ -1230 -260 -67 1250 914 -1820 -2538 -298 1472 1234 -1023 -3232 -1524 2685 2501 -1400 -3070
1880c070J708K409J540j415l008J25J667M75L37O28j422j660Q56J621J044n56
$$ -3070 -1362 1047 2587 1172 -1836 -1711 -44 431 768 1396 -26 -1686 -830 791 1835 1279
1896A279k387j735K986L453j744l480q93J721L028Q95l078k339J211J954J36J68
$$ 1279 -1108 -2843 143 3596 1852 -1628 -2521 -800 2228 3123 45 -2294 -1083 871 1007 1175
1912A175n02j609l09J326P20O04o99k541j50L538J696k690k641m72K390L272p13
$$ 1175 673 -936 -1245 81 801 1405 706 -1835 -1985 1553 3249 559 -2082 -2554 -164 3108 2395
1929B395m148q87K387J453j33m77j346q03J453M90K45L06j507j982J412L195m8
$$ 2395 -1753 -2640 -253 1200 1067 590 -756 -1559 -106 384 629 935 -572 -2554 -1142 2053 2005
1946B005k465k005N3L309K265k062l642L40K531J100k75j296j293N20J545j03
$$ 2005 -460 -2465 -2412 897 3162 1100 -2542 -2202 329 1429 1154 -142 -1435 -915 630 527
1962E27r8K21j867o62K305J780p23k232j691Q56L645J194l718k465J530K490Q07
$$ 527 429 650 -1217 -1879 426 2206 1483 -749 -2440 -1584 2061 3255 -463 -2928 -1398 1092 1899
1979A899q41k292p40K128R65r46K21l51j487L96K274M55r91j832j269J937L534
$$ 1899 1058 -1234 -1974 154 1119 173 394 43 -1444 -1048 1226 1681 690 -1142 -2411 -474 3060
1996C060q11l516j368J888K415P69k020k768J136K402K51r49n62o33j61J457P15
$$ 3060 2249 -1267 -2635 -747 1668 2437 417 -2351 -1215 1187 1438 489 -73 -706 -867 590 1305
2013A305j71j106j411m97K643K289k129k865l09K093K158K24l035j848K013K196
$$ 1305 1134 28 -1383 -1880 763 3052 923 -1942 -2251 -158 2000 2224 -811 -2659 -646 1550
2029A550n12p01j040o68J008J164M4m59r13j478O63K813P80k460k253M69K422
$$ 1550 1038 337 -703 -1371 -363 801 845 386 -527 -2005 -1342 1471 2251 -209 -2462 -1993 429
2046D29K002j347l398rK686J393j135j224r80N02J517M10o82o5p46j238J632K457
$$ 429 2431 1084 -2314 -2323 363 1756 621 -603 -1583 -1081 436 846 164 99 -647 -1885 -253 2204
2064B204n43k427j282P43K794J504k813k877J530K883M52j287j849n61J581J954
$$ 2204 1661 -766 -2048 -1305 1489 2993 180 -2697 -1167 1716 2168 881 -968 -1529 52 2006
2080B006r90j093K3o09m3J864P21j037j584p71P68K812N13l398j645J949K047
$$ 2006 1016 -77 -54 -663 -706 1158 1879 842 -742 -1513 -745 2067 2580 -818 -2463 -514 1533
2097A533J17j398k389L38K753R05j580r24l81m95J420J524o50j225j015l22J677
$$ 1533 1650 252 -2137 -1799 954 1859 279 -645 -1026 -1521 -101 1423 773 -452 -1467 -1789 -112
2114a12K202j285l017k2K357J298j45k362j645J681K553l09j552n23m94N53J405
$$ -112 2090 805 -2212 -2234 123 1421 1276 -1086 -2731 -1050 1503 1194 -358 -881 -1375 -822 583
2131E83O19p51q44j032J12K288J507k276k438J112K220J247j077l186l31L199
$$ 583 1202 451 -393 -1425 -1313 975 2482 206 -2232 -1120 1100 2347 1270 -1916 -2247 952
2147I52J831j504j710o62M21J458P01o48m75k90r67L86K101J60k186j031R52J509
$$ 952 2783 1279 -431 -1093 -672 786 1487 839 364 74 -893 -507 1594 1754 -432 -1463 -511 998
2165I98J270j755l024O86L271R80j699j831r27J201K304k17j567l69j28k77R89
$$ 998 2268 513 -2511 -1825 1446 2426 727 -1104 -2031 -830 1474 1257 -310 -679 -807 -1084 -95
2182i5J081j180j203K50P02J321K04k299j803K045K508N1j420k120l11J917J957
$$ -95 986 -194 -1397 -1147 -445 876 1080 -1219 -3022 -977 1531 1582 162 -1958 -2269 -352 1605
2199A605p08j213k91n33N56J666j95j342m92N07R13J388j059l029K24K975J808
$$ 1605 897 -316 -607 -1140 -584 1082 887 -455 -947 -440 473 1861 802 -2227 -2003 972 2780
2216B780r41k050j998J042K922N12j647q10K95k39P04L98m12n96k6j46R96J347
$$ 2780 1839 -211 -2209 -1167 1755 2267 620 -190 105 -134 570 968 556 -40 -66 -212 784 2131
2234B131j670k484N26K818J393j013k895j915K304L061o46k224p33O70Q55O83
$$ 2131 461 -2023 -1497 1321 2714 1701 -1194 -3109 -805 2256 1610 -614 -1347 -677 178 861
2250H61j276p81J001L50m78O14K88j869q12J243J614J125j070l013r24L297J680
$$ 861 -415 -1196 -195 155 -323 291 579 -1290 -2102 -859 755 1880 810 -2203 -3127 170 1850
2267A850r87j782m74N67J542o9j385m59J289L18J44L90j119j694N09J766J585
$$ 1850 863 -919 -1393 -826 716 647 -738 -1197 92 410 554 944 -175 -1869 -1360 406 1991
2284A991K28k548k289J281L143J21j604r17O3J100P48j120r92Q67P29k53N44O0
$$ 1991 2219 -329 -2618 -1337 1806 1927 323 -594 -531 569 1317 197 -795 72 801 548 1092 1152
2302A152j497j142O42J716J775n82l265j866K607K846o21k166j340R85K126r9
$$ 1152 -345 -1487 -845 871 2646 2064 -1201 -3067 -460 2386 1765 -401 -1741 -756 1370 1271
2318A271k337q28J953P90l51o5q07q32l2P79Q59J329r48l070n67K667J768m65
$$ 1271 -1066 -1894 59 849 498 433 -374 -1206 -1238 -459 400 1729 781 -2289 -2856 -189 1579 1114
2336A114j754j510J415K089o25k161k81J620J026K93o35k008m72J533J085P45
$$ 1114 -640 -2150 -735 1354 729 -1432 -1713 -93 933 1226 591 -1417 -1889 -356 729 1474
2352A474M6k064j496J017K174J38n91j227m52J371J166j492j175O95J134M26L93
$$ 1474 1520 -544 -2040 -1023 1151 1289 698 -529 -981 390 1556 64 -1111 -416 718 1144 1537
2369A537j033j852J39J219J129J064r11k676o15K254J256l72j159j147P61K016
$$ 1537 504 -1348 -1209 10 1139 2203 1292 -1384 -1999 255 1511 1139 -20 -1167 -406 1610
2385A610l87k218p36J414J255P15q64j962m66J079O82P84L55j110j858J42J237
$$ 1610 1223 -995 -1731 -317 938 1653 789 -1173 -1639 -560 122 906 1261 151 -1707 -1565 -328
2402c28J014N22j641j297J003K047l28k284l54P09K232J199k518k480N29K235
$$ -328 686 1208 -433 -1730 -727 1320 992 -1292 -1646 -937 1295 2494 -24 -2504 -1975 260
2418B60Q00J90j032j040q7R56M3K61L90r90n75J028Q86p51r31n55R62J918M93
$$ 260 1060 1250 218 -822 -909 47 90 351 741 -249 -824 204 1090 339 -592 -1147 -185 1733 2226
2437B226k592j796J061J785R49j16j567j396R50J073o9J47l98r54N68J481m47
$$ 2226 -366 -2162 -1101 684 1633 1517 -50 -1446 -496 577 508 655 257 -697 -129 1352 905
2454I05j444r10M09J836J658j536k701P3J593R43K80m66j389O1N97j7L51N73p93
$$ 905 -539 -1449 -1040 796 2454 918 -1783 -1710 -117 826 1106 640 -749 -688 -91 -108 243 816 23
2473B3j164Q79J185p4j499j309P52K887J277k985k829J041K292J269o04j891p81
$$ 23 -1141 -262 923 849 -650 -1959 -1207 1680 2957 -28 -2857 -1816 476 1745 1141 -750 -1531
2490a531J559N35q33lQ69n68k65K27M04k0p51j068Q69K478L75k941j851J205J971
$$ -1531 28 563 -270 -273 596 28 -237 -10 394 374 -377 -1445 -576 1902 2277 -664 -2515 -1310 661
2509F61J284p82k283l73J940J81m63k50l91p0R41M81p27o67j30k30J640J528j761
$$ 661 1945 1163 -1120 -1493 447 628 165 -85 -476 -546 395 876 149 -518 -648 -878 762 2290 529
2528E29k029o0J148J405O37j395j457O36R21oP7k29n79k2J033J47l18r49r15P47
$$ 529 -1500 -1560 -412 993 1630 235 -1222 -586 335 329 406 177 -402 -424 609 756 438 -511 -1426 -679
2548f79K471K55k311j887O11K066J475p29k503k05J712R19j124m31k72N16O59
$$ -679 1792 2047 -264 -2151 -1540 526 2001 1272 -1231 -1436 276 1195 71 -360 -632 -116 543
2565E43k4o97O2j60r37Q46J846j93j619j520K08J811K093j422k583J37K067O23
$$ 543 519 -178 -116 -276 -1213 -367 1479 1286 -333 -1853 -1645 166 2259 837 -1746 -1609 458 1081
2583A081m68j363p81J272J570o27j185j67O9J34J363J3o83q13l54K6J695R43j570
$$ 1081 613 -750 -1531 -259 1311 684 -501 -668 -599 -465 898 911 228 -585 -939 -913 782 1725 155
2602A55j644Q63R95N02k09j221o51J478J104p03o35p85l01J201J535o21j448n08
$$ 155 -1489 -626 369 871 662 -559 -1210 268 1372 669 34 -751 -1052 149 1684 1063 -385 -893
2620h93l2J186J430o82k133J26J315P25l30j083p72P18J631n78p74l85Q8PP17
$$ -893 -925 261 1691 1009 -1124 -998 317 1042 712 -371 -1143 -425 1206 628 -146 -531 -443 -436 281
2639B81M80m19m70r00k27J638J405j240k103K36J345J145k89k088q14J919J722
$$ 281 761 342 -128 -1028 -1255 383 1788 548 -1555 -1319 26 1171 882 -1206 -2020 -101 1621
2656A621j037j587l22M28J231Q61j330l15J83l10OJ246M77j173r33K44P88J384
$$ 1621 584 -1003 -1325 -897 334 1195 -135 -450 -267 -577 -571 675 1152 -21 -954 -710 78 1462
2674A462n02k118k42J934J025p62j158p88N10J859L31j748k99r2N93N95O57q43
$$ 1462 960 -1158 -1400 534 1559 797 -361 -1149 -639 1220 1551 -197 -496 -588 5 600 1257 414
2692D14j218K74N97Q82K87j538r04R46J227J14q02p34o81J188J107l97q80k53
$$ 414 -804 -530 67 949 1236 -302 -1206 -260 967 1081 279 -455 -1136 52 1159 762 -118 -371
2710c71k87J08J431lj114p21p8R11J451m83j983r50J972J574p50j350j148P80
$$ -371 -658 -550 881 878 -236 -957 -1035 -124 1327 844 -1139 -2089 -117 1457 707 -643 -1791 -1011
2728a011K092l2j536n80O45J08K94M91m83m05J73n52O25J377n83j758j31J602
$$ -1011 1081 1049 -487 -1067 -422 -314 -20 471 -12 -417 -244 -796 -171 1206 623 -1135 -1266 336
2746C36R55o5j574j535J156K404j2j994n17J99R99R87m48j370R6R02l06M31L92
$$ 336 1291 1226 -348 -1883 -727 1677 1665 -329 -846 -647 352 1339 891 -479 -383 519 213 644 1036
2765A036j206o02O92P11L02j37j382o62J490J121m89j083k58r0J040O50j041q56
$$ 1036 -170 -772 -80 631 933 796 -586 -1248 242 1363 874 -209 -467 -557 483 1133 92 -764
2783g64R2M10N46O68o11j542q5J346P40N9j142j591Q37K086j87j244p13Q2Q29
$$ -764 -672 -262 284 952 341 -1201 -1286 60 800 859 -283 -1874 -1037 1049 862 -382 -1095 -1013 -184
2802a84Q80l64r02r4O02k58K89Q96p99j077J73Q52R49J86j427j592J561J973l85
$$ -184 696 332 -570 -664 -62 -320 -31 865 66 -1011 -838 14 963 1149 -278 -1870 -309 1664 1279
2821A279j532j040L06J845Q89j375j495O45Q97K3K27m42o91L71M51j72O96N4j494
$$ 1279 -253 -1293 -987 858 1747 372 -1123 -478 419 442 669 227 -464 -93 358 186 882 936 -558
2840e58n11J512P48k4j058j172L66J915L52j708j031O68O59O56m7j415n22Q28
$$ -558 -1069 443 1191 1167 109 -1063 -697 1218 1570 -138 -1169 -501 158 814 767 -648 -1170 -342
2858c42O46O4K36r30j136R78J212n1o06r27n01J141J476j000j160K95L43K96P15
$$ -342 304 368 604 -326 -1462 -484 728 677 71 -856 -1357 -216 1260 260 -900 -605 -262 34 749
2877G49n97j015J96N90J79N54j31j393m61J159J148J1r22j385J00K135Q17j731
$$ 749 152 -863 -667 -77 102 656 525 -868 -1329 -170 978 989 67 -1318 -1218 917 1734 3
2895Cj117M46J070Q07m35j272k78J075L33j89N6k44p48j09R42M49K88p02j620
$$ 3 -1114 -668 402 1209 774 -498 -776 299 632 443 499 255 -493 -602 340 789 1077 375 -1245
2914a245M59J860J69j320j105N26J016J159j079j808M34J388J62k43l26q39jP29
$$ -1245 -786 1074 1243 -77 -1182 -656 360 1519 440 -1368 -934 454 616 373 47 -792 -793 -64
2932f4L06J50J9j044o04J226J071n49j156k57J86J250N46j387r33O39R30K17K0
$$ -64 242 392 411 -633 -1237 -11 1060 511 -645 -902 -716 534 1080 -307 -1240 -601 329 546 566
2951E66p87q22K96R44K53K95p00j083K69J387M44j184o91K52P24J246q60j737
$$ 566 -221 -1043 -747 197 450 745 45 -1038 -769 618 1062 -122 -813 -561 163 1409 549 -1188
2969a188R9J285O67j83j56j068j66R95p1Q9M18p38j099Q58J099j44o12o81k62
$$ -1188 -1089 196 863 680 524 -544 -710 285 214 303 721 -17 -1116 -258 841 697 85 -596 -858
2988h58J550J001j411j860L77J537P58j1j397r29P78J034j92Q7k41o06j23P52
$$ -858 692 1693 282 -1578 -1201 336 1094 1083 -314 -1243 -465 569 377 464 223 -383 -506 246
3006B46Q1l37k30l69J67J438J05j474r75P38R09Q51n03j391p14J296N61R6j98
$$ 246 327 -10 -240 -609 -442 996 1101 -373 -1348 -610 299 1150 647 -744 -1458 -162 399 495 297
3025B97o51m00N87R50m76n09k26n1O49J038p41j354j97P55R27O27r15j482N01
$$ 297 -354 -754 -167 783 307 -202 -428 -479 170 1208 467 -887 -1084 -329 598 1225 310 -1172 -671
3044f71R39L17J6n06n74J09P34J02n84J16l76k5J161M33j166j101N7P89J548M9
$$ -671 268 585 601 95 -479 -370 364 466 -118 -2 -378 -403 758 1191 25 -1076 -1019 -230 1318 1367
3064A367j783j190J241R40R4m69o43R4O74J91p29%K60l20L30Q66l70r13m87j50
$$ 1367 -416 -1606 -365 575 669 200 -443 -349 325 516 -213 -213 47 -273 57 923 553 -360 -847 -997
3084i97J141J385p22j674l58J069Q92P2o38j029O00J158l73r16m3L24j21P96K42
$$ -997 144 1529 807 -867 -1225 -156 736 808 170 -859 -259 899 526 -390 -433 -109 -230 566 808
3103H08q06o81k74L93J271Q22j405j292K59J097N10k18q57m52R17M99n86m53Q6
$$ 808 2 -679 -953 -560 711 1533 128 -1164 -905 192 702 484 -373 -825 92 591 5 -448 -362
3122c62J18M21N65j23o97n98l29P30J625Lk190o09P62J177L67n45j238N16J121
$$ -362 -244 177 742 619 -78 -676 -1005 -275 1350 1353 -837 -1446 -684 493 860 315 -923 -407 714
3141G14n9j052o1K14K13N16L03n13n05l73k16R47J387o51j776j5P67Q27L44j092
$$ 714 655 -397 -458 -244 -31 485 788 275 -230 -603 -819 128 1515 864 -912 -927 -160 667 1011 -81
3161h1j016J107J142q20o82Mj15Q75N17l60q98r3l98N60J018N53j324j016L62
$$ -81 -1097 10 1152 332 -350 -346 -461 414 931 571 -327 -420 -818 -258 760 1313 -11 -1027 -665
3180f65N52O74l7q76n69J280L82o69n25l89J38J282K34o60o47l30J22P87J025
$$ -665 -113 561 524 -352 -921 359 741 72 -453 -842 -704 578 812 152 -495 -825 -703 84 1109
3199A109p10r62j45L13O04M82n29r55M04J126k10m76o15k63R58R07j29j088l62
$$ 1109 399 -563 -708 -395 209 691 162 -793 -389 737 527 51 -564 -827 131 1038 909 -179 -541
3218e41M2K15R24L94q13n27j5J33P64N02j205o77J019O77l13n48r25J2J655N13
$$ -541 -499 -284 640 1034 221 -306 -321 -188 576 1078 -127 -804 215 892 579 31 -894 -882 773 1286
3238A286q30r78q0J54O87O21n33o37J55k43K40N81L3j103K6Q03K63l6o77r15O82
$$ 1286 456 -522 -602 -448 239 860 327 -310 -155 -398 -158 423 456 -647 -621 182 445 409 -268 -1183 -501
3259e01J556Oj317p29O5N83J008%r28r8j03j7J88O09l99n52N11M19K10o0j148
$$ -501 1055 1061 -256 -985 -920 -337 671 671 -257 -355 -458 -475 -287 322 -77 -629 -118 301 511 451 -697
3280f97m56J179J266n10j063o05L30P56Q43o39n93J58q1K31K63K2p22R0L70L94
$$ -697 -1153 26 1292 782 -281 -886 -556 200 1043 404 -189 -31 -112 119 382 404 -318 -228 142 536
3300E36K93o12j207R7J679O10j008j044k22M69J214Qr65k95L69m8J51J93l60l90
$$ 536 829 217 -990 -893 786 1396 388 -656 -878 -409 805 813 -152 -447 -78 -126 25 218 -142 -532
3320e32K81K88L42J68r26r49Q19J438q3r43q84j61R26J067m98j187L16L07lL15
$$ -532 -251 37 379 547 -379 -1328 -509 929 846 -97 -981 -1142 -216 851 353 -834 -518 -211 -214 101
3340A01k3o46J96N13M9J64q5j145j49J135R35n46o70q51L16J326N70j053n31J57
$$ 101 78 -568 -372 141 190 354 269 -876 -1025 110 1045 499 -171 -1022 -706 620 1190 137 -394 -237
3360b37J61N15N1o44q8L24N24j09J53m53j182P60J160j13l77q54n66P76J146o5
$$ -237 -76 439 490 -154 -242 82 606 497 650 197 -985 -225 935 822 445 -409 -975 -199 947 882
3380H82j000l82L17L03N36m68p30M40M73j69K28k13o12m52N91J107l02n52q58
$$ 882 -118 -500 -183 120 656 188 -542 -102 371 202 430 217 -395 -847 -256 851 549 -3 -861
3399h61j59J303P21r00q00j0N73M67K03q19m66M24N69Lq4j02r77N12P95n9J6m28
$$ -861 -1020 283 1004 104 -696 -706 -133 334 537 -282 -748 -324 245 248 164 62 -915 -403 392 333 349 -79
3421g9p15K48J251J74r16n36l3Q27O97l37j152P9Q39J4J65j30o89j81N96L89j29
$$ -79 -794 -546 705 879 -37 -573 -606 221 918 581 -571 -492 347 361 526 396 -293 -474 122 511 382
3442C82J17p63o01Q89R67m16p10m26K41P69O48r48r82O36N13L92l84l52o47L17
$$ 382 499 -264 -865 24 991 575 -135 -561 -320 449 1097 149 -833 -197 316 708 324 -28 -675 -358
3462c58O61p0J59j28r74J2R62N61n78o38m32N83R40m4j226m06P27M18L71m52o65
$$ -358 303 233 392 264 -710 -698 264 825 247 -391 -823 -240 700 656 -570 -976 -249 169 540 88 -577
3483e77k36Q21L17j17qn83l11K88P86P8n02j76m72N83J322p62j064p2Q61K70L03
$$ -577 -813 8 325 208 200 -383 -694 -406 380 458 -44 -220 -692 -109 1213 451 -613 -685 176 446 749
3504G49p18p81M31Q68k32j49o0m60k5M85L63L1o21j64k14J171M15j137p39K34
$$ 749 31 -750 -319 549 317 168 108 -352 -377 108 471 502 -119 -283 -497 674 1089 -48 -787 -553
3524e53P82N26j67j060m39R51N33l38Jl35m85M80N25p7j80k87o09L90J218l28
$$ -553 229 755 588 -472 -911 40 573 235 236 -99 -584 -104 421 344 164 -123 -732 -342 876 548
3544E48r48l93M20N24P27p79j081L05J030J63l83j52m55kN82N8j0j37m88k59Q56
$$ 548 -400 -793 -373 151 878 99 -982 -677 353 516 133 -19 -474 -476 106 164 154 17 -471 -730 126
3565A26O90p12n41m59O49R84J01r73q67O21R95n9k43m31o06P13N95k80l35j34
$$ 126 816 104 -437 -896 -247 737 838 -135 -1002 -381 614 555 312 -119 -725 -12 583 303 -32 -166
3585a66l28J61P92K64p65k73l37N32J045k64j248k48R91M44j06m25n50J05Q16
$$ -166 -494 -333 459 723 -42 -315 -652 -120 925 661 -587 -835 156 600 494 69 -481 -376 440
3604D40J10n11rj83k27M70M93m17m73r4j3M59P70o18j141L75P61N22l19o38o34
$$ 440 550 39 30 -153 -380 90 583 166 -307 -401 -414 45 815 197 -944 -569 192 714 395 -243 -877
3625h77P94P17m99k77K4l08M81L59j5m21j19k98J09Q57L50j004q23O52O42L89
$$ -877 -83 634 135 -142 -118 -426 55 414 399 -22 -141 -439 -330 527 877 -127 -950 -298 344 733
3645G33m14r46j47J129J97m12m00m5J76M13L80m31k88k73rL74P92l84j097J19
$$ 733 319 -627 -774 355 552 140 -260 -305 -129 284 664 233 -55 -328 -337 37 829 445 -652 -533
3665e33N30M63K74o75r21M56J052k72m23m05N2L73N50j59n78P6n9j61Q86K06n97
$$ -533 -3 460 734 59 -862 -406 646 374 -49 -454 -402 -29 521 362 -216 -140 -199 -360 526 732 135
3686A35p42L84L92M16J98r27p22P36Q37l49m01n05K15M79N29o74l52J49n8J75
$$ 135 -607 -223 169 585 783 -144 -866 -130 707 358 -43 -548 -333 146 675 1 -351 -202 -260 -85
3706h5Q66m67n68k63K33L32O31j59j407M39O71K17j62m27n69M59P96Rr35j23J89
$$ -85 781 314 -254 -517 -284 48 679 520 -887 -448 223 440 278 -149 -718 -259 537 546 -389 -512 -323
3727c23MO78J62o73k40K3O3P59K75p45q53M69Q42R8m82n09k02N00J015o64p33
$$ -323 -319 359 521 -152 -392 -369 -306 453 728 -17 -870 -401 441 539 57 -452 -654 -154 861 197 -536
3748e36K48k3M46N84m31n54jKL30M95j44r79j08P85L04J47o77m69P1J134K16q92
$$ -536 -288 -311 135 719 288 -266 -267 -265 65 560 416 -563 -671 114 418 565 -112 -581 -510 624 840 -52
3770e2l87l7M83K73L00o65j92o3P0J76N75k76r82L74O57J5j22n63l97P16Q96k19
$$ -52 -439 -476 7 280 580 -85 -277 -340 -270 -94 481 205 -777 -403 254 269 147 -416 -813 -97 799 580
3792E80r48k25M6N20O71k84p48j11K56N3M71J67o37j46J62M46L2j94r47K99Q12
$$ 580 -368 -593 -547 -27 644 360 -388 -499 -243 -190 281 448 -189 -335 -173 273 305 111 -836 -537 275
3813B75M47m30p38m5N5J066N6o78l03N2P9K19L82l68m55L33J65K3L79n52o54M25
$$ 275 722 292 -446 -491 -436 630 686 8 -295 -243 -164 55 437 69 -386 -53 112 135 514 -38 -692 -267
3835b67Q52K28q86n15k5O87N82K9r14k98M21J45L26O6m02k37K41J84j29J12m58
$$ -267 585 813 -73 -588 -613 74 656 685 -229 -527 -106 39 365 431 29 -208 33 217 88 200 -258
3856b58m66Q62N57j87p09n01l8J091M46o60o45PJ98J75M79n03k23M02J16j23J05
$$ -258 -724 138 695 508 -201 -702 -740 351 797 137 -508 -501 -303 -128 351 -152 -375 27 143 20 125
3877A25k0o65P1R52M9j26o81o29M65J245q1p98m10N8L57N03l8o10J98K23L6k3
$$ 125 105 -560 -489 463 512 386 -295 -924 -459 786 705 -93 -503 -445 -88 415 377 -233 -35 188 224 201
3899B01O3l94k83M88J89J66q4p42l06Q49P47k29q53r9m7P02J80m03o33M76M33
$$ 201 264 -130 -413 75 264 430 346 -396 -702 147 894 665 -188 -287 -334 368 548 145 -488 -12 421
3920D21k30m3r7m66K51M67J13j92j60p38Q0Q15O10p10n29n3J79O46j3o30j66L93
$$ 421 191 148 51 -415 -164 303 416 224 64 -674 -594 221 831 121 -408 -461 -282 364 351 -279 -445 -52
3942e2K07j30K23o88j04L88M24o5J79n49q77N41J237j16n16n65r4M84O22l13p14
$$ -52 155 25 248 -440 -544 -156 268 203 382 -167 -1044 -503 734 618 102 -463 -557 -73 549 236 -478
3963d78L14N96m6j88j72n34K07O58N9Nn5r29j94J013M84j95o86k56K32P50K97
$$ -478 -164 432 386 198 26 -508 -301 357 416 421 366 -563 -757 256 740 545 -141 -397 -165 585 882
3984H82j129k46N49L10L5l64l17r1M17M01l4j62l18l34J89O88O2k58n38k53J55
$$ 882 -247 -493 56 366 401 37 -280 -371 46 447 413 251 -67 -401 -212 476 538 280 -258 -511 -356
4005c56N74N8q63K55L14K75J76m87o43M41N20J84j35k53m47k41O93M13k66k68
$$ -356 218 276 -587 -332 -18 257 433 -54 -697 -256 264 448 313 60 -387 -628 65 478 212 -56
4025e6j77j40M83M00n44k98k4K95N65j22n49m05M60M78O8k78q3o12N76K13o7j36
$$ -56 -233 -373 110 510 -34 -332 -356 -61 504 382 -167 -572 -112 366 434 156 73 -539 37 250 183 47
4047D7n0m99J71P99n0n56l07L71L78M48l65j010R2P02L53j31k35m44P3K07M08
$$ 47 -3 -502 -331 468 418 -138 -445 -74 304 752 387 -623 -531 171 524 393 158 -286 -213 -6 402
4068D02k86m3Lm65M51L46l73k66m1J49N01K60p67o26M47M04L86k21m55l86M28
$$ 402 116 73 76 -389 62 408 35 -231 -272 -123 378 638 -129 -755 -308 96 482 261 -194 -580 -152
4089a52L94k13R6p6k70j98N79Q0l15k58j0K81N87M1j090k05O93O15n4m05n95k
$$ -152 242 29 125 49 -221 -419 160 240 -75 -333 -343 -62 525 566 -524 -729 -36 579 525 120 -475 -477
4111d77N05M31m32m2J1l91J62M63j56k76k2q1K48O23k94r65L99M11M55l1p34l23
$$ -477 28 459 27 -15 -4 -395 -233 230 74 -202 -224 -305 -57 566 272 -693 -294 117 572 541 -193 -516
4133e16K69O44j3m65J29k51j7L53J04k09j16j55O2O71J03n48n60N32jN86k88n36
$$ -516 -247 397 384 -81 48 -203 -220 133 237 28 -88 -243 -181 490 593 45 -515 17 16 602 314 -222
4155b22n49P40L59j48k98Q0j94K02N17n26l12p5K43k6P34k18q61l6O10L57L45
$$ -222 -771 -31 328 180 -118 -38 -232 -30 487 -39 -351 -426 -183 -209 525 307 -554 -590 20 377 722
4176G22m25p37P0P45j83j50j87k83K96M04j02l87p3L74k02M48K13o66l99K09K36
$$ 722 297 -440 -370 375 192 42 -145 -428 -132 272 170 -217 -290 84 -118 330 543 -123 -522 -313 -77
4197g7M10L39p24q06O97N55k00N5n78l8L89L41k48l06L1M5J52L52k45l30j42J84
$$ -77 333 672 -52 -858 -161 394 194 249 -329 -367 22 363 115 -191 -160 -115 37 389 144 -186 -328 -144
4219a44K14O00k59j050q8Q68L28k86j71n37J17R69l10k60k30J31r8M71M1k66l98
$$ -144 70 670 411 -639 -727 141 469 183 12 -525 -408 561 251 -9 -239 -108 -206 265 306 40 -358
4240c58K16JK38N41m77o64J79N45K0L8m99m03M91N61k48o03J97J2N08J04k90l44
$$ -358 -142 -141 97 638 161 -503 -324 221 241 279 -220 -623 -132 429 181 -422 -225 -213 295 399 109 -235
4262b35M5M8J8L84J82o85m24N57M88j19j62n02l1P06J54n04k66J69K4L27K67n07
$$ -235 -190 -142 -124 260 442 -243 -667 -110 378 259 97 -405 -436 270 424 -80 -346 -177 -153 174 441 -66
4284f6k42k8K02J35N15j88p08QM26K27n3j92o94L57R47j40m56m27K02J97K93k06
$$ -66 -308 -336 -134 1 516 328 -380 -372 54 281 228 36 -658 -301 646 506 50 -377 -175 22 315 109
4306A09m57l0J64K64R2K58o30j63J55K54L93k06m70l01O65L72l45k22k93J37N16
$$ 109 -348 -378 -214 50 142 400 -230 -393 -238 16 409 203 -267 -568 97 469 124 -98 -391 -254 262
4327B62L82n74k80n2K28J6L26k58m20J28K18M1L58l73n22J29N08L90m53l33l77
$$ 262 644 70 -210 -262 -34 -18 308 50 -370 -242 -24 17 375 2 -520 -391 117 507 54 -279 -656
4348f56M77N54O4p57j07M36K5J87N0m75O0j3P0L73j35k35l87K09O73j51j61j32
$$ -656 -179 375 439 -318 -425 11 36 223 273 -202 -142 -155 -85 288 153 -82 -469 -260 413 262 101 -31
4370c1l43N22J59j71m01J23Q4J67J94l87k88K54K61j17R3O3o28J65M31J42j81
$$ -31 -374 148 307 136 -265 -142 -58 109 303 -84 -372 -118 143 26 119 182 -446 -281 150 292 111
4391A11k10l84m1Q49R5l66l65R1J75L73o5m81l05L41L95k25L77m51k55J32K21
$$ 111 -99 -483 -524 325 420 54 -311 -220 -45 328 263 -218 -523 -182 213 -12 365 -86 -341 -209 12
4412A2K83k11k88k72N73O69m06n76k22M54J83K38l25m93K35K58l7k1J96m64M5
$$ 12 295 84 -204 -476 97 766 360 -216 -438 16 199 437 112 -381 -146 112 75 54 250 -214 -169
4433a69K36L74l42j81j99j38M99N01k79m50k53J56P80p1n05j31K17K06k18K07
$$ -169 67 441 99 -82 -281 -419 80 581 302 -148 -401 -245 535 464 -41 -172 45 251 33 240
4453B40k78j20K07J47n4J50l15o16M30N89J0m12q2j60J47O09j28p30K9M80j9J41
$$ 240 -38 -158 49 196 142 292 -23 -639 -209 380 390 -22 -104 -264 -117 492 364 -366 -337 143 124 265
4475B65j21m13R1K70J90j97J67l70j32K36O20l66k82k91oP01J96m22n84L67M3
$$ 265 144 -269 -178 92 282 85 252 -118 -250 -14 606 240 -42 -333 -339 362 558 136 -448 -81 -38
4496c8L14n3k77k67N26r8o7L4q6n33K49M66J87k40k93j39K10M85Q6n64k33J62
$$ -38 276 223 -54 -321 205 107 40 74 -12 -545 -296 170 357 117 -176 -315 -105 380 466 -98 -331 -169
4518a69L40K46m36k07j71Q45j64j37j20k66r0L13M07p5k03j88l33N63J91j7o91
$$ -169 171 417 -19 -226 -397 448 284 147 27 -239 -329 -16 391 316 113 -75 -408 155 346 329 -362
4539c62K24mL07L49q13k26M01M35m8j93k09m27L58L81M7j60k39j35R3M79K49n68
$$ -362 -138 -142 165 514 -299 -525 -124 311 263 70 -139 -566 -208 173 220 60 -179 -314 -221 258 507 -61
4561f1k88K59L37K11j70n69r1N15K53k30j1m90QL56J78p2N9l25j18P9N62N0n09
$$ -61 -349 -90 247 458 288 -281 -372 143 396 166 155 -335 -327 29 207 135 194 -131 -249 -170 392 442 -67
4584f7p8J3L30K43l70m69K01N16j16J49l10m85L04M82j19J15j49n60J03O10J7
$$ -67 -145 -132 198 441 71 -398 -197 319 203 352 42 -443 -139 343 224 339 190 -370 -267 343 360
4605C60l82j32J8n6K55K92o10j6J11M91m7k9n21j41L76K88j71o9k06k19L53M51
$$ 360 -22 -154 -136 -192 63 355 -255 -271 -160 331 284 255 -266 -407 -31 257 86 17 -189 -408 -55 396
4627C96l27k39km0K45M16k53o02O6L99K16K2l40l51n7O71j30j23M5J42k65L23
$$ 396 69 -170 -172 -212 33 449 196 -406 -340 59 275 297 -43 -394 -451 220 90 -33 12 154 -111 212
4649B12P5l38kk17J09N18r7n46q2K35K02M19j36n55l98O69K68q7k93O0k38K25
$$ 212 287 -51 -53 -270 -161 357 260 -286 -368 -133 69 488 352 -203 -601 68 336 249 -44 16 -222 3
4671CJ93o6m06J12K09k40L14J82n15j56L31O8L85j92n11k62M17L76l6p1m34J31
$$ 3 196 130 -276 -164 45 -195 119 301 -214 -370 -39 29 414 222 -289 -551 -134 242 206 135 -299 -168
4693a68L67L8j21j22m7P4KL31l69j43J66p2L06J65m16p01M61M93M9J0l37l13N09
$$ -168 199 237 116 -6 -53 21 23 354 -15 -158 8 -64 242 407 -9 -710 -249 244 293 303 -34 -347 162
4716A62K12k34l79K36j5J3N6k6m2j90J85R3M41k12n42n15P03L28No3m37l3N07
$$ 162 374 140 -239 -3 -18 -5 51 25 -17 -207 -22 71 512 300 -242 -757 -54 274 279 216 -221 -254 253
4739B53j34k93l4K04J38n1n0k80R3J84k68M58K52l52n13j7N33Q1J59k70n15M09
$$ 253 119 -174 -208 -4 134 83 33 -247 -154 30 -238 220 472 120 -393 -410 123 204 363 93 -422 -13
4761a3L39k60k13JQ3K52J15j16m41q6K71J44J08J07m18j88J29L18K57j96l88j02
$$ -13 326 66 -147 -146 -63 189 304 188 -253 -339 -68 76 184 291 -127 -315 -186 132 389 193 -195 -297
4783b97L17M90m09j66k8m2J48K66k51k75K0Q4K14J91j25n08k5M97J28j70k6m05
$$ -297 20 510 101 -65 -93 -135 13 279 28 -247 -227 -143 71 262 137 -371 -396 101 229 59 33 -372
4805c72J19K98j52Q6k80Q5L19K19Ln06K13j75K91P2P0l09l04J75K30K24n8m35
$$ -372 -253 45 -107 -21 -301 -216 103 322 325 -181 32 -143 148 220 290 -19 -323 -148 82 306 248 -187
4827a87j73K94M80l15k74k9K4L63J37j97m93K50R9J20J66k47k03j15K21p1M18
$$ -187 -360 -66 414 99 -175 -204 -180 183 320 123 -370 -120 -21 99 265 18 -185 -300 -79 -150 268
4848B68q5k83p7L94O1k96k6j38j4M87mn45j46K93m0L04J59l54m38M68R7m8J67
$$ 268 183 -100 -177 217 278 -18 -44 -182 -196 291 287 -258 -404 -111 -151 153 312 -42 -480 -12 85 37 204
4871B04o9l87J55K50j01j40j69K6L90K26k38m72P6J18J60R1j8j77j88K52J93L4
$$ 204 135 -252 -97 153 52 -88 -257 -231 159 385 147 -325 -249 -131 29 120 102 -75 -263 -11 182 216
4893B16j32q9j12n4M22j10j39l02N2K74N56p31k67L17K00P5J09m12p6J18J38m4
$$ 216 84 -5 -117 -171 251 141 2 -300 -248 26 582 -149 -416 -99 101 176 285 -127 -203 -85 53 9
4915IJ81o2m52J98K71j7R9k18l46K86L72r7m54j84J19K76M01l36k72J1J85l4N1
$$ 9 190 128 -324 -126 145 128 227 9 -337 -51 321 224 -230 -414 -295 -19 382 46 -226 -215 -30 -64 -13
4938a3R9k16q7K68J10r1j98q0p9L11M92k98m50K9J02L62Q7n30p8J68L85p5Nk33
$$ -13 86 -130 -217 51 161 70 -128 -208 -287 24 516 218 -232 -203 -101 261 348 -182 -260 -92 293 218 223 -10
4962a0l80K87L20LL7k65k89L30O2J48l59r3nK61P5R9m54L5L48j37M1L7j78p0K89
$$ -10 -390 -103 217 220 257 -8 -297 33 95 243 -116 -209 -214 47 122 221 -233 -198 150 13 54 91 -87 -157 132
4987A32j41M2Q1k49J39J68j0j66o5k21j45N64L22m75k69K47MJ80j6k14j37K48
$$ 132 -9 33 114 -135 4 172 162 -4 -69 -290 -435 129 451 -24 -293 -46 -42 138 122 -92 -229 19
5009A9P1k03J65k2j66q0L81n9l2k09j02J12M10J74m82k76Q2M35p4L8n59K75N2
$$ 19 90 -113 52 30 -136 -216 165 106 74 -135 -237 -125 285 459 -23 -299 -217 218 144 182 -377 -102 -50
5032e0M3J27j65j52j60J89N53m24lk17J5L78J00j85k11pN9K22k3j66k19J67N4
$$ -50 -7 120 -45 -197 -357 -168 385 -39 -42 -259 -244 134 234 49 -162 -169 -110 112 89 -77 -296 -129 -75
5055g5R3P3j93j08J07J37J86k77K45k83k01N37L5l12k37J80J66R7Om63k9L84M0
$$ -75 18 91 -102 -210 -103 34 220 -57 188 -95 -296 241 276 -36 -273 -93 73 170 176 -287 -316 68 108
5078A08j32r9m1p2J97K31l04M19k81j81O2K38K0j92K3jL3L08k88m91K28M44n3
$$ 108 -24 -123 -164 -236 -39 192 -112 307 26 -155 -93 145 165 -27 -4 -5 28 336 48 -443 -215 229 176
5101A76p5k07k08J15M45j40k4l71K50j34L60j1j45j28Oq5K44J67m75J26n2L78
$$ 176 101 -106 -314 -199 246 106 82 -289 -39 -173 187 176 31 -97 -91 -176 68 235 -240 -114 -166 212
5123B12q0P4m05q5K97K49k64j22J08l7R8J58J36l56k7j87K09L59Ln92q0M41J69
$$ 212 132 206 -199 -284 13 262 -2 -124 -16 -53 45 203 339 -17 -44 -231 -22 337 340 -252 -332 109 278
5146B78K0k89l43O7N64om05J87M1l28K59L07n57J27oJ8J55J84j55l80r1M54J22
$$ 278 298 9 -334 -267 297 291 -114 73 114 -214 45 352 -205 -78 -84 -66 89 273 118 -262 -353 101 223
$$ [...]
8191a70
##END NTUPLES=NMR FID
##END=
