##TITLE=1H_CG-1120
 DMSO, 8 sc, 
 17.9.2019
##JCAMPDX= 6.0         $$ Bruker NMR JCAMP-DX V2.0
##DATA TYPE= NMR FID
##DATA CLASS= NTUPLES
##ORIGIN= UXNMR, Bruker Analytische Messtechnik GmbH
##OWNER= root
$$ XWIN-NMR		Version 3.5
$$ Tue Sep 17 14:44:44 2019 Russian Standard Time (UT+4h)  she@DPX200
##.OBSERVE FREQUENCY= 200.1315
##.OBSERVE NUCLEUS= ^1H
##.DELAY= (6, 6)
##.ACQUISITION MODE= SIMULTANEOUS
##.ACQUISITION SCHEME= undefined
##.AVERAGES= 8
##.DIGITISER RES= 18
##SPECTROMETER/DATA SYSTEM= spect
##.PULSE SEQUENCE= zg30
##.SOLVENT NAME= DMSO
##.SHIFT REFERENCE= (INTERNAL, DMSO, 0, 15.7039)
##AUDIT TRAIL= $$ (NUMBER, WHEN, WHO, WHERE, WHAT)
$$ ##TITLE= Audit trail, XWIN-NMR		Version 3.5
$$ ##JCAMPDX= 5.01
$$ ##ORIGIN= Bruker BioSpin GmbH
$$ ##OWNER= she
$$ F:/spectra/data/she/nmr/H-F/1/audita.txt
$$ ##AUDIT TRAIL=  $$ (NUMBER, WHEN, WHO, WHERE, WHAT)
(   1,<2019-09-17 14:43:50.10 +0400>,<she>,<DPX200>,
      <created by zg, POWCHK disabled, PULCHK disabled
       configuration hash MD5:
       00 E9 B6 7A A2 85 ED C7 34 08 36 98 17 FE 4E 26
       data hash MD5: 16K
       C8 2E FD 3F 09 61 A7 48 BA 2F B2 77 B9 75 80 8B>)
$$ ##END=
$$ 
$$ hash MD5
$$ AC BA 06 15 76 D1 2B 34 94 76 57 B7 58 BC 10 6C
##$RELAX= 
##$RELAX= 
##$RELAX= 
##$RELAX= 
##$RELAX= 
##$RELAX= 
$$ Bruker specific parameters
$$ --------------------------
##$DU= <F:/spectra>
##$EXPNO= 1
##$NAME= <H-F>
##$PROCNO= 1
##$TYPE= <nmr>
##$USER= <she>
##$AMP= (0..31)
100 100 100 100 100 100 100 100 100 100 100 100 100 100 100 100 100 100 
100 100 100 100 100 100 100 100 100 100 100 100 100 100 
##$AQSEQ= 0
##$AQ_mod= 1
##$AUNM= <au_zg>
##$AUTOPOS= <>
##$BF1= 200.13
##$BF2= 200.13
##$BF3= 200.13
##$BF4= 200.13
##$BF5= 200.13
##$BF6= 200.13
##$BF7= 200.13
##$BF8= 200.13
##$BYTORDA= 1
##$CFDGTYP= 0
##$CFRGTYP= 5
##$CHEMSTR= <none>
##$CNST= (0..31)
1 1 145 1 1 1 1 1 1 1 1 1 1 1 1 1 1 1 1 1 1 1 1 1 1 1 1 1 1 1 1 1 
##$CPDPRG= <>
##$CPDPRG1= <>
##$CPDPRG2= <>
##$CPDPRG3= <>
##$CPDPRG4= <mlev>
##$CPDPRG5= <mlev>
##$CPDPRG6= <mlev>
##$CPDPRG7= <mlev>
##$CPDPRG8= <mlev>
##$CPDPRGB= <>
##$CPDPRGT= <>
##$D= (0..31)
0 1.2 0 0 0 0 0 0 0 0 0 0.03 0 0 0 0 0 0 0 0 0 0 0 0 0 0 0 0 0 0 0 0 
##$DATE= 1568717029
##$DBL= (0..7)
120 120 120 120 120 120 120 120 
##$DBP= (0..7)
150 150 150 150 150 150 150 150 
##$DBP07= 0
##$DBPNAM0= <>
##$DBPNAM1= <>
##$DBPNAM2= <>
##$DBPNAM3= <>
##$DBPNAM4= <>
##$DBPNAM5= <>
##$DBPNAM6= <>
##$DBPNAM7= <>
##$DBPOAL= (0..7)
0.5 0.5 0.5 0.5 0.5 0.5 0.5 0.5 
##$DBPOFFS= (0..7)
0 0 0 0 0 0 0 0 
##$DE= 6
##$DECBNUC= <off>
##$DECIM= 24
##$DECNUC= <off>
##$DECSTAT= 4
##$DIGMOD= 1
##$DIGTYP= 9
##$DL= (0..7)
0 120 120 120 120 120 120 120 
##$DP= (0..7)
150 150 150 150 150 150 150 150 
##$DP07= 0
##$DPNAME0= <>
##$DPNAME1= <>
##$DPNAME2= <>
##$DPNAME3= <>
##$DPNAME4= <>
##$DPNAME5= <>
##$DPNAME6= <>
##$DPNAME7= <>
##$DPOAL= (0..7)
0.5 0.5 0.5 0.5 0.5 0.5 0.5 0.5 
##$DPOFFS= (0..7)
0 0 0 0 0 0 0 0 
##$DQDMODE= 0
##$DR= 18
##$DS= 0
##$DSLIST= <SSSSSSSSSSSSSSS>
##$DSPFIRM= 0
$$ [...]
##$SUBNAM2= <"">
##$SUBNAM3= <"">
##$SUBNAM4= <"">
##$SUBNAM5= <"">
##$SUBNAM6= <"">
##$SUBNAM7= <"">
##$SUBNAM8= <"">
##$SUBNAM9= <"">
##$SW= 24.0689530833862
##$SWIBOX= (0..15)
0 0 2 0 0 0 0 0 0 0 0 0 0 0 0 0 
##$SW_h= 4816.95568400771
##$TD= 16384
##$TD0= 1
##$TE= 0
##$TE2= 300
##$TE3= 300
##$TEG= 300
##$TL= (0..7)
0 120 120 120 120 120 120 120 
##$TP= (0..7)
150 150 150 150 150 150 150 150 
##$TP07= 0
##$TPNAME0= <>
##$TPNAME1= <>
##$TPNAME2= <>
##$TPNAME3= <>
##$TPNAME4= <>
##$TPNAME5= <>
##$TPNAME6= <>
##$TPNAME7= <>
##$TPOAL= (0..7)
0.5 0.5 0.5 0.5 0.5 0.5 0.5 0.5 
##$TPOFFS= (0..7)
0 0 0 0 0 0 0 0 
##$TUNHIN= 0
##$TUNHOUT= 0
##$TUNXOUT= 0
##$USERA1= <user>
##$USERA2= <user>
##$USERA3= <user>
##$USERA4= <user>
##$USERA5= <user>
##$V9= 5
##$VALIST= <valist>
##$VCLIST= <CCCCCCCCCCCCCCC>
##$VD= 0
##$VDLIST= <DDDDDDDDDDDDDDD>
##$VPLIST= <PPPPPPPPPPPPPPP>
##$VTLIST= <TTTTTTTTTTTTTTT>
##$WBST= 1024
##$WBSW= 4
##$XGAIN= (0..3)
0 0 0 0 
##$XL= 0
##$YL= 0
##$YMAX_a= 107103
##$YMIN_a= -196521
##$ZGOPTNS= <>
##$ZL1= 120
##$ZL2= 120
##$ZL3= 120
##$ZL4= 120
##$ABSF1= 10
##$ABSF2= 0
##$ABSG= 5
##$ABSL= 3
##$ALPHA= 0
##$AQORDER= 0
##$ASSFAC= 0
##$ASSFACI= 0
##$ASSFACX= 0
##$ASSWID= 0
##$AUNMP= <proc_1d>
##$AZFE= 0.1
##$AZFW= 0.1
##$BCFW= 1
##$BC_mod= 2
##$BYTORDP= 1
##$COROFFS= 0
##$CY= 11.3945322036743
##$DATMOD= 1
##$DC= 2
##$DFILT= <>
##$DTYPP= 0
##$F1P= 20.1720416913024
##$F2P= 0.152960286110954
##$FCOR= 0.5
##$FTSIZE= 0
##$FT_mod= 4
##$GAMMA= 1
##$GB= 0.15
##$INTBC= 1
##$INTSCL= 1
##$ISEN= 128
##$LB= 0.24
##$LEV0= 0
##$LPBIN= 0
##$MAXI= 10000
##$MC2= 0
##$MEAN= 0
##$ME_mod= 0
##$MI= 1.114404
##$NCOEF= 0
##$NC_proc= 0
##$NLEV= 6
##$NOISF1= 3.799351
##$NOISF2= 2.8
##$NSP= 1
##$NTH_PI= 0
##$NZP= 0
##$OFFSET= 15.70392
##$PC= 1
##$PHC0= -9580.659
##$PHC1= 19.60096
##$PH_mod= 1
##$PKNL= yes
##$PPARMOD= 0
##$PSCAL= 0
##$PSIGN= 0
##$REVERSE= no
##$SF= 200.130013532006
##$SI= 16384
##$SIGF1= 3
##$SIGF2= 2
##$SINO= 400
##$SIOLD= 16384
##$SREGLST= <1H.CDCl3>
##$SSB= 0
##$STSI= 0
##$STSR= 0
##$SW_p= 3612.71676300578
##$SYMM= 0
##$S_DEV= 0
##$TDeff= 0
##$TDoff= 0
##$TI= <>
##$TILT= no
##$TM1= 0
##$TM2= 0
##$TOPLEV= 0
##$USERP1= <user>
##$USERP2= <user>
##$USERP3= <user>
##$USERP4= <user>
##$USERP5= <user>
##$WDW= 1
##$XDIM= 8192
##$YMAX_p= 0
##$YMIN_p= 0
$$ End of Bruker specific parameters
$$ ---------------------------------
##NTUPLES= NMR FID
##VAR_NAME=  TIME,          FID/REAL,        FID/IMAG
##SYMBOL=    X,             R,               I
##VAR_TYPE=  INDEPENDENT,   DEPENDENT,       DEPENDENT
##VAR_FORM=  AFFN,          ASDF,            ASDF
##VAR_DIM=   8192,          8192,            8192
##UNITS=     SECONDS,       ARBITRARY UNITS, ARBITRARY UNITS
##FACTOR=    0.0002076,     1,               1
##FIRST=     0,             0,               0
##LAST=      1.7004516,     0,               0
##MIN=       0,             -196521,         0
##MAX=       1.7004516,     107103,          0
$$ Real data points
##PAGE= N=1
##DATA TABLE= (X++(R..R)), XYDATA
$$ [...]
$$ plain form
2103 -1389 1088 2010 85 -1754 -469 1922 1545 -867 -1869 708 2098 417 -1583 -1167 1248 1636
2119 1636 -815 -1977 -123 1275 262 -1469 -1382 130 787 -312 -1447 -830 536 -12 -1468 -1197
2135 -1197 217 290 -1034 -1426 -804 359 -515 -1763 -1004 219 13 -1319 -1076 -219 777 -198 -1447 -1108
2153 -1108 921 1136 -681 -1804 147 1939 974 -1279 -1477 1496 2218 89 -1754 294 2513 1800
2169 1800 -514 -1034 733 2638 1415 -1278 -996 2273 2758 625 -1283 210 2335 1709 -954 -1135
2185 -1135 1223 1779 639 -828 -296 1070 1075 -213 -1489 -371 1296 867 -1029 -1072 319 903 -493
2202 -493 -1159 -769 361 -203 -1050 -635 -218 -494 -1026 -925 -451 -447 -898 -1147 -868 44 161 -1195 -1251 -196
2222 -196 436 -1248 -2210 -476 648 343 -1754 -1228 857 1296 -492 -1419 -1307 535 1174 -465 -1712
$$ packed form
2103a389K477R22j925j839J285K391l77k412j002K577J390j681k000M16K415L88
2119A636k451j162J854J398j013j731Q7J512O57j099j135O17J366n48j456K71
2135a197J414P3j324l92O22J163q74j248P59J223k06j332K43Q57R96r75j249L39
2153a108K029K15j817j123J951J792r65k253j98K973P22k129j843K048K219p13
2169A800k314n20J767J905j223k693K82L269M85k133j908J493K125o26k663j81
2185a135K358N56j140j467N32J366Nj288j276J118J667m29j896m3J391N84j396
2202d93o66L90J130n64q47M15M17k76n32J01M74Mm51k49K79R12J17j356n6J055
2222a96O32j684r62J734J124l05k097N26K085M39j788r27J12J842O39j639j247
$$ plain form
2239 -1712 -249 1843 1062 -1367 -1224 967 1571 -186 -1738 -283 1776 1460 -737 -797 644 1573 1013
2256 1013 -490 -856 932 2117 706 -740 26 1677 1350 -212 6 898 1376 565 -186 417 1154
2273 1154 787 609 136 246 557 755 327 -122 834 729 -111 -263 497 720 -655 -715 369 968 -428
2292 -428 -1115 -342 487 -204 -1140 -949 -536 -40 -583 -1408 -1773 -63 667 -1213 -2405 -842 769 -29
2310 -29 -2427 -1728 203 594 -531 -1689 -569 467 798 -774 -1362 -244 1155 875 -1152 -1268 1006
2327 1006 1933 -184 -1590 306 1691 1145 -362 -491 702 1387 822 -556 -174 1171 1553 566 -671
2344 -671 298 1990 1012 -888 -500 1214 1549 -245 -382 748 938 429 -248 -121 309 398 136 -153 287
2363 287 853 125 -761 -574 644 841 -888 -1360 89 1501 -352 -974 -416 659 204 -897 -1032 -158
$$ packed form
2239a712J463K092p81k429J43K191O04j757j552J455K059l16k197o0J441R29n60
2256A013j503l66J788J185j411j446P66J651l27j562K18Q92M78q11p51O03P37
2273A154l67j78m73J10L11J98m28m49R56j05q40j52P60K23j375o0J084N99j396
2292d28o87P73Q29o91r36J91M13M96n43q25l65J710P30j880j192J563J611p98
2310b9k398O99J931L91j125j158J120J036L31j572n88J118J399k80k027j16K274
2327A006R27k117j406J896J385n46j507j29J193O85n65j378L82J345L82r87j237
2344f71R69J692r78j900L88J714L35j794j37J130J90n09o77J27M30Q9k62k89M40
2363B87N66p28q86J87J218J97j729m72J449J412j853o22N58J075m55j101j35Q74
$$ plain form
2381 -158 780 12 -1357 -985 585 905 -526 -2193 -980 1431 416 -1713 -1674 821 1093 -887 -1728
2398 -1728 -1044 887 503 -1271 -1816 -388 1378 883 -1739 -1579 699 1615 -472 -2113 -501 1615
2414 1615 924 -1071 -821 498 1210 32 -941 -704 471 1344 228 -1333 90 1445 1111 -881 -696
2431 -696 915 1186 203 -343 383 779 294 20 478 369 573 137 -41 96 572 737 -320 -672 731
2450 731 732 -604 -567 557 695 -413 -1187 -45 1105 254 -1130 -823 200 908 213 -1157 -1212 428
2468 428 1229 -329 -1818 -604 1417 503 -1482 -1551 898 1257 -276 -1635 -846 944 1018 -811 -1310
2485 -1310 -284 1374 1017 -823 -1795 236 1858 271 -1781 -835 999 1039 -550 -1027 149 820 393
2502 393 -708 -757 104 695 502 -671 -518 529 708 -16 -745 178 511 -37 74 423 -111 -1 227
$$ packed form
2381a58R38p68j369L72J570L20j431j667J213K411j015k129L9K495K72j980q41
2398a728O84J931l84j774n45J428J766m95k622J60K278R16k087j641J612K116
2414A615o91j995K50J319P12j178r73K37J175Q73j116j561J423J355l34j992J85
2431f96J611K71r83n46P26L96m85k74M58j09K04m36j78J37M76J65j057l52J403
2450G31Jj336L7J124J38j108p74J142J150q51j384L07J023P08o95j370n5J640
2468D28Q01j558j489J214K021r14j985o9K449L59j533j359P89J790P4j829m99
2485a310J026J658l57j840r72K031J622j587k052R46J834M0j589m77J176O71m27
2502C93j101m9Q61N91j93j173J53J047J79p24p29R23L33n48J11L49n34J10K28
$$ plain form
2521 227 131 347 -106 -396 -98 414 -153 -196 -167 237 705 120 -635 -710 1144 1408 -655 -1722 129 1494
2541 1494 674 -775 -972 243 1169 145 -975 -550 1019 1292 -85 -1461 -435 1626 1112 -937
2557 -937 -1559 746 2224 214 -1152 -728 789 1359 -180 -1184 -679 733 949 -343 -1292 -233 1285
2574 1285 632 -772 -774 582 947 -18 -688 -280 197 201 -45 -808 -805 28 126 -351 -435 -630 -454 334 -286 -307
2596 -307 -381 -710 20 169 209 -1080 -864 567 447 -955 -1590 -31 777 335 -1077 -1030 344 1189 396
2615 396 -1404 -1180 1197 1762 -432 -1559 -491 1960 1396 -888 -1219 893 1699 658 -977 -708 843
2632 843 1930 19 -1374 -609 1619 1643 -263 -1157 489 2051 643 -1097 -460 878 1322 231 -879
2649 -879 -143 637 662 136 -564 -405 823 557 -294 -493 338 216 -159 -355 170 78 -176 -179 163 -109 -749
$$ packed form
2521B27r6K16m53k90K98N12n67m3K9M04M68n85p55p5J854K64k063j067J851J365
2541A494q20j449j97J215R26j024j120M25J569K73j377j376J026K061n14k049
2557i37o22K305J478k010j366M24J517N70j539j004N05J412K16j292r49J059J518
2574A285o53j404kJ356L65r65o70M08M77Mk46p63LQ33R8m77q4j95J76P88o20k1
2596c07p4l29P30J49M0j289K16J431j20j402o35J559Q08m42j412M7J374Q45p93
2615C96j800K24K377N65k194j127J068K451n64k284l31K112Q06j041j635K69J551
2632H43J087j911j393P65K228K4j906q94J646J562j408j740O37J338M44j091j110
2649h79P36P80K5n26p00J59J228k66q51j99Q31j22l75j96N25r2k54lL42k72o40
$$ plain form
2670 -749 -576 705 450 -526 -873 -512 326 373 -700 -1581 -313 933 204 -1351 -1190 708 1031 -646
2688 -646 -1810 -590 1265 846 -1311 -1995 -331 1370 514 -1321 -1720 151 1501 256 -1893 -1182
2704 -1182 1191 1177 -773 -1680 -179 1608 1056 -1045 -743 743 1819 558 -685 -680 1020 2074 245
2721 245 -552 230 1366 954 131 -84 482 955 786 -68 195 876 803 540 -62 212 191 476 208 185 158
2742 158 -119 -76 501 349 -117 -873 -235 395 219 -568 -1003 -126 625 -164 -1327 -1089 66 146 -945 -1456
2762 -1456 -820 552 401 -1055 -1693 -255 723 -258 -1595 -1223 166 646 -454 -1721 -1011 977 806
2779 806 -835 -1270 -124 1171 218 -995 -959 483 1065 -100 -851 -198 900 664 -296 -1144 213 1303
2797 1303 508 -584 -383 797 844 106 -150 290 453 743 -22 87 307 617 304 412 197 68 321
$$ packed form
2670g49J73J281k55r76l47L61Q38M7j073q81J268J246p29j555J61J898L23j677
2688f46j164J220J855m19k157o84J664J701q56j835l99J871J350j245k149P11
2704a182K373j4j950r07J501J787n52k101L02J486J076j261j243NJ700J054j829
2721B45p97P82J136m12q23k15N66M73j69q54K63O81p3k63o02K74k1K85k68k3k7
2742A58k77M3N77j52m66p56O38O30j76p87m35Q77P51p89j163K38J155Q0j091n11
2762a456O36J372j51j456o38J438R78r81j337L72J389M80j100j267P10J988j71
2779H06j641m35J146J295r53j213L6J442N82j165p51O53J098k36r60q48J357J090
2797A303p95j092K01J180M7p38k56M40J63K90p65J09K20L10l13J08k15j29K53
$$ plain form
2816 321 387 545 431 229 86 45 875 535 -348 -36 197 654 275 -631 -205 597 601 -255 -590 146 1107
2837 1107 347 -412 -881 150 871 -275 -1108 -335 621 409 -735 -1040 -130 663 238 -1471 -1147 -68
2855 -68 339 -411 -1526 -562 503 -5 -816 -1405 -242 331 -169 -833 -600 28 347 1 -624 -300 797
2874 797 219 -291 -305 378 495 69 -171 72 833 437 -87 -333 680 333 166 600 441 614 598 120
2894 120 168 777 683 376 99 812 967 329 -204 249 1003 450 -304 -428 718 1139 330 -679 -170 769
2914 769 483 -84 -653 -188 691 332 -831 -776 615 604 -684 -1030 -377 374 343 -943 -792 137 659 -162
2934 -162 -1028 -342 455 505 -506 -822 -162 991 215 -986 -956 450 451 -204 -610 -344 344 272 -453 -813
2954 -813 47 352 160 -402 -451 41 531 -342 -547 63 364 186 -469 -259 377 335 -2 -430 435 622 44
$$ packed form
2816C21O6J58j14k02j43m1Q30l40q83L12K33M57l79r06M26Q02Mq56l35P36R61
2837A107p60p59m69J031P21j146q33P73R56k12j144l05R10P93m25j709L24J079
2855f8M07p50j115R64J065n08q11n89J163N73n00o64K33O28L19l46o25L24J097
2874G97n78n10j4O83J17m26k40K43P61l96n24k46J013l47j67M34j59J73j6m78
2894A20M8O09r4l07k77P13J55o38n33M53P54n53p54j24J146M21q09j009N09R39
2914G69k86n67n69M65Q79l59j163N5J391j1j288l46O53P51l1j286J51R29N22q21
2934a62q66O86P97N0j011l16O60J153p76j201L0J406Jo55m06K66O88p2p25l60
2954h13Q60L05j92n62m9M92M90q73k05O10L01j78o55K10O36m2l37m28Q65J87n78
$$ plain form
2975 44 -151 114 519 274 -263 -99 565 571 376 -722 71 747 590 -685 -404 469 776 -64 -342 -134
2995 -134 423 722 -21 -818 466 803 465 -611 -856 386 1515 -209 -1064 -464 811 585 -729 -635
3013 -635 246 785 393 -527 -569 561 651 -12 -1027 -261 703 404 -663 -1070 94 834 323 -759 -546
3032 -546 268 31 -94 -516 -124 364 433 -224 -442 412 501 387 -452 -397 464 168 -484 -116 454 45 -547
3053 -547 -84 358 196 -502 -313 101 281 178 -248 -503 107 567 -1 -422 -93 572 454 -561 -588 471
3073 471 928 153 -574 142 766 570 -380 -778 -368 268 857 -570 -760 -97 1010 209 -698 -456 419
3092 419 644 -202 -908 237 793 82 -390 -542 292 642 369 -345 -374 392 279 -393 -383 137 666 94
3112 94 -349 -266 540 83 0 -126 340 57 163 64 -216 22 240 -119 -34 279 21 -373 -416 -71 586 -238
$$ packed form
2975D4j95K65M05k45n37J64O64Oj95j098P93O76j57j275K81Q73L07q40k78K08
2995a34N57K99p43p97J284L37l38j076k45J242J129j724q55O00J275k26j314R4
3013f35Q81N39l92r20m2J130R0o63j015P66R64k99j067m07J164P40n11j082K13
3032e46Q14k37j25m22L92M88O9o57k18Q54Q9j14q39N5Q61k96o52L68N70m09n92
3053e47M63M42j62o98J89M14J80j03m26k55O10M60n68m21L29O65j18j015k7J059
3073D71M57p75p27P16O24j96r50l98M10O36N89j427j90O63J107q01r07K42Q75
3092D19K25q46p06J145N56p11m72j52Q34L50k73p14k9P66j13o72J0N20N29n72
3112I4m43Q3Q06m57q3j26M66k83J06r9k80K38K18l59Q5L13k58l94m3L45O57q24
$$ plain form
3134 -238 -814 -21 403 383 -949 -810 585 343 -285 -626 -315 1 275 -289 -780 -487 590 419 -683
3153 -683 -954 238 833 108 -851 -698 382 405 -224 -547 -316 477 316 -29 -440 -68 919 113 -639 -67
3173 -67 557 451 -131 -324 64 728 105 -81 137 571 283 162 -114 287 241 523 98 224 403 301 191
3194 191 -109 328 563 -102 -81 313 537 -151 -462 -213 260 433 -199 -319 75 351 164 -167 -731 205
3214 205 774 47 -848 -399 393 623 -664 -323 -32 140 19 -446 -466 317 641 -53 -620 -416 445 531
3234 531 -526 -844 28 626 217 -756 -444 -84 -64 -558 -670 -224 434 -62 -340 -359 -207 626 250 -330
3254 -330 -396 559 381 -533 -129 453 203 -404 -106 238 401 21 337 -17 390 661 360 -466 -134 602
3274 602 512 92 -211 398 725 112 -334 302 589 596 -167 -21 384 852 -68 -520 -374 518 846 117 -485
$$ packed form
3134b38n76P93M24k0j332J39J395k42o28l41L11L16K74n64m91K93J077j71j102
3153f83k71J192N95p25r59J53J080K3o29l23K31P93j61l45m11L72R87q06p52N72
3173f7O24j06n82j93L88O64o23j86K18M34k88j21k76M01m6K82m25J26J79j02j10
3194A91l00M37K35o65K1L94K24o88l11K49M73J73o32j20L94K76j87l31n64R36
3214B05N69p27q95M49P92K30j287L41K91J72j21m65k0P83L24o94n67K04Q61Q6
3234E31j057l18Q72N98m09r73L12L60K0m94j12M46O58m96k78j9J52Q33l76n80
3254c30o6R55j78r14M04N82k50o07K98L44J63l80L16l54M07K71l01q26L32P36
3274F02r0m20l03O09L27o13m46O36K87Pp63J46M05M68r20m52J46Q92L28p29o02
$$ plain form
3295 -485 -415 524 502 -597 -569 31 443 -234 -738 -287 273 -218 -601 -311 -211 151 -97 -583 -911 -343 113
3316 113 -394 -966 -445 462 146 -797 -397 348 95 -434 -470 121 176 -245 -409 -494 -314 120 -355 -710 -102
3337 -102 490 361 -460 -276 253 474 -282 -396 116 788 564 -332 62 327 612 417 -200 -67 429 819
3357 819 264 -196 109 712 309 -363 -376 542 599 -381 -352 246 487 199 126 83 219 384 397 -398 -94 114
3379 114 236 -292 -26 159 292 -134 -494 -33 887 -40 -215 -408 139 -73 5 81 -341 -86 145 -265 -587
3400 -587 224 365 -18 -743 -327 48 -107 -851 -615 -1 -165 -234 -545 -148 -114 90 100 -528 -201 154 219
3421 219 -329 -459 132 216 -194 -257 212 315 183 -116 -7 85 330 221 -66 354 210 417 100 -35 43
3442 43 603 309 159 -102 582 314 -254 24 393 422 115 91 -26 254 -14 62 225 194 274 -267 -381 -247
$$ packed form
3295d85P0R39k2j099K8O00M12o77n04M51N60m91l83K90J00L62k48m86l28N68M56
3316A13n07n72N21R07l16r43M00P45k53n29l6N91N5m21j64q5J80M34m75l55O08
3337a02N92j29q21J84N29K21p56j14N12O72k24q96L94K65K85j95o17J33M96L90
3357H19n55m60L05O03m03o72j3R18N7r80K9N98K41k88p3m3J36J65J3p95L04K08
3379A14J22n28K66J85J33m26l60M61R20r27j75j93N47k12P8P6m22K55K31m10l22
3400e87Q11J41l83p25M16L75j55p44K36O14j64o9l11L97L4K04J0o28L27L55O5
3421B19n48j30N91Q4m10o3M69J03j32k99J09R2K45j09k87M20j44K07l17j35P8
3442D3N60k94j50k61O84k68n68K78L69K9l07k4j17K80k68P6J63l1Q0n41j14J34
$$ plain form
3464 -247 305 528 -469 -635 321 171 -377 -267 -183 218 -179 -467 -313 357 278 -198 -698 -369 -107 205 -428
3485 -428 -313 -287 530 224 -674 -330 116 98 -157 -135 -69 170 -42 -210 -305 -187 148 272 -326 -323 108 21 -2
3508 -2 -555 51 225 -168 -208 66 235 -83 -131 -359 63 169 -45 -493 13 64 251 -111 -157 -141 428 390 -426
3531 -426 -61 368 841 37 -212 520 604 379 -290 -265 221 871 141 -54 -69 541 606 -33 -599 201 497
3552 497 4 -506 93 682 390 37 -220 -84 81 312 -160 -629 -16 356 46 -315 -253 213 -82 -249
3572 -249 -174 -128 415 0 -464 147 402 101 -131 -130 9 402 3 -326 104 191 -87 -411 -425 290 425 -100
3594 -100 -386 142 350 418 -163 -459 373 518 14 -526 -166 232 425 -91 -390 113 791 146 -497 -304
3614 -304 362 495 -267 -426 -52 551 401 -37 -154 104 341 377 -349 26 190 503 -209 -275 221 413 87
$$ packed form
3464b47N52K23r97j66R56j50n48J10Q4M01l97k88J54O70p9m76n00L29K62L12o33
3485d28J15K6Q17l06q98L44M46j8k55K2O6K39k12j68r5J18L35J24n98LM31q7k3
3508bn53O06J74l93m0K74J69l18m8k28M22J06k14m48N06N1J87l62m6J6N69l8q16
3531d26L65M29M73q04k49P32Q4k25o69K5M86O50p30j95j5O10O5o39n66Q00K96
3552D97m93n10N99N89k92l53k57J36J65K31m72m69O13L72l10l61O2M66k95j67
3572b49P5M6N43m15m64O11K55l01k32JJ39L93l99l29M30Q7k78l24j4P15J35n25
3594a00k86N28K08O8n81k96Q32J45n04n40L60L98J93n16k99N03O78o45o43J93
3614c04O66J33p62j59L74O03j50m38j17K58K37L6p26L75J64L13p12o6M96J92l26
$$ plain form
3635 87 -379 -243 317 250 67 21 -291 401 226 -21 -110 35 94 -62 -31 -88 22 2 38 -244 -28 464 234
3658 234 -160 41 188 354 -341 -155 -121 133 -146 -176 -75 343 75 -77 -175 -13 505 475 -345 -293 346 207
3680 207 -236 -308 -42 535 20 -178 -101 271 251 -520 -209 152 212 205 -18 -81 -164 42 -331 -101 -313 135 184
3703 184 -82 -465 -203 147 -33 -227 -113 240 -173 71 -444 60 14 182 15 -149 93 106 -260 -114 -148
3724 -148 9 -69 -141 -148 382 29 -459 -317 147 247 -43 -200 166 152 232 20 -122 290 421 164 98 -24
3746 -24 397 363 172 -582 33 595 313 -216 -555 -177 274 295 -253 -121 58 17 -212 -63 -133 254 -209 -411
3768 -411 -503 -46 -169 -505 -668 -213 -49 -82 -269 -499 -2 -65 -282 -308 -64 -21 -90 -543 -236 373 2 -426
3790 -426 -280 -168 -6 -275 -485 -238 182 113 -212 -209 -72 28 -207 -269 -440 94 23 -300 -479 45 196 134
$$ packed form
3635H7m66J36N60o7j83m6l12O92j75k47q9J45N9j56L1n7J10k0L6k82K16M92k30
3658B34l94K01J47J66o95J86L4K54k79l0J01M18k68j52r8J62N18l0q20N2O39j39
3680B07m43p2K66N77n15j98P7L72k0p71L11L61O0pk23o3q3K06l73K30k12M48M9
3703A84k66l83K62L50j80j94J14L53m13K44n15N04m6J68j67j64K42J3l66J46l4
3724a48J57p8p2pN30l53m88J42M64J00k90j57L66j4Q0k12j42M12J31k57o6j22
3746b4M21l4j91p54O15N62k82n29l39L78M51K1n48J32J79m1k29J49p0L87m63k02
3768d11r2M57j23l36j63M55J64l3j87k30M97o3k17k6K44M3o9m53L07O09l71m28
3790d26J46J12J62k69k10K47M20o9l25LJ37J00k35o2j71N34p1l23j79N24J51o2
$$ plain form
3812 134 -56 -484 203 574 -268 -514 274 122 66 -252 -252 -231 426 252 -21 -256 130 494 72 -204 -80
3833 -80 569 267 -207 76 630 380 -14 -224 5 181 187 -229 -223 247 78 -60 -304 -272 -8 160 -467 -273
3855 -273 83 264 1 -443 -35 311 109 -398 -41 130 193 39 -245 -267 113 388 94 -308 61 497 51
3876 51 -288 -150 595 394 -257 -171 125 304 230 -20 -68 -105 438 256 -386 -470 128 501 -79 -141 481 497 148
3899 148 -412 347 342 454 -90 -92 487 566 641 261 -104 -58 654 265 -53 192 356 194 189 -220 497 23 -291
3922 -291 106 329 467 159 -283 -192 37 135 146 -111 -261 122 349 -300 -593 318 308 -436 -560 -123 249
3943 249 174 -273 -308 -42 528 185 -25 -459 -187 349 -160 -629 -286 315 71 -676 -218 280 221 -438 -254
3964 -254 -334 -166 95 68 -511 -171 -85 16 -24 -105 -33 -73 -84 -536 -51 300 230 -550 -152 45 -211 -302 79
$$ packed form
3812A34j90m28O87L71q42k46P88j52n6l18%K1O57j74k73k35L86L64m22k76J24
3833h0O49l02m74K83N54k50l94k10K29J76Om16OM70j69j38k44L2K64J68o27J94
3855b73L56J81k63m44M08L46k02n07L57J71O3j54k84k2L80K75k94m02L69M36m46
3876E1l39J38P45k01o51Q6K96J79p4k50m8l7N43j82o42q4N98L73n80o2O22J6l49
3899A48n60P59nJ12n44kN79P9P5l80l65M6P12l89l18K45J64j62nm09P17m74l14
3922b91L97K23J38l08m42R1K29R8J1k57j50L83K27o49k93R11j0p44j24M37L72
3943B49p5m47l5K66N70l43k10m34K72N36n09m69L43O01k44p47M58M98n9o59J84
3964b54q0J68K61k7n79L40Q6J01m0q1P2m0j1m52M85L51p0p80L98J97k56r1L81
$$ plain form
3987 79 35 317 449 123 -56 -138 332 -57 -213 142 491 368 -110 -246 137 271 -393 -368 569 350 -12
4008 -12 76 22 82 29 209 -378 -481 138 63 -462 -441 224 11 -195 -316 -364 -4 32 -218 -103 99 -95 -218
4031 -218 -208 -188 -289 49 -94 -371 -70 83 86 -390 -253 313 144 -243 -416 226 -8 -154 -189 -132 172 -97
4053 -97 -20 -92 -230 196 14 -360 -364 309 -8 -309 -158 84 270 125 -360 -150 212 113 -53 86 192 322
4075 322 236 -237 -160 9 705 275 -542 35 375 383 -148 5 458 315 38 -271 324 166 -20 11 -85 -171
4097 -171 106 -82 -41 -329 -38 307 174 -516 -28 -49 -177 -370 -302 -61 -15 -19 94 -13 102 57 -354 -296 220
4120 220 417 105 -144 160 555 263 -339 15 227 76 66 48 130 427 347 -97 -319 -40 290 23 -82
4141 -82 -304 54 387 -199 -333 115 446 327 -385 175 209 309 153 51 -274 -70 383 58 27 278 281 -31
$$ packed form
3987G9m4K82J32l26j79q2M70l89j56L55L49j23m78j36L83J34o64K5R37k19l62
4008a2Q8n4O0n3J80n87j03O19p5n25K1O65k13k06j21m8L60L6k50J15K02j94j23
4031b18J0K0j01L38j43k77L01J53Lm76J37N66j69l87j73O42k34j46l5N7L04k69
4053i7P7p2j38M26j82l74mO73l17l01J51K42J86j45m85K10L62r9j66J39J06J30
4075C22q6m73P7J69O96m30q17N77L40Qn31J53M53j43k77l09N95j58j86L1r6q6
4097a71K77j88M1k88K91L45j33o90M88k1j28j93O8K41M6mJ13j07J15m5m11N8N16
4120B20J97l12k49L04L95k92o02L54K12j51j0j8Q2K97q0m44k22K79L30k67j05
4141h2k22L58L33n86j34M48L31j19p12N60L4J00j56j02l25K04M53l25l1K51Ll12
$$ plain form
4163 -31 -70 -136 504 338 -142 -252 205 299 0 -262 -177 273 37 -86 -185 -45 95 248 275 -147 61 113 41
4186 41 -255 -43 94 -35 -169 -197 323 238 -175 47 -57 -172 66 -71 -269 -126 401 -286 -183 -132 330
4207 330 428 -115 -229 195 369 150 -318 -284 -24 59 159 -109 -211 -41 87 19 6 -119 494 -77 -62 31
4229 31 345 -29 -194 -399 117 159 -20 279 60 226 213 30 -160 -12 636 -105 -62 64 462 165 -109
4250 -109 -373 -96 321 172 -139 -90 156 -37 125 -383 146 -138 27 -194 -5 -24 96 -137 -318 -42 369
4271 369 95 -191 -362 206 190 -61 -195 144 501 109 111 -368 80 391 382 -402 75 489 173 -29 -353 135
4293 135 96 59 -40 -11 73 121 -82 -77 363 370 -52 -197 -110 44 206 -4 -381 -89 187 -171 -293 85 -105 250
4317 250 -268 75 206 -43 -259 -285 109 -15 88 -151 -260 -266 223 -147 -92 -136 -76 -39 -86 -229 -162 343 201
$$ packed form
4163c1l9o6O40j66m80j10M57R4k99k62Q5M50k36j23r9J40J40J53K7m22K08N2p2
4186D1k96K12J37j29j34k8N20q5m13K22j04j15K38j37j98J43N27o87J03N1M62
4207C30R8n43j14M24J74k19m68L4K60Q3J00k68j02J70J28o8j3j25O13n71J5R3
4229C1L14l74j65k05N16M2j79K99k19J66j3j83j90J48O48p41M3J26L98k97k74
4250a09k64K77M17j49l11M9K46j93J62n08N29k84J65k21J89j9J20k33j81K76M11
4271C69k74k86j71N68j6k51j34L39L57l92Km79M48L11rp84M77M14l16k02l24M88
4293A35l9l7r9K9Q4M8k03NM40Pm22j45Q7J54J62k10l77K92K76l58j22L78j90L55
4317B50n18L43J31k49k16k6L94j24J03k39j09oM89l70N5m4O0L7m7j43O7N05j42
$$ plain form
4340 201 -288 -47 -97 142 -115 -66 -354 185 183 -323 -363 -94 -75 76 -148 -193 249 -60 -87 -122 -299 378 -206
4363 -206 130 -14 -92 -32 -196 -225 -25 -15 268 38 64 -88 171 -128 -162 107 270 12 -124 -425 244 48
4385 48 -21 218 -273 153 -162 -115 -57 95 333 95 14 51 77 -83 -313 -327 245 67 251 -191 -341 3 135
4408 135 -10 -200 10 219 -91 -154 -180 244 624 -93 -244 121 101 131 -239 -235 89 361 -33 -240 -23 -49
4430 -49 117 106 -62 -8 -60 -273 -293 137 155 177 55 -234 46 323 154 -281 -134 -71 204 -379 -150 -226 151
4453 151 40 -249 62 165 299 162 35 51 172 416 37 -102 211 243 -200 -20 85 418 300 -312 -33
4474 -33 83 350 30 -204 -199 59 52 -229 -266 -125 38 293 17 -316 214 156 18 -139 -54 294 -99 -315 -240
4497 -240 34 56 5 38 -241 53 68 -71 -79 70 7 -75 -235 -30 83 11 -45 -3 155 -94 324 -392 -103 551
$$ packed form
4340B01m89K41n0K39k57M9k88N39kn06m0K69J9J51k24m5M42l09k7l5j77O77n84
4363b06L36j44p8O0j64k9K00J0K83k30K6j52K59k99l4K69J63k58j36l01O69j96
4385D8o9K39m91M26l15M7N8J52K38k38q1L7K6j60k30j4N72j78J84m42j50L44J32
4408A35j45j90K10K09l10o3k6M24L80p17j51L65k0L0l70ML24K72l94k07K17k6
4430d9J66j1j68N4n2k13k0M30J8K2j22k89K80K77j69m35J47O3K75n83K29p6L77
4453A51j11k89L11J03J34j37j27J6J21K44l79j39L13L2m43J80J05L33j18o12K79
4474c3J16K67l20k34NK58pk81l7J41J63K55k76l33N30n8j38j57Q5L48l93k16P5
4497b40K74K2n1L3k79K94J5j39qJ49o3q2j60K05J13p2n6M2J58k49M18p16K89O54
$$ plain form
4521 551 431 93 -317 -18 1 -114 -69 -47 107 462 -184 -118 54 69 -3 -349 -102 225 302 -224 -72 -45 -87
4544 -87 388 216 -100 127 146 -79 -335 -21 475 247 -132 -463 126 266 -100 -115 5 -32 202 -44 35 54
4566 54 151 12 -287 13 -106 -142 -188 -293 133 401 -226 -224 -117 42 95 -194 1 40 -101 -19 -107 -25 28 31 54
4591 54 -238 -4 130 328 -322 -221 260 213 284 -216 19 269 125 -83 -6 -124 13 139 -34 -112 90 224
4613 224 -264 -82 -43 422 -241 -244 169 -446 -54 186 -115 -223 59 31 -112 121 -100 137 31 -123 22
4634 22 -28 -184 -145 -39 263 228 -139 160 197 -78 -287 69 -156 -17 214 125 -296 16 362 60 -324 -293
4656 -293 136 198 232 -436 122 363 -190 -202 4 206 29 98 -198 154 41 360 190 -224 -339 201 259 -178
4678 -178 -384 43 245 6 16 -47 283 42 -19 193 -165 177 -253 88 -346 186 214 -102 -219 -103 211
$$ packed form
4521E51j20l38m10K99J9j15M5K2J54L55o46O6J72J5p2l46K47L27P7n26J52K7m2
4544h7M75j72l16K27J9k25k56L14M96k28l79l31N89J40l66j5J20l7K34k46P9J9
4566E4R7j39k99L00j19l6m6j05M26K68o27KJ07J59N3k89J95L9j41Q2q8Q2N3LK3
4591E4k92K34J34J98o50J01M81m7P1n00K35K50j44k08P7j18J37J26j73p8K02J34
4613B24m88J82L9M65o63lM13o15L92K40l01j08K82k8j43K33k21K37j06j54J45
4634B2n0j56L9J06L02l5l67K99L7k75k09L56k25J39K31q9m21L12L46l02l84L1
4656b93M29O2L4o68N58K41n53j2K06K02j77O9k96L52j13L19j70m14j15N40N8m37
4678a78k06M27K02k39J0o3L30k41o1K12l58L42m30L41m34N32K8l16j17J16L14
$$ plain form
4699 211 -4 -309 193 67 -291 56 144 8 60 -68 -156 45 -73 -30 -58 -69 185 -13 118 -456 -210 290
4721 290 2 -186 -26 199 106 -152 -264 -100 -43 -69 -174 -91 -110 154 72 -291 -216 125 591 250 -309 -228 21
4744 21 -5 -219 27 119 26 82 -380 -85 191 315 168 -267 -160 -86 -273 -103 -256 -31 99 -141 -172 248
4766 248 334 -86 -13 -82 -115 62 -102 -131 -158 -51 -77 -12 -70 -224 201 -135 -150 187 205 -148 -285 -3 74 9
4790 9 -232 -254 119 -72 64 -229 -195 -60 -73 2 -435 -248 -39 158 28 -296 222 165 -213 -41 -300 59
4812 59 -72 220 64 45 159 -63 -16 -430 -223 -142 95 -263 -224 507 -23 -420 -263 183 10 332 -277 -161
4834 -161 75 312 57 -224 71 63 -8 440 -16 287 252 -25 1 190 65 -124 108 100 -59 -148 -367 -168 5
4857 5 160 -165 -250 62 -189 207 44 78 -97 183 -155 -85 -115 307 3 -46 135 101 226 -111 107 -24 40
$$ packed form
4699B11k15l05N02j26l58L47Q8j36N2j28q8K01j18M3k8j1K54j98J31n74K46N00
4721B90k88j88J60K25r3k58j12J64N7k6j05Q3j9K64q2l63P5L41M66l41n59Q1K49
4744B1k6k14K46R2r3N6m62K95K76J24j47m35J07P4j87J70j53K25J30k40l1M20
4766B48Q6m20P3o9l3J77j64k9k7J07k6O5n8j54M25l36j5L37J8l53j37K82P7o5
4790Ik41k2L73j91J36k93L4J35j3P5m37J87K09J97j30l24N18n7l78J72k59L59
4812E9j31K92j56j9J14k22M7m14K07Q1K37l58L9P31n30l97J57M46j73L22o09J16
4834a61K36K37k55k81K95qp1M48m56L03l5k77K6J89j25j89K32qj59q9k19J99J73
4857EJ55l25q5L12k51L96j63L4j75K80l38P0l0M22l04m9J81l4J25l37K18j31O4
$$ plain form
4880 40 -59 267 108 148 22 230 -191 -135 -224 249 75 85 51 327 345 157 90 12 110 -97 109 -141 -150 181
4904 181 40 12 -253 22 55 202 -93 262 230 -115 -118 50 -221 -71 -1 102 188 50 154 -4 -94 211 15
4927 15 184 17 164 -66 -34 136 111 347 50 246 -31 343 71 -241 -93 -55 122 93 84 85 -36 115 59
4950 59 -401 -132 419 212 8 -306 112 125 -177 68 49 -58 62 64 20 -336 161 228 -111 -386 158 92 -45
4973 -45 -87 -246 -22 -85 59 -296 -207 214 2 -274 31 -59 -46 -30 -94 -141 111 -19 -383 -41 23 154 -132
4996 -132 -186 67 -201 -6 -216 103 31 18 -10 -148 -190 -178 101 -282 -82 -181 81 -162 64 125 -95 18 -152
5019 -152 -127 165 -34 -349 -260 86 74 -123 -188 -128 -53 -17 148 -307 -49 306 -121 -318 -50 -16 49 -280 -480
5042 -480 -178 -67 67 -165 106 78 176 64 -94 -275 284 28 96 -346 -151 165 343 -114 -129 74 -32
$$ packed form
4880D0r9L26j59M0j26K08m21N6q9M73j74J0l4K76J8j88o7p8R8k07K06k50rL31
4904A81j41k8k65K75L3J47k95L55l2l45lJ68k71J50P0J03Q6j38J04j58r0L05j96
4927A5J69j67J47k30L2J70k5K36k97J96k77L74k72l12J48L8J77k9rJj21J51n6
4950E9m60K69N51k07k04l14M18J3l02K45j9j07J20Km4l56M97O7l39k75N44o6j37
4973d5m2j59K24o3J44l55Q9M21k12k76L05r0J3J6o4m7K52j30l64L42O4J31k86
4996a32n4K53k68J95k10L19p2j3k8j38m2J2K79l83K00r9K62k43K26O1k20J13j70
5019a52K5K92j99l15Q9L46j2j97o5O0P5L6J65m55K58L55m27j97K68L4O5l29k00
5042d80L02J11J34k32K71k8R8j12j58j81N59k56O8m42J95L16J78m57j5K03j06
$$ plain form
5063 -32 43 -449 -150 -213 300 -101 -154 -15 94 -86 -167 -7 104 349 -28 -106 200 63 188 -55 -393 -85
5085 -85 107 275 -74 14 -141 194 -228 106 -11 43 -350 -69 -34 -49 157 -283 125 167 -231 -25 81 -66
5107 -66 318 172 67 -368 514 -20 -25 -95 0 39 168 53 -113 146 54 -67 190 29 114 222 -6 -252 -28
5130 -28 -15 237 78 -18 -1 -185 218 77 -152 58 -54 -128 -271 -34 393 378 -57 -176 -136 130 83 71 88
5153 88 171 106 20 137 167 -261 289 117 243 -154 -120 163 41 175 118 -51 308 200 -235 234 -98 181
5175 181 91 210 130 -238 378 252 24 22 553 -65 71 -175 -210 -154 425 -107 -126 -257 195 189 -141 -258 -348
5198 -348 256 46 -104 -69 -181 292 159 70 -236 -97 -113 -193 -181 28 209 178 -121 -153 -80 195 -143 -157 95
5221 95 -65 -265 -128 203 -133 116 240 -68 -200 134 -45 -109 147 109 -13 -346 -12 34 -15 61 175 394
$$ packed form
5063c2P5m92K99o3N13m01n3J39J09j80q1J60J11K45l77p8L06j37J25k43l38L08
5085h5J92J68l49Q8j55L35m22L34j17N4l93K81L5j5K06m40M08M2l98K06J06j47
5107f6L84j46j05m35Q82n34np0R5L9J29j15j66K59r2j21K57j61Q5J08k28k46K24
5130b8J3K52j59r6J7j84M03j41k29K10j12p4j43K37M27j5m35j19M0K66m7j2J7
5153H8Q3o5q6J17L0m28N50j72J26l97L4K83j22J34n7j69L59j08m35M69l32K79
5175A81r0J19q0l68O16j26k28kN31o18J36k46l5N6N79n32j9j31M52ol30j17r0
5198c48O04k10j50L5j12M73j33q9l06J39j6q0J2K09J81l1k99l2P3K75l38j4K52
5221I5j60k00J37L31l36K49J24l08j32L34j79o4K56l8j22l33L34M6m9P6J14K19
$$ plain form
5243 394 215 -40 -63 -117 2 -4 -175 -111 -83 120 299 -5 -74 55 -11 -140 -192 -89 -74 360 251 -259 11
5266 11 -79 146 -94 -517 -141 -34 155 -3 -192 -37 19 340 -167 -65 142 75 -24 -277 82 -62 24 -295
5288 -295 -195 40 94 153 -202 -189 6 -111 -85 3 7 -21 40 -5 -49 82 -155 38 119 61 95 199 -76 375 106
5313 106 -112 65 -58 181 -41 -463 -220 -127 363 -211 -206 -248 4 -39 -55 -34 -101 60 45 -69 -178 155 81
5336 81 -305 -31 -53 141 118 -333 159 80 35 -223 92 187 11 9 16 202 -13 -59 51 58 -181 -106 104 32 -209
5361 -209 80 178 -110 -289 -105 -47 -191 -321 -70 91 -153 5 112 -252 -174 -83 -127 -181 319 268 -4 78 -104
5384 -104 125 -215 -231 60 88 59 -108 -238 212 31 -103 151 -29 76 9 -35 47 -56 -275 56 -103 6
5406 6 -84 133 330 -176 -6 76 -3 -12 -19 -106 383 -10 80 82 5 17 92 36 19 -43 75 68 214 214 -90 373 175 -18
$$ packed form
5243C94j79k55k3n4J19oj71O4K8K03J79l04o9J29o6j29n2J03J5M34j09n10K70
5266A1r0K25k40m23L76J07J89j58j89J55N6L21n07J02K07o7r9k53L59j44Q6l19
5288b95J00K35N4N9l55J3J95j17K6Q8Mk8O1m5m4J31k37J93Q1n8L4J04k75M51k69
5313A06k18J77j23K39k22m22K43R3M90n74Nm2K52m3j6K1o7J61j5j14j09L33p4
5336H1l86K74k2J94k3m51M92p9m5k58L15R5j76kPJ86k15m6J10Pk39P5K10p2k41
5361b09K89R8k88j79J84N8j44j30K51J61k44J58J07l64P8R1m4n4N00n1k72Q2j82
5384a04K29l40j6K91K8k9j67j30M50j81j34K54j80J05o7m4Q2j03k19L31j59J09
5406Fr0K17J97n06J70Q2p9rpq7M89l93R0Kp7J2P5n6j7o2J18pJ46%l04M63j98j93
$$ plain form
5434 -18 315 93 126 -69 -7 -211 -23 -139 25 13 -100 -16 -183 -26 112 -55 -168 -4 163 -61 100 44
5456 44 172 -83 -3 73 20 -4 52 -183 36 102 29 121 109 2 248 176 -27 210 139 163 -293 -194 -63 -246 -16
5481 -16 100 39 18 -201 60 -165 166 150 225 -223 -56 -72 87 87 -79 169 299 -13 32 360 -371 -54 124
5504 124 -128 -113 -21 212 199 -189 -133 125 157 313 131 -109 -229 -84 -121 4 -149 -146 -45 162 -46 135 315
5527 315 178 -235 71 57 -134 132 -96 -338 -60 -8 -110 -41 -46 29 -15 -92 -132 53 -372 -195 -23 497 25
5550 25 -38 -109 -108 -125 -91 86 -6 -32 -316 54 -176 45 118 94 -272 -54 137 -91 -214 -315 75 132 165 -314
5574 -314 -36 -175 -86 -31 -261 64 -222 184 -11 -183 -206 261 274 -196 -128 77 -85 -66 35 119 73 60 -39
5597 -39 -91 -84 12 5 -38 -160 -75 -49 -320 -110 -136 39 -403 -182 -102 358 67 -61 -167 -353 261 -38 88 190
$$ packed form
5434a8L33k22L3j95O2k04J88j16J64j2j13Q4j67J57J38j67j13J64J67k24J61n6
5456D4J28k55Q0P6n3k4N6k35K19O6p3R2j2j07K46p2k03K37p1K4m56R9J31j83K30
5481a6J16o1k1k19K61k25L31j6P5m48J67j6J59%j66K48J30l12M5L28p31L17J78
5504A24k52J5R2K33j3l88N6K58L2J56j82k40j20J45l7J25j53LJ01K07k08J81J80
5527C15j37m13L06j4j91K66k28k42K78N2j02O9nP5m4p7m0J85m25J77J72N20m72
5550B5o3p1Jj7L4J77r2k6k84L70k30K21P3k4l66K18J91k28j23j01L90N7L3m79
5574c14K78j39Q9N5k30L25k86M06j95j72k3M67J3m70O8K05j62J9J01Q4m6j3r9
5597c9n2PR6pm3j22Q5K6k71K10k6J75m42K21Q0M60k91j28j06j86O14k99J26J02
$$ plain form
5621 190 -118 -8 27 -53 -157 214 94 -23 132 116 81 -57 93 -14 66 -56 -162 39 667 190 147 88
5643 88 -368 -38 213 -22 -535 180 467 81 53 139 6 208 -83 -30 -57 182 -30 -245 -120 131 -49 134
5665 134 -64 -24 -73 298 41 -129 121 42 176 20 124 -150 33 32 -76 132 317 384 117 -75 2 137
5687 137 359 -128 -37 2 -72 -301 -20 194 71 -186 67 223 266 66 113 113 -71 36 -7 94 -107 211 80
5710 80 -15 -114 216 91 -228 -238 -45 113 -427 -214 124 162 158 437 -237 -29 31 166 86 -10 6 180 -77 79
5734 79 151 208 -59 -110 -84 -196 139 -78 169 -57 94 35 -131 126 -257 84 43 -25 122 174 148 85 -90 182
5758 182 243 -229 -248 117 51 -31 -339 -50 -129 -174 163 -29 -212 -15 271 222 -34 25 -37 280 96 32 190
5781 190 -96 -356 77 -173 48 -78 -29 318 -232 124 212 -143 53 20 -111 -105 -71 -120 57 308 187 -25
$$ packed form
5621A90l08J10L5q0j04L71j20j17J55j6l5j38J50j07Q0j22j06K01O28m77m3n9
5643H8m56L30K51k35n13P15K87l86k8Q6j33K02k91N3k7K39k12k15J25K51j80J83
5665A34j98M0m9L71k57j70K50p9J34j56J04k74J83jj08K08J85O7k67j92P7J35
5687A37K22m87R1L9p4k29K81K14j23k57K53J56M3k00M7%j84J07m3J01k01L18j31
5710H0r5r9L30j25l19j0J93J58n40K13L38L8mK79o74K08O0J35q0r6J6J74k57J56
5734G9P2N7k67n1K6j12L35k17K47k26J51n9j66K57l83L41m1o8J47N2k6o3j75K72
5758A82O1m72j9L65o6q2l08K89p9m5L37j92j83J97K86m9k56N9o2L17j84o4J58
5781A90k86k60M33k50K21j26M9L47n50L56Q8l55J96l3j31OL4m9J77K51j21k12
$$ plain form
5803 -25 -90 -168 -183 -154 159 262 40 342 -342 15 310 -163 -118 -53 224 -77 76 164 382 113 -294 -147 -97
5826 -97 -127 53 29 54 44 -80 44 47 -302 255 89 90 -56 -158 -60 97 -346 -46 33 -104 -225 -141 -133 -76 -77 -95
5852 -95 -85 123 94 -225 118 165 70 -41 383 22 259 107 -132 3 -97 25 127 -26 54 -9 -58 1 -134
5875 -134 -125 194 309 80 -327 -226 -180 9 -119 197 63 156 107 123 1 -55 -72 51 20 -163 -83 58 164
5898 164 -112 -87 2 -149 -149 -281 36 -73 4 -188 -80 114 -158 153 73 49 -152 -117 -134 88 245 248 -150 112
5922 112 187 127 39 -152 -42 -29 -204 31 28 80 -78 159 39 -321 117 -71 -94 21 306 230 165 -75 -6 5
5946 5 82 82 27 -11 133 36 138 -77 67 15 -91 113 44 76 -209 -80 96 -164 -134 -55 353 -79 -239 12
5970 12 -131 174 -9 82 -58 -130 210 176 -242 158 -142 -95 22 22 64 156 -211 87 -92 -80 -2 69 70 -91 118
$$ packed form
5803b5o5p8j5K9L13J03k22L02o84L57K95m73M5O5K77l01J53Q8K18k69m07J47N0
5826i7l0J80k4K5j0j24J24Ll49N57j66Jj46j02R8J57m43L00P9j37j21Q4QN7jj8
5852i5J0K08k9l19L43M7r5j11M24l61K37j52k39J35j00J22J02j53Q0o3m9N9j35
5875a34RL19J15k29m07J01M6J89j28L16j34R3m9J6j22n6j7J23l1j83Q0J41J06
5898A64k76K5Q9j51%j32L17j09P7j92J08J94k72L11q0k4k01L5j7K22J57Ll98K62
5922A12P5o0q8j91J10J3j75K35lN2j58K37j20l60M38j88k3J15K85p6o5k40O9J1
5946EP7%n5l8J44r7J02k15J44n2j06K04o9L2k85J29J76k60L0P9M08m32j60K51
5970A2j43L05j83R1j40p2L40l4m18M00l00M7J17%M2R2l67K98j79J2P8P1Jj61K09
$$ plain form
5995 118 447 174 -161 25 -50 -115 244 227 114 160 323 -224 -51 26 179 -3 73 172 -12 218 -58 117
6017 117 108 151 -212 -179 -8 -311 -122 -286 223 11 -111 -273 -251 -52 -172 113 79 53 72 -167 8 -244 142
6040 142 74 105 81 82 -11 -235 -123 18 165 -203 6 -119 -284 153 112 29 5 -70 10 -38 -87 -254 293 71
6064 71 121 -327 96 256 -201 11 268 79 128 200 -42 -94 87 -28 -154 -300 45 11 -209 218 359 52
6086 52 -20 -132 141 85 212 10 -131 107 55 165 11 -178 86 34 105 211 228 205 114 -18 -132 178 28
6109 28 -22 -319 -237 -60 194 -340 86 219 -190 56 -337 -215 162 -209 -215 174 78 156 137 126 -50 30 124 -29
6133 -29 -118 -62 68 57 90 -70 -194 -149 72 -8 -75 206 -302 -51 -59 172 162 245 160 45 -99 -50 -145 -277 -442
6158 -442 -61 65 -173 -58 33 173 -193 53 -387 45 -100 -77 -267 34 99 150 -2 -358 -71 96 39 -204
$$ packed form
5995A18L29k73l35J86p5o5L59j7j13M6J63n47J73P7J53j82P6R9j84K30k76J75
6017A17rM3l63L3J71l03J89j64N09k12j22j62K2J99j20K85l4k6J9k39J75k52L86
6040A42o8L1k4Jr3k24J12J41J47l68K09j25j65M37m1q3k4p5Q0m8m9j67N47k22
6064G1N0m48M23J60m57K12K57j89M9P2k42n2J81j15j26j46L45l4k20M27J41l07
6086E2p2j12K73n6J27k02j41K38n2J10j54j89K64n2P1J06J7k3r1j32j14L10j50
6109B8n0k97Q2J77K54n34M26J33m09K46l93J22L77l71oL89r6P8j9j1j76Q0R4j53
6133b9q9N6J30j1L3j60j24M5K21q0o7K81n08K51qK31j0Q3q5j15j44M9r5j32j65
6158d42L81J26k38J15R1J40l66K46m40M32j45K3j90L01O5N1j52l56K87J67n7k43
$$ plain form
6180 -204 59 172 41 -30 69 -65 280 -249 -196 18 31 -223 -99 147 -215 125 34 -128 -26 66 29 -92
6202 -92 -111 -123 -26 -97 -165 -39 -210 74 -210 -200 50 -100 124 229 -151 -47 -547 -99 160 247 -85 260 -135
6225 -135 -65 273 -168 -66 -101 -121 73 56 -359 34 -33 137 45 -164 -165 174 81 -115 -177 -179 352 237 -36 -38 113
6250 113 -83 -281 187 159 86 -39 184 254 -66 -32 54 -5 -211 93 134 74 256 -80 6 -339 149 241 67
6273 67 168 -1 -21 -183 -9 69 153 -135 -16 9 25 -138 -35 -208 -159 11 -360 67 -163 157 117 -48 -147
6296 -147 105 -46 170 319 16 -253 -125 164 -53 166 -26 116 -34 -35 183 -27 155 305 -4 128 111
6317 111 -70 17 -160 117 152 45 -108 15 23 -61 49 -102 -11 -336 -106 -151 296 -8 -62 342 -93 104 132
6340 132 48 250 38 91 22 -80 263 20 -85 139 231 -10 9 163 193 -285 -216 -259 92 5 -265 265 44
$$ packed form
6180b04K63J13j31p1R9j34L45n29N3K14J3k54J24K46l62L40r1j62J02R2l7j21
6202i2j9j2R7p1o8J26j71K84k84J0K50j50K24J05l80J04n00M48K59Q7l32L45l95
6225a35P0L38m41J02l5k0J94j7m15L93o7J70r2k09jL39r3j96o2kN31j15k73kJ51
6250A13j96j98M68k8p3j25K23P0l20L4Q6n9k06L04M1o0J82l36Q6l45M88R2j74
6273F7J01j69k0j62J74P8Q4k88J19K5J6j63J03j73M9J70l71M27k30L20m0j65r9
6296a47K52j51K16J49l03k69J28K89k17K19j92J42j50jK18k10J82J50l09J32j7
6317A11j81Q7j77K77L5j07j53J23Qq4J10j51R1l25K30m5M47l04n4M04m35J97K8
6340A32q4K02k12N3o9j02L43k43j05K24R2k41J9J54L0m78O9m3L51q7k70N30k21
$$ plain form
6363 44 42 65 -2 106 179 83 139 -36 -174 100 -69 -210 -1 -43 112 -90 246 -131 273 363 -336 203 -204
6386 -204 359 9 37 -100 -239 346 54 -394 63 -37 127 313 123 169 -292 -8 43 129 157 -6 -23 207
6408 207 -49 -92 -159 -160 247 8 -31 -59 -81 78 260 -152 -26 -18 31 2 -72 -99 109 -160 -8 22 -213 -354 14
6433 14 -114 -120 210 72 -296 -92 102 -147 -47 192 -21 43 123 206 261 -67 -157 38 5 29 157 320 10
6456 10 111 -126 381 19 103 -144 52 -253 -52 -57 262 137 103 4 37 -138 -227 -68 -46 -133 -102 -30 123 -104
6480 -104 -158 -114 -49 -23 18 312 -93 -175 -17 -73 7 -78 155 -193 -18 144 -107 -286 -92 -18 271 -165 -56
6503 -56 67 116 -39 -17 -77 -118 -263 34 205 -198 -98 -81 -7 -51 129 -215 -21 1 -182 181 84 -207 26
6526 26 197 -48 -251 85 75 141 -59 141 -30 121 184 107 72 -154 -302 71 -8 -110 -28 -90 -77 -200 -83
$$ packed form
6363D4kK3o7J08P3r6N6j75j38K74j69j41K09m2J55k02L36l77M04R0o99N39m07
6386b04N63l50K8j37j39N85k92m48M57j00J64J86j90M6m61K84N1Q6K8j63j7K30
6408B07k56m3o7jM07k39l9k8k2J59J82m12J26QM9k9p4k7K08k69J52L0k35j41L68
6433A4j28oL30j38l68K04J94k49J00K39k13O4Q0Q3N5l28r0J95l3K4J28J63l10
6456A0J01k37N07l62Q4k47J96l05K01nL19j25l4r9L3j75q9J59K2q7L1P2J53k27
6480a04n4M4O5K6M1K94m05q2J58n6Q0q5K33l48J75J62k51j79J94P4K89m36J09
6503e6J23M9j55K2o0m1j45K97J71m03J00J7P4m4J80l44J94K2j83L63r7k91K33
6526B6J71k45k03L36j0O6k00K00j71J51O3p7l5k26j48L73p9j02Q2o2J3j23J17
$$ plain form
6549 -83 -65 -50 89 105 -4 229 -116 -12 -86 46 61 -228 -85 -88 -43 218 241 -127 197 -165 8 194 201 -81
6573 -81 357 -18 224 -132 165 44 -196 -204 -89 105 39 -175 291 77 132 135 -172 183 -17 -227 -32 89
6595 89 1 80 -92 25 -130 107 -27 -33 -38 -204 333 25 -497 35 11 85 -10 17 104 148 9 73 14 17 136 81
6621 81 18 44 166 80 -137 -1 251 77 -165 -389 146 101 -65 -183 51 271 158 126 -141 -139 -30 18 -210
6644 -210 -52 -68 -7 -90 138 67 46 198 38 -195 345 -11 -533 17 40 164 -239 190 -240 41 83 -39
6666 -39 -41 22 106 -222 189 11 109 62 -101 -214 89 101 32 128 -491 -167 128 -59 -29 -128 178 24 -35 -198
6690 -198 -277 -46 -6 -161 -11 210 96 -147 54 119 79 32 -154 -94 25 -129 44 177 -50 53 40 -271
6712 -271 -83 113 -94 -202 96 113 86 -170 138 -41 81 -156 -8 65 22 144 216 -128 13 114 231 1
$$ packed form
6549h3J8J5J39J6j09K33l45J04p4J32J5k89J43lM5K61K3l68L24l62J73J86Pk82
6573h1M38l75K42l56K97j21k40qJ15J94o6k14M66k14N5Ll07L55k00k10J95J21
6595H9q8P9j72J17j55K37j34onj66N37l08n22N32k4P4r5K7Q7M4j39O4n9LJ19n5
6621H1o3K6J22q6k17J36K52j74k42k24N35m5j66j18K34K20j13l2k67KJ09M8k28
6644b10J58j6O1q3K28p1k1J52j60k33N40l56n22N50K3J24m03M29m30K81M2j22
6666c9kO3Q4l28M11j78R8m7j63j13L03J2o9R6o19L24K95j87L0r9L06j54n9j63
6690a98p9K31M0j55J50K21j14k43K01O5m0m7j86O0J19j54J73J33k27J03j3l11
6712b71J88J96k07j08K98J7k7k56L08j79J22k37J48P3m3J22P2l44J41J01J17k30
$$ plain form
6734 1 45 240 93 134 -71 -288 -339 82 -203 -22 31 -84 90 -222 89 12 23 340 20 137 232 -138 -26
6757 -26 -190 143 -58 34 -188 16 -126 109 -221 -267 -214 -38 116 -249 -123 87 33 -17 -77 -286 59 48 -349
6780 -349 -300 4 155 -186 -135 -65 246 149 311 -216 -422 12 -38 -334 235 -37 -60 334 -73 141 104 229
6802 229 -281 95 384 195 -9 -86 25 -11 125 31 20 169 306 -196 225 11 -126 35 -187 74 142 62
6824 62 -140 -187 -161 75 55 99 36 -28 33 -183 -173 -14 -145 -170 -274 -22 -53 -132 107 -40 -138 257 112 -131
6848 -131 155 138 117 236 -86 108 -156 129 30 71 -277 -91 73 52 71 -5 -79 -1 3 -84 -62 22 8 -69 219
6873 219 -87 82 -103 -37 318 -159 -366 -427 8 -17 135 -131 -362 -5 61 -21 -146 275 117 -249 220 -25
6895 -25 47 0 169 -140 91 43 167 -87 16 -23 173 -25 -83 9 -326 -31 -225 -269 -119 -136 -339 214 -227
$$ packed form
6734AM4J95j47M1k05k17n1M21k85J81N3j15J74l12L11p7J1L17l20J17R5l70J12
6757b6j64L33k01R2k22K04j42K35l30m6N3J76J54l65J26K10n4n0o0k09L45j1l97
6780c49M9L04J51l41N1P0L11r7J62n27k06M34n0k96N69k72k3L94m07K14l7J25
6802B29n10L76K89j89k04p7J11l6J36r4j1J49J37n02M21k14j37J61k22K61O8q0
6824F2k02m7K6K36k0M4o3o4O1k16J0J59j31k5j04K52l1p9K39j47r8L95j45k43
6848a31K86j7k1J19l22J94k64K85r9M1l48J86J64k1J9p6p4P8Mq7K2Q4j4p7K88
6873B19l06J69j85O6L55m77k07o1M35k5J52k66k31L57O6q2j25M21j58l66M69k45
6895b5P2m7J69l09K31m8J24k54J03l9J96j98n8R2l35K95j94m4J50j7k03N53m41
$$ plain form
6918 -227 113 52 9 28 -375 -122 86 -370 -199 53 58 60 249 198 261 66 46 13 -14 165 141 -273 116 194 -457
6943 -457 150 138 41 90 23 13 -294 101 166 76 96 -6 9 -212 118 118 383 50 38 -16 -67 41 145 42 136
6968 136 95 -169 -29 -74 105 50 -268 -64 69 77 -97 -23 -145 36 -2 337 192 8 256 -69 35 -82
6990 -82 409 -178 217 -103 67 169 -77 -149 -174 156 156 -134 -45 -359 -68 118 44 -108 -59 -39 21 -132 -158 -58
7014 -58 -13 -148 212 -219 83 4 249 -83 -204 52 72 -185 -218 30 7 129 -69 -40 343 -87 -273 57
7036 57 39 174 -185 -66 85 -239 -108 51 296 -284 -18 130 -273 -302 -131 97 208 -118 -98 26 -24 -64
7058 -64 -255 -193 93 -258 67 -399 -129 -34 -123 -195 274 96 -95 -84 -20 137 1 -1 122 86 -30 -260 -321 -66
7082 -66 156 57 -164 -71 -20 -102 -157 -78 -48 223 155 147 20 -5 -92 -201 14 0 -234 37 -238 -212 -100 -92 -67 82
$$ packed form
6918b27L40o1m3J9m03K53K08m56J71K52NKJ89n1O3j95k0l3k7J79k4m14L89P8o51
6943d57O07j2r7M9o7j0l07L95O5r0K0j02J5k21L30%K65l33j2n4n1J08J04j03R4
6968A36m1k64J40m5J79n5l18K04J33Qj74P4j22J81l8L39j45j84K48l25J04j17
6990h2M91n87L95l20J70J02k46p2k5L30%k90Q9l14K91J86p4j52M9K0O0j53k6J00
7014e8M5j35L60m31L02p9K45l32j21K56K0k57l3K48k3J22j98K9L83m30j86L30
7036E7j8J35l59J19J51l24J31J59K45n80K66J48m03k9J71K28J11l26K0J24n0m0
7058f4j91O2K86l51L25m66K70R5q9p2M69j78j91J1O4J57j36kJ23l6j16k30o1K55
7082f6K22r9k21R3N1q2n5P9L0K71o8qj27k5q7j09K15j4k34K71k75K6J12QK5J49
$$ plain form
7108 82 -60 169 -42 59 123 -86 208 201 -87 -160 -109 -117 -4 78 120 -42 -23 -113 -67 -131 -15 39 -195 -318 -23
7133 -23 -292 15 50 -7 -22 -110 -273 112 1 -46 -45 -266 207 -30 107 -6 -46 394 94 272 245 65 -54
7156 -54 45 76 -75 172 87 51 -55 112 158 -22 -32 156 -133 371 182 -91 -69 -15 257 -161 63 -61 13
7179 13 -95 135 -328 243 -51 39 159 284 -119 -31 273 -192 117 20 109 -175 158 45 42 -108 -105 16 443
7202 443 140 12 288 96 -123 -59 125 246 117 -69 -133 124 -45 42 -45 -258 135 -16 71 -308 214 2
7224 2 -160 -95 81 53 -232 232 95 -183 -255 -228 -101 -300 -243 94 -50 -106 -33 -45 -74 324 -139 -196 149 -95
7248 -95 -276 165 111 100 68 137 103 -150 445 218 370 12 -86 196 95 53 187 27 -225 119 44 -120 80
7271 80 173 79 -122 -209 49 -180 26 20 36 -187 22 1 -125 -77 -188 61 46 7 -119 121 184 5 102 -44
$$ packed form
7108H2j42K29k11J01O4k09K94pk88p3N1qJ13Q2M2j62J9r0M6o4J16N4k34j23K95
7133b3k69L07L5n7j5q8j63L85j11m7Jk21M73k37J37j13m0M40l00J78k7j80j19
7156e4R9L1j51K47q5l6j06J67M6j80j0J88k89N04j89k73K2N4K72m18K24j24P4
7179A3j08K30m63N71k94R0J20J25m03Q8L04m65L09r7Q9k84L33j13lj50LJ21M27
7202D43l03j28K76j92k19O4J84J21j29j86o4K57j69Q7q7k13L93j51Q7l79N22k12
7224Bj62O5J76k8k85M64j37k78p2K7J27j99N7L37j44n6P3j2k9L98m63n7L45k44
7248i5j81M41n4j1l2O9l4k53N95k27J52l58r8K82j01m2J34j60k52L44p5j64K00
7271H0R3r4k01q7K58k29K06oJ6k23K09k1j26M8j11K49j5l9j26K40O3j79R7j46
$$ plain form
7295 -44 -79 -8 -151 101 -129 -86 86 -201 16 -13 126 -15 -40 62 -59 -78 -7 -19 -112 237 -28 16 125 -145
7319 -145 50 226 -90 -165 8 11 -75 -256 -102 -302 -207 -131 10 34 -86 43 63 264 44 -116 -214 172 7
7342 7 109 47 -316 -5 296 183 108 -38 108 -91 -5 -8 -73 233 232 253 10 39 209 97 111 -60 216 216 23
7367 23 -8 301 63 111 -172 -20 156 77 155 356 190 173 79 -97 -88 -21 -17 178 -363 -38 -36 211 3 -231 -105
7392 -105 -22 -211 226 -169 -266 13 -59 -145 115 353 408 -132 -217 107 65 74 -219 -146 20 31 -239 0 309 -39
7416 -39 -222 -1 36 -177 -197 167 71 301 -259 -68 -166 136 -70 37 -282 -183 165 -89 256 72 47 315
7438 315 -128 -59 173 262 136 -27 -50 193 370 51 205 80 -34 -84 -93 238 -29 68 8 -169 -45 -131 -3
7461 -3 -17 13 -45 -111 122 -386 -160 138 -124 162 -64 -17 66 112 -217 -73 -136 -183 26 -141 -53 213 1 -67
$$ packed form
7295d4l5P1j43K52k30M3J72k87K17k9J39j41k5J02j21j9P1j2r3L49k65M4J09k70
7319a45J95J76l16p5J73Lq6j81J54k00R5P6J41K4j20J29K0K01k20j60r8L86j65
7342GJ02o2l63L11L01j13p5j46J46j99Q6lo5L06jK1k43K9J70j12J4j71K76%j93
7367B3l1L09k38M8k83J52J76p9P8K01j66j7r4j76RO7MJ95n41L25KK47k08k34J26
7392a05Q3j89M37l95r7K79p2q6K60K38N5n40q5L24m2Rk93P3J66J1k70K39L09l48
7416c9j83K21L7k13k0L64r6K30n60J91r8L02k06J07l19R9L48k54L45j84k5K68
7438C15m43O9K32Q9j26j63k3K43J77l19J54j25j14n0rL31k67R7o0j77J24q6J28
7461cj4L0n8o6K33n08K26K98k62K86k26M7Q3M6l29J44o3m7K09j67Q8K66k12o8
$$ plain form
7485 -67 250 205 193 152 -20 -228 24 255 -294 -119 -162 -15 -266 260 29 -52 54 -165 80 -181 53 -76
7507 -76 14 200 91 -122 460 -85 -150 359 92 129 -155 -31 11 99 -80 -399 98 105 -292 -380 341 -270 -111
7530 -111 31 147 67 106 -6 -2 -246 104 339 -157 -87 243 -79 197 6 -120 6 25 19 100 59 149 -4 135
7554 135 -111 85 43 -98 -251 -14 -134 -52 160 208 305 -56 172 -49 -135 206 154 -7 -42 -21 165 14 -70
7577 -70 169 -80 124 89 139 -89 -5 -29 -119 -163 62 41 75 -48 153 15 -3 65 -68 -305 261 -15 -453 308
7601 308 231 47 13 -102 -64 -8 -31 114 205 48 133 -71 405 -89 -49 2 -142 77 -108 161 26 182 155
7624 155 -51 -151 -48 146 81 21 -117 -315 143 -122 -303 -318 -187 -8 179 59 248 -58 -41 -112 -92 -161
7646 -161 71 343 -80 -99 87 146 163 -105 29 -28 194 -580 29 1 13 -63 -52 283 173 167 -81 86 45 123
$$ packed form
7485f7L17m5j2m1j72k08K52K31n49J75m3J47k51N26k31q1J06k19K45k61K34j29
7507g6R0J86j09k13N82n45o5N09k67L7k84J24M2Q8j79l19M97Pl97q8P21o11J59
7530a11J42J16q0L9j12Mk44L50K35m96P0L30l22K76j91j26J26J9oQ1m1R0j53J39
7554A35k46J96m2j41j53K37j20Q2K12M8R7l61K28k21q6L41n2j61l5K1J86j51q4
7577g0K39k49K04l5N0k28Q4k4r0m4K25k1L4j23K01j38j8O8j33k37N66k76m38P61
7601C08p7j84l4j15L8N6k3J45R1j57Q5k04M76m94M0N1j44K19j85K69j35J56k7
7624A55k06j00J03J94o5o0j38j98M58k65j81j5J31J79J87j20J89l06J7p1K0o9
7646a61K32K72m23j9J86N9J7k68J34n7K22p74O09k8J2p6J1L35j10ok48J67m1P8
$$ plain form
7670 123 105 239 68 -86 43 278 -82 109 -231 -2 -241 -193 458 -233 -43 26 371 -35 -111 -258 7
7691 7 293 170 88 35 44 108 357 -64 -145 240 -12 -108 -22 -19 -407 -10 200 -153 -272 -59 42 -30 120 170 2
7716 2 2 -236 -33 -27 164 -52 144 -39 -64 -198 -65 -60 340 177 -41 -110 45 134 35 81 -271 82 -6 255 6
7741 6 199 -46 -129 -112 -167 112 -91 79 -134 14 -19 -218 229 -111 -11 -180 113 45 -70 80 -24 -237
7763 -237 22 -146 -297 -4 -213 -77 -382 65 21 -15 -188 -51 154 -57 -16 2 246 52 106 46 156 171
7785 171 17 13 59 284 194 -127 60 -63 264 -267 67 -76 98 36 78 117 71 24 142 151 -43 189 -255 -69
7809 -69 35 57 -29 5 53 30 -138 33 -68 -114 -27 -268 -111 -1 24 -50 376 -287 -1 210 105 -113 -89 132
7833 132 38 -50 93 -213 197 -11 -4 136 -163 50 -252 -54 -168 125 138 171 101 -29 105 116 230 58 -169
$$ packed form
7670A23j8J34j71j54J29K35l60J91l40K29k39M8O51o91J90O9L45m06p6j47K65
7691GK86j23q2n3RO4K49m21q1L85k52r6Q6Ll88L97K10l53j19K13J01p2J50N0j68
7716B%k38K03OJ91k16J96j83k5j34J33NM00j63k18o9J55Q9r9M6l52L53q8K61k49
7741FJ93k45q3J7n5K79k03J70k13J48l3j99M47l40J00j69K93o8j15J50j04k13
7763b37K59j68j51K93k09J36l05M47m4l6j73J37K05k11M1J8K44j94N4o0J10J5
7785A71j54mM6K25r0l21J87j23L27n31L34j43J74o2M2L9m6m7J18Rj94K32m44J86
7809f9J04K2q6L4M8k3j68J71j01m6Q7k41J57J10K5p4M26o63K86K11j05k18K4K21
7833A32r4q8J43l06M10k08PJ40k99K13l02J98j14K93J3L3p0j30J34J1J14j72k27
$$ plain form
7856 -169 26 98 -54 -219 56 -291 -349 -195 -85 -290 -145 -26 197 -173 -42 -16 -23 -60 -38 -181 -125 9 330
7879 330 78 -159 -38 155 15 -106 69 79 228 5 -40 -75 256 -6 56 -104 -167 59 212 29 -332 -12
7901 -12 211 41 11 26 202 125 -79 -11 12 -154 127 -7 86 180 145 38 -143 60 163 -59 -131 -136 -105 -69 -87
7926 -87 -109 49 -300 -42 6 -51 -40 113 243 -146 42 -303 97 59 -55 -8 47 -98 -132 87 -217 15 -82
7949 -82 -15 148 -154 -119 11 -111 -128 163 114 -88 -106 58 144 196 -166 55 -2 101 23 237 -38 -203 105
7972 105 36 -29 340 89 279 75 257 25 98 66 -4 198 160 216 -88 110 -127 177 -38 142 -165 -65
7994 -65 26 -194 201 -38 -226 -32 -281 -223 32 262 -26 38 -3 76 56 -40 113 -59 75 -209 147 -95 -18
8017 -18 -150 146 61 -4 11 -47 71 19 126 -217 -44 -100 54 -89 -38 55 141 -2 -17 -25 -261 -126 295 -124
$$ packed form
7856a69J95P2j52j65K75l47n8J54J10k05J45J19K23l70J31K6pl7K2j43N6J34L21
7879C30k52k37J21J93j40j21J75J0J49k23m5l5L31k62O2j60o3K26J53j83l61L20
7901a2K23j70l0J5J76p7k04O8K3j66K81j34R3R4l5j07j81K03J03k22p2nL1L6j8
7926h7k2J58l49K58M8n7J1J53J30l89J88l45M00l8j14M7N5j45l4K19l04K32r7
7949h2O7J63l02L5J30j22j7K91m9k02j8J64Q6N2l62K21n7J03p8K14k75j65L08
7972A05o9o5L69k51J90k04J82k32P3l2p0K02l8N6l04J98k37L04k15J80l07J00
7994f5R1k20L95k39j88J94k49N8K55K30k88O4m1P9k0r6J53j72J34k84L56k42P7
8017a8j32K96q5o5J5n8J18n2J07l43J73n6J54j43N1R3Q6j43j5qk36J35M21m19
$$ plain form
8041 -124 2 195 -94 -16 110 -148 -1 -281 -100 168 -166 -250 -126 279 -315 293 -41 -257 154 -46 108
8062 108 -101 186 -13 -54 55 -238 -114 -178 84 -131 -189 -2 -133 -13 103 134 -109 66 84 188 -153 -32
8084 -32 43 56 -261 -215 -2 -166 -143 -227 107 257 170 -9 143 -157 80 32 -267 89 1 2 -103 323 -134 -106
8108 -106 -161 -111 207 154 -285 -218 64 185 15 64 118 13 0 -253 -300 22 54 -45 -13 278 65 59 139 -29 144
8133 144 -108 -121 26 149 220 -289 -179 -40 -142 -16 -39 -54 -181 195 -289 -152 -193 -187 -68 -15 -216 -195 2
8156 2 -193 -25 -501 -44 196 -246 -207 9 177 175 164 -154 -158 163 -47 -261 -3 25 -141 189 94 -144 143
8179 143 15 319 204 102 55 257 -135 22 21 13 45 -258
$$ packed form
8041a24J26J93k89P8J26k58J47k80J81K68l34q4J24M05n94O08l34k16M11k00J54
8062A08k09K87j99m1J09k93J24o4K62k15n8J87j31J20J16L1k43J75J8J04l41J21
8084c2P5J3l17M6K13j64K3q4L34J50q7j79J52l00K37m8k99L56q8Jj05M26m57K8
8108a06n5N0L18n3m39O7K82J21j70M9N4j05j3k53m7L22L2r9L2K91k13oQ0j68J73
8133A44k52j3J47J23P1n09J10J39j02J26k3j5j27L76m84J37m1OJ19N3k01K1J97
8156Bj95J68m76M57K40m42L9K16J68kj1l18mL21k10k14K58K8j66L30r5k38K87
8179A43j28L04j15j02m7K02l92J57jqL2l03
8191b58
$$ Imaginary data points
##PAGE= N=2
##DATA TABLE= (X++(I..I)), XYDATA
$$ plain form
0 0 0 0 0 0 0 0 0 0 0 4 -8 8 -8 8 -8 16 -16 17 -24 24 -32 36 -40 48 -56 64 -72 81 -91 103 -116 130 -146
33 -146 163 -183 204 -225 251 -279 308 -343 378 -419 465 -515 571 -636 707 -794 892 -1009 1151
52 1151 -1326 1550 -1848 2263 -2885 3920 -5958 11534 -58776 -196521 -94670 49888 101206
65 101206 32660 -27743 -34476 -11725 -9602 -2175 29416 58513 26429 -42609 -64742 3330 79285
78 79285 69421 -8928 -46941 -13199 25163 16220 -6961 -7989 4536 3965 -8117 -13473 -2348
91 -2348 7771 -689 -21081 -28016 -16080 -2289 -775 -4150 -5565 -9151 -16387 -11848 2733 1134
105 1134 -19034 -21769 3169 18335 372 -19864 -9276 16271 15896 -15413 -34712 -9341 27228
118 27228 19675 -23285 -38623 -1386 29944 2758 -45700 -40313 9101 22051 -21447 -51243
$$ packed form
0@%%%%%%%%%Mj2J6j6J6j6K4l2L3m1M8n6O8p6Q8j04J20j36J53j72J94k19K46k76
33a46L09l46L87m29M76n30N87o51P21p97Q84r80J086j207J343j501J686j901K160
52A151k477K876l398M111n148O805r878J7492p0310j37745J01851J44558N1318
65A01206o8546o0403o733K2751K123P427L1591K9097l2084o9038k2133O8072P5955
78G9285r864p8349l8013L3742L8362q943k3181j028J2525n71j2082n356J1125
91b348J0119q460k0392o935J1936J3791J514l375j415l586p236M539J4581j599
105A134k0168k735K4938J5166j7963k0236J0588K5547l75l1309j9299K5371L6569
118B7228p553m2960j5338L7237L1330k7186m8458N387M9414J2950m3498k9796
$$ plain form
130 -51243 -21245 19721 8954 -39158 -56107 -14651 24323 2268 -46989 -45971 4916 28500
142 28500 -9085 -47731 -28312 17300 19350 -17749 -30599 -606 25026 11685 -17184 -18999
154 -18999 8162 25666 7803 -16581 -7371 21238 25596 2566 -10790 497 13525 9645 287
167 287 883 5764 6626 6654 8560 4822 -2799 -3668 2304 5815 3413 -1160 -832 8191 14287 3056 -11929
184 -11929 -5172 14823 13333 -9756 -16156 10921 33002 14900 -17059 -14777 16344 27043 1502
197 1502 -21350 -8111 24898 30534 -682 -21319 1261 28889 12519 -24578 -24123 13208 29391
210 29391 807 -26870 -11047 21387 18664 -16455 -33334 -12032 15297 10240 -16593 -22820 3088
223 3088 19162 -1006 -24395 -15192 7717 7438 -11382 -14452 3992 17224 8804 -5356 -5033 5947
$$ packed form
130e1243K9998M0966j0767m8112j6949M1456L8974k2055m9257J018N0887K3584
142B8500l7585l8646J9419M5612K050l7099j2850K9993K5632j3341k8869j815
154a8999K7161J7504j7863k4384R210K8609M358k3030j3356J1287J3028l880r358
167B87N96M881Q62K8J906l738p621q69N972L511k402m573L28R023O096j1231j4985
184a1929O757J9995j490k3089o400K7077K2081j8102l1959K282L1121J0699k5541
197A502k2852J3239L3009N636l1216k0637K2580K7628j6370l7097M55L7331J6183
210B9391k8584k7677J5823L2434k723l5119j6879K1302K7329n057k6833o227K5908
223C088J6074k0168k3389R203K2909k79j8820l070J8444J3232q420j4160L23J0980
$$ plain form
237 5947 10075 3470 -1359 3355 12731 14688 9106 9271 12524 7479 -766 3133 13837 10757 -878
252 -878 -190 13096 17012 3281 -8925 -2974 8841 4190 -11558 -12448 4672 15618 1969 -18424
266 -18424 -14528 9845 14432 -12341 -28565 -6628 21161 12818 -15586 -18474 7313 21649 2246
279 2246 -20154 -10429 17619 20579 -4067 -16677 3948 27515 15148 -16634 -19068 11969 25643
292 25643 1746 -20911 -8203 16024 14353 -10313 -21241 -5235 10167 144 -18760 -16257
304 -16257 3198 8115 -10012 -22870 -10501 7348 1293 -17463 -16678 1976 8655 -2802 -11130
317 -11130 -3963 4770 2257 -5125 -3257 7107 9937 1157 -3122 5867 13506 5813 -6487 -3351
331 -3351 10957 13369 -1043 -6727 6304 14224 1293 -12629 -6239 8530 6521 -10159 -15921
$$ packed form
237E947M128o605m829M714R376J957n582J65L253n045q245L899J0704l080j1635
252h78O88J3286L916j3731j2206N951J1815m651j5748q90J7120J0946j3649k0393
266a8424L896K4373M587k6773j6224K1937K7789q343k8404k888K5787J4336j9403
279B246k2400R725K8048K960k4646j2610K0625K3567j2367l1782k434L1037J3674
292B5643k3897k2657J2708K4227j671k4666j0928J6006J5402j0023j8904K503
304a6257J9455M917j8127j2858J2369J7849o055j8756P85J8654O679j1457q328
317a1130P167Q733k513p382J868J0364K830q780m279Q989P639p693j2300L136
331c351J4308K412j4412n684J3031P920j2931j3922O390J4769k009j6680n762
$$ plain form
344 -15921 931 15205 3231 -18633 -17833 4627 12521 -6972 -22435 -7621 16867 13088 -11610
357 -11610 -15901 6585 18907 1298 -18275 -8511 17671 22581 -492 -14737 3596 25592 15803
370 15803 -11882 -15569 9013 23458 6801 -12935 -3965 18009 16254 -7450 -16635 -503 13129
383 13129 3033 -14735 -11814 7818 14508 -2539 -17382 -8725 5614 3197 -11107 -13122 -470
396 -470 7938 532 -7528 -3151 4452 237 -8441 -7304 1865 5003 -611 -5104 356 7228 2271
411 2271 -6893 -5378 3018 2205 -6873 -7576 3292 8956 -1042 -13547 -8313 5565 4372 -12594 -19135
426 -19135 -4425 9619 2124 -15953 -16090 1720 8202 -9109 -23197 -11044 8730 5387 -14908
439 -14908 -19498 281 14313 -54 -21438 -16664 7688 14042 -4676 -17954 -5405 14479 12015
$$ packed form
344a5921J6852J4274j1974k1864Q00K2460P894j9493j5463J4814K4488l779k4698
357a1610m291K2486J2322j7609j9573R764K6182M910k3073j4245J8333K1996r789
370A5803k7685l687K4582J4445j6657j9736Q970K1974j755k3704r185J6132J3632
383A3129j0096j7768K921J9632O690j7047j4843Q657J4339k417j4304k015J2652
396d70Q408p406q060M377P603m215q678J137R169L138n614m493N460O872m957
411B271r164J515Q396q13r078p03J0868N664r998j2505N234J3878j193j6966o541
426a9135J4710J4044p495j8077j37J7810O482j7311j4088J2153J9774l343k0295
439a4908m590J9779J4032j4367k1384M774K4352O354j8718j3278J2549J9884k464
$$ plain form
452 12015 -8814 -14481 3306 15525 4459 -10982 -5334 12084 14741 -570 -10127 19 13431
465 13431 8924 -4959 -6580 5067 11088 4155 -4574 -2870 3862 3908 -2387 -2946 1648 2901 -1437
480 -1437 -3019 126 2018 -1768 -5927 -3004 2414 279 -6076 -4160 4313 3702 -5521 -9935 -1169
495 -1169 7029 1649 -10558 -9275 5887 12046 -1146 -14535 -7582 8038 8245 -8554 -16093 -1293
509 -1293 13462 4130 -14644 -13150 4918 10029 -6166 -19453 -8538 10534 9676 -9429 -16166
522 -16166 -876 12535 3520 -13569 -12649 5216 13554 1481 -9397 -293 13473 10350 -2594
535 -2594 -4959 5836 12766 7196 -1199 2354 12394 14179 5551 576 4872 9548 6913 2318 3887
550 3887 8931 7674 2360 3665 8690 6118 -2603 -2789 4380 8350 1809 -3832 21 8247 7269 -4057
$$ packed form
452A2015k0829n667J7787J2219j1066j5441N648J7418K657j5311r557J0146J3412
465A3431m507j3883j621J1647O021o933q729J704O732M6o295n59M594J253m338
480a437j582L145J892l786m159K923N418k135o355J916Q473o11r223m414Q766
495a169Q198n380j2207J283J5162O159j3192j3389O953J5620K07j6799p539J4800
509a293J4755r332j8774J494J8068N111j6195j3287J0915J9072q58j9105o737
522a6166J5290J3411r015j7089R20J7865Q338j2073j0878R104J3766l123j2944
535b594k365J0795O930n570q395L553J0040J785q628m975M296M676k635m595J569
550C887N044j257n314J305N025k572q721j86P169L970o541n641L853Q226r78j1326
$$ plain form
566 -4057 -7922 1405 9612 2770 -8775 -5417 10510 14269 -1668 -12657 -953 14224 8210 -9276
580 -9276 -11155 5574 15732 4818 -10958 -8100 8747 11187 -5579 -16378 -4458 11075 5709
593 5709 -12525 -14857 1999 9809 -4440 -18298 -12112 3185 4008 -8401 -14918 -6177 4888 640
607 640 -11411 -11596 -160 4457 -3925 -9983 -2159 6911 3488 -5107 -3992 4778 6605 -101 -2086
622 -2086 3534 7597 5386 579 2047 7572 7743 612 -2422 5557 11537 4301 -5142 -1156 10329
637 10329 9495 -3541 -8565 2495 10644 3001 -8874 -5997 6092 8333 -3722 -12895 -5230 8257
651 8257 5837 -10491 -14159 1335 11276 -975 -15843 -10716 5430 7051 -7681 -14570 -3556
664 -3556 7776 1996 -10998 -11918 -126 6279 -3038 -14490 -8829 5162 4903 -8966 -13258 -2454
$$ packed form
566d057l865R327Q207o842j1545L358J5927L759j5937j0989J1704J5177o014j7486
580i276j879J6729J0158j0914j5776K858J6847K440j6766j0799J1920J5533n366
593E709j8234k332J6856P810j4249j3858O186J5297Q23j2409o517Q741J1065m248
607F40j2051j85J1436M617q382o058P824R070l423q595J115Q770J827o706j985
622b086N620M063k211m807J468N525J71p131l034P979N980p236r443L986J1485
637A0329q34j3036n024J1060Q149p643j1875K877J2089K241j2055r173P665J3487
651H257k420j6328l668J5494R941j2251j4868N127J6146J621j4732o889J1014
664c556J1332n780j2994r20J1792O405r317j1452N661J3991k59j3869m292J0804
$$ plain form
678 -2454 4834 -2813 -12374 -9050 393 1379 -6012 -9116 -3315 1171 -2307 -8445 -7782 -396 1735 -5285
694 -5285 -9182 -1303 5610 -488 -8479 -4461 4106 2787 -5042 -6119 2790 7475 1590 -5598 -1442
709 -1442 6704 6891 -1937 -6863 874 11226 7366 -4956 -4553 8403 11746 -51 -7764 366 10373
724 10373 6724 -3847 -4677 5592 10619 3008 -6759 -3995 6165 8425 -1746 -8408 -250 9877
738 9877 5036 -6226 -5282 5107 6055 -2543 -6736 -446 5524 3056 -3876 -4143 2119 4730 -733
753 -733 -6078 -2918 4033 3011 -4894 -5766 2283 5171 -3261 -7436 -1354 3939 -675 -6662 -4931 2040
769 2040 3386 -2983 -7512 -3387 3765 2280 -6316 -7602 767 6451 273 -8259 -3201 6733 5164
784 5164 -5387 -6219 3084 8271 1952 -4847 -1915 6067 8073 1014 -4376 679 8453 6590 -2122
$$ packed form
678b454P288p647r561L324R443R86p391l104N801M486l478o138O63P386K131p020
694e285l897P879O913o098p991M018Q567j319p829j077Q909M685n885p188M156
709a442Q146J87q828m926P737J0352l860j2322M03J2956L343j1797p713Q130J0007
724A0373l649j0571q30J0269N027p611r767K764J0160K260j0171o662Q158J0127
738I877m841j1262R44J0389R48q598m193O290N970k468o932k67O262K611n463
753g33n345L160O951j022p905q72Q049K888q432m175O082N293m614n987J731O971
769B040J346o369m529M125P152j485q596j286Q369N684o178q532N058R934j569
784E164j0551q32R303N187o319o799K932P982K006p059n390N055P774j863q712
$$ plain form
799 -2122 -3285 5449 9053 1343 -4899 761 7792 4395 -3204 -2495 3366 5102 650 -3448 -1500
814 -1500 2997 2951 -2347 -4519 1252 5053 -9 -5591 -1775 4803 2623 -5093 -4321 3765 5423 -1704
830 -1704 -5368 -85 5092 2940 -3453 -4705 1073 5967 1697 -5751 -3334 5794 6045 -3744 -7837
845 -7837 747 7931 1446 -7540 -4941 4739 5440 -2691 -7167 -2304 3797 2906 -4831 -7218 725 6554
861 6554 -165 -8332 -4066 5289 4347 -4740 -7043 1139 6039 860 -4820 -1922 3662 2970 -1469 -3537
877 -3537 -125 4654 2409 -3872 -3188 4200 5463 -1821 -5364 831 5548 706 -5309 -2287 4515
892 4515 4027 -3447 -5045 909 5013 823 -4997 -4313 2977 6321 -941 -7530 -1181 7652 3863 -6229
908 -6229 -6216 4281 8064 -18 -6957 -1437 7059 5338 -3115 -5456 1435 7334 3719 -4916 -4662 5441
$$ packed form
799b122j163Q734L604p710o242N660P031l397p599P09N861J736m452m098J948
814a500M497m6n298k172N771L801n062n582L816O578k180p716P72Q086J658p127
830a704l664N283N177k152o393j252N778M894m270p448K417R128K51r789m093
845g837Q584P184o485q986K599R680P01q131m476M863O101q91p737k387P943N829
861F554o719q167M266R355r42r087k303Q182M900n179n680K898N584o92m439k068
877c537L412M779k245o281O84P388J263p284l543O195M717m842o015L022O802
892D515m88p474j598N954M104m190n820O84P290L344p262o589O349Q833l789j0092
908f229J3J0497L783q082o939N520Q496j721q453k341O891N899l615q635K54J0103
$$ plain form
924 5441 8835 -926 -7478 -393 8145 4083 -4812 -4470 3639 6380 -139 -5209 -1274 4496 3293
939 3293 -3034 -4787 329 4922 1453 -5278 -3440 4284 3766 -4171 -5477 1639 4443 -1407 -5467
954 -5467 -1775 3505 2070 -4058 -4729 738 4142 -97 -5678 -3838 3445 4236 -3388 -7565 8 6916
970 6916 711 -7536 -4665 4736 4927 -3441 -7120 -896 5763 2544 -5768 -5922 1943 6216 69 -7200
986 -7200 -4061 5151 5485 -4198 -7437 759 6835 884 -5846 -2815 4300 4764 -1288 -4809 -619 5148
1002 5148 3308 -2750 -3278 2765 5744 777 -3980 -365 5466 3820 -2228 -1436 4218 5147 144 -2012
1018 -2012 1764 4596 3176 -1191 -1413 3161 4908 720 -3258 113 5026 2934 -3174 -3508 3169
1033 3169 5289 -1250 -6178 -1211 5010 1944 -4513 -4958 609 3801 -488 -6470 -4851 1931 3162
$$ packed form
924E441L394r761o552P085Q538m062q895L42Q109K741o519n070L935N770j203
939C293o327j753N116M593l469o731J838P724n18p937j306P116K804n850m060
954e467L692N280j435o128o71N467L404m239n581J840P283P91p624m177P573O908
970F916o205q247K871R401J91q368l679O224O659l219q312j54P865M273o147p269
986g200L139R212L34r683l239Q196O076n951o730L031P115M64o052l521M190N767
1002E148j840o058n28O043K979m967m757L615N831j646o048P92N654R29n003k156
1018b012L776K832j420m367k22M574J747m188l978L371M913k092o108l34O677
1033C169K120o539m928M967O221l066o457m45N567L192m289n982J619O782J231
$$ plain form
1048 3162 -4257 -7958 -2381 3917 -6 -7056 -6633 1072 3095 -3251 -7267 -2892 2197 757 -4015
1063 -4015 -5421 -918 3038 155 -4571 -3256 2235 3034 -2246 -3976 972 3782 753 -2821 -526
1078 -526 3389 2802 -1215 -1281 2040 3787 1462 -972 421 3478 3556 -704 -1819 2714 5103 1185
1094 1185 -2711 535 5229 3818 -1735 -2891 3060 6058 1169 -3247 -647 4297 4855 -723 -3777
1109 -3777 445 5789 3276 -3808 -3504 3795 5814 -161 -4842 -967 4625 3259 -3325 -4426 1110
1124 1110 3882 227 -4214 -2797 1889 2674 -2114 -5328 -1525 2946 268 -4618 -4169 626 1376 -2756
1140 -2756 -4779 -1796 1407 -849 -4335 -3230 243 296 -2857 -4033 -1365 1316 -451 -4350 -3341
1155 -3341 1538 2234 -2882 -4769 34 3790 335 -4101 -2606 3034 3961 -1196 -4471 225 5344
$$ packed form
1048C162p419l701N577O298l923p050M23P705K023o346m016M375N089j440m772
1063d015j406M503L956k883m726J315N491P99n280j730M948K810l029l574K295
1078e26L915n87m017o6L321J747k325k434J393L057P8m260j115M533K389l918
1094A185l896L246M694j411n553j156N951K998m889m416K600M944N58n578l054
1109c777M222N344k513p084L04P299K019n975m681L875N592j366o584j101N536
1124A110K772l655m441J417M686P85m788l214L803M471k678m886M49M795P50m132
1140b756k023K983L203k256l486J105L473N3l153j176K668K681j767l899J009
1155c341M879O96n116j887M803L756l455m436J495N640R27n157l275M696N119
$$ plain form
1170 5344 2882 -2851 -3258 3273 6683 1700 -3986 -412 6209 5776 -1086 -2959 2903 7445 3282
1185 3282 -2347 -932 5251 6799 557 -3209 1055 6143 4260 -2040 -2492 3229 5974 1098 -3786
1200 -3786 -1020 4199 2502 -2653 -3474 603 3299 -104 -3965 -2447 2020 1161 -3741 -4379 -479 1806
1216 1806 -872 -4824 -2857 1453 759 -4174 -5044 -115 2156 -1708 -5077 -2753 2094 2187 -3278 -5424
1232 -5424 46 3728 406 -4812 -2819 3126 3916 -1755 -4992 -483 5029 2519 -4277 -3705 3145
1247 3145 5330 269 -4477 -1213 5026 4238 -2243 -4336 1473 5663 1634 -3516 -1836 3690 4728
1262 4728 -651 -3841 349 5002 2726 -2370 -1765 3054 4598 604 -2592 155 4505 2888 -1553
1277 -1553 -1558 3056 4014 656 -1894 427 3804 2684 -1344 -2145 2221 3926 361 -2914 -318 3562
$$ packed form
1170E344k462n733m07O531L410m983n686L574O621m33o862j873N862M542m163
1185C282n629J415O183J548o242l766M264N088j883o300m52N721K745m876m884
1200c786K766N219j697n155q21M077K696l403l861J518M467q59m902o38L900K285
1216A806k678l952J967M310o94m933q70M929K271l864l369K324M847R3n465k146
1232e424N470L682l322n218J993N945P90n671l237M509N512k510o796N72O850
1247C145K185n061m746L264O239p88o481k093N809M190m029n150J680N526J038
1262D728n379l190M190M653k276n096O05M819J544l994l196K747M350j617m441
1277a553nM614R58l358k550K321L377j120m028q01M366J705l565l275K596L880
$$ plain form
1293 3562 1913 -2485 -2999 1414 3099 -960 -4226 -1996 2613 1172 -3416 -4953 -448 2668 -282
1308 -282 -5273 -3686 1791 2149 -3117 -5632 -1377 2411 319 -4469 -3986 1431 2883 -1430 -4302 -1446
1324 -1446 2309 1637 -2298 -3620 758 3615 429 -3340 -1707 2617 2467 -1305 -2673 842 3458
1339 3458 675 -1939 -842 2191 1960 -1031 -1938 562 2553 1088 -1617 -1132 2175 2757 -1114 -2665
1355 -2665 784 3221 439 -2190 -645 2927 2966 -1019 -2639 814 3531 1190 -2126 -2096 2049 3335
1371 3335 199 -3228 -620 3628 1694 -2893 -3031 1331 2894 -203 -3192 -1348 2292 1887 -2124
1386 -2124 -3628 -510 1921 224 -2913 -2472 885 2708 -1421 -3620 -820 2279 275 -3081 -1464
1401 -1464 1730 1959 -781 -2108 322 1956 605 -1741 -1525 1261 1980 -311 -1999 217 2619 843
$$ packed form
1293C562j649m398n14M413J685m059l266K230M609j441m588j537M505L116k950
1308b82m991J587N477L58n266k515M255L788k092m788M83N417J452m313k872K856
1324a446L755o72l935j322M378K857l186l769J633M324j50l772j368L515K616
1339C458k783k614J097L033k31k991r07K500J991j465k705M85L307N82l871j551
1355b665L449K437k782k629J545L572L9l985j620L453K717k341l316L0M145J286
1371C335l136l427K608M248j934m587j38M362J563l097k989J844L640m05m011
1386b124j504L118K431j697l137M41L357J823m129k199K800L099k004l356J617
1401a464L194K29k740j327K430J634j351k346K16K786P19k291j688K216K402j776
$$ plain form
1417 843 -2813 -1975 2007 2239 -1930 -3068 695 2910 547 -2722 -2163 1447 2565 -1006 -3426 -1379
1433 -1379 2808 1906 -2456 -3620 543 3547 4 -4381 -1739 3346 2422 -1996 -3001 460 3013
1448 3013 963 -2524 -2163 1498 3045 -194 -2861 -369 3017 2201 -2050 -2461 1640 3468 -241 -2496
1464 -2496 62 2802 1444 -1706 -1541 886 2314 171 -1904 -487 2229 1726 -1453 -1928 1327 2889
1480 2889 -340 -2973 -348 3346 2014 -2279 -2290 1703 2902 -429 -2786 -574 2436 2508 -1249 -3044
1496 -3044 775 3857 926 -3486 -2534 2803 3579 -1600 -4008 -20 3880 967 -3488 -2885 1254 2228
1512 2228 -492 -3553 -1627 2457 2397 -2112 -4308 -551 3036 86 -4031 -2760 1904 2282 -1573 -2898
1528 -2898 -98 2077 -55 -2376 -1556 602 2074 271 -1957 -686 2399 1839 -1732 -1685 1568 2684
$$ packed form
1417H43l656Q38L982K32m169j138L763K215k363l269N59L610J118l571k420K047
1433a379M187r02m362j164M163L004l543m385K642N085r24m418j005L461K553
1448C013k050l487L61L661J547l239k667K492L386q16m251m11M101J828l709k255
1464b496K558K740j358l150J65K427J428k143k075J417K716n03l179m75L255J562
1480B889l229k633K625L694j332m293j1L993J199l331k357K212L010P2l757j795
1496c044L819L082k931m412R52N337P76n179k408L988L900k913m455O03M139R74
1512B228k720l061J926M084o0m509k196L757L587k950m117J271M664L78l855j325
1528b898K800K175k132k321Q20K158J472j803k228J271L085n60l571M7L253J116
$$ plain form
1544 2684 -385 -2320 809 3257 1283 -1843 -1155 1934 2116 -426 -1771 320 3104 2274 -936 -2081
1560 -2081 1732 3643 336 -3131 -546 4097 2935 -1220 -2137 2310 4087 879 -2399 -822 3242
1575 3242 3407 474 -1936 197 4095 3255 -1581 -2731 1902 3960 235 -2891 -441 2993 1888
1590 1888 -1739 -2279 357 1659 -480 -2748 -2227 404 1376 -999 -3398 -1899 888 -687 -3551 -3141
1606 -3141 432 227 -2351 -2821 -511 728 -1224 -2672 -1696 532 92 -1339 -1678 64 1375 458
1622 458 -1971 -1842 1478 2442 -631 -2469 962 3571 1298 -1787 -328 2664 2680 -378 -1458 336
1638 336 3261 2582 -575 -1571 1081 3416 1432 -2016 -974 3092 3362 -840 -1822 1413 3199 589
1654 589 -1819 -618 1764 2188 571 -1186 -420 2000 1694 -486 -2008 607 1976 78 -1870 99
$$ packed form
1544B684l069j935L129K448j974l126O88L089J82k542j345K091K784q30l210j145
1560b081L813J911l307l467K585M643j162m155r17M447J777l208l278J577M064
1575C242J65k933k410K133L898q40m836j150M633K058l725l126K450L434j105
1590A888l627n40K636J302k139k268N21K631R72k375k399J499K787j575k864M10
1606c141L573k05k578m70K310J239j952j448R76K228m40j431l39J742J311r17
1622D58k429J29L320R64l073j838L431K609k273l085J459K992J6l058j080J794
1638C36K925o79l157r96K652K335j984l448J042M066K70m202r82L235J786k610
1654E89k408J201K382M24j617j757P66K420l06k180j522K615J369j898j948J969
$$ plain form
1670 99 2210 470 -1825 -889 506 622 -875 -1334 -387 608 -6 -1208 -1801 -98 364 -1192 -2890
1687 -2890 -1494 929 252 -2920 -2565 560 966 -2133 -3760 -996 1078 -214 -2558 -2401 -113 1391
1703 1391 -409 -3038 -2089 751 1206 -1779 -3210 -156 2877 715 -2972 -1884 1720 1601 -904 -1839
1719 -1839 -268 1982 1696 -253 -878 1025 2543 668 -1166 -112 2687 2618 -495 -529 1813 3150
1735 3150 744 -779 936 2343 1377 14 197 1807 2091 905 -611 -72 2265 1573 -895 -1738
1751 -1738 1269 2678 215 -2099 -537 2220 1088 -2233 -2179 540 1615 -858 -2536 -1948 782 1277
1767 1277 -1617 -3721 -1553 1725 290 -3373 -3430 359 1759 -1638 -3987 -1553 1456 323 -2313
1782 -2313 -2179 -46 1239 77 -2328 -1640 1024 1596 -678 -2608 -290 2511 710 -1594 -918 1589
$$ packed form
1670I9K111j740k295R36J395J16j497m59R47R95o14j202n93J703M62j556j698
1687b890J396K423o77l172L55L125M06l099j627K764K074j292k344J57K288J504
1703A391j800k629R49K840M55k985j431L054L033k162l687J088L604j19k505r35
1719a839J571K250k86j949o25J903J518j875j834J054K799o9l113l4K342J337
1735C150k406j523J715J407r66j363J83J610K84j186j516N39K337o92k468q43
1751a738L007J409k463k314J562K757j132l321N4K719J075k473j678N88K730M95
1767A277k894k104K168L278j435l663n7L789J400l397k349K434L009j133k636
1782b313J34K133J285j162k405O88K664N72k274j930K318K801j801k304O76K507
$$ plain form
1798 1589 1550 -420 -924 741 2284 614 -571 -554 1079 1672 19 -1487 133 2302 1262 -1123
1814 -1123 -1152 2090 2155 -330 -1895 418 2465 1149 -1382 -670 1794 2558 243 -1561 -568 1902 2126
1831 2126 -682 -2073 1092 3340 1067 -2057 -792 2404 2261 -1112 -2261 75 2330 1062 -1872
1846 -1872 -1686 981 1687 -416 -2711 -1571 1404 1508 -1502 -3029 205 1572 -858 -2738 -1592 564
1862 564 222 -1570 -1995 -208 1170 -216 -1906 -1379 150 755 -926 -1940 -488 1606 621 -1479
1878 -1479 -989 1421 1206 -1395 -1516 333 1724 226 -1298 -774 1358 1933 -638 -1735 -93 1620
1894 1620 1091 -1101 -1230 1446 2721 173 -1809 -145 2154 1350 -1417 -1111 1180 2612 592 -1078
1910 -1078 -1105 1635 1902 -383 -1619 111 2100 1231 -836 -1017 1414 2022 -781 -1860 5 1312
$$ packed form
1798A589l9j970n04J665J543j670j185J7J633N93j653j506J620K169j040k385
1814a123k9L242O5k485j565K313K047j316k531P12K464P64k315j804R93K470K24
1831B126k808j391L165K248k273l124J265L196j43l373j149K336K255j268k934
1846a872J86K667P06k103k295J140K975J04l010j527L234J367k430j880J146K156
1862E64l42j792m25J787J378j386j690N27J529O05j681j014J452K094r85k100
1878a479M90K410k15k601j21J849J391j498j524N24K132N75k571j097J642J713
1894A620n29k192j29K676J275k548j982J664K299q04k767L06K291J432k020j670
1910a078k7K740K67k285j236J730J989q69k067j81K431O08k803j079J865J307
$$ plain form
1926 1312 443 -946 -1020 607 1155 60 -1396 -456 775 579 -1172 -1153 661 1248 -587 -1395 -205
1943 -205 1034 77 -1432 -871 616 1021 -324 -1377 -223 1102 505 -1293 -1354 820 1118 -224 -1763
1960 -1763 -640 1531 1122 -1608 -1799 309 2090 331 -1579 -858 914 1272 -304 -1641 -478 1244
1976 1244 853 -1359 -1111 775 1196 -354 -1674 -593 908 752 -1031 -1071 375 1188 -219 -981 -198
1993 -198 743 227 -801 -822 294 956 -176 -939 -160 931 464 -1156 -1061 354 1176 25 -1199 354
2011 354 1471 549 -1118 -1138 1044 1295 -185 -1272 -48 2204 1858 -886 -1364 571 1591 277 -1651
2028 -1651 -695 1572 2112 72 -1599 -38 1875 734 -1265 -1348 859 1955 128 -1527 -317 1746
2044 1746 1084 -693 -1633 -1 1275 503 -984 -1019 893 979 -631 -1511 -318 821 -130 -1287 -1283 596
$$ packed form
1926A312q69j389p4J627N48j095j456R40J231j96j751J9J814N87j835q08J190
1943b05J239r57j509N61J487M05j345j053J154J325n97j798o1K174K98j342j539
1960a763J123K171m09k730j91K108J781j759j910P21J772L58j576j337J163J722
1976A244l91k212K48J886M21j550j320J081J501j56j783m0J446Q13j407p62P83
1993a98R41n16j028k1J116O62j132p63P79J091m67j620R5J415Q22j151j224J553
2011C54J117r22j667k0K182K51j480j087J224K252l46k744m78J935J020j314j928
2028a651R56K267N40k040j671J561J913j141j999q3K207J096j827j655J210K063
2044A746o62j777r40J632J276p72j487l5J912Q6j610q80J193J139r51j157MJ879
$$ plain form
2062 596 800 -812 -1215 -300 432 -235 -1387 -875 599 290 -619 -1349 112 1160 -237 -2006 -902
2079 -902 1049 773 -1097 -1776 303 1781 588 -1640 -1169 1012 1460 -733 -1776 -146 1857 1706
2095 1706 -1367 -1975 865 2375 84 -1957 -707 1760 1818 -382 -1873 64 2259 1121 -962 -1317
2111 -1317 1207 2194 486 -1557 -476 2046 1975 -758 -1336 841 2268 934 -570 -166 1023 1540
2127 1540 515 -752 279 1161 689 -226 -152 866 986 -296 -977 10 969 121 -1512 -285 1071
2144 1071 55 -1309 -1047 131 276 -613 -2027 -955 472 718 -1610 -2199 -471 1017 -620 -2850
2160 -2850 -2111 601 1259 -1173 -2322 -547 1488 117 -1899 -1986 308 1599 169 -2047 -1204 1872
2176 1872 1897 -721 -2116 -157 2313 1052 -1021 -1074 1165 2037 297 -755 259 1741 1708 130 -412
$$ packed form
2062E96K04j612m03R15P32o67j152N12J474l09r09p30J461J048j397j769J104
2079i02J951k76j870o79K079J478j193k228M71K181M48k193j043J630K003j51
2095A706l073o08K840J510k291k041J250K467N8k200j491J937K195j138k083l55
2111a317K524R87j708k043J081K522p1k733n78K177J427j334j504M04J189N17
2127A540j025j267J031Q82m72r15P4J018J20j282o81R87R59q48j633J227J356
2144A071j016j364K62J178J45q89j414J072J427K46k328n89J728J488j637k230
2160b850P39K712O58k432j149J775K035j371k016q7K294J291j430k216Q43L076
2176A872K5k618j395J959K470j261k073n3K239Q72j740j052J014J482l3j578n42
$$ plain form
2193 -412 514 2148 1621 -135 -162 1306 1623 154 -221 764 1303 771 -90 568 944 279 82 360 469
2212 469 382 -26 -307 -137 654 656 -577 -744 586 589 -802 -1169 -349 1181 -316 -1618 -859 754 830 -1242
2232 -1242 -1631 -885 685 473 -860 -1893 -367 1506 153 -2257 -1920 734 898 -1123 -2201 -491
2248 -491 1264 611 -1696 -1651 114 852 -144 -1332 -1142 384 1338 -248 -1342 -321 1068 439 -1104
2265 -1104 -855 537 890 3 -473 342 1016 571 -28 -83 327 868 968 220 168 1152 1098 38 385 1187
2285 1187 1132 -21 171 1373 1640 129 -85 591 1418 687 -307 58 643 1300 447 -405 -447 776 1093
2304 1093 -389 -1642 347 1513 250 -1696 -1516 729 553 -1045 -1750 -933 618 133 -1260 -1791
2320 -1791 -603 597 -223 -2214 -1709 290 842 -1339 -2472 -454 1010 -49 -1936 -1593 0 732
$$ packed form
2193d12R26J634n27j756k7J468L17j469l75R85N39n32q61O58L76o65j97K78J09
2212D69q7m08k81J70P91Kj233j67J330Lj391l67Q20J530j497j302P59J613P6k072
2232a242l89P46J570k12j333j033J526J873j353k410L37K654J64k021j078J710
2248d91J755o53k307M5J765P38r96j188J90J526R54j586j094J021J389o29j543
2265a104K49J392L53q87m76Q15O74m45n99n5M10N41J00p48n2R84n4j060L47Q02
2285A187n5j153J92J202K67j511k14O76Q27p31r94L65N85O57q53q52m2J223L17
2304A093j482j253J989J166j263j946J80K245j76j598p05Q17J551m85j393n31
2320a791J188J200q20j991N05J999N52k181j133K018J464j059j887L43J593P32
$$ plain form
2336 732 -416 -1120 -962 636 832 -293 -1024 -126 1129 63 -1192 -592 1085 1528 -521 -643 579
2353 579 871 -73 -167 82 344 537 407 262 241 879 573 -612 -146 923 1293 -335 -831 1048 1809
2372 1809 205 -704 96 1145 653 -614 -289 783 954 216 -760 -450 542 1238 -407 -1568 234
2389 234 1484 685 -1718 -1181 1328 1675 -913 -1784 158 877 646 -1043 -1340 -85 1020 136 -1955
2406 -1955 -1332 1035 1264 -990 -2368 -349 1437 255 -2010 -1654 588 649 -373 -1320 -756 464 694
2423 694 -382 -1375 -252 1080 391 -1343 -982 622 887 -238 -835 106 746 -1 -314 377 262 177
2441 177 -42 -9 294 845 686 -235 -282 356 837 -325 -347 731 1128 -269 -673 548 1400 536 -1103
2460 -1103 -609 675 1199 -165 -902 -777 741 1090 -658 -1661 80 2020 758 -1347 -1114 1192
$$ packed form
2336G32j148p04J58J598J96j125p31Q98J255j066j255O00J677M43k049j22J222
2353E79K92r44r4K49K62J93j30j45k1O38l06j185M66J069L70j628m96J879P61
2372A809j604r09Q00J049m92j267L25J072J71p38r76L10R92O96j645j161J802
2389B34J250p99k403N37K509L47k588q71J942P19k31j689k97J255J105q84k091
2406a955O23K367K29k254j378K019J786j182k265L56K242O1j022r47N64J220K30
2423F94j076r93J123J332o89j734L61J604K65j125n97R41O40p47l13O91j15q5
2441A77k19L3L03N51j59r21m7O38M81j162k2J078L97j397m04J221Q52q64j639
2460a103M94J284N24j364p37J25J518L49j748j003J741J940j262k105K33K306
$$ plain form
2476 1192 1660 -528 -1943 -371 1317 667 -847 -1391 422 1243 345 -1254 -1351 560 1857 231 -1878
2493 -1878 -735 1432 640 -1028 -1152 302 682 100 -989 -480 306 766 429 -1024 -684 15 944 -565
2511 -565 -847 20 636 197 -197 224 30 -246 -182 436 -99 -502 -603 -27 513 -66 -124 -42 -13 577 -535
2532 -535 -1027 -493 914 1081 -786 -1350 191 1611 97 -1672 -989 883 1252 -293 -1212 -234 1093
2549 1093 1317 -498 -1632 -280 1348 1127 -1292 -1599 851 1758 -311 -1530 -606 1024 1079 -300 -1117
2566 -1117 -501 1408 1180 -483 -1283 119 1436 387 -876 -454 831 1108 -405 -736 524 754 279
2583 279 215 -170 58 428 401 317 -146 224 332 105 360 -203 -180 -242 302 551 -102 -675 -248 1031 377
2604 377 -854 -924 374 1003 50 -1187 -1028 770 791 -290 -1675 -1102 847 893 -854 -1907 -201 1570
$$ packed form
2476A192M68k188j415J572J688o50j514n44J813Q21q98j599r7J911J297j626k109
2493a878J143K167p92j668j24J454L80n82j089N09P86M60l37j453L40O99R29j509
2511e65k82Q67O16m39l94M21j94k76O4O18n35m03j01N76N40n79n8Q2K9N90j112
2532e35m92N34J407J67j867n64J541J420j514j769O83J872L69j545r19R78J327
2549A093K24j815j134J352J628k21k419l07K450R07k069j219R24J630N5j379q17
2566a117O16J909k28j663q00J402J317j049j263M22J285K77j513l31J260K30m75
2583B79o4l85K28L70k7q4m63L70J08k27K55n63K3o2N44K49o53n73M27J279o54
2604C77j231p0J298O29r53j237J59J798K1j081j385N73J949M6j747j053J706J771
$$ plain form
2622 1570 724 -1874 -1645 660 1711 -228 -1413 -981 1174 1332 -390 -1474 -531 1620 809 -936
2638 -936 -1491 584 1513 189 -1067 -820 969 1035 50 -848 -209 718 761 -183 -528 108 801 312 -481
2657 -481 -165 750 657 93 398 231 538 -95 210 572 49 -475 110 1086 742 -272 -593 -143 778 792
2677 792 62 -626 398 1505 333 -1002 -617 968 1245 -573 -1693 -486 1333 751 -986 -1640 131
2694 131 1376 121 -1638 -1523 482 1387 -751 -2237 -1008 907 501 -1611 -1778 -304 948 80
2710 80 -1486 -1291 231 872 -615 -1553 -1233 684 768 -578 -1423 27 925 383 -826 -798 120 399 90
2729 90 -461 84 449 545 172 -168 -66 443 457 177 197 715 352 185 759 1089 556 -4 706 1173 661
2750 661 144 -309 610 1149 385 -346 17 1125 1036 -4 -755 -128 1233 787 -979 -937 439 1280 30
$$ packed form
2622A570q46k598K29K305J051j939j185M32K155J58j722j084R43K151q11j745
2638i36n55K075R29j324j256K47J789O6r85q98O39R27M3r44l45O36O93m89p93
2657d81L16R15r3n64L05j67L07o33L05L62n23n24N85R76l44j014l21M50R21J4
2677G92p30o88J024J107j172j335L85J585K77j818j120J207J819n82j737o54J771
2694A31J245j255j759J15K005R05k138j486J229J915m06k112j67J474J252q68
2710H0j566J95J522O41j487r38L20J917Q4j346q45J450Q98n42j209K8R18K79l09
2729I0n51N45L65R6l73l40J02N09J4k80K0N18l63j67N74L30n33n60P10M67n12
2750F61n17m53R19N39p64p31L63J108q9j040p51O27J361m46j766M2J376Q41j250
$$ plain form
2769 30 -1550 -722 864 794 -746 -1261 -518 1164 98 -1125 -1252 17 910 -26 -1532 -1103 582 610
2787 610 -508 -1654 -731 782 93 -510 -1355 74 489 -71 -1147 -944 454 253 -487 -500 -295 449
2805 449 231 -542 -374 -9 577 273 -394 -5 160 126 -95 277 384 268 -398 330 595 90 -63 155
2825 155 819 644 110 -409 285 1039 997 -66 -367 550 1175 329 -108 -277 997 1082 232 -510 174 1095
2845 1095 794 -616 -557 444 1006 472 -734 -422 602 885 -137 -868 -370 621 466 -781 -917 187
2863 187 910 -671 -1127 -537 298 -94 -905 -915 -538 369 -238 -893 -867 -52 152 -554 -744 -424 -66 -344
2883 -344 -499 -519 192 -233 -483 -430 -83 242 -130 -598 -263 302 181 -561 -164 400 572 74 -183 129 865
2904 865 602 -439 -142 829 1012 -101 -194 478 846 370 32 -332 278 968 268 -687 -367 814 1009
$$ packed form
2769C0j580Q28J586p0j540n15P43J682j066j223j27J269Q93r36j506M29J685K8
2787F10j118j146R23J513o89o03q45J429M15n60j076K03J398k01p40j3K05P44
2805D49k18p73J68L65N86l04o67L89J65l4k21L72J07j16o66P28K65n05j53K18
2825A55O64j75n34n19O94P54m2j063l01R17O25q46m37j69J274Q5q50p42O84R21
2845A095l01j410N9J001N62n34j206L12J024K83j022p31M98R91j55j247j36J104
2863A87P23j581m56N90Q35l92q11j0L77R07o07o55K6Q15K04p06j90L20L58k78
2883c44j55k0P11m25k50N3L47L25l72m68L35N65j21p42L97N64J72m98k57L12P36
2904H65k63j041K97R71J83j113r3O72L68m76l38l64O10O90p00r55L20J181J95
$$ plain form
2923 1009 -346 -846 160 1226 638 -494 -726 715 913 -128 -637 -281 360 369 -660 -933 -88 732
2941 732 175 -1023 -385 665 772 -589 -779 -272 477 218 -716 -757 214 641 -7 -393 -542 341 189
2960 189 -472 -755 -1 330 -347 -855 -256 158 3 -650 -444 -126 346 -449 -262 126 287 -100 -526 -371
2980 -371 410 613 -71 -895 -411 802 375 -947 -807 430 699 12 -870 -56 1033 546 -126 -599 518
2999 518 1026 290 -489 -441 779 1146 -119 -924 189 1042 277 -430 -764 470 1097 21 -669 -334 450
3018 450 1093 -250 -1014 -83 890 432 -974 -766 369 883 103 -737 -271 615 354 -482 -361 -93 159
3037 159 121 -469 -368 139 570 -120 -359 -204 221 30 -390 -333 531 178 -499 23 673 -163 -784 -358 -41
3058 -41 329 133 -261 -284 -40 480 -213 -583 -171 649 601 -582 -888 359 1035 -259 -846 -136 663 400
$$ packed form
2923A009j355n00J006J066n88j132k32J441J98j041n09L56O41Rj029k73Q45Q20
2941G32n57j198O38J050J07j361j90N07P49k59r34m1R71M27o48l86j49Q83j52
2960A89o61k83P54L31o77n08N99M14j55o53K06L18M72p95J87L88J61l87m26J55
2980c71P81K03o84q24M84J213m27j322J40J237K69o87q82Q14J089m87o72m73J117
2999E18N08p36p79M8J220L67j265q05J113Q53p65p07l34J234O27j076o90L35P84
3018D50O43j343p64R31R73m58j406K08J135N14p80q40M66Q86k61q36J21K68K52
3037A59l8n90J01N07M31o90k39J55M25j91m20N7Q64l53o77N22O50q36o21M26L17
3058d1L70j96l94k3K44N20o93l70M12Q20m8j183l06J247O76j294n87P10P99k63
$$ plain form
3078 400 -238 -531 -93 609 286 -698 -885 321 1044 -120 -755 -498 1047 520 -833 -725 238 625 2
3097 2 -550 -455 80 392 236 -653 -705 480 739 -341 -605 397 290 -41 -850 88 571 465 -67 -336
3117 -336 242 -49 23 398 144 124 -49 -31 -93 277 548 -153 -36 359 400 14 -476 47 599 550 -455 -200
3139 -200 453 724 210 -631 55 191 479 135 -642 -175 563 379 -1088 -677 380 584 -319 -1013 -288
3158 -288 240 269 -514 -873 -423 240 -14 -233 -560 -32 330 -201 -909 -456 486 360 -704 -706 158 250 53
3179 53 -108 -40 -112 92 94 196 -189 332 8 -148 12 437 240 148 -150 589 506 -59 -471 382 846 -164
3201 -164 -9 26 350 422 -224 -214 328 312 231 -42 -450 303 791 221 -851 -118 1117 594 -229 -454 287
3222 287 547 -74 -390 -251 326 354 -137 -790 -63 856 584 -152 -439 -73 810 177 -691 -346 301 127
$$ packed form
3078D00o38k93M38P02l23r84j87J206P23j164o35K57J545n27j353J08R63L87o23
3097Bn52R5N35L12j56q89n2J185K59j080k64J002j07l31q09R38M83j06n32k69
3117c36N78k91P2L75k54k0j73J8o2L70K71p01J17L95M1l86m90N23N52m9j005K55
3139b00O53K71n14q41O86J36K88l44p77M67P38j84j467M11J057K04r03o94P25
3158b88N28K9p83l59M50O63k54k19l27N28L62n31p08M53R42j26j064kQ64R2j97
3179E3j61O8p2K04KJ02l85N21l24j56J60M25j97r2k98P39q3n65m12Q53M64j010
3201a64J55L5L24P2o46J0N42j6q1k73m08P53M88n70j072P33J235n23q23k25P41
3222B87K60o21l16J39N77K8m91o53P27R19k72p36k87L66Q83o33q68L45O47j74
$$ plain form
3242 127 -376 -332 77 334 173 -307 -534 -56 251 -259 -674 -236 136 181 -569 -740 243 271 -643 -584 91
3263 91 232 -359 -671 -291 126 -74 -394 -253 -283 312 334 -247 -367 112 393 -29 -555 107 881 295 -263
3284 -263 75 274 646 -109 -335 -105 607 509 -107 -446 108 1053 663 -340 -174 529 986 -10 -313 572
3304 572 747 195 -241 109 399 672 404 -129 -437 348 723 -56 -658 -164 376 -249 -396 -484 547 81
3324 81 -476 -521 182 -51 -555 -352 -332 -23 -23 -170 -644 -225 168 -197 -373 -602 206 387 -610 -887 -247 420
3346 420 -166 -839 -498 30 150 -325 -511 -456 148 282 -643 -672 127 529 78 -523 150 612 279 -529 -413
3367 -413 373 635 322 19 -63 308 348 284 -31 77 103 547 34 -365 399 551 4 -276 250 496 126
3388 126 -147 -160 178 333 166 160 229 292 187 209 -62 2 428 -88 -379 -86 494 182 -604 -200 359 498
$$ packed form
3242A27n03M4M09K57j61m80k27M78L07n10m15M38L72M5p50j71R83K8r14N9O75
3263I1J41n91l12L80M17k00l20J41l0N95K2n81j20M79K81m22n26O62P74n86n58
3284b63L38J99L72p55k26K30P12r8o16l39N54R45l90j003J66P03M57r96l03Q85
3304E72J75n52m36L50K90K73k68n33l08P85L75p79o02M94N40o25j47q8J031m66
3324H1n57m5P03k33n04K03K0L09%j47m74M19L93l65j76k29Q08J81r97k77O40O67
3346D20n86o73L41N28J20m75j86N5O04J34r25k9P99M02m51o01O73M62l33q08J16
3367d13P86K62l13l03q2L71M0o4l15J08K6M44n13l99P64J52n47k80N26K46l70
3388A26k73j3L38J55j67oO9O3j05K2k71O4M26n16k91K93N80l12p86M04N59J39
$$ plain form
3410 498 -37 -67 -288 366 -128 -374 -237 -431 -158 -286 -550 -495 44 50 -296 -701 -607 -13 -44 -109 -318 -35
3432 -35 -135 -390 -418 -430 141 -123 -9 -235 -38 527 -267 -494 -128 134 310 -174 -105 154 339 109 216
3453 216 99 280 314 -97 503 161 318 120 -63 -8 298 279 176 64 85 537 181 -150 153 550 266
3474 266 -85 -106 188 435 499 164 -79 440 359 -236 -134 20 706 384 -281 -209 419 260 -254 -162 -143 305
3496 305 154 -328 -425 103 405 34 -246 -296 174 286 18 -294 -221 375 -108 -328 147 469 -191 -247 -103
3517 -103 -44 -76 -50 -476 -161 502 406 -651 -487 -173 -15 414 -217 -210 488 393 -76 -429 105 471 -48 -293
3539 -293 -537 18 611 49 -357 -73 437 732 107 -392 261 602 -73 -608 170 479 524 -436 -444 -10 450
3560 450 245 -312 -81 311 449 -97 -268 308 470 170 -148 -270 250 327 -290 -288 -16 577 131 -327 -348
$$ packed form
3410D98n35l0k21O54m94k46J37j94K73j28k64N5N39Ol46m05R4N94l1o5k09K83
3432c5j00k55k8j2N71k64J14k26J97N65p94k27L66K62J76m84O9K59J85k30J07
3453B16j17J81L4m11O00l42J57j98j83N5L06j9j03j12K1M52l56l31L03L97k84
3474B66l51k1K94K47O4l35k43N19q1n95J02J54O86l22o65P2O28j59n14R2J9M48
3496C05j51m82r7N28L02l71k80n0M70J12k68l12P3N96m83k20M75L22o60n6J44
3517a03N9l2K6m26L15O63r6j057J64L14J58M29o31PO98r5m69l53N34L66n19k45
3539b93k44N55N93n62m06K84N10K95o25m99O53L41o75n35P78L09M5r60qM34M60
3560D50k05n57K31L92J38n46j71N76J62l00l18j22N20P7o17KK72N93m46m58k1
$$ plain form
3581 -348 63 275 19 -372 -247 217 370 -302 -368 87 209 -34 -260 21 200 101 -232 -373 430 137 -255
3602 -255 -321 -255 -11 376 -110 -148 53 209 249 -323 -374 85 193 -172 -527 -174 710 372 -351 -453 308 385
3624 385 41 -295 51 39 263 -364 -597 202 275 18 -283 27 139 267 25 -180 -34 452 -58 -261 -196
3645 -196 39 269 -567 -12 20 131 -165 -208 -144 178 7 -166 -274 80 188 120 -50 -251 352 137 33
3666 33 -396 89 419 -64 -58 -42 211 622 -234 -329 -155 228 343 -128 -632 -113 102 17 -436 8 160 217
3688 217 47 -216 175 159 -23 -475 -200 417 533 48 -274 1 54 11 -305 -164 30 109 84 -538 172 310
3710 310 68 -406 -453 -42 246 -119 -464 -395 -20 22 -50 -279 -191 -93 -113 -253 -97 89 -247 -510 -285 97
3732 97 -152 -72 -273 -222 313 88 -206 -398 -223 221 229 -412 -536 261 188 -180 -290 334 10 536 -244 -300
$$ packed form
3581c48M11K12k56l91J25M64J53o72o6M55J22k43k26K81J79r9l33j41Q03k93l92
3602b55o6O6K44L87m86l8K01J56M0n72n1M59J08l65l55L53Q84l38p23j02P61P7
3624C85l44l36L46j2K24o27k33P99P3k57l01L10J12J28k42k05J46M86n10k03O5
3645a96K35K30q36N55L2J11k96m3O4L22j71j73j08L54J08o8j70k01O03k15j04
3666C3m29M85L30m83OJ6K53M11q56r5J74L83J15m71n04N19K15q5m53M44J52N7
3688B17j70k63L91j6j82m52K75O17J16m85l22K75N3m3l16J41J94P9k5o22P10J38
3710C10k42m74m7M11K88l65l45O9L75M2p2k29Q8R8k0j40J56J86l36k63K25L82
3732I7k49Q0k01N1N35k25k94j92J75M44Qo41j24P97p3l68j10O24l24N26p80n6
$$ plain form
3754 -300 69 293 -67 -137 222 92 385 146 -86 -36 425 194 -161 -63 561 281 9 -483 -171 393 11
3775 11 -25 48 135 166 -21 -59 -49 451 -51 -451 -300 131 -106 -129 -405 -62 317 -104 -140 -356 -13 280 -98
3798 -98 -294 211 -8 -91 36 -100 327 314 -145 -484 -173 599 35 -396 -442 90 286 -62 -500 -224 544
3819 544 77 -425 -113 -124 260 -188 -322 -296 408 483 193 -243 159 543 352 -158 -112 550 -22 190 -31
3840 -31 157 197 247 201 95 143 624 259 184 165 301 450 108 -246 281 306 148 -42 241 622 251 26 -180
3863 -180 273 458 -46 -310 -480 212 564 116 -265 149 487 -66 -480 -81 339 234 -459 -296 379 63
3883 63 84 -195 68 171 155 -56 -203 -469 337 173 -324 -282 339 410 -200 -327 -54 17 318 -328 -200 55
3905 55 192 87 -79 -60 -56 242 104 -143 -7 579 -35 -78 -148 374 233 23 51 81 453 114 -28 -24 217
$$ packed form
3754c00L69K24l60p0L59j30K93k39k32N0M61k31l55R8O24k80k72m92L12N64l82
3775A1l6P3Q7L1j87l8J0N00n02m00J51M31k37k3k76L43L79m21l6k16L43K93l78
3798i8j96N05k19q3J27j36M27j3m59l39L11P72n64m31m6N32J96l48m38K76P68
3819E44m67n02L12j1L84m48j34K6P04P5k90m36M02L84j91n10M6O62n72K12k21
3840c1J88M0N0m6j06M8M81l65p5j9J36J49l42l54N27K5j58j90K83L81l71k25k06
3863a80M53J85n04k64j70O92L52m48l81M14L38n53m14L99M20j05o93J63O75l16
3883F3K1k79K63J03j6k11j47k66Q06j64m97M2O21P1o10j27K73P1L01o46J28K55
3905E5J37j05j66J9MK98j38k47J36N86o14m3p0N22j41k10K8L0L72l39j42MK41
$$ plain form
3928 217 342 89 -247 -263 345 256 -243 -229 88 87 -128 -162 193 294 14 -120 -396 87 226 -25 -156 11
3950 11 -53 -72 111 -114 -49 286 215 -535 -249 634 320 -15 -450 -37 165 196 114 -377 -217 -117 346 -514
3972 -514 -469 158 -49 -172 -719 -107 146 -527 -316 -292 34 -191 -279 -73 -170 -156 -409 -267 -32 54 13 -274
3994 -274 -366 -76 158 -273 -221 -236 416 195 -7 -443 580 506 294 161 -36 293 86 334 64 -42 129
4015 129 240 90 -8 227 340 153 -431 -149 251 264 1 -153 48 -139 0 38 -44 -53 -190 15 -337 80
4037 80 504 55 -679 -33 90 301 -25 -56 -19 193 -3 27 210 352 -79 -274 -18 -110 333 116 -509 -92
4059 -92 210 319 -133 -374 -91 503 80 -422 196 188 -34 -363 -208 78 290 112 12 -405 113 321 -121
4080 -121 -669 -253 445 328 -242 -15 136 461 -100 -7 -27 269 70 -18 -329 85 105 163 -264 -141 330 498
$$ packed form
3928B17J25k53l36j6O08q9m99J4L17jk15l4L55J01k80j34k76M83J39k51j31J67
3950A1o4j9J83k25O5L35p1p50K86Q83l14l35m35M13K02L1q2m91J60J00M63q60
3972e14M5O27k07j23n47O12K53o73K11K4L26k25q8K06r7J4k53J42K35Q6m1k87
3994b74r2K90K34m31N2j5O52k21k02m36J023p4k12j33j97L29k07K48k70j06J71
4015A29J11j50r8K35J13j87n84K82M00J3k63j54K01j87J39L8q2rj37K05l52M17
4037H0M24m49p34O46J23K11l26l1L7K12j96L0J83J42m31j95K56r2M43k17o25M17
4059i2L02J09m52k41K83N94m23n02O18qk22l29J55K86K12j78j00m17N18K08m42
4080a21n48M16O98j17n70K27J51L25n61R3k0K96j99q8l11M14K0N8m27J23M71J68
$$ plain form
4102 498 -2 -256 293 173 4 -91 55 111 423 -46 -109 241 213 -140 -1 -45 41 129 -3 -241 -15 262
4124 262 96 -122 -282 371 312 -132 -203 240 490 -53 -56 90 326 218 285 -510 -375 16 434 -136 -462 -84
4146 -84 422 -147 -592 -75 376 269 -18 -100 -362 153 -28 -188 -21 35 258 122 -133 -43 445 51 -496
4167 -496 -73 373 404 -50 15 236 244 -22 116 -38 -88 441 -195 39 51 -15 214 183 -78 80 386 -272 -345
4190 -345 -320 346 206 -174 220 -195 -90 21 -162 -209 80 189 214 -309 60 245 33 -423 -274 346 366
4211 366 -152 88 357 72 393 -28 97 -92 242 368 -378 18 239 274 65 -81 -35 275 31 62 -92
4232 -92 257 115 -65 -391 -130 -107 -167 -99 -98 82 254 -121 -173 -4 409 212 -147 20 99 99 -47 -314 7
4255 7 -54 -45 29 -117 16 -184 235 -71 -374 263 14 -302 -445 -122 94 -62 -353 -238 -76 9 -146 -253
$$ packed form
4102D98n00k54N49j20j69r5J46N6L12m69o3L50k8l53J39m4Q6Q8j32k38K26K77
4124B62j66k18j60O53n9m44p1M43K50n43lJ46K36j08O7p95J35L91M18n70l26L78
4146h4N06n69m45N17M51j07k87q2k62N15j81j60J67N6K23j36k55R0M88l94n47
4167d96M23M46L1m54O5K21Qk66J38j54n0N29o36K34J2o6K29l1k61J58L06o58p3
4190c45K5O66j40l80L94m15J05J11j83m7K89J09K5n23L69J85k12m56J49O20K0
4211C66n18K40K69k85L21m21J25j89L34J26p46L96K21L5k09j46M6L10k44L1j54
4232i2L49j42j80l26K61K3o0O8JJ80J72l75n2J69M13j97l59J67P9%j46k67L21
4255Go1RP4j46J33k00M19l06l03O37k49l16j43L23K16j56k91J15J62Q5j55j07
$$ plain form
4277 -253 -254 94 -119 -304 24 70 136 115 -259 -168 33 339 -103 -324 301 -118 -35 -99 -202 233 -114 -198 -340
4300 -340 210 -44 -33 34 -91 -9 145 313 -328 -39 296 100 142 225 -68 260 -260 -17 231 47 24 -177
4322 -177 -19 297 108 -38 81 62 94 -165 -286 -172 316 289 -45 -122 111 93 211 -219 139 362 219 -160
4344 -160 -168 150 34 298 -20 -25 54 473 82 104 141 -101 -28 21 -219 -32 9 110 131 24 238 182 -96 -189
4368 -189 -163 156 32 -300 -139 1 130 12 222 -5 36 116 -38 21 248 267 -24 27 4 225 199 -465 -100
4391 -100 388 244 229 153 210 578 109 -208 180 287 385 91 8 -56 500 382 -252 -115 307 346 189 -10
4413 -10 15 181 69 -77 -41 -38 154 -282 -193 -12 -119 171 286 -240 -115 205 162 14 -380 -12 159 90 72
4436 72 4 199 29 -67 -294 -154 152 -219 -227 -179 137 -122 -107 -350 83 -15 -146 -164 254 222 -111 -10 89 154
$$ packed form
4277b53jL48k13j85L28M6O6k1l74R1K01L06m42k21O25m19Q3o4j03M35l47q4j42
4300c40N50k54J1O7j25Q2J54J68o41K89L35j96M2Q3k93L28n20K43K48j84k3k01
4322a77J58L16j89j46J19j9L2k59j21J14M88k7l34p7K33j8J18m30L58K23j43l79
4344a60qL18j16K64l18nP9M19l91K2L7k42P3M9k40J87M1J01K1j07K14n6k78r3
4368a89K6L19j24l32J61J40J29j18K10k27M1Q0j54N9K27J9k91N1k3K21k6o64L65
4391a00M88j44j5p6N7L68m69l17L88J07R8k94q3o4N56j18o34J37M22L9j57j99
4413a0K5J66j12j46L6LJ92m36Q9J81j07K90J15n26J25L20m3j48l94L68J71o9j8
4436G2o8J95j70r6k27J40L06l71qM8L16k59J5k43M33r8j31j8M18l2l33J01R9O5
$$ plain form
4460 154 183 -13 -161 -136 12 155 -200 -22 -69 471 185 -235 -146 116 118 289 -54 -163 161 -120 -2 -325
4482 -325 -73 366 84 -281 -5 32 -1 -173 56 164 262 96 -295 -393 387 42 -164 -174 89 5 215 -379
4504 -379 -407 -52 -62 -227 39 -141 -95 70 -77 -24 89 167 -46 -423 -76 95 77 -248 -302 -111 227 174 -373
4527 -373 -83 233 155 -260 -595 263 22 -133 -254 -213 24 35 60 -67 -61 -427 330 -127 -119 -298 60 -162 -23
4550 -23 18 147 234 -48 21 16 262 -271 -53 -50 167 178 -85 58 13 209 175 -188 -82 217 138 -102 -121 53
4574 53 512 -41 -225 142 121 -18 53 48 -52 166 185 -255 41 97 14 -91 -422 75 196 249 19 -252 -19
4597 -19 208 -268 -223 191 156 194 -314 -201 -13 36 -158 177 -231 228 26 138 -376 -193 260 1 -163 -55
4619 -55 -29 105 128 30 -123 187 35 -77 96 -133 -56 -41 -63 -66 78 24 27 -155 97 -148 -47 37 228 172 -213
$$ packed form
4460A54K9j96j48K5J48J43l55J78m7N40k86m20Q9K62KJ71l43j09L24k81J18l23
4482c25K52M39k82l65K76L7l3j72K29J08R8j66l91r8P80l45k06j0K63q4K10n94
4504c79k8L55j0j65K66j80M6J65j47N3J13P8k13l77L47J71j8l25n4J91L38n3n47
4527c73K90L16p8m15l35Q58k41j55j21M1K37J1K5j27Ol66P57m57Qj79L58k22J39
4550b3M1J29Q7k82O9nK46n33K18LK17J1k63J43m5J96l4l63J06K99p9k40j9J74
4574E3M59n53j84L67k1j39P1nj00K18J9m40K96N6q3j05l31M97J21N3k30k71K33
4597a9K27m76M5M14l5L8n08J13J88M9j94L35m08M59k02J12n14J83M53k59j64J08
4619e5K6J34K3r8j53L10j52j12J73k29P7J5k2lJ44n4Lj82K52k45J01Q4J91n6l85
$$ plain form
4644 -213 62 14 137 -79 46 209 -203 59 122 -127 -92 50 183 -41 -276 87 92 -160 -387 4 221 126
4666 126 335 -167 -133 396 86 -23 -220 -109 317 135 -545 -138 358 123 195 -305 -46 470 -110 -164 99
4687 99 -24 150 -217 -51 -9 -70 42 83 -138 64 -108 -13 -139 127 230 -164 -284 -56 260 17 -186 57
4709 57 177 -18 124 147 -19 3 18 483 19 11 -37 60 -174 -90 275 248 -37 -497 -213 278 317 -89 21 -100
4733 -100 -150 -16 -199 -419 73 243 -220 -309 -254 162 72 -140 -210 125 160 -103 228 179 163 221 194 52 -11 18
4757 18 -88 -168 -185 168 162 8 -154 -131 37 80 211 -85 -6 68 42 316 -90 23 201 219 41 111 411 -318
4781 -318 -289 45 456 233 -374 -14 -64 -35 25 -47 -29 -120 35 -300 4 -92 54 -238 -77 -175 242 140 -469
4804 -469 -125 193 376 67 -129 120 88 -45 -105 -41 209 287 -64 127 -236 32 287 -106 31 -157 -22
$$ packed form
4644b13K75m8J23k16J25J63m12K62O3k49L5J42J33k24k35L63Nk52k27L91K17r5
4666A26K09n02L4N29l10j09j97J11M26j82o80M07M96k35P2n00K59N16n80n4K63
4687I9j23J74l67J66M2o1J12M1k21K02j72R5j26K66J03l94j20K28L16k43k03K43
4709E7J20j95J42K3j66K2J5M65m64qm8R7k34Q4L65k7k85m60K84M91L9m06J10j21
4733a00n0J34j83k20M92J70m63q9N5M16r0k12p0L35L5k63L31m9j6N8k7j42o3K9
4757A8j06q0j7L53oj54j62K3J68M3J31k96P9P4k6K74m06J13J78J8j78P0L00p29
4781c18K9L34M11k23o07L60n0K9O0p2J8r1J55l35L04r6J46k92J61r8M17j02o09
4804d69L44L18J83l09j96K49l2j33o0O4K50P8l51J91l63K68K55l93J37j88J35
$$ plain form
4825 -22 110 -166 -204 -95 88 -281 -177 235 -42 -12 27 200 -235 -29 -79 161 -83 -36 390 -17 -23 127 151
4848 151 69 -48 122 355 320 116 -95 361 39 74 -109 142 13 5 125 -77 37 642 186 -525 113 33
4870 33 299 -207 -373 189 -76 4 -163 50 -71 68 328 -66 -228 32 166 46 -150 347 -20 215 98
4891 98 -231 175 95 -87 48 132 5 -112 -27 -245 -41 -93 -59 -349 -53 37 -197 -76 -197 91 -109 60
4913 60 -313 86 178 -89 -223 -109 -382 -143 218 -104 -144 -259 147 -156 12 -87 -103 112 -193 -77 -19 -169
4935 -169 -284 111 64 -122 12 -120 -245 242 83 -91 7 275 -216 47 -54 -93 245 -31 -316 -304 56
4956 56 405 74 -82 -380 170 25 -107 -61 -357 150 -45 -176 -64 22 115 10 -216 145 229 -82 -90 -164 217
4979 217 45 -103 -156 -227 126 43 9 -131 36 120 92 -426 -336 -85 -132 -298 -280 144 -6 -149 -90 9 85 83 -344
$$ packed form
4825b2J32k76l8J09J83l69J04M12k77L0L9J73m35K06n0K40k44M7M26m07oJ50K4
4848A51q2j17J70K33l5k04k11M56l22L5j83K51j29qJ20k02J14O05m56p11O38q0
4870C3K66n06j66N62k65Q0j67K13j21J39K60l94j62K60J34j20j96M97l67K35j17
4891I8l29M06q0j82J35Q4j27j17Q5k18K04n2L4k90K96R0k34J21j21K88k00J69
4913F0l73L99R2k67j34J14k73K39L61l22m0j15M06l03J68r9j6K15l05J16N8j50
4935a69j15L95m7j86J34j32j25M87j59j74R8K68m91K63j01l9L38k76k85J2L60
4956E6L49l31j56k98N50j45j32M6k96N07j95j31J12Q6R3j05k26L61Q4l11qp4L81
4979B17j72j48n3p1L53q3l4j40J67Q4k8n18R0K51m7j66J8M24j50j43N9R9P6km27
$$ plain form
5004 -344 18 -153 128 227 -60 68 114 35 -176 -421 12 77 294 12 49 238 428 -153 82 189 -22 -25
5026 -25 -118 -49 188 24 172 17 224 210 251 -142 -88 116 17 12 -373 222 192 184 -51 -114 374 448 149 -76 -82
5051 -82 346 111 -243 -142 -152 -16 36 -106 -287 255 330 -57 146 312 149 72 -109 94 172 -203 186 -289
5073 -289 -260 -209 230 97 40 126 -84 -135 104 248 142 215 189 -28 43 -437 -31 81 51 -37 178 -153 141
5096 141 155 -66 -4 -150 -143 -57 170 321 -146 -59 192 -34 -76 -98 31 57 111 -162 266 165 145 -111 175 14
5120 14 214 211 -331 4 174 251 -73 3 -138 159 321 -87 -1 -107 263 -103 -367 -314 -201 38 21 -110 52
5143 52 -16 -78 137 -434 -130 104 344 12 -107 192 137 -13 -418 -133 102 28 -269 -260 -58 -101 -31 -88 33
5166 33 -31 -223 -44 -140 69 120 42 -25 -2 -15 12 -148 213 154 -99 55 -50 -38 80 -80 119 -87 22 11
$$ packed form
5004c44L62j71K81R9k87J28M6p9k11k45M33O5K17k82L7J89J90n81K35J07k11l
5026b5r3O9K37j64J48j55K07j4M1l93N4K04r9nl85N95l0qk35o3M88P4k99k25o
5051h2M28k35l54J01j0J36N2j42j81N42P5l87K03J66j63p7j81K03P8l75L89m75
5073b89K9N1M39j33n7Q6k10n1K39J44j06P3k6k17P1m80M06J12l0q8K15l31K94
5096A41J4k21O2j46PQ6K27J51m67Q7K51k26m2k2J29K6N4k73M28j01k0k56K86j61
5120A4K00ln42L35J70P7l24P6j41K97J62m08Q6j06L70l66k64N3J13K39j7j31J62
5143E2o8o2K15n71L04K34K40l32j19K99n5j50m05K85K35p4k97RK02m3P0n7J21
5166C3o4j92J79r6K09N1p8o7K3j3K7j60L61n9k53J54j05J2J18j60J99k06J09j1
$$ plain form
5190 11 -150 7 30 292 -36 -234 -106 -154 249 75 -285 -67 -6 48 -66 -424 56 163 -63 68 24 88
5212 88 69 -56 245 -95 231 240 85 -4 307 168 -13 52 91 190 122 146 13 119 98 -22 1 -138 -84 -102 28
$$ packed form
5190A1j61J57K3K62l28j98J28m8M03j74l60K18O1N4j14l58M80J07k26J31m4O4
5212H8j9j25L01l40L26Rj55q9L11j39j81O5L9R9o8K4j33J06k1j20K3j39N4j8J30
$$ [...]
8191A16
##END NTUPLES=NMR FID
##END=
