##TITLE=1H_CG-1120-ao
 DMSO, 8 sc, 
 25.9.2019
##JCAMPDX= 6.0         $$ Bruker NMR JCAMP-DX V2.0
##DATA TYPE= NMR FID
##DATA CLASS= NTUPLES
##ORIGIN= UXNMR, Bruker Analytische Messtechnik GmbH
##OWNER= root
$$ XWIN-NMR		Version 3.5
$$ Wed Sep 25 14:14:10 2019 Russian Standard Time (UT+4h)  she@DPX200
##.OBSERVE FREQUENCY= 200.1315
##.OBSERVE NUCLEUS= ^1H
##.DELAY= (6, 6)
##.ACQUISITION MODE= SIMULTANEOUS
##.ACQUISITION SCHEME= undefined
##.AVERAGES= 8
##.DIGITISER RES= 18
##SPECTROMETER/DATA SYSTEM= spect
##.PULSE SEQUENCE= zg30
##.SOLVENT NAME= DMSO
##.SHIFT REFERENCE= (INTERNAL, DMSO, 0, 15.7039)
##AUDIT TRAIL= $$ (NUMBER, WHEN, WHO, WHERE, WHAT)
$$ ##TITLE= Audit trail, XWIN-NMR		Version 3.5
$$ ##JCAMPDX= 5.01
$$ ##ORIGIN= Bruker BioSpin GmbH
$$ ##OWNER= she
$$ F:/spectra/data/she/nmr/H-F/1/audita.txt
$$ ##AUDIT TRAIL=  $$ (NUMBER, WHEN, WHO, WHERE, WHAT)
(   1,<2019-09-25 14:13:16.60 +0400>,<she>,<DPX200>,
      <created by zg, POWCHK disabled, PULCHK disabled
       configuration hash MD5:
       00 E9 B6 7A A2 85 ED C7 34 08 36 98 17 FE 4E 26
       data hash MD5: 16K
       E0 66 CB DD 50 86 7C 2C D4 04 A3 C8 65 C5 39 18>)
$$ ##END=
$$ 
$$ hash MD5
$$ B1 82 07 AE 85 DC C5 50 D0 0A 44 2A F1 C3 B1 B5
##$RELAX= 
##$RELAX= 
##$RELAX= 
##$RELAX= 
##$RELAX= 
##$RELAX= 
$$ Bruker specific parameters
$$ --------------------------
##$DU= <F:/spectra>
##$EXPNO= 1
##$NAME= <H-F>
##$PROCNO= 1
##$TYPE= <nmr>
##$USER= <she>
##$AMP= (0..31)
100 100 100 100 100 100 100 100 100 100 100 100 100 100 100 100 100 100 
100 100 100 100 100 100 100 100 100 100 100 100 100 100 
##$AQSEQ= 0
##$AQ_mod= 1
##$AUNM= <au_zg>
##$AUTOPOS= <>
##$BF1= 200.13
##$BF2= 200.13
##$BF3= 200.13
##$BF4= 200.13
##$BF5= 200.13
##$BF6= 200.13
##$BF7= 200.13
##$BF8= 200.13
##$BYTORDA= 1
##$CFDGTYP= 0
##$CFRGTYP= 5
##$CHEMSTR= <none>
##$CNST= (0..31)
1 1 145 1 1 1 1 1 1 1 1 1 1 1 1 1 1 1 1 1 1 1 1 1 1 1 1 1 1 1 1 1 
##$CPDPRG= <>
##$CPDPRG1= <>
##$CPDPRG2= <>
##$CPDPRG3= <>
##$CPDPRG4= <mlev>
##$CPDPRG5= <mlev>
##$CPDPRG6= <mlev>
##$CPDPRG7= <mlev>
##$CPDPRG8= <mlev>
##$CPDPRGB= <>
##$CPDPRGT= <>
##$D= (0..31)
0 1.2 0 0 0 0 0 0 0 0.06 0 0.03 0 0 0 0 0.0002 0 0 0 0 0 0 0 0 0 0 0 0 
0 0 0 
##$DATE= 1569406395
##$DBL= (0..7)
120 120 120 120 120 120 120 120 
##$DBP= (0..7)
150 150 150 150 150 150 150 150 
##$DBP07= 0
##$DBPNAM0= <>
##$DBPNAM1= <>
##$DBPNAM2= <>
##$DBPNAM3= <>
##$DBPNAM4= <>
##$DBPNAM5= <>
##$DBPNAM6= <>
##$DBPNAM7= <>
##$DBPOAL= (0..7)
0.5 0.5 0.5 0.5 0.5 0.5 0.5 0.5 
##$DBPOFFS= (0..7)
0 0 0 0 0 0 0 0 
##$DE= 6
##$DECBNUC= <off>
##$DECIM= 24
##$DECNUC= <off>
##$DECSTAT= 4
##$DIGMOD= 1
##$DIGTYP= 9
##$DL= (0..7)
0 120 120 120 120 120 120 120 
##$DP= (0..7)
150 150 150 150 150 150 150 150 
##$DP07= 0
##$DPNAME0= <>
##$DPNAME1= <>
##$DPNAME2= <>
##$DPNAME3= <>
##$DPNAME4= <>
##$DPNAME5= <>
##$DPNAME6= <>
##$DPNAME7= <>
##$DPOAL= (0..7)
0.5 0.5 0.5 0.5 0.5 0.5 0.5 0.5 
##$DPOFFS= (0..7)
0 0 0 0 0 0 0 0 
##$DQDMODE= 0
##$DR= 18
##$DS= 0
##$DSLIST= <SSSSSSSSSSSSSSS>
$$ [...]
##$SUBNAM2= <"">
##$SUBNAM3= <"">
##$SUBNAM4= <"">
##$SUBNAM5= <"">
##$SUBNAM6= <"">
##$SUBNAM7= <"">
##$SUBNAM8= <"">
##$SUBNAM9= <"">
##$SW= 24.0689530833862
##$SWIBOX= (0..15)
0 0 2 0 0 0 0 0 0 0 0 0 0 0 0 0 
##$SW_h= 4816.95568400771
##$TD= 16384
##$TD0= 1
##$TE= 0
##$TE2= 300
##$TE3= 300
##$TEG= 300
##$TL= (0..7)
0 120 120 120 120 120 120 120 
##$TP= (0..7)
150 150 150 150 150 150 150 150 
##$TP07= 0
##$TPNAME0= <>
##$TPNAME1= <>
##$TPNAME2= <>
##$TPNAME3= <>
##$TPNAME4= <>
##$TPNAME5= <>
##$TPNAME6= <>
##$TPNAME7= <>
##$TPOAL= (0..7)
0.5 0.5 0.5 0.5 0.5 0.5 0.5 0.5 
##$TPOFFS= (0..7)
0 0 0 0 0 0 0 0 
##$TUNHIN= 0
##$TUNHOUT= 0
##$TUNXOUT= 0
##$USERA1= <user>
##$USERA2= <user>
##$USERA3= <user>
##$USERA4= <user>
##$USERA5= <user>
##$V9= 5
##$VALIST= <valist>
##$VCLIST= <CCCCCCCCCCCCCCC>
##$VD= 0
##$VDLIST= <DDDDDDDDDDDDDDD>
##$VPLIST= <PPPPPPPPPPPPPPP>
##$VTLIST= <TTTTTTTTTTTTTTT>
##$WBST= 1024
##$WBSW= 4
##$XGAIN= (0..3)
0 0 0 0 
##$XL= 0
##$YL= 0
##$YMAX_a= 200949
##$YMIN_a= -258659
##$ZGOPTNS= <>
##$ZL1= 120
##$ZL2= 120
##$ZL3= 120
##$ZL4= 120
##$ABSF1= 10
##$ABSF2= 0
##$ABSG= 5
##$ABSL= 3
##$ALPHA= 0
##$AQORDER= 0
##$ASSFAC= 0
##$ASSFACI= 0
##$ASSFACX= 0
##$ASSWID= 0
##$AUNMP= <proc_1d>
##$AZFE= 0.1
##$AZFW= 0.1
##$BCFW= 1
##$BC_mod= 2
##$BYTORDP= 1
##$COROFFS= 0
##$CY= 11.3945322036743
##$DATMOD= 1
##$DC= 2
##$DFILT= <>
##$DTYPP= 0
##$F1P= 20.1720416913024
##$F2P= 0.152960286110954
##$FCOR= 0.5
##$FTSIZE= 0
##$FT_mod= 4
##$GAMMA= 1
##$GB= 0.15
##$INTBC= 1
##$INTSCL= 1
##$ISEN= 128
##$LB= 0.24
##$LEV0= 0
##$LPBIN= 0
##$MAXI= 10000
##$MC2= 0
##$MEAN= 0
##$ME_mod= 0
##$MI= 1.114404
##$NCOEF= 0
##$NC_proc= 0
##$NLEV= 6
##$NOISF1= 3.799351
##$NOISF2= 2.8
##$NSP= 1
##$NTH_PI= 0
##$NZP= 0
##$OFFSET= 15.70392
##$PC= 1
##$PHC0= -9579.938
##$PHC1= 25.60095
##$PH_mod= 1
##$PKNL= yes
##$PPARMOD= 0
##$PSCAL= 0
##$PSIGN= 0
##$REVERSE= no
##$SF= 200.130013532006
##$SI= 16384
##$SIGF1= 3
##$SIGF2= 2
##$SINO= 400
##$SIOLD= 16384
##$SREGLST= <1H.CDCl3>
##$SSB= 0
##$STSI= 0
##$STSR= 0
##$SW_p= 3612.71676300578
##$SYMM= 0
##$S_DEV= 0
##$TDeff= 0
##$TDoff= 0
##$TI= <>
##$TILT= no
##$TM1= 0
##$TM2= 0
##$TOPLEV= 0
##$USERP1= <user>
##$USERP2= <user>
##$USERP3= <user>
##$USERP4= <user>
##$USERP5= <user>
##$WDW= 1
##$XDIM= 8192
##$YMAX_p= 0
##$YMIN_p= 0
$$ End of Bruker specific parameters
$$ ---------------------------------
##NTUPLES= NMR FID
##VAR_NAME=  TIME,          FID/REAL,        FID/IMAG
##SYMBOL=    X,             R,               I
##VAR_TYPE=  INDEPENDENT,   DEPENDENT,       DEPENDENT
##VAR_FORM=  AFFN,          ASDF,            ASDF
##VAR_DIM=   8192,          8192,            8192
##UNITS=     SECONDS,       ARBITRARY UNITS, ARBITRARY UNITS
##FACTOR=    0.0002076,     1,               1
##FIRST=     0,             0,               0
##LAST=      1.7004516,     0,               0
##MIN=       0,             -258659,         0
##MAX=       1.7004516,     200949,          0
$$ Real data points
##PAGE= N=1
##DATA TABLE= (X++(R..R)), XYDATA
$$ [...]
1786a393R72J306j07j234o92J402R51q33j278L70J545K57j522n47J201J201q85
1803G14j187K07J400Q0r70q13P52J154m09j187l21J376P05j435r12O06J437l90
1821H07j470j53J153N93r14j037M44R33mj146n35R31J045n96j368J54J392K33
1839D62j212p19P18J297o61j205J11J256N20j181n20O63Q82Pj246q0J020O26q04
1858f6q46K59J423n7j392j24J114P02q80r99L79J235J91j167n23P47R90k38j276
1877e28K05Q92N57j202p01P82J164m55j149p6J077N71r15p89L64J125j84r10o30
1896h02R16Q58p08j281L47J432Q7j352n72J124P79n69j268J42J306L39j184r07
1914a313Q23J086l67j213K6J097P57j140j162Q64J169k03j082k57J268N09j022
$$ plain form
1786 -1393 -421 885 778 -456 -1148 254 1205 372 -906 -536 1009 1266 -256 -803 398 1599 714
1803 714 -473 -266 1134 1214 244 -569 183 1337 928 -259 -580 796 1501 66 -846 -240 1197 807
1821 807 -663 -816 337 930 16 -1021 -577 356 352 -794 -1329 -398 647 51 -1317 -1163 229 462
1839 462 -750 -1469 -751 546 -115 -1320 -1209 47 567 -614 -1134 -471 411 418 -828 -908 112 738 -66
1858 -66 -912 -653 770 713 -679 -803 311 1013 133 -866 -487 748 939 -228 -751 -4 986 748 -528
1877 -528 -323 569 1126 -76 -777 5 1169 714 -435 -511 566 1137 222 -567 -203 922 738 -172 -802
1896 -802 114 972 264 -1017 -670 762 849 -503 -1075 49 828 259 -1009 -867 439 778 -406 -1313
1914 -1313 -490 596 229 -984 -958 139 896 -244 -1406 -542 627 424 -658 -915 353 862 -160
1931a60q71M07J231L96j534m09R20Q67l54j394K10J229M05r73q23O88J087m12
1949E10j015l34J048R84j101r86P20R48P7j317n41J151Q00m36j457O98J024Mr87
1968b10n57Q24R27m36j263K55J231L22j246q48P24J195k78j372L2J197M95j145
1986a53r95R88J023r7j276j60R07P36m85j322K33J131M19j287p46R42J078m84
2004D52j141j29J269M73j064p31P18P08o8j044l81J075N61o43j054M06J071J66
2022F44j134m80Q21P87n89q96K05J041K73r53n73O45O76l68p32MR55L43q15l00
2042d46K90Q77k47r66J8M64O99m64o98L89R34q6j153R9P40L04n38p17O25P81l9
2063H66j050l82P94O08l97q95K62R78J84j066o13O07Q79m12j026j5J032N05q20
$$ plain form
1931 -160 -1031 -624 607 1003 -531 -940 -20 847 493 -901 -691 538 943 -30 -853 -165 922 510
1949 510 -505 -839 209 1193 92 -894 -174 774 851 -466 -1007 144 944 508 -949 -251 773 777 -210
1968 -210 -767 57 984 548 -715 -460 771 1093 -153 -1001 -277 918 640 -732 -700 497 992 -153
1986 -153 -1148 -160 863 766 -510 -670 237 973 488 -834 -601 530 949 -338 -1084 -142 936 452
2004 452 -689 -818 451 924 -140 -871 -153 555 487 -557 -938 137 698 55 -999 -593 478 644
2022 644 -490 -970 -149 638 49 -847 -642 399 672 -281 -854 -209 467 99 -633 -629 326 669 -146 -446
2042 -446 -156 721 474 -492 -474 -10 689 225 -473 -84 850 764 -389 -290 450 754 216 -501 124 905 866
2063 866 -184 -566 228 836 439 -456 -194 784 968 -98 -711 -104 775 363 -663 -678 354 859 39
2082C9p43N74R66p29n72l33P88O55o34q86J34J080L66j161p33P66R95m50j093
2101i71J0R25N69q24o58M69R92l56q70o5Q06M71n45o96K60J126l59p99J05O94
2121B84L28n31n20L95P86nr60k68Q57O36o23r25O30Q51j15q03m33O79P54n07r98
2142d88L67R70L2p94p47Q33Q14k45j248Q7J060L90r66j056N89J247j55j351l38
2161i99J004J005r18r72O9J111M93j201q50P58R38j11j421r8J126N81q03q77N25
2180f40R87O4j225l17Q40Q27n32q25K04P12N59p63o21L53J197m75p40J05Q93R5
2200F98o99m67O72N57k98n58N0N31L33o66k80K81O45j5p46J3N83M69q84o53P12
2221B78O27j92j114K9P37M98n79p35J66Q11J11q58n37O02R90p39j157J14J428
$$ plain form
2082 39 -704 -130 836 107 -465 -798 -10 645 11 -875 -741 339 705 -456 -1189 -423 572 122 -971
2101 -971 -961 -36 533 -291 -949 -480 512 156 -714 -779 27 498 -47 -743 -483 643 284 -515 -410 284
2121 284 612 81 -439 -44 742 737 -223 -491 366 1002 379 -546 84 935 820 17 -416 263 1017 510 -488
2142 -488 -121 849 881 87 -660 173 987 742 -506 -419 641 1031 65 -991 -402 845 690 -661 -999
2161 -999 5 1010 92 -880 -811 300 793 -408 -1258 -500 438 327 -1094 -1192 -66 515 -288 -1165 -640
2180 -640 347 411 -814 -1131 -291 536 4 -821 -617 95 654 -109 -730 -377 820 345 -395 -290 603 698
2200 698 -1 -468 204 761 463 -95 -45 486 819 153 -127 154 799 784 38 51 634 1103 219 -434 278
2221 278 905 713 -401 -372 365 863 284 -451 -285 526 637 -221 -758 -156 834 95 -1062 -948 480
2240D80j07j001m26O03Q30q0j046m79J053O23l96j087K13P69N54j009o26O53R56
2259D77l83j030J20Q63M11o46n34L61P91m1m57l27N24M08k00n97P4P93J96p52
2279E1k29N84K61l47k04J55L22k13q4k45L74K51l17l32K78L23J16q72j06O41R9
2300E06l97o97N33O10j76r52l4P11N15n10r07j7J057J42o89q25O24J108l17j290
2320a005K3Q30Q00r59p18L35J029P6q77o15O67P57l4r85l70R96P78o74j101P69
2340b78Q76j99p57k80O80P13n43q08L65N36J82k65m72K57P12j16o70l8O05L93
2360H93r01k35N19L61k04n54LO78j34l65M5J17L57l98o45K75M28J61l09o36N71
2381B7O33l91r06J67O58K74p04q30R97P95m91j096J7R01O26o69r00N7J345O7j018
$$ plain form
2240 480 373 -628 -1054 -451 379 299 -747 -1226 -173 450 54 -1033 -820 -51 503 -506 -1132 -479 477
2259 477 94 -936 -816 47 458 -188 -722 -361 430 389 -68 -395 129 537 337 -260 -186 607 803 51
2279 51 -178 406 667 320 116 271 593 380 296 51 425 676 359 27 305 628 744 -128 -234 407 506
2300 506 109 -588 -55 555 379 -573 -607 104 619 109 -798 -815 242 384 -305 -1130 -506 602 285 -1005
2320 -1005 -982 -152 648 -311 -1029 -694 335 411 -466 -1081 -414 343 309 -676 -1046 -50 728 54 -1047 -278
2340 -278 598 399 -358 -638 42 755 212 -596 -231 305 487 222 -250 7 719 603 -67 -105 500 893
2360 893 -8 -243 276 637 433 -121 -118 560 426 61 106 223 580 182 -463 -188 240 401 92 -544 27
2381 27 660 269 -637 -470 188 462 -242 -1072 -75 720 229 -867 -850 51 677 8 -892 -835 510 577 -441
2402d41q02Q77J233n60j159j43J264M34q46p09L58J000J84p47q62P81P90n4j277
2421f79J14R22L71o96o28M06N29K26o26j48M01L13j01m15k29L22M63l19m76L77
2441A27M61k57n01L92L01k48l31J01J15J89j67l11L5K44q7l79P1M98J4l17n99
2462f49M32P25j54q44j58Q90J95o44m80K35Q84O2r86k66O87N92j87j068j43J034
2482A57P01q37p82J77J237J80j103k90O20N27O2j193j34P89O45m99q34L51P15
2501D89K34r28l75N48P46o12n81M09K64J40k84k35j8N37j14m30L0K00K07l11j88
2522b72J62K71j40k13P8L14j6l43j9N90p6m94q5L39L09k01n26l3N02M87m99q51
2544g16L58Q81Pr60l24P83O81n76q14p2J071K16n11p34K63R76J94r20o64R06P11
$$ plain form
2402 -441 -1243 -366 867 307 -852 -995 269 703 -143 -852 -494 506 690 -57 -919 -138 652 598 -679
2421 -679 -565 357 728 32 -596 -190 339 565 -61 -209 192 505 404 -11 -240 82 545 226 -250 127
2441 127 588 331 -170 222 523 275 -56 45 160 349 182 -129 -94 150 63 -316 -245 253 267 -50 -649
2462 -649 -217 508 354 -490 -648 242 437 -207 -687 -452 432 494 -492 -758 -71 521 334 -734 -877 157
2482 157 858 21 -761 -584 653 833 -270 -560 60 587 649 -544 -678 111 756 257 -577 -226 489
2501 489 723 -205 -580 -32 714 102 -479 -70 194 334 50 -185 -203 334 220 -210 -180 20 227 -84 -272
2522 -272 -110 161 21 -192 -114 200 184 -159 -178 412 336 -158 -243 96 405 204 -322 -355 147 634 135 -716
2544 -716 -358 523 530 -430 -754 29 710 134 -680 -752 319 535 24 -710 -447 529 723 -197 -861 45 756
2565G56m21j081M8J119M25r16q12N76R25k0j094l94P78O87k07r92p3Q95K90p51
2585b62m80N57O64j53p39m1M46K41k50l03K9L57O7j13l56J97N48r0n63K18L19
2606B93qm39O7L52K25l55k88L58J67j85l81K2O00J57o14l54L69M81m6q00l6Q26
2628D11L59q54m92M33O35P4o97m29N61N99j75j005Q1R75K12p34q07L71J081j64
2648D35r03n04Q25O39k51q84j9P35L42m48p84L97O00K17p66m47N88P35l39p17
2668e49jO97J87n37l13L37L57J81o02K7K69J43j54p8l4L81J6k23n9J16J54j51
2690A64l2K06l8k44k01K47M10l58o8J21N7J41l84j52K20M40no90k68O21M11l98
2712B00m77LP43j8n53o15N79O42l88p89n4R47J54n15p64M85O81J60p68n87O70
$$ plain form
2565 756 335 -746 -698 421 846 -70 -882 -306 619 599 -495 -889 -111 576 369 -623 -696 199 489 -262
2585 -262 -742 -185 479 326 -413 -454 -8 233 -17 -320 -291 66 133 20 -336 -139 409 319 -244 -26 293
2606 293 285 -154 -87 265 490 135 -153 205 372 187 -194 -172 428 585 -29 -383 -14 467 421 -379 -415 411
2628 411 770 -84 -576 -143 492 566 -131 -560 1 600 425 -580 -499 476 688 -46 -853 -482 599 435
2648 435 -468 -972 -147 492 241 -643 -662 73 415 -33 -817 -420 180 397 -369 -816 -228 507 168 -549
2668 -549 -550 147 334 -203 -516 -179 178 359 -243 -216 53 196 42 -36 -70 311 327 104 45 161 315 164
2690 164 132 338 300 56 -145 102 512 154 86 207 264 405 21 -131 89 529 524 -166 -434 187 598 200
2712 200 -277 -274 469 451 -102 -717 -138 504 116 -673 -727 220 374 -141 -905 -420 261 421 -347 -934 -264
2733b64P84m59n68l52P99N70p74m54l6Q70K79p59m72P03M56L5q40R5N07K92l96
2754A6j95P8L91j89j4j32N06n4l29j22Q3L72j81k6n3M10J9m90k53M12J96l16l41
2777b12K04O47j58m72nJ45L47k86k80l43Q05R4n70m58J87Q41j97o74j80N76M33
2798D44l52q94K37O56J80o87m83P11M17j11q23k2O88N17m91r82K63R38M3o96j65
2819f12L64P45j42p85k01P23M59m87m73L29M60N7o27l55P33K55lm94l9K61M15
2840E83l69j70J5K50j46O7k45K97Mj27l44L56J81j62j73O7K21J13l73j81J47J91
2862B02l5n66K56L57J5n24o3K66M07k81n48r0R21k23l25o24M37R33j99j015L1
2883f68O48N02n16o87L66N25K10o60m15M77M83L3p32k16P23L81k67n92K08O50
$$ plain form
2733 -264 520 61 -507 -859 -60 510 -264 -718 -754 116 395 -364 -836 -133 323 358 -482 -387 120 412 16
2754 16 -179 -101 290 101 87 -45 461 407 78 -44 39 411 230 204 151 561 580 90 -163 249 445 129 -212
2777 -212 -8 639 481 9 4 149 496 210 -70 -413 392 486 -84 -542 -355 486 289 -385 -565 11 444
2798 444 92 -802 -565 91 271 -416 -899 -188 229 118 -705 -727 -39 478 -13 -995 -732 206 249 -447 -612
2819 -612 -248 497 355 -430 -631 92 551 64 -409 -80 380 437 -190 -545 188 443 440 -54 -93 168 583
2840 583 214 44 59 309 163 230 -15 282 286 159 -185 171 352 190 17 84 305 418 45 -136 11 202
2862 202 167 -399 -143 214 229 -295 -358 -92 315 34 -514 -604 317 94 -231 -855 -418 515 316 -699 -668
2883 -668 -20 482 -34 -721 -355 170 380 -280 -695 -218 265 298 -434 -650 73 454 187 -405 -197 453
2903D53om59k90L93N30k27l77j31L01L09o33j34M57Q4P3k72L8P6J41j31k73J14
2925C6K26j45j76k6L83j83l37K73j27K20j08j03J7K33m7j01l04L96j7n2n80K26
2947b96M33L00n32n57M61P21l76o09L1L61M42k89m87r2Q50J60r32j59O58K85k72
2968A01o14l2O67K17n82j59K68M57n7l50m05O12L14k54l21j05O08O6m53l38M29
2989F9J52J30m68q0M69P2j01l50J65J84m4l73L2J85K48k29k95K29K26Rk80j16
3011a66L09J99k48k74L9M27k33l18j82N33J83l02l02K78L45O6p66q2P15J32k86
3032F7k52J11K38N7l17l90L44M75m6n32j95N89K02l11m72J00R88l25n87k43M72
3053b7M04j38m94j69O03K97m57m83J57O95m4n22j18M11M05m49m47LN28M1k34j40
$$ plain form
2903 453 447 -12 -302 91 621 394 17 -114 187 496 -137 -271 186 270 343 71 109 185 326 195 -78 36
2925 36 262 117 -59 -85 298 115 -222 51 -76 144 36 -67 -50 183 136 35 -269 127 110 58 -522 -296
2947 -296 137 437 -95 -652 -191 530 154 -455 -424 -63 379 90 -397 -489 361 521 -411 -570 88 373 101
2968 101 -513 -545 122 339 -243 -402 -134 323 266 -84 -489 123 437 183 -138 -243 365 431 -22 -360 69
2989 69 221 351 -117 -197 272 344 243 -107 58 242 198 -175 -143 42 290 61 -234 -5 221 230 -50 -166
3011 -166 143 342 94 -180 -141 286 53 -265 -447 86 269 -33 -335 -57 288 354 -412 -494 221 353 67
3032 67 -185 -74 164 221 -96 -486 -142 333 287 -245 -440 149 351 40 -432 -332 656 331 -256 -499 -27
3053 -27 377 239 -255 -424 179 476 19 -464 -307 388 344 -178 -296 115 520 71 -376 -373 155 196 -38 -178
3075a78K38J55K6m43q1M23L15l31l76L83K45l53j37j26M12o2j0j62J28K60k43
3096H3k27M8J93R0j70j08JK84J40o37P0N06j11k36k67J93N99m68k34K17K59k4
3118B01k21l15K82J85J92m23k94M43L12j60o41L13J78J32k30l26K13N61k71m76
3138c45J5K38N97l64l23j26L74K68n93j97M98K03j78n70L25N08j49m48m9K27J96
3159A07K2k96MM44J22k96j62J68K73j04m45l9M87mk20o1R9P6j46l3k14K62M35
3182D79l25k89J77K06j92j90O1K33J69j23l44R2K97Ml73l87L77L76r8m11M9J00
3204a12K80k28k45M3N58j73l58l48P85lk97l77p9N17J27j84k74Q7L64J2n06j54
3226e65N81K50k49k30K3N85j44n49J04K70K23k40k75J00N01j84j89j13L03K91
$$ plain form
3075 -178 60 215 241 -202 -283 140 455 124 -252 131 376 23 -114 -240 172 110 100 -62 66 326 83
3096 83 -144 -96 97 187 17 -91 -90 194 334 -303 -233 273 162 -74 -341 -148 451 -17 -251 -34 225 201
3118 201 -20 -335 -53 132 324 -99 -393 50 362 202 -439 -126 52 184 -46 -372 -159 402 131 -345
3138 -345 -330 -92 505 141 -182 -308 66 334 -259 -456 42 245 67 -503 -178 330 181 -267 -316 -89 107
3159 107 129 -167 -163 281 403 107 -55 113 386 282 -163 -202 285 281 61 0 99 175 29 -4 -218 44 479
3182 479 154 -135 42 248 56 -134 -73 160 329 206 -138 -46 251 255 -118 -505 -128 248 150 -261 -212 -112
3204 -112 168 -60 -305 -262 296 123 -235 -583 202 199 -98 -475 -554 -37 90 -94 -368 -281 83 95 -411 -565
3226 -565 16 266 17 -213 -190 395 251 -298 -194 76 299 59 -216 -116 385 201 12 -101 202 493
3246D93l25k27K7K75J10m07j44L69M05j81n56Q4K88J20m37QQ5L30n3m90l4N53
3268B93L8l01l61R7O26j98m30j27K89K76k87k01MM89l9n05j5K25K79kn22KL88
3291A8P6k17k62L31K19l2m83j11L64K78l07j51K9M27l6q1l00K56J73j35l69J10
3313b03N54j49j74j52L65J79k11l81J28K63J65j08l67J66K39L2l45j60M88k50
3333G9k54j43K76M26r4m37O4M04ok85l8mk6J01k44j14L78l4N1k48oM68k38k6l87
3358c37K69K07j05l35N6K38J94m24j31N0L96j9m12k60O70J78l24k34K14M06k11
3379H6j37j21J29L54l74j1NK29K13l77k32L58L70j04m90J36L43j10l9l13L07L9
3401B61k49M0r7K81J53l76J1K7K77L1l71m40O19K47j57l81N9M18k21k50j72K57
$$ plain form
3246 493 168 -59 -32 243 353 -54 -198 171 576 395 -161 -77 211 331 -106 -98 -13 317 264 -226 -260 293
3268 293 331 30 -331 -234 392 194 -236 -363 -74 202 -85 -286 -282 207 168 -337 -352 -127 152 150 -372 -370 18
3291 18 94 -123 -385 -54 165 133 -350 -461 -97 181 -126 -277 -248 179 143 62 -238 18 191 56 -313 -203
3313 -203 351 202 28 -124 241 420 209 -172 -44 219 384 276 -91 75 314 346 1 -159 329 79
3333 79 -175 -318 -42 384 290 -147 -83 321 315 30 -8 -12 -38 63 -181 -295 83 49 100 -148 -154 314 76 50 -337
3358 -337 -68 139 34 -301 -245 -7 187 -237 -368 -318 78 59 -353 -613 57 235 -89 -323 -109 297 86
3379 86 -51 -172 -43 311 -63 -74 -69 160 373 -4 -236 122 492 388 -102 34 377 267 228 -85 222 261
3401 261 12 52 -45 236 389 13 24 51 328 359 -12 -452 167 414 257 -124 -65 353 132 -118 -290 -33
3423c3J56k07j50j1K56J28l33r2J00M16j27n82J64M32P1k26l81K93J51K1k38K
3445a90J11J53l4l57J22N2N66m66k99L97J07L6m25K15K85l7k24k04J22L27M8m42
3467a37lM44P1j58n06M11J39n1l24O4K17O8j50k11m0K92N0q9k41K03K98j97l19
3490a69l3K86K66l53k22J68L63j42l81J23J11K55k20l12J17J09K12k83J81J8J2
3511A06K4l31q9M40m3q5k39L7K26J31l37Q7K4jn2j10J1M74l18p1j66J48L38j35
3535F9l38J01M21r1j73k28L91n3k95j3J73J87J45m92J65j99M19N2j83k93L35J20
3557B20l68L7R3J04o8q6j45K34J75k37k09j6M85j21k5k37K42Oj56j94K11L4n9
3580h0m1O0n9K95j93j73J56L6L60o92j3L30K20l1j53q1K07jk02n8J13J48j53j73
$$ plain form
3423 -33 123 -84 -234 -245 11 139 -194 -286 -186 230 103 -479 -315 117 188 -38 -419 -126 25 46 -192 -190
3445 -190 -79 74 40 -317 -195 -143 423 -43 -342 55 162 198 -227 -12 273 236 12 -192 -70 257 305 -137
3467 -137 -140 304 375 217 -289 122 261 210 -114 -50 167 235 85 -126 -166 126 176 87 -154 49 347 150 -169
3490 -169 -202 84 350 -3 -225 -57 306 164 -217 -94 17 272 52 -260 -143 -34 178 -105 76 94 106
3511 106 130 -201 -290 150 107 22 -217 -180 46 177 -160 -73 -49 -50 -102 -212 -201 273 -45 -116 -282 -134 204 69
3535 69 -269 -168 253 162 -11 -239 152 99 -196 -209 -36 151 296 -196 -31 -230 189 241 58 -235 100 220
3557 220 -148 -111 -18 86 18 -68 -213 21 196 -41 -250 -266 219 98 73 -164 78 84 -72 -266 -55 -21 -80
3580 -80 -121 -61 -120 175 -18 -191 -35 1 361 -331 -344 -14 206 175 22 -59 148 147 -55 -113 0 148 -5 -178
3604a78k3J30L44m35j38Q2M54j20l45j72L69J5J53l95J03K85J00k18K0o4K14J0
3626A91k98R7K18K9k45j66j8M05J3m06l0K56J02n7l40J89K65j26j51j94L87J66
3648B87j96l35M6N71j11k15l75L93J30J16n38J79k5M99l18m72J63M04n4n9k05
3669a15K88K38j99l84Q4J49J0j77j98L12K47k37l67J32K97n7k17j66L24L75l86
3690d7j31j94M54J77k50l50M7K67K50k64k27L60J5K4k95Q6L55p5j90k84K80K13
3712B21l40J11o4OK47k98P3m1L17j15l62qL60j84kJ03j27J91J23k71k74N12K9
3735B07k45o2k8K56p0p3j34J25J36j90P3J7J10j86N2m6NP0N6j87P8P4Oj40j06
3760b02J63J11k2k63L24k08R2o4k15k9L18P2l75J9L34L8k12k2P6K54j20q9L7r
$$ plain form
3604 -178 -201 -71 273 -162 -300 -218 236 116 -229 -401 -32 -17 136 -259 -156 129 229 11 31 -33 181 191
3626 191 -107 -10 208 237 -8 -174 -192 213 226 -180 -210 46 148 91 -249 -60 205 79 -72 -266 121 287
3648 287 91 -244 -198 373 262 47 -328 65 195 311 -227 -48 -73 426 108 -364 -201 203 149 90 -115
3669 -115 173 411 212 -172 -88 61 71 -106 -304 8 255 18 -349 -217 80 23 -194 -360 -36 339 -47
3690 -47 -178 -372 82 259 9 -341 -294 -27 223 -41 -268 92 107 131 -164 -78 277 202 12 -272 8 221
3712 221 -119 -8 -72 -66 181 -117 -44 -85 232 117 -245 -253 107 -77 -79 24 -103 88 211 -60 -334 178 207
3735 207 -38 -100 -128 128 58 -15 -149 -24 112 -78 -5 12 122 -64 -12 -58 -53 17 73 -114 -36 38 44 -96 -202
3760 -202 -39 72 50 -213 111 -97 -5 -69 -284 -313 5 77 -298 -279 55 93 -119 -141 -65 189 69 -20 17 8
3784Hj2N4k62k6L78Pr3k45R8K78j5k29j24L55k5r8o1l8J85P4l06R9m0L16j37k85
3810a44KL29J06l44q4J83N4M3l38L26m4K53k18k81K15N2L5j22j14J63Q4n1l27
3833b22JM43j71k34o2K69J14k55r0J77Q3J26k40k58L44K95k89l49k9M50K31m78
3855a44n7J79J78j55j59k5M29J15l01k6N1lQ5ql65l1O12l32j97j3O03n3l16r2
3879b5M1K52k67K04n8J01j45J70l23R8O8J42j79k94L71L31k64m19K02K78Kk22
3901F4k49J79J82k33n2m1L17P4k92l30J83K71j03r0o8K31j9k97K5L07rj06j97
3924b53J75P8r1j44J97k39K86O8l9r0O0K07j26N5k20J75k8j00lK18K3q4j72J37
3948I0j43K58m5k46m5L16Q8k95j5R9J02Qk68N5J8J20q2m0L9J50j51j17O5l6K64
$$ plain form
3784 8 -4 50 -212 -238 140 147 54 -191 -93 185 170 -59 -183 172 147 49 -12 -50 135 209 -97 2 -38 278 141 -144
3810 -144 -142 187 293 -51 -135 48 102 145 -193 133 89 342 124 -157 58 110 145 23 -91 72 156 105 -222
3833 -222 -221 222 51 -183 -245 24 138 -117 -207 -30 53 179 -61 -319 25 320 31 -318 -347 103 334 -144
3855 -144 -201 -22 156 1 -158 -183 246 361 60 34 85 82 167 159 -206 -237 375 43 -154 -167 436 383 67 -25
3879 -25 16 268 1 205 147 248 103 273 -50 48 116 258 79 -215 156 487 223 -196 6 284 286 64
3901 64 -185 -6 176 -57 -109 -150 167 241 -51 -381 -198 73 -30 -120 -188 43 24 -273 -248 59 50 -56 -253
3924 -253 -78 0 -91 -235 -38 -277 9 77 38 -52 8 215 89 144 -76 99 71 -29 -32 186 209 125 -47 90
3948 90 -53 205 160 -86 -131 185 273 -22 -37 62 164 172 -96 -41 -23 97 15 -25 14 164 13 -104 -39 -75 189
3973A89k85N2J43K12l19k09K01K69k50j06R5j28Q7J28k69J10J33Jj35N2J4q2J84
3996H7m46K29N4J35j53j47K08J73l62N9n6M18o0m0l66J38K47l3l47R2L40J66l03
4019C3k60j2M05J15l52j42L14J45l99j49N3K51L56k17l09N8K66p2l06Q3K22J20
4041B03m90M1J34K77n4j97j17K44P6Q4l26q2L70j8k37n0J17L54j27j88k88M76
4063B02j28k34p9K01JJ57k03j48M13N7l49ok82L92M2r0j31k9L19k20r1P5L45j80
4087C4j7o0j2L07r3m23J06J83J78j67j98J32K29o4k44N1L65o7k29j12K7J22J97
4110B45n4m02J62K51k54k56J08J64K12j55k40M8L99j1j12l90M07j39q3J45k5J5
4132C5P4k18J8P9J89nl02k4K38K26k88j06L72r0k17j68R9J16P9j54k00K33K17
$$ plain form
3973 189 -96 -44 99 311 -8 -217 -16 253 3 -103 -8 -136 -49 79 -190 -80 53 54 -81 -29 -15 -97 87
3996 87 -359 -130 -76 59 -94 -241 -33 140 -222 -163 -219 199 139 99 -267 -129 118 85 -262 -170 170 336 33
4019 33 -227 -239 166 281 -71 -213 101 246 -153 -302 -249 2 358 141 -168 -110 156 84 -222 -139 83 203
4041 203 -287 -246 -112 165 111 -86 -203 41 117 201 -125 -207 163 145 -92 -142 -25 329 202 14 -274 202
4063 202 74 -160 -239 -38 -37 120 -83 -231 182 239 -110 -116 -398 -6 36 -54 -185 -214 105 -115 -206 -131 214 34
4087 34 17 -43 -55 252 159 -264 -158 25 203 36 -162 -30 199 135 -109 -58 307 240 11 -101 -74 48 245
4110 245 191 -211 -49 202 -52 -308 -200 -36 176 21 -219 -171 228 217 105 -285 122 -17 -100 45 20 35
4132 35 109 -109 -91 -12 177 172 -130 -154 84 310 22 -84 288 198 -19 -187 -88 28 107 -47 -247 -14 203
4155B03j43k43N8K02J80j70m19M40Nk93J45k11K39Q8j80L2o5L28k90j8J35j53
4177a30K24Ol58L8L52m7j82K4J89J16l24qo9J90j01O1n3j34K85K9n9k69K87J81
4201B48m11R1pL01j06o6k93J81L86l42Q1m8k1J51k0j70K0J89j96j0K6J35J4j81
4225d8j87K52K49k43j22RJ78m9p4j53K44n3j8j66J4K58Q3j34j48o1L75j41j51
4248h6j89K60J29n2m22K64L98k67l3k18K52O4j23k54j0%L62j60p6R9P0P5l07K08
4272a6L00m9l1m83J57K14j51P5k10J36J71o9p1j93M31j28o7j3N3J48k64J06j58
4295a12J75o4R6k52M4K64m4J0j95Q9K83j79q1k68J66J50r2j19J28J45j91j7l0
4318i4J10J68j05l16KK77j6l0j47K22O4j05j65J84q2Q0n0k16K14L17k20Jj51J42
$$ plain form
4155 203 60 -183 -125 77 257 87 -332 108 113 -180 -35 -246 -7 81 -99 -67 -132 196 -94 -112 23 -130
4177 -130 94 100 -258 -220 132 85 -97 -73 116 232 -92 -100 -169 21 -80 -19 -72 -206 79 108 49 -220 67 248
4201 248 -163 -72 -79 222 116 50 -243 -62 324 -18 63 15 -6 145 125 -45 -25 164 -32 -42 -16 119 133 -48
4225 -48 -235 17 266 23 -99 -90 88 39 -35 -188 56 3 -15 -181 -167 91 174 40 -108 -169 206 65 -86
4248 -86 -275 -15 114 62 -360 -96 302 35 2 -216 36 100 -23 -277 -287 -287 75 -85 -161 -62 8 83 -224 -16
4272 -16 284 235 204 -279 -122 92 -59 16 -194 -58 113 44 -27 -220 211 83 16 3 56 204 -60 46 -112
4295 -112 63 -1 95 -157 -113 151 107 117 -78 11 294 115 34 -234 -68 82 -10 -129 -1 144 -47 -64 -94
4318 -94 16 184 79 -237 -235 42 26 -4 -151 71 135 30 -135 49 -33 47 -3 -219 -5 312 92 93 -58 84
4342H4L7n9m26M50j03l8j83J02J21L14n5m25K62K3K00k03k22J28L04k96j4m1M8
4365HR6k08LK25J57j73q2J47j15K48k43q9q2J45K71k41Ok47K76Q0k75J85J18k33
4389b3N2j71L13j33O3j59M1N8j29L7L2J76q4J24k44o1J05L35k32j29N0L9p4j44
4413a58L3L16R3k45j13J0J26Q7k04l9J63n4j1m9r7K13M7p5k8m4K87j37m05J16
4437a68L60m9r5j60K62M3m6k90J9J67J42j58L3j5J65J02l00j17K71j15j50j2J27
4460A6L04k26p0j74k4L07n5l32R3K95j42k3l8q5K28j89k4J08j7O1p0j43J83J56
4484A39j22p4j02J93J24j83R3m8j07J24k04j1L00k5r3rL4R5J0k25m1M4J35J30
4508A77l14J54O2j01N4n5j03M20k13j54l8L04p7O6o8j22J46j57O6k14J82J54k42
$$ plain form
4342 84 121 62 -364 86 -17 -55 -238 -136 -15 299 244 -181 81 104 304 101 -121 7 311 15 1 -40 8
4365 8 104 -104 -101 124 281 108 26 173 58 306 63 -26 -108 37 308 67 73 -174 102 182 -93 92 210 -23
4389 -23 29 -142 171 38 101 -58 -17 41 -88 -51 -19 157 73 197 -47 -108 -3 332 100 -29 21 60 -14 -158
4413 -158 -125 191 284 39 -74 -64 62 149 -55 -94 69 15 4 -45 -142 71 118 43 15 -29 258 121 -284 -168
4437 -168 192 143 48 -112 150 193 147 -143 -124 43 185 27 60 45 210 312 12 -105 166 51 -99 -111 16
4460 16 320 94 24 -150 -174 133 78 -254 -161 134 -8 -31 -69 -154 74 -115 -139 -31 -48 13 -57 -200 -17 139
4484 139 17 -57 -159 34 158 -25 68 20 -87 37 -167 -178 122 97 4 -5 29 124 134 -91 -132 -88 47 177
4508 177 -137 17 79 -22 32 -23 -126 294 81 -73 -111 193 116 182 114 -8 138 -19 47 -167 15 169 -73
4531g3j66J22J10J23j28k27J58K77k94j25L26j23L9j86J0K24k52K89k13j49J03
4552a55K03l1k16L38j44Q8j58j77L98j97J07r3o3K22K7p6j59j17K62l5QN8p5R7
4576A12k78k5J56J86j57J61p2k19P1K0k48L84j2J2p0j16KL19r9l61K67N0j16k00
4600b33p5L01J41j38j88J69P6J2n5O1k81K58q6nj2K07l7l3k92K1K96l8n6j87K20
4625D6Nj37J09n2R0J69l18N5m0j95K59j26K8O9K02k44JJ71J56l62k8J57K4K7j31
4650f5Q4M4K70k35j8r6J61M1j28k88l7M05Qk57J09j35J72L5k67K58J9j19j13L3
4674a19J95p2K64m01%K72J44k41k13J37O3O3k18k1K03Q2k61R1r3J83J85j31k54
4697a42J15k3N0j55J9L19k87K14j48O6J07O4l63O0K50j18Om1j37L03j46r8N2O7
$$ plain form
4531 -73 -239 -117 -7 116 -12 -239 -81 196 -98 -223 103 -20 19 -167 -157 67 -185 104 -109 -258 -155
4552 -155 48 17 -199 139 -5 83 -75 -252 146 -51 56 -37 -100 122 149 73 -86 -203 59 24 32 90 15 112
4576 112 -166 -191 -35 151 -6 155 83 -136 -65 -45 -293 91 79 91 21 -95 -93 226 127 -234 33 83 -33 -233
4600 -233 -308 -7 134 -4 -192 -23 53 65 10 71 -210 48 -38 -43 -55 152 115 82 -210 -189 107 69 13 -174 46
4625 46 51 -86 23 -29 61 230 -88 -33 -73 -268 -9 -135 -107 -38 164 -80 -79 92 248 -114 -142 15 39 66 -65
4650 -65 19 63 333 98 80 -16 145 186 58 -230 -267 138 146 -111 -2 -137 35 70 -197 61 80 -39 -152 -119
4674 -119 76 4 268 -133 -133 139 283 42 -171 -34 29 92 -126 -147 56 138 -123 -32 -125 58 243 112 -142
4697 -142 -27 -50 0 -155 -136 183 -104 110 -38 28 135 199 -164 -104 146 28 34 -7 -144 159 13 -85 -33 34
4721C4K5j55n4J14k9m4K13j97K95j06j74P7n7J92K4j92j82J48K25j20j34n2L51
4744B02m8k83j24K75J17rl94K24K16p2j68O5J11m8qj24M7j23K86l3j36j8K4J45
4768A24k74N7R7J95k42q5J38L3j8o6J6p4p9K91k24J17j02J58J16m06K27O4P1j51
4792a7Pn1J78j38P9j4P3R4k20j6n0J32K9p6p3J7J27j09j14K47P8j02j30P2r2J85
4818A16k4k87K45K5j21O1M8j79J35J09j95j66K95n8J5l02L55L1j06j08J7L8K03
4841A47k8l38K21P6K8j69N1J66q2j27k0l4L7K93l52JJ44P7j47ql1J19j1Q7mn9
4867C7M6k5k5o7j25J73j9j69K92j11j24m7L7K55m7j92MjP2J05j31j82L06Q2%r6
4893D8o9P1J11j09j82K13m9j41K69j56J17k13mK03o0J5j89L8J54K15k40m7jjJ41
$$ plain form
4721 34 59 -96 -150 -36 -65 -109 104 -93 202 96 -78 -1 -58 134 158 -34 -216 -68 157 37 -97 -149 202
4744 202 154 -129 -253 22 139 130 -264 -40 176 104 -64 1 112 64 56 -68 -21 -144 142 109 -27 -45 -21 124
4768 124 -150 -93 4 199 -43 -128 10 43 25 -41 -25 -99 -178 113 -111 6 -96 62 178 -228 -1 63 134 -17
4792 -17 -10 -61 117 -21 58 44 117 211 -9 -25 -75 57 86 10 -63 -46 81 -28 -142 105 183 81 -49 23 -69 116
4818 116 92 -195 50 75 -46 15 63 -116 19 128 -67 -233 62 4 19 -283 72 103 -3 -111 -94 -56 147
4841 147 119 -219 2 78 106 -63 -12 154 72 -55 -75 -109 -72 221 -131 -130 14 91 -56 -64 -95 24 13 100 96 37
4867 37 83 58 33 -34 -159 14 -5 -174 118 7 -117 -164 -127 128 81 -111 -107 -108 -36 69 -62 -244 62 144 144 48
4893 48 -21 50 161 52 -130 83 34 -107 162 6 123 -90 -94 109 49 64 -125 -87 67 282 42 -5 -6 -7 134
4918A34Q4q4l15N0K40JJ5j58K19j32J62p9m4O4k47O7m9R3k3RR0j23QJ23k74J81
4944A2o7Q7r4O9p4J71j30K5r4K0q8K49j49OK58k34j0R9j99O3m4R4K1K4J6m3L2
4971B0N0J23k16k9p2J36q8J09J13r0k7j33J65k02J85j07J54l65J25J22K39k42
4993c0m6J03J22k31J28K4J31j42K5l47L22nQ3k40O7K0Q9j08OJ5N9P6J3q6n7J88
5019A79j41Ll1m3K70k53m7K10n5k9p3J18o8M0o9k77L12j5Pr9L1J54j20N0o4p2
5045h2J08j06J37j07Q0M5j26JJ77j16j79J24J62j07K44l16j23J17L23m5j98j09
5067i6K5K5O1k3K8L8K31l66j01K28J58J4m47J37Q6N7j63l8j6J89J92l28p2QK69
5092I6j1l28K65l0K24m12P3M4J3J07j45R3K6j13K71j28r4J22m6M9k14K36j25J34
$$ plain form
4918 134 218 134 -181 -131 109 110 125 -33 186 54 216 137 93 157 -90 -23 -72 21 -2 7 97 -26 -18 105 -169 12
4944 12 -55 32 -62 7 -67 104 -26 -1 -95 -75 -163 86 -63 -57 201 -33 -43 56 -143 -80 -124 -30 -9 15 31 -12 20
4971 20 70 193 -23 -52 -124 12 -76 33 146 56 29 -104 61 -141 44 -63 91 -274 -149 -27 212 -30
4993 -30 -76 27 149 -82 46 70 201 59 84 -263 59 54 137 -103 -36 -16 73 -35 -29 -14 45 121 134 48 -9 179
5019 179 38 41 10 -33 237 -16 -63 147 92 63 -10 108 40 80 11 -266 46 31 38 -61 -30 124 4 54 -10 -82
5045 -82 26 -80 57 -50 30 75 -51 -50 127 11 -168 -44 118 11 255 -61 -184 -67 256 211 13 -96
5067 -96 -71 -46 15 -8 20 58 289 -77 -178 50 208 222 -225 -88 -2 55 -108 -146 -162 27 219 -109 -181 -173 96
5092 96 85 -243 22 -8 216 -196 -123 -79 -66 41 -104 -11 15 -98 173 45 -49 73 27 76 -138 98 -27 107
5116A07k20J22J8L8m7k11l6K67K62l04j8P6N3q1j40N5K73j48l15J79r8K38o1j33
5140a24J76oj79Q5j02J50j9K9k19R3J08n9jj60K27K1k04JJ51m6J28l9Mq3Q4J51
5166A67j26j0m4J01J09p4k29P6K69j96J19k6J18j32l38R3J70p1j29R9l6K08j30
5189a2M9j09P8Pp0N5L5KJ8j26K56k79K13j03O9m4k09O7J38j61l2J40j9r1J39j64
5215a53J03Q9l2p8M4J93q8j32J36j52R5r0M1Q7j24rj18K77j7K9k62P5K13K9k48
5240i2j5J72or6J8K1k0J32l6k29N3J39P2N2l05J62k7N8j88R0J9J03k54L1K00j27
5266g3J14o7M4L4l6L9p5k5R4M5k34N3R3J17j02q0R7J06j32r7n7L92j19mk23p2
5292a68J83K4l8k2oj2M4j57K91p8r6J01j15p2R4r4J58j44K16m3j88K1j22K00r4
$$ plain form
5116 107 -113 9 27 65 18 -193 -229 38 300 -4 -22 54 107 26 -114 -59 214 66 -249 -70 -168 70 9 -124
5140 -124 52 46 -133 -48 -150 0 -19 10 -209 -116 -8 -67 -68 -228 -1 20 -184 -183 -32 -78 50 11 15 -68 16 167
5166 167 41 31 -13 88 197 123 -106 -30 239 43 162 136 254 122 -216 -123 47 -24 -153 -54 -90 118 -12
5189 -12 37 -72 6 13 -57 -2 33 35 53 -73 183 -96 117 14 83 39 -170 -103 35 -126 -158 -18 -37 -128 11 -153
5215 -153 -50 39 7 -71 -27 166 78 -54 82 -70 25 -65 -24 63 -61 -70 -188 89 72 101 -161 -86 127 156 -92
5240 -92 -107 65 59 -37 -19 2 -18 114 78 -151 -98 41 113 165 -140 22 -5 53 -135 -45 -26 77 -177 -146 54 -73
5266 -73 41 -26 18 52 16 55 -20 -45 49 94 -140 -87 6 123 21 -59 38 144 12 -85 -142 250 131 127 -96 -168
5292 -168 15 39 1 -21 -27 -39 5 -152 139 61 -35 66 -49 -121 -27 -121 37 -107 109 66 -122 -101 -223 -23 -117
5317a17j31K40J18P3l52M0O7J57j09N3n1K1j4j48q2O8K89j12K3j12p5L01q1j36
5341g0qQ5O9j10PJ6J08O4k55k8J18L0P5o2J2J11r8j88Q0O2J22j6k66J09O1o0l6
5368f8N0M3J44l87K24q7J27k35P1K2J79p1l3O7r9M0J14q8%k75K30k4L5RK20k18
5394a0K0j40J41L7k2j12R5O4n0l6q7J90MK4lj67J08J11j08j84O0J62k29l6J7J70
5420A9l3K2L3o2l9L30l48O4P4p9Q2l8o2J10n6Q9j36l9l7R4P9j22J19J84l94J72
5446B6Jj16Q0j6N4pR2k25R0r9Q8m4Q1J6l2P8j23j15J71M8j55K13n5q9LP0j2j70
5474a47K31k3J03k84K16r7Q1J0k68K80p4N8o9K5L7k8Q6j29K87k8r4k49J16N7P3
5499A70j64j15k8L5R9j92J79j04O7J08J81k29J87j7k1n6J8K7k72Q4r4j0J68r8
$$ plain form
5317 -117 -248 -8 110 183 -169 -129 -62 95 -14 39 -12 9 -5 -153 -235 -167 122 10 33 -79 -154 147 66 -70
5341 -70 -78 7 76 -34 -27 -11 97 161 -94 -122 -4 26 101 39 51 162 64 -124 -44 18 140 124 -142 -33 28 -32 -68
5368 -68 -18 25 169 -218 6 -81 46 -189 -118 -96 83 12 -21 46 -53 -13 101 13 13 -262 -32 -56 -21 -12 208 -10
5394 -10 10 -130 11 48 26 -86 9 73 23 -13 -100 90 94 118 115 -52 56 167 59 -125 -65 97 -132 -168 -151 19
5420 19 -14 8 41 -21 -60 270 -78 -14 60 -19 63 25 -37 73 17 106 -30 -69 -106 -12 67 -55 64 248 -146 26
5446 26 27 -89 -9 -25 29 22 114 -111 -21 -120 -32 -76 5 21 -11 67 -56 -171 0 48 -107 106 51 -38 -35 35 23 -147
5474 -147 84 61 164 -120 96 -1 80 90 -178 102 28 86 17 42 79 51 137 8 295 267 173 -76 40 97 170
5499 170 6 -109 -137 -102 -3 -195 -16 -120 -53 55 236 7 194 177 156 100 118 145 -127 -43 -137 -147 21 -77
5523g7p6M21l48J62j51O2j26K25j50J82j29j6J61k33QJ58p4M2l46L04J86j79K7
5546C3m9J01r1J3n5qnJ27N0r5n2J72k70m0J28o6K86k45o6J21J94q1l28J28J01
5571Cj0J99j67k0J03n4p5%j29J61J46k0l61K42R9j12q1M9j40K00j39r3J53r3J45
5596Fj59L81k44P0r9j99J78J12O4k81K14r7K49n5q6l55M92k05j28L78l25J40j13
5619f2J99n2q8j12k83J45K82j4l6j5jO8o9j0L2J07p7J8j2P4l2r5p1O6K60k20m8
5646d6Q1j38L6o0j9K64j50K01j32k15J77O0l8J02j08m2J50j72J29j49O4q2J38
5669E1O0k49J06m4J42j05o8J30j58J79j45J80r6L8r3J01L9n2r6Q1q9RQ7j40N0
5694h2J9j3J12PQ8M5j47j70J35J21q4pJ02j03J00k4k35n6K03R9j55L45l88J97
$$ plain form
5523 -77 -153 268 -80 82 -69 -7 -133 92 -58 124 -5 -21 140 -93 -85 73 -1 41 -305 -1 185 6 33
5546 33 -16 85 -6 7 -48 -56 -61 66 116 21 -31 141 -129 -169 -41 -107 179 -66 -132 -11 183 102 -226 -98 3
5571 3 -7 192 25 5 108 54 -21 -21 -150 11 157 137 -224 18 117 5 -76 -27 -167 33 -106 -199 -46 -139 6
5596 6 -153 228 -16 54 -45 -244 -66 46 110 -171 43 -54 195 140 54 -301 191 -14 -142 236 -89 51 -62
5619 -62 137 85 -3 -115 -398 -253 29 15 -21 -36 -37 31 -38 -48 -16 91 14 32 20 94 62 -33 -104 -38 222 2 -46
5646 -46 35 -103 -67 -127 -146 118 -32 169 37 -178 -1 59 21 123 15 -27 123 -49 80 -69 -5 -87 51
5669 51 111 -138 -32 -76 66 -39 -107 23 -135 44 -101 79 -17 21 -72 29 68 16 -80 1 -88 -79 8 -132 -82
5694 -82 -63 -76 36 43 131 176 29 -141 -6 115 31 24 126 23 123 99 -136 -192 11 110 -45 300 -88 109
5718A09p9m8R5j68K17j49j10P4Q5j47o7J35M6q1M0J48pN2r8N1j58R8J34j88q5
5743a01J45P3P4k51K4P5l2m5M6j88K28l0k2l4q0J68j1j26m0K39R7r4j46R0Q0m6
5769I3M1r2J61J3l43Q7N4M1K2l6N2J66j86J30j63O3k72K29p3M5J3k45L65j02j46
5794h3J81N6r9k3K89j28k69J04r8K16j85J2or0J34K28j77o9O7j95J59j5o4K61
5818B06j37j4k34N5Q0N5j38P6Rj0K20r8L0j01JO6k12J16J37L7j10J6j8m4R5K19
5844C02j64L2j71r3K30o3M0k3r3K1k14J93J11l02L21j80M1p4J29qO6j11m1N4q1
5869g8rJ04p2J1L39k43j10Q0P8j22K1n1J48q6J56j37n6K6Q3k62K13j58K82k10
5893e3j44J29K18J22l41j6L6J20q8R2oK20j56l07K20n2j11J56L2n8O8j63J02k1
$$ plain form
5718 109 30 -18 77 -91 126 -23 -133 -59 26 -121 -188 -53 -7 -88 -48 100 93 145 47 98 -60 38 172 -16 -101
5743 -101 44 117 191 -60 -36 39 7 -38 8 -180 48 18 -4 -38 -118 50 39 -87 -127 112 209 115 -31 59 139 93
5769 93 134 42 203 216 -127 -40 14 55 77 41 93 259 73 203 40 103 -169 60 -13 32 45 -200 165 63 -83
5794 -83 98 154 55 32 321 193 -76 28 -70 146 -39 -27 -33 -123 11 239 62 -7 60 -135 24 9 -55 206
5818 206 69 55 -179 -124 -44 11 -127 -51 -42 -52 168 70 100 -1 0 66 -146 -30 107 144 34 50 32 -12 83 302
5844 302 138 170 -1 -94 136 73 113 90 -3 18 -196 -3 108 -194 127 -53 -12 -86 43 35 101 -10 -51 3 -78
5869 -78 -87 17 -55 -44 295 52 -58 22 100 -22 -1 -52 96 10 166 29 -27 -1 82 -180 33 -125 157 -53
5893 -53 -197 -68 150 272 -69 -85 -49 71 -17 75 69 289 133 -174 46 -6 -117 39 71 13 81 -82 20 -1
5917aK15j19k3j74N3K06k15K68l53R4J0J66j9k04J1j41L36j4j55r3J39o7J00K3
5941D3M2Q4j26J0L4j60q8L4L17k28lj22J83J91l42J33M2K5j73J9k9K09r7J43j46
5966ep4J17j21P4o3J17J5j04q7J29M7n3J55k86K08n7q5M4J1J06j20J77j66j06
5990a27J74J80l47R2Q2P1K0j11j22K91j88n1l4K24j50Q8n1l8P3j14R3N2r4J64
6014A77r2o5j04k7Q1J99j85k70K46M4j03K17M2jj50r1K4K2Q2m4K4o1Oj58J68J46
6040A27l76K22J25n0p8J90k24j40P3n7l7R6K24j18K7L8K0Q2k61R9J13k84K28q
6064C1j77L1J64j38M1r7R6n8K8L9J27r0lJ15M9n8j44J04qJ48k13J36j96N9j41
6089a55J71l15M17j74q8J55L4Q7j92p0j14L19o6j36n9J09q3N0N7R3j59o7J46P2
$$ plain form
5917 -1 214 95 72 -102 -49 157 -58 210 -143 -49 -39 127 108 -96 -85 -226 110 96 -59 -152 -13 -80 20 43
5941 43 85 169 43 53 87 -73 -161 -127 190 -38 -41 -163 20 211 -131 2 44 69 -104 -85 -114 95 -2 141 -5
5966 -5 -79 38 -83 -9 -72 45 60 -44 -131 -2 45 -8 147 -139 69 12 -73 -29 -18 88 -32 145 -21 -127
5990 -127 47 227 -120 -28 54 125 145 34 -88 203 15 -36 -70 154 4 92 41 3 76 -38 55 107 13 177
6014 177 85 20 -84 -111 -30 169 -16 -286 -40 4 -99 118 160 159 9 -82 -58 -36 46 2 26 -35 -29 -187 -19 127
6040 127 -249 -27 98 48 -30 160 -64 -204 -131 -188 -225 -129 95 -23 4 42 62 144 -117 -18 95 -189 39 31
6064 31 -146 -115 49 -89 -48 -145 -49 -107 -79 -40 87 -3 -6 109 158 100 -44 60 52 200 -13 123 -73 -14 -155
6089 -155 16 -299 118 -56 -144 11 45 132 -60 -130 -244 75 9 -127 -186 -77 -160 -110 -53 40 -119 -186 -40 32
6113C2Q4j22J68j78j24J23K88m42K23ol5j54O3J00n0j45L67l24L27n4j78J21o6
6136A8N8K0L9k86J48J13j66N5j47J92l10K52Q7o2J24m42L27l3j96K80P0q2j69
6159a10oM6R0j0j16J07n8Lq1L5L14q8j70K4%l2J46j10o6R7R5k8n5j13J77r3r9
6186a01jk5J52Kp2l9QJ4O4r2K34k54Q7p1l4m0K80o8K2l4K2o6r0J01J34K3nk26
6214g5K6r6K08J5o0J10q5J3p9k1q3J67j75J69k00K78n3j01N1MJ8j52k8J29J5k5
6240c0j52J08L1J95j18J23k54K23j03P3j58J15J6j69K14l65J90J39j47l4J90j49
6262f2j95K38J13O1j60k13K73J10j2k69J12J01k58J71kj30J49L2o2j34K0K82j33
6285C2j3j11J92n9p6K6j73J77j01J70j74Q3K2J76r1q0J87j11j23J35M9K4k73P6
$$ plain form
6113 32 116 -6 162 -16 -140 -17 271 -171 52 46 11 -143 -80 20 -30 -175 192 -132 195 141 -37 84 18
6136 18 76 96 135 -151 -3 110 -56 -1 -148 44 -266 -14 73 11 135 -307 20 -13 -209 71 141 59 -110
6159 -110 -116 -70 20 10 -106 1 -57 -54 -135 -100 214 126 -44 -20 -20 -52 94 -16 -82 15 110 82 27 -86 91 -2 -101
6186 -101 -102 -127 25 27 -45 -84 -76 -62 2 -90 144 -110 -23 -94 -128 -168 112 44 66 32 54 -12 -102 -1 133 156 151 -75
6214 -75 -49 -145 63 78 18 128 43 56 -23 -44 -127 40 -135 34 -166 112 59 -42 9 13 31 -121 -149 -20 -5 -30
6240 -30 -182 -74 -43 152 34 157 -97 126 23 96 -62 53 69 -100 114 -251 -61 78 -69 -103 87 -62
6262 -62 -257 -19 94 155 -5 -218 55 165 153 -116 -4 97 -161 10 8 -122 27 59 -3 -137 -117 165 32
6285 32 19 -92 100 41 -35 -9 -182 -5 -106 64 -110 -27 -5 171 80 0 187 76 -47 88 137 161 -112 -36
6309c6j40J86J8q4k8M7L1J2j29j0L37k97J25k13J59n6M3oJ6rJ54n8kJ8j14O4o8
6336d0M7o8K67n2k12K08j61r7J16K30k18n6J26j42L2M3j40J52n8j74K28r7M5N5
6360C4Q0R3k70p5M5Q4r8K42r5J29o6k07M7l0J69j2j46J2J59j25P9L3k8L4j54L6
6386c0m2j48L51j03k0qP1j75l9R1J31j98R7k4JO5K41j94n0o8J03k0j21J26j9M3
6412F1J0n5R8n6J62j75k67K50N3j08k9R6O2n4m3j48J09j22L22r8o1J1P0m0l2n9
6438d3j53K17r4J25r6N0M9J2p7J3l7J12J4p1j00K33j19r7Q8L0J46l85J52l9J38
6463F8j04lr4q0L47K2k36N0L4M6j02j2Q3J84j62p4k0j04K35k84J79J04k8r3k2
6488f6J89j35R7j71N4j2J22m0R8r0k44M24k69m1J64L0l58RJ31q5J48j30J28M1
$$ plain form
6309 -36 -176 10 28 -56 -84 -37 -6 6 -123 -133 204 -93 32 -181 -22 -78 -35 -41 -25 -34 120 62 60 78 -36 28 -40
6336 -40 7 -61 206 154 -58 150 -11 -108 8 238 20 -36 90 -52 -20 23 -117 35 -23 -197 31 -66 -21 34
6360 34 114 207 -63 -138 -93 -9 -107 135 40 169 103 -104 -57 -87 82 70 -76 -64 95 -30 49 82 54 88 -66 -30
6386 -30 -72 -220 131 28 8 0 71 -104 -143 -52 79 -119 -22 -46 -45 20 261 67 17 -51 52 32 -89 37 18 61
6412 61 71 16 114 58 220 45 -222 28 81 -27 -56 40 102 48 5 -143 -34 -156 166 68 7 18 88 48 16 -43
6438 -43 -196 21 -73 52 -44 6 55 67 -10 3 -34 78 92 21 -79 154 35 -62 26 56 202 -183 -31 -70 68
6463 68 -36 -39 -133 -213 134 156 -80 -30 4 50 -52 -64 19 203 41 -33 -53 -157 78 -206 -27 77 49 -44 -66
6488 -66 123 -12 85 -86 -32 -44 78 38 136 46 -198 226 -43 -84 80 110 -248 -239 -108 -193 -45 -175 -47 -6
6512fl7j9J70k29J68J49l3j36j35K64k9j86J6m1r7K54j43N9K0L9j33P5J58l42
6536a94Q7J12q0P0J06j24j57J62J63j9j15j18M8J30j58J49K03o1j41j67O2J77
6558A35j69J24j02j80M45l61J74J39k05o7j96J84J82rk97J03J3r4Q3K5P5j31K5
6581a04J86k4j51P7o7rJ67r3q8m3J52j55n9L26j75K9J16q8J03l0n6J02l20M3J03
6606e8q9K60j74j6J87r0P6P6j32j30P0J73k0j17j59J70l5j30J52R8r5q6R8K9r7
6631c9L24k08j40J72R7j45j05RK58l09M4J1K1j79J79r9j04L31K9l96K94Q6k14
6654h3L03j77j2N0j00j16M3J24P2j10j75J47L6K5Q4j81J06o3M2j04J6q0Q1K01
6678A29q6o7Kl3K44p4l34K19R0j22J22k63K50j26K51k39K03Rj89j8J00j74q3P3
$$ plain form
6512 -6 -43 -62 108 -121 47 196 163 27 -108 156 127 -59 -43 -84 -181 73 -70 -11 9 48 -85 -10 148 -194
6536 -194 -107 5 -75 -5 101 -23 -180 -18 145 126 11 -107 -59 71 -87 62 265 204 63 -104 -42 135
6558 135 -34 90 -12 -192 253 -108 66 205 0 -67 -263 -79 103 94 -203 -100 -87 -181 -98 -73 2 -129 -104
6581 -104 82 58 -93 -16 -83 -92 75 -18 -106 -149 3 -152 -211 115 -60 -31 85 -3 100 70 14 116 -204 -161 -58
6606 -58 -147 113 -61 -77 110 20 96 172 40 -90 -20 153 133 16 -143 27 -8 -138 14 112 17 -69 29 58 -39
6631 -39 285 77 -63 109 206 61 -44 -35 223 -86 -42 -31 -10 -189 -10 -109 -213 118 147 -249 45 131 -83
6654 -83 220 43 31 81 -19 -135 -92 32 104 -6 -181 -34 2 27 111 -70 36 -27 15 -89 -73 -153 -72 129
6678 129 43 -24 -22 -55 189 115 -219 0 90 -32 90 -173 77 -49 202 -37 166 175 -14 -32 68 -106 -189 -116
6702a16l2K39n7M3o3jk42K56J40j00J2M5j71N4L5k8jm1J60l3j07p4K03j84r1k6
6728a80J94j82K76o2J8m0j92J70q8J57n4J01j18r9K81k59l1J37o3n4N7J0m3J9
6752d5M6m4J15j48J96m6o9Q7j12J58j32j2Np1l6J71n0N1k14J46K84j69l20Q3P8
6777d8J04K5j74P0r7K09k81L73j06k0qk07J52K0K8m8k9J14j87J56n2j76J75m6
6801e3J06j93J31P1o3j8k5o6k6j00J64M4k51J23K25j20K57k52K8Pj06j7L61k71
6825d4M1j1K18l02R6J56k12J78k33m4K21m3j46Q1j6Q5P3N1j06j42L0R3k5r6J11
6850A4O1q4K2p8J50j96O1j43J29K30j88P9lKK1j38K0K36k70J67n6J52j64O4q9
6875aJ37k97K20J6k14K41j97J28l7Q1r2N6Q0r0J30k60p5J67k46Q2K70j37J12k17
$$ plain form
6702 -116 -148 91 34 77 14 13 -229 27 167 67 79 124 -47 7 42 14 13 -28 132 99 -8 -82 121 -63 -154 -180
6728 -180 14 -168 108 46 64 24 -168 2 -86 71 17 118 0 -99 182 -77 -108 29 -34 -88 -31 -21 -64 -45
6752 -45 1 -43 72 -76 120 74 5 92 -20 138 6 -6 -1 -72 -108 63 13 64 -150 -4 280 111 -209 -126 -48
6777 -48 56 81 -93 -23 -120 89 -192 181 75 55 47 -160 -8 12 40 -8 -37 77 -110 46 -6 -182 -7 -53
6801 -53 53 -140 -9 62 -1 -19 -44 -110 -136 -236 -72 -28 -279 -156 69 -51 206 -46 -18 -11 -117 -134 227 -44
6825 -44 -3 -14 204 -98 -2 154 -58 120 -113 -157 64 21 -125 -44 -60 25 98 149 43 -99 -69 24 -1 -97 14
6850 14 75 -9 13 -65 85 -111 -50 -193 -64 166 -22 57 54 56 77 -61 -41 195 -75 92 36 188 24 88 -1
6875 -1 136 -161 59 75 -139 102 -95 33 -4 77 -15 41 121 31 161 -99 -174 -7 -253 -171 99 -38 74 -143
6899a43Q9J14l5j30L6Q1P2j12o6J0J10O7j50J97k13O3M6n8R3j30j87K43N3r0J38
6924I8m6j51P9J23P8N2k64Q4j95j8J94q9J66k37J17J94j75o8J27k31j26K93J12
6947A17j79P9J79q0k91J27J51k44J19n3J07jj19K05j34j09J36J32l0O7j22K0%
6970G7n7j05M0Q3Qj82J40m4K06j84p9J62r4J12j58K6J79Jj1j23j8k4J49p5n8J01
6996G2p7O2j7j19K73j49J84k98j28O7J20J21n1R9j63J72k81K03j89m2K56k87J21
7019e1k5O4r4M3q2L18k14o6l4J11k8K32o6k31K38m4j91K51J1M4j42q8J18j10L5
7044aM7j44J75J00j80j7K9N3o1p5J12o8J36r7o5Pj4o3n0J40k1J96j12k77K02J15
7070F7n9O6k42K72q8m4L4m1J18n0P2k30J81J94k73K28j43q6LL9k1J68q1j94O6
$$ plain form
6899 -143 -54 60 25 -105 -69 12 84 -28 -94 -84 26 93 -57 140 -73 -10 36 -22 71 -59 -246 -3 50 -40 98
6924 98 52 -99 -20 103 181 233 -31 53 -142 -160 34 -55 111 -126 -9 185 10 -58 69 -162 -288 5 117
6947 117 -62 17 196 116 -175 -48 103 -141 -22 -75 32 31 -88 117 -17 -126 10 142 112 179 57 77 77
6970 77 20 -85 -45 38 46 -136 4 -40 166 -18 -97 65 -29 83 -75 -49 130 131 120 -3 -21 -45 104 29 -29 72
6996 72 -5 57 40 -79 194 45 229 -69 -197 -130 -10 111 60 159 -4 168 -113 90 -99 -141 115 -172 -51
7019 -51 -76 -12 -106 -63 -145 173 -41 -107 -141 -30 -58 174 108 -123 115 71 -120 131 142 186 44 -44 74 -36 -1
7044 -1 46 -98 77 177 -3 -20 9 62 1 -74 38 -30 106 9 -56 -49 -63 -126 -176 -36 -57 139 27 -250 -48 67
7070 67 8 74 -168 104 16 -28 6 -35 83 33 105 -125 56 250 -23 205 62 -24 -21 18 -3 165 84 -110 -44
7095d4K4R1j23O5j85L23j91J7j8j59L21j96M0J44m3j77K17q0p7jJN4J46k81J12
7120b0K02n7k24K97k49J39j95j13K94J37q8r1o0J1o9j1P2K98j76j79J76j01Q0
7143G3l0r4K02j80P5j40J57Q0M8n1j23o2P8l09J66L1KL62j97l0M0k48K45L9k10
7168g6n6p1J37Q4j08M9rlo5L9J4J31l2K00l33j2k9Q6N3K2j68J21N8J29k93K96
7194A64k89%O0K8K21k42R8l7J07l18K31L2L9K1m2m3q3Q2l6j09M5k6k3J00N6R4
7220A30j23q3Jq1RJ51Q6m2J22j62r1o1J50L6RL6j89l2J86K8l4q7q7N7K56p4k41
7247a30K66k73K08j60K4o1J88K1k70L10k3j84K73j57P4j03mJ45k24K53k7j4R6
7270B28l97R3k6qJ02Pm4q2RJ44J5l2M0l10L04k27L88l02N5J40j98J95m7j02K1
$$ plain form
7095 -44 -20 71 -52 13 -172 151 -40 -23 -41 -200 121 -75 -35 109 66 -111 106 26 -51 -52 -51 3 149 -132 -20
7120 -20 182 125 -99 198 -51 88 -107 -220 74 211 123 32 -28 -17 -86 -97 -25 273 97 -82 94 -7 73
7143 73 43 -51 151 -29 46 -94 63 143 191 140 17 -45 33 -276 -110 -79 -77 285 88 58 98 -150 95 134 -76
7168 -76 -132 -203 -66 18 -90 -41 -50 -53 -118 -79 -65 66 34 234 -99 -111 -140 -54 -1 21 -147 -26 32 161 -132 164
7194 164 -125 -125 -65 -37 184 -58 40 3 110 -208 23 55 94 115 73 30 -53 29 -7 -116 -71 -97 -120 -20 36 130
7220 130 7 -76 -75 -156 -147 4 90 48 170 8 -83 -144 6 42 51 87 -102 -134 52 80 46 -41 -128 -71 185 111 -130
7247 -130 136 -137 71 -89 -65 -126 62 83 -187 123 100 -84 189 32 106 3 -1 144 -80 173 146 132 228
7270 228 -169 -76 -102 -110 -8 -1 -45 -127 -118 26 41 9 49 -261 43 -184 204 -98 -43 97 -101 94 47 -55 -34
7295c4J41n3j00j12J07J8J4N2p5ln9R7Q4n1k6Qj11O9N9Q7j19n2nK30j89P9j02
7322d6Q2N4r9J72k2l31J57m5K23j25q8J03L5p2J27j76Q6j45L52j33j81Q9m7J85
7346A55j49j46J23j6O3J68k20R1m3%j55J9P5r3n6J08j2M5mJ24Rm1j26JJ49l9j01
7373g1P4J34Oj67P6j42l8L23r2o7R3j74j91J49J55k47K90j01k3O3J32j35j13J08
7397D2J20l1M5j0n8p3o2O5k05L9K54k81J92O7j34n5j69M15p8k3M9o7j24J43j29
7422f8M6j60J53J88J7r9j58J28m0L9k77J18R4K00j41k0Q7j44j15K54o8J89l04
7445h1J83j35J28o5j7K9n1O6k0Nj24j4J48Q1j57q9J41j6p6R3j30J30j45P3J5O
7471b2o3J02l8O0j03J44j70O2Q9o8m0Q2OmM0k1m9k11J97L2J17j59K19l01M03l45
$$ plain form
7295 -34 107 54 -46 -158 -51 -33 -19 33 -42 -45 -104 -7 77 26 0 8 -103 -34 25 112 -7 -59 -64 166 -23 56 -46
7322 -46 36 90 -9 163 141 -190 -33 -78 145 20 -68 35 70 -2 125 -51 35 -110 242 109 -72 17 -30 155
7346 155 6 -140 -17 -33 30 198 -22 69 26 26 -129 -110 -35 -128 -184 -76 -88 -43 -47 77 86 45 -81 -80 69 30 -71
7373 -71 3 137 143 -24 52 -90 -128 195 103 36 129 -45 -236 -87 68 -179 111 10 -13 50 182 47 -66 42
7397 42 162 131 176 166 108 35 -27 38 -167 -128 126 -155 37 104 -30 -85 -254 161 83 60 109 42 -82 61 -68
7422 -68 -22 -182 -29 159 176 77 -81 47 7 46 -231 -113 -19 181 40 20 107 -37 -152 102 34 223 -81
7445 -81 102 -33 95 30 13 42 -9 57 37 42 -82 -96 52 133 -24 -113 28 12 -64 29 -101 29 -116 -43 -28 -22
7471 -22 -85 17 -21 39 -64 80 -90 -28 61 -7 -47 35 41 37 77 56 7 -204 -7 25 142 -17 202 -99 304 -41
7497d1J01j92K9J99k26QK70l01J73J70j51L6K5j49K7J20M4j29r5R8rn9k6k1r3
7522a92J26n3K90k30j0J6J16k58K28k5k29K76K5j53k8L0O7RK9m0J53j44k5k9K0
7547c1j3Qq1J80r6oN2l0n3J79o2m5k2j4M5J87n3j35p1m1J26pm8K0k5L6O0k27K04
7576C7l8j65M02k4j37j49JK04Qj2k28K16l12J89l3r5K31j87L1M5r7L5J86j51J82
7601A39p6j73L3R9j29J91r8J06J6k09L0j42J62K25J7j35j03p2K20L6k4J2k1Jq3
7626B2j60R9n5K54mr1OL1K0j30J14L7k02L5J2oJ0j6QM8J7j99J50l4n4K16j81o0
7654a13J31k36K97Q1j41k7K71l80J07Q2n9k95K39M5pL1k24J06Q9j18J01L1M2k57
7678b04K11J62lrj64O8J3n8K2n4J0r0J53J9K2Ll7l65L81j72Q3J98p4k1k01k3m8
$$ plain form
7497 -41 60 -132 -103 96 -130 -122 148 -153 20 190 39 75 100 -49 -22 98 142 13 -82 16 7 -52 -78 -99 -192
7522 -192 -66 -119 171 -59 -69 -53 63 -195 33 8 -221 55 80 -73 -101 -71 -4 5 34 -6 147 3 -22 -51 -31
7547 -31 -44 -36 -117 63 -33 -39 13 -17 -70 109 47 2 -20 -34 11 198 145 10 -61 -102 24 17 -31 -11 -36 0 60 -167 37
7576 37 -1 -166 236 212 75 -74 -73 131 139 127 -101 115 -197 -8 -41 -136 95 -92 -61 -16 -113 -78 108 -43 139
7601 139 63 -110 -77 22 -107 84 -14 92 108 -101 -71 -213 -51 174 191 56 -47 -119 101 137 113 125 104 105 22
7626 22 -138 -39 -94 160 156 65 71 102 122 -8 106 143 -59 -24 -12 -18 -8 -24 -16 32 49 -150 0 -34 -88 128 -53 -113
7654 -113 18 -218 79 160 19 -8 263 -117 -10 72 13 -282 -43 2 -5 26 -198 -92 -3 -121 -20 11 53 -204
7678 -204 7 169 166 157 -7 61 74 16 38 -16 -6 -96 57 76 98 101 64 -301 80 -92 -9 189 115 94 -107 -130 -178
7705a78J99k13JJ54O0k60J15J62j38K2N3P6L9m4J13j31p4j0k0L6j01L12j73K2
7729B2Kk12J64M9J1j48Q7l0J79r7q0q1K72q5p2j9j34Q3J28L8J25k06R5r5K06j62
7755D0n2O6J3p4m4J53j24P1k13J75j42j4K48p9n9MJ15j06L3j21Q3j50K83mr4j84
7781a76J03J13l16L74Rj27j04O8L41j62j76J38j05K15k94J95k78P9K55k2j60N4
7803B4j58J92K8J11n7l0j07L5j78J95r7q2N9k7J74m0j07k0nJ51K1n2r3J90j22
7828ErL8j44J81l61J64K20n7J69o6p9k25K55p3J16r6j25O3L2k8q5O4K4P7mO4j02
7855A8J20j60p5J24o5J39j7j89Q5Q4k9j8j70K04J0j24M0J02r7K4P4j00j5MR2M8
7881A09rj1j00P2k01J52l2M0N7j91L60k62P6j0k7p8N1J35n4Qj50J96r4J1p8K09
$$ plain form
7705 -178 21 -192 -191 -37 23 -237 -122 40 -98 -76 -23 53 92 48 161 30 -44 -54 -74 -38 -139 173 0 22
7729 22 24 -188 -24 25 36 -112 -25 -55 124 27 -53 -134 138 53 -19 -38 -172 -89 39 77 202 -4 91 -4 202 40
7755 40 -12 54 67 -7 -51 102 -22 49 -164 11 -131 -145 103 24 -35 -31 84 -22 11 -110 -27 -177 106 102 8 -176
7781 -176 -73 40 -276 98 107 -20 -124 -56 285 123 -53 85 -20 195 -99 96 -182 -103 152 130 -30 24
7803 24 -134 58 86 197 140 110 3 38 -140 55 -42 -124 -65 -92 82 42 -65 -85 -90 61 82 30 -63 127 5
7828 5 -4 34 -110 71 -290 -126 94 37 206 140 61 -164 91 18 134 38 -87 -24 8 -20 -105 -41 -17 60 56 120 18
7855 18 138 -22 -97 27 -38 101 84 -105 -20 64 35 17 -153 51 61 -63 -23 79 -18 6 80 -20 -35 -31 61 109
7881 109 100 89 -11 61 -140 12 -20 20 77 -114 246 -16 60 50 23 -55 -4 131 77 85 -65 131 37 48 -30 179
7907A79o6k06MK07j23OJ0K4p3J7J81L7l24j08J53J88l26J33L3Q4q3L8j10J42J33
7932A50j20j10J80q5M7L2r0R4jr2J22O8k64J69q8l0Q2j10J47M3j34rq8L08k75
7957e4J76j85J52j7l3O5k43l7L75j46j17J02kl3j62K18Q0j60j98K90O7o9M7j12
7981Dj41K40k56J18j1J30J8o8j51J41r4J94k0k00M8O2P6k46J84j13n4J96M3q3
8005A7j44J80n2J41j27om5R0j89J75J70k06j4n5oJ31k55Q7R8j33L58j98J13k29
8029i9K47MM8k28M9o8J44k60J96j54J55j50n2K25%o8J35j79Q1J43l78Q1N2J84
8053A08n0m3j6j27mM0J43J08j29n4K83k53o8P0j62J44K5K8j10J0J10r2N5m4K06
8078A78j64N1o4L4M3q7oQJ4J28L6o3j32%R5r0q7L60l88L67l11o5K17Q9r5j18n2
$$ plain form
7907 179 113 -93 -89 118 -5 1 11 35 -38 -21 160 197 -127 -235 -82 106 -220 -87 -54 30 -53 -15 -125 17 150
7932 150 30 -80 100 15 62 94 4 98 97 5 127 195 -69 100 12 -18 64 -46 101 144 10 1 -87 221 -54
7957 -54 122 -63 89 72 39 104 -139 -176 199 53 -64 38 36 3 -159 59 139 -21 -219 71 138 69 116 4
7981 4 -137 103 -153 -35 -46 84 102 34 -117 24 -70 124 104 -96 -48 14 90 -156 28 -85 -139 57 100 17
8005 17 -127 53 1 142 15 9 -36 54 -135 40 210 4 -10 -65 -71 60 -195 -108 -10 -143 215 17 130 -99
8029 -99 148 152 200 -28 21 -47 97 -163 33 -121 34 -116 -168 57 57 -11 124 -55 26 169 -209 -128 -76 108
8053 108 58 15 -1 -128 -132 -92 51 159 30 -24 259 6 -62 8 -154 -10 15 43 -67 -57 53 -39 16 -28 178
8078 178 14 65 1 35 78 -9 -15 -7 7 135 171 108 -24 -24 71 -19 -106 254 -134 233 -78 -143 74 163 68 -50 -102
8105a02J33j28K69k09j15L9j1L8J84k11Q2J04Q0j43Pk03J33Q4J16j40p3M8K3J7
8129B2J06j5r3m8P0J2j22m9J45J3J73l51J50j17J83m9O6n3O7j39P2l5q6K70k13
8154b1j83L14j78j38J81m2J1j4Q7J32l55K61Q4k58P1J20j11J3J13j05%K1j6j26
8178a39K85k5r9k26J67R9o9K2L3P2j3O2m1
$$ plain form
8105 -102 31 -97 172 -37 -152 -113 -124 -86 98 -113 -31 73 153 10 17 -186 -53 31 147 7 -66 -18 5 22
8129 22 128 113 20 -28 42 54 -68 -117 28 41 214 -137 13 -104 79 30 96 43 110 -29 43 8 -78 192 -21
8154 -21 -204 110 -68 -206 -25 -67 -56 -70 17 149 -206 55 139 -119 -48 72 -39 -26 87 -18 -18 3 -13 -139
8178 -139 146 121 22 -204 -37 62 -7 15 48 120 107 169 128
8191A28
$$ Imaginary data points
##PAGE= N=2
##DATA TABLE= (X++(I..I)), XYDATA
0@%%%%%%%%%Qj6J6j6J6j6K4l2L2m0M8n6P2q0Q8j04J20j36J56j78J99k24K53k84
33a50L17l53L93m38M87n39N97o62P33q11Q98r96J105j225J364j528J717j938K204
52A175k531K944l488M235n331P103j0437J8878p7677j93530J07132K24343J28133
65B00949q4460j67475r7133M7642J19348R6289K3q7772j12697l4326Q4205J34160
77I8753M2686r7974j38316k6483J02894J11201N363q4769q0939q950N2674O1731
89C7871K2177l1111n9486l8438J8807O3452M4935k0542o5147l9393K4903N6313
101A4341K8394j8205l8004k6421K308L1465L7172N748l6624m2095j023M1720L6204
114C4980j0447m0301k1539J6004K3508K662q969j470j065j5463j3502J7483L3953
$$ plain form
0 0 0 0 0 0 0 0 0 0 0 8 -8 8 -8 8 -8 16 -16 16 -24 24 -32 40 -40 48 -56 64 -72 84 -94 105 -119 134 -150
33 -150 167 -186 207 -231 256 -283 314 -348 385 -426 472 -524 581 -644 720 -808 909 -1029 1175
52 1175 -1356 1588 -1900 2335 -2996 4107 -6330 12548 -65129 -258659 -151527 72816 200949
65 200949 116489 -50986 -148119 -100477 18871 115160 115183 27411 -85286 -119612 -35407 98753
77 98753 141439 43465 -94851 -121334 -18440 92761 98124 13355 -67584 -76534 -23860 37871
89 37871 60048 28937 -30549 -68987 -50180 13272 58207 37665 -27482 -66875 -41972 14341
101 14341 42735 24530 -13474 -39895 -37587 -6122 31050 36798 174 -41921 -42944 -1224 34980
114 34980 24533 -15768 -37307 -21303 2205 4867 -4102 -5572 -6637 -22100 -35602 -18119 15834
127A5834K266m0451l1285K0956M6006J0821l5356l0768J4207L4109M914k3307
139a2054p861J9831J1345j8095j6352J8606L0371m220l5009j4129K8354L1291
151C2078p765l3190j2168K3008K1835r968k2326L9J7798K318j6871p778J4014
164A024J2222j0927j8712M52J7173Q377j0901j3479R12J0869N146n424n029K899
178e398L237l160p10O167L542o579n364N660P983k617q051J460Q740M08j0333
193e015l879R922Q857p637j5272q15J7512R339j5638j8744P331K2682J268k2606
207a2695j0859J8349J8267j0037k2682J046K4439J0816j9177j8904J0778K6818
219A6159L003k4686j3433K0239K3871r137k5679j217K4401J2317j7809j8759Q775
$$ plain form
127 15834 18100 -22351 -53636 -32680 13326 24147 -11209 -41977 -27770 6339 11253 -12054
139 -12054 -19915 -84 11261 -6834 -23186 -4580 25791 21571 -13438 -27567 787 32078
151 32078 24313 -8877 -21045 1963 23798 13830 -8496 -8457 9341 11659 -5212 -12990 1024
164 1024 13246 2319 -16393 -15941 1232 9609 -1292 -14771 -13859 -2990 2156 -3268 -8297 -5398
178 -5398 -2161 -5321 -6031 136 3678 -2901 -8265 -2605 5378 2761 -5290 -3830 4910 5318 -5015
193 -5015 -8894 1028 9885 2248 -13024 -13839 3673 13012 -2626 -21370 -14039 8643 9911 -12695
207 -12695 -23554 -5205 13062 3025 -19657 -18611 5828 16644 -2533 -21437 -10659 16159
219 16159 19162 -5524 -18957 1282 25153 16016 -9663 -10880 13521 25838 8029 -10730 -1955
232a955K2174R37k1430j1095J4806J6719p545k0782k771J7618R514j4142j4964
245a2916O023J4677q04j3318n011R560P801n381q737K123Q723J309o778k677N820
260D14M631l603m047L827N617l053o371K617Q654j112r401k503R317O223p846
275C364j0791K940J2704J635j4002q813J0826J3327o126j7648j970J7957R449
288A2852j5357j5899Q798K0168O30j9201r023J5412J7575o871k0405j365K0883
301H197J1435j5187j7497Q073K1574J637k0441r830J5374J6130q023j9229j140
314h927J7078Q428j2888j5270M995J6481J273j6205q180J1176J1500o111j3413
327a0063l5J2097M506r216o938N768Q093j217o895j331O547L751l883l873L420
$$ plain form
232 -1955 20219 21156 -274 -11369 3437 20156 12611 -8171 -10942 6676 16190 2048 -12916
245 -12916 -6893 7784 6980 -6338 -11349 -1789 6012 631 -8106 -5983 2740 4049 -2729 -5406 414
260 414 5045 1442 -2605 1222 6839 3786 -2585 32 8686 7574 -1827 -4330 4987 11210 3364
275 3364 -7427 -4487 8217 9852 -4150 -12963 -2137 11190 5064 -12584 -14554 3403 12852
288 12852 -2505 -18404 -9606 10562 11192 -8009 -17032 -1620 15955 9084 -11321 -12686 8197
301 8197 19632 4445 -13052 -4979 16595 18232 -2209 -12039 3335 19465 11442 -7787 -8927
314 -8927 8151 16579 3691 -11579 -6584 9897 11170 -5035 -13215 -2039 9461 3350 -10063
327 -10063 -10098 1999 6505 -2711 -9649 -3881 4212 2995 -3900 -5231 1316 5067 1184 -2689 731
342G31N177k102m328J644N023l45o124j085O722K687o839n782N038P460l227r925
358e275j680Q823N536q077j0393L931J2529R17j3495o711J0774J1761o143j4542
372a2045k98J5856P325j2164j2055P549J5896M01j5178o974J2764J3653o730j5900
386g900L48J6009O615j3015j1861O870J4927q14j5104n997J1591J0316o981j3396
400h392Q02J2331M095j0054q485O364J0628k148j0167j694Q631N188n405o553
414d859L429P539l0o208j221N957L283m592l667L432M976k156n720N89O425N90
430G767o857l533N544N128m635q006R83Q419J794r376o361O740Q771l932j1194
445h748j237J1264N973r300j0135N258J3179L87j3025n302J1217J0978n502j3478
$$ plain form
342 731 5908 3806 -522 1122 6145 5800 -324 -1409 5313 8000 1161 -4621 417 7877 4650 -5275
358 -5275 -6955 1868 7404 -673 -11066 -7135 5394 6311 -7184 -13895 -3121 8640 2497 -12045
372 -12045 -12343 3513 10838 -1326 -13381 -5832 10064 10465 -4713 -11687 1077 14730 8000 -7900
386 -7900 -7552 8457 15072 2057 -9804 -2934 11993 11179 -3925 -9922 1669 11985 5004 -8392
400 -8392 -7590 4741 8836 -1218 -9703 -3339 7289 5141 -5026 -6720 1911 7099 1694 -4859
414 -4859 -1430 6109 6079 -129 -1350 4607 7890 3298 -369 3063 8039 5883 163 752 7177 7767
430 7767 910 -2623 2921 8049 3414 -4592 -3609 4810 6604 -2772 -9133 -2393 6378 2446 -8748
445 -8748 -9985 1279 7252 -2048 -12183 -6925 6254 6641 -6384 -11686 -469 10509 5007 -8471
459h471P55J4328N902j1365j0361P158J3948p38j4100n002J1598J0284p426j3108
473f598J608J3353L705j1627q400O742J1287k147j2100k707J0340O240o841r057
487f202L244R451J379q689m128O933O633l767p380J235P623J598o378l502M706
502B756N058l318n949J425N794R3o182k721M643L731l958o441J291O832j54p445
518d545l551N889N651m788q160J402Q752K015q625n284O616Q323k859r436j058
533i658R745N956o965q712M324J1320P27j0582m441Q994Q619m973j0421Q65J0851
548E649L735q853p441N191R696j179j0039l235Q028O880n677r037J638R467J657
563F480q202m962N876O765k527p704l90P347K906n431m669L091N917l78o296j673
$$ plain form
459 -8471 -7716 6612 12514 1149 -9212 -2054 11894 11156 -2944 -7946 3652 13936 6510 -6598
473 -6598 -4990 8363 12068 441 -7959 -1217 10070 7923 -4177 -6884 3456 9696 2855 -6202
487 -6202 -2958 6493 7872 -817 -4945 1988 8621 4854 -2526 -1291 6332 7930 1552 -1950 2756
502 2756 7814 4496 -1453 -28 5766 5859 -323 -3044 1599 5330 1372 -5069 -3778 3054 2900 -4545
518 -4545 -8096 -2207 3444 -1344 -9504 -8102 650 2665 -5960 -11244 -4628 3695 836 -8600 -9658
533 -9658 87 6043 -922 -9634 -5310 6010 6737 -3845 -8286 708 9327 4354 -6067 -5202 5649
548 5649 9384 531 -6910 -1719 7977 6798 -3241 -6476 1552 8432 2755 -6282 -4644 4823 6480
563 6480 -1722 -6684 -808 5957 3430 -4274 -4664 2683 5589 158 -4511 -1420 4497 4119 -2177 -3850
579c850N774K950m675m428K921M833j882n379o90M950J873n131l854K956M485
594H53j942n656j026N163L091n295n211L673O833j620p240j484P367M330n158
609c322o189K801Q468Q26p560l472O633O909l176p809K92R002L658p295o408N407
625a235Q819j998q965j582P674N127n255p432J968Q186J213p672m626N537O714
640F473k966p979l72P822L047o589n259M444O097j407o899r27N789L571m125n165
656d445J907O048k06o190k033N241L895m206n725K324N995l46o330k088N329L027
672B197l562n188J325N657Q27n810l332M637N703l069o474N53P420K315o545m199
688g545N162O753k424o820J12P023L544m914n237K684P503P98p596l048O294O060
$$ plain form
579 -3850 1924 4874 199 -4229 -1308 3525 1643 -3736 -4426 524 2397 -2734 -6588 -3632 853
594 853 -1089 -6745 -7771 -2608 483 -4812 -10023 -6350 483 -1137 -8377 -9861 -2494 1836 -3322
609 -3322 -9511 -6710 1758 2584 -4976 -8448 -1815 5094 1918 -5891 -5599 3403 7061 -234 -6642 -1235
625 -1235 7584 5586 -3379 -4961 2713 7840 2585 -4847 -2879 5307 6520 -1152 -5778 -241 6473
640 6473 3507 -4472 -4844 2978 6025 -564 -5823 -1379 4718 3311 -3588 -4515 1274 4845 720 -4445
656 -4445 -2538 3510 3304 -2886 -4919 322 4217 11 -5714 -3390 2605 2259 -4071 -6159 -830 2197
672 2197 -1365 -6553 -5228 429 1256 -4554 -7886 -3249 2454 -615 -7089 -6536 884 3199 -3346 -7545
688 -7545 -2383 4370 1946 -4874 -4762 2261 5805 891 -4346 -1662 5841 6639 -957 -4005 2289 8349
704H349m130p295J153P813J845p184m578M978O196k265o632j346O008L656m785
719A783n829K022O797N00p051k916N697M767l635o274J367O281R33n582l037M078
735i9M390j887n523j38N123K575m862m458L309N247j333o109m72N485K132m574
751a194m066L079M625j050n008j203M573K975k868m777J266N907P32n787k273
766e069N345M280l449n057J484N905R74m725k928L939M437j497n242l85N211K920
782F143m505m822K830O203j172o203j346N691K976m098m548J614N058K1m963k291
798c412L623M141k427n043k0N446J885m971l559L477M946k225n279N58M930J628
814C698m126l233K817L952p55m500j229M133L144l444m405J683N377k31n412j667
$$ plain form
704 8349 4219 -3076 -1923 5890 7735 551 -4027 951 7147 4882 -1750 -3096 2912 6568 1783
719 1783 -4046 -2024 4773 5273 -1778 -4694 1003 5770 2135 -4139 -2772 3509 4442 -1140 -4177 -99
735 -99 4291 2404 -3119 -3257 1866 4441 -421 -4879 -1570 3677 2344 -3765 -4237 1248 3380 -1194
751 -1194 -5260 -2181 2444 1394 -3614 -4817 -244 2731 -137 -4914 -3648 2259 2991 -2796 -5069
766 -5069 276 4556 1107 -3950 -2466 3439 4413 -312 -3240 699 5136 3639 -1603 -1988 3223 6143
782 6143 1638 -3184 -354 5849 4677 -1526 -2872 2819 5795 1697 -2851 -1237 3821 3842 -1121 -3412
798 -3412 211 4352 1925 -3118 -3138 2308 4193 -778 -4337 -860 4086 1861 -3418 -2860 2070 3698
814 3698 -428 -3661 -844 3108 2353 -2147 -3376 757 3901 457 -3948 -2265 3112 2881 -2531 -4198
830d198M950L013l633m473J704M625L87m287k242L463L865j833m788J55M913K287
846C908m560l730L231N271j564n468k63N186K282l957l551K177M500J02n087j841
862c364M247L583k667n173R59N610Q85n373l032M110M307k546m933O64M859J616
878C752m151l513K692M694p32n143j362M916L194l736m387K086N358k99n104j805
894c540M593L163k914m372J017M693Q84m188k885L180M631k243m865l34N077K095
910C992m612l569K960M642j285m768r67M398K236k968l773J159M743Q08m741k556
926d301L923M062k843m614R48M744J189m586k566L093M073j821m327K7M207J968
942C176l072l662J611M528K00m830j632M477L172l526l853J957M441j12m137j547
$$ plain form
830 -4198 752 3765 132 -4341 -2637 1988 2375 -1912 -4154 -691 3174 1341 -3447 -3292 1621 3908
846 3908 -652 -4382 -1151 4120 2556 -2912 -3175 2011 4293 336 -3215 -1038 3462 3564 -1523 -3364
862 -3364 883 4466 1799 -3374 -2415 3195 4080 -1293 -4325 -215 4092 1546 -3387 -2723 2136 3752
878 3752 -399 -3912 -1220 3474 2742 -2401 -3763 1153 4347 611 -3776 -1690 3668 3369 -1735 -3540
894 -3540 1053 4216 1302 -3070 -2053 2640 3524 -664 -3549 -369 4262 2019 -2846 -3180 1897 3992
910 3992 -620 -4189 -1229 3413 2128 -2640 -3607 791 3027 59 -3714 -2555 2188 2996 -1745 -4301
926 -4301 -378 3684 841 -3773 -2825 1919 3108 -1478 -4044 -951 3122 1301 -3026 -2999 1208 3176
942 3176 104 -3558 -1947 2581 2781 -2049 -3681 796 3968 442 -3411 -1454 2987 2875 -1262 -2809
958b809L326L070k057l755M65M170J459l767l019L029L959j368m585j67M617J412
974C980l700k711K446L545r95l901j000L753J901k509l264Q42L727N48l797k421
990c556L478L165k337m141R05L919O00l590j976K463L205j662l722j82L591J722
1006A882k889k815J761L984q58l990q26L891K332l131k796J924L191K3l599j147
1022c063L169K582j877l226Q55L610Q39l634j734L091L135j851l908P40M293L57
1038C378l019k085K338L198j207l545l85L423K060l110l067J961L500n05l831
1053h96j236L653K207k651l381J300L381Kl213j628K332K903j632l502k41L763
1069A161J197l471k617K257L337j170l738l39L789J448l156k519J699L281k20
$$ plain form
958 -2809 517 3587 1530 -2225 -1760 2410 3869 102 -2917 112 4071 2703 -1882 -2049 2568 3980
974 3980 280 -2431 15 3560 2565 -1336 -2336 1417 3318 809 -2455 -1613 2114 2662 -1135 -3556
990 -3556 -78 3087 750 -3391 -2486 1433 2033 -1557 -3533 -1070 2135 473 -3249 -3431 160 1882
1006 1882 -1007 -3822 -2061 1923 1065 -2925 -3751 140 2472 -659 -3455 -1531 1660 1683 -1916 -3063
1022 -3063 106 2688 811 -2415 -1560 2050 2889 -745 -2479 612 3747 1896 -2012 -1272 3021 3378
1038 3378 359 -1726 612 3810 2603 -942 -1327 2096 4156 1046 -2021 -60 3440 2935 -896
1053 -896 -2132 1521 3728 1077 -2304 -1004 2377 2379 -834 -2462 -130 2773 1141 -2361 -2602 1161
1069 1161 2358 -1113 -3730 -1473 1864 694 -3044 -3383 406 1854 -1302 -3821 -2122 1159 939
1084I39l419j128L038K509k098l498J105M120M65l903j676L258K868j725l667
1099b812Q66M013P41l160j993K325L363q93l570o11L622K424k912l040J689L819
1115C871l34l495j453L520K254k667l207J204L440L80l175k130K503K960j585
1130B086l466k28L488J354l329k621K101L171r85l439r84L299J743k546k568R99
1146a925L250j23l287j492K826K331j542l339K69L671O58l172j520K121K560j147
1162A39l106Q1L490R54k832k058J967L072n71l340o35L620J795k434k763J864
1178g57L117k65k926r48K733K325j742k986Q88L239N02k784j642K215K768j510
1194B227k905m7L126J007k678k219J823K687q65k989p10K719J355j963k740J049
$$ plain form
1084 939 -2480 -3608 -570 1939 -159 -3657 -2552 1568 2033 -1870 -3546 -288 2580 855 -2812
1099 -2812 -1946 2067 2808 -352 -2345 -20 3343 2450 -1120 -1731 1891 4315 1403 -1637 52 3871
1115 3871 3537 42 -1411 2109 4363 1696 -1511 -307 3133 3513 338 -1792 711 3671 2086
1130 2086 -1380 -1608 1880 3234 -95 -2716 -615 2556 1571 -1868 -2852 447 2190 -356 -2924 -1925
1146 -1925 1325 1202 -2085 -3577 -751 1580 38 -3301 -3032 639 1297 -1875 -3395 -1274 1286 139
1162 139 -2967 -2886 604 1558 -1274 -3332 -1365 1707 1136 -2204 -2839 781 2576 142 -2621 -757
1178 -757 2360 2095 -831 -1779 954 3279 1537 -1449 -561 2678 3180 396 -1246 969 3737 2227
1194 2227 -678 -725 2401 3408 730 -1489 334 3021 2156 -833 -1543 1176 2531 568 -2172 -1123
1210a123K620m5l153q04K448J878j861k637N89K615J56k580j055J978J997j220
1226a97k494K66K501P22k244j769J797K418p51k817o8K765J023k352j747J866
1242a081K233m47k591k14K324J367j873k123J365K506P6k937p35K722J888j557
1258I23k450N19L050O99k885j550K317K463j474k712M6L005J237k731k072J742
1274A27K667n93l011o47K443J878k245k713R06K960J63l142j084K310J821j570
1290B70k754L53K887N97k737j618J959K327p82k801k80K721J276k136k228J509
1306a437K707o09k572n51K591J564j743k312Q69K738J14k734j157K607J927j696
1322C06k115J08K986N81k388j726K272K129r62k898q3K946J179k348j954J546
$$ plain form
1210 -1123 1497 1452 -1701 -2505 -57 1821 -40 -2677 -2088 527 683 -1897 -2952 -974 1023 -197
1226 -197 -2691 -2425 76 798 -1446 -3215 -1418 1000 249 -2568 -2636 129 1152 -1200 -2947 -1081
1242 -1081 1152 705 -1886 -2100 224 1591 -282 -2405 -1040 1466 1542 -1395 -2130 592 2480 923
1258 923 -1527 -1008 2042 2741 -144 -1694 623 3086 1612 -1100 -1054 1951 3188 457 -1615 127
1274 127 2794 2201 -810 -1457 986 2864 619 -2094 -1188 1772 1935 -1207 -2291 19 1840 270
1290 270 -2484 -2131 756 1353 -1384 -3002 -1043 1284 502 -2299 -2579 142 1418 -718 -2946 -1437
1306 -1437 1270 661 -1911 -2462 129 1693 -50 -2362 -1493 1245 1359 -1375 -2532 75 2002 306
1322 306 -1809 -1701 1285 1866 -522 -2248 24 2153 1191 -1707 -1790 1156 2335 -13 -1967 -421
1338d21K680n09k517q89K599J944j962k460Q40K751N51k987j470K434K223j556
1354A251k871L09K789R70k504j802J384K514o52k904m76K307J568j945k230J066
1370a226K548j11k858m43K079J537j539k002N60K359M01k216j196J789K135j041
1386G76k306L7K601M85j888j495J613K054j193k198K85K118O36j543j661R99K121
1403A441k83k171o23J980J436j673j984Q62K341J23k346p45J782J586j388j861
1419a523N48K080N84j993j220J415J872o50k186r5K246J063k043j822J467J964
1435A707o37j958l76K015R24j140k092P33K089P9k108q11J637J801j298k151M59
1452a127K339K74k116r33J857J347j288j449J39J943M33j546j246R60J830j54
$$ plain form
1338 -421 2259 1750 -767 -1656 943 2887 925 -1535 -695 2056 2607 -380 -1850 584 2807 1251
1354 1251 -1620 -1311 1478 2448 -56 -1858 -474 2040 1388 -1516 -1992 315 1883 -62 -2292 -1226
1370 -1226 1322 1211 -1647 -2090 -11 1526 -13 -2015 -1455 904 1305 -911 -2107 -318 1817 776
1386 776 -1530 -1493 1108 1593 -295 -1790 -177 1877 684 -1514 -1229 889 1525 -18 -1679 -680 1441
1403 1441 1158 -1013 -1636 344 1780 107 -1877 -1015 1326 1449 -897 -1642 140 1726 338 -1523
1419 -1523 -975 1105 1689 -304 -1524 -109 1763 1113 -1073 -1168 1078 2141 98 -1724 -257 1707
1435 1707 1070 -888 -1264 751 1675 535 -1557 -824 1265 1344 -764 -1575 62 1863 565 -1586 -1127
1452 -1127 1212 1486 -630 -1563 294 1641 353 -1096 -957 986 1419 -127 -1373 -413 1417 1263
1468A263k206k39J829J118j875j505Q71K169m79j960n52J926R04j131j984N31
1484a320J875M43j974j204J739J990j363k303M38K386L66j850j230J364J973o75
1500F55j965k7J880R14j370j690J001K316j25k329p04J966J702j697j789N68K342
1517A648J48j986j046J609J625r51j931K7J933P58j537j677J085K170l66k431
1533i22l74K290J146j894j557R31K050k30j868p34J449J351r30k065J65K182O39
1550A629k126j535J483J951q82k177Q8K169N50j855j312J174J601m19j900l01
1566a862J802R69j211j859Q84K210p6j946p50J911J438j362j536N62J977kj211
1583f2r61J159J544m31j560l15K034P26j544j368R85J809m38k123j22J849P17
$$ plain form
1468 1263 -943 -1182 647 1765 -110 -1615 -744 1425 946 -1014 -1566 360 1264 133 -1851 -1320
1484 -1320 555 998 -976 -2180 -441 1549 186 -2117 -1679 707 1073 -777 -2007 -643 1330 655
1500 655 -1310 -1337 543 1457 87 -1603 -602 1714 1589 -740 -1444 522 2224 527 -1262 -694 1648
1517 1648 1796 -190 -1236 373 1998 1047 -884 -857 1076 1834 297 -1380 -295 1875 1509 -922
1533 -922 -1296 994 2140 246 -1311 -380 1670 1440 -428 -1162 287 1638 708 -1357 -1192 990 1629
1550 1629 -497 -2032 -549 1402 520 -1657 -1569 600 1150 -705 -2017 -843 758 339 -1561 -1862
1566 -1862 -60 909 -302 -2161 -1277 933 857 -1089 -1839 72 1510 148 -1388 -826 1151 1149 -62
1583 -62 -1023 136 1680 1249 -311 -626 1408 2134 590 -778 207 2016 1578 -545 -667 1182 1899
1600A899j352j480Q83J717l57j344p85J257J378q38j769J42K025K35j862r67J306
1617H8J725r80j858K15J591J89j262r87Q10J372m10j448q00J487J203j118j724
1634a907Q59J678l87j633l04J357R85j257j272P36J296p0j031n65J037J211o98
1651C5j400K11J783M59j447p31J131J422p28j399J30J519N67j435o52Q84J069
1668A418k31j042o64J544Q99j170j536O87K025l48j714o75J584Q58j106j353M15
1685d09J429J65j269q56Q31J459o22j930j64J944N62j642j082J037J445n69j867
1702a538R4J496N45j001j358N36J506L2j393q75J391J242q97j755L43J701N58
1719F27j708q57J338J274n25j813L42J681N70j309r76P32J532qj632n40J527J405
$$ plain form
1600 1899 547 -933 -50 1667 1310 -34 -819 438 1816 978 -791 -649 1376 1611 -251 -1218 88
1617 88 1813 833 -1025 -810 781 970 -292 -1279 -469 903 493 -955 -1755 -268 935 -183 -1907
1634 -1907 -1048 630 243 -1390 -1694 -337 648 -609 -1881 -1145 151 81 -950 -1515 -478 733 35
1651 35 -1365 -1154 629 1088 -359 -1090 41 1463 735 -664 -534 985 1552 117 -535 349 1418
1668 1418 1187 145 -519 1025 1924 754 -782 -95 1930 1582 -132 -807 777 1635 529 -824 -409
1685 -409 1020 1185 -84 -940 -109 1350 728 -1202 -1366 578 1140 -502 -1584 -547 898 329 -1538
1702 -1538 -1444 52 597 -404 -1762 -1226 280 312 -1081 -1956 -565 677 -220 -1975 -1632 69 627
1719 627 -1081 -1938 -600 674 149 -1664 -1322 359 929 -380 -1356 -624 908 900 -732 -1272 255 1660
1737A660j126j578Q38J734j37j573m72J409Q87p01j302J41J379M89j474q21R42
1754B95J427l04k052j81J667P86j490j411R97J472l67j680m08J568P70j076j387
1771a374M16J558L53j817p04J203J295o43j960L33J586M05j607q83J126J272m81
1788G8j315m4J308O81j037j269O28J478j4j449l62J320P96q99j359O78J709l56
1806E72j032l85J032R03m52j231q7J435O18j203p28Q35J275m76j449M8J315M33
1824A423j067r90R59P98j29j016k56P49J010q42j526P12J130O0j210p19J071J066
1842A223r87j382M12J457J32j282o82Q14P38k87r70r6R02P42r85j035Q08J043
1860E65j44j276%R54M51o73j149O39J374j88j225k91P84R66p25r85J68J370L23
$$ plain form
1737 1660 534 -1044 -206 1528 1391 -182 -654 755 1642 941 -361 -220 1159 1648 174 -647 295
1754 295 1722 1418 -634 -815 852 1638 148 -1263 -266 1206 839 -841 -1249 319 1089 13 -1374
1771 -1374 -958 600 953 -864 -1568 -365 930 287 -1673 -1340 246 651 -956 -1839 -713 559 78
1788 78 -1237 -1281 27 708 -329 -1598 -970 508 494 -955 -1317 3 799 -100 -1459 -781 928 572
1806 572 -460 -845 187 1090 638 -593 -680 755 1373 170 -558 277 1552 1076 -373 -325 990 1423
1824 1423 356 -634 325 1123 994 -22 -278 471 1481 639 -887 -175 955 1015 -195 -914 157 1223
1842 1223 236 -1146 -734 723 855 -427 -1109 -295 443 156 -814 -910 -8 734 -251 -1286 -478 565
1860 565 421 -855 -855 99 550 -123 -1272 -633 741 553 -672 -963 -179 787 62 -923 -755 615 938
1879I38j516n83J262P96m42j251L97J049L22j087n52Q24Q48l87q58l20J068Q06
1897A314j193o88M23J390j71j526k47J368O14r51q76J20J217J67j254o27R85J033
1915A098q46q95q1J368M61j451r54R96J084l36j259j45J357N50j097r16N56J225
1933G15J4j407m35J246Q07q32j261L51J281Q7r99p98J057J182p20j168J02J219
1951D41L85j136p08R60P22j44j412K36J039M68p46j077M34J319k54j259j77J119
1969B10Q49j054p11J46J115K11j100n32Q32R18k30j530L89J144K53j114p21Q55
1987g0J139l30j422j11J308N57j055q83L45J514k18j166n56J112R31r50q78J60
2005e73J345K47j131q81J102P79k96j224j29J172O33j045j103P39J162j47j188
$$ plain form
1879 938 -578 -1161 101 897 455 -796 -399 650 972 -115 -667 157 1005 618 -240 -560 508 1314
1897 1314 121 -567 -144 1246 1075 -451 -698 670 1284 333 -543 -423 794 961 -293 -920 65 1098
1915 1098 252 -643 -724 644 1105 -346 -1300 -304 780 444 -815 -960 397 947 -150 -1066 -510 715
1933 715 729 -678 -1113 133 940 108 -1153 -802 479 566 -433 -1231 -174 1008 288 -880 -778 441
1951 441 826 -310 -1018 -58 664 520 -892 -656 383 851 105 -972 -538 781 527 -732 -909 210
1969 210 1059 5 -706 -560 555 766 -334 -866 -34 884 654 -876 -487 657 910 -204 -925 -70
1987 -70 1069 739 -683 -794 514 1071 16 -867 -522 992 774 -392 -948 164 1095 145 -733 -573
2005 -573 772 1019 -112 -993 109 888 592 -632 -761 411 1044 -1 -1104 -365 797 650 -538
2022e38k21Q41N51n19j115L61J259j61r94k32O77M91m18p35K66P18K25q51n09
2041i04O61J062q46p42K44P42K33p50o78P62Q53m07j019J56R44K69p35m21L70
2060b06R33m1j270K9P92N00p62p28M47R02j5q96k85P11J009p99q37J85R49K56
2080H74r84n73O61R83m54q97M7R87K26p46o34K17Q98J05j128l27J285N11q41q74
2100f64K59Q30J07o55o54N46P06l24q85Q8O66M34q69o92P02Q82m76q34JP87M65
2121D20r20n45O97P31k39p74j69Q60M84o68o88N36R54k98r02r6R22P30j022q25
2141h12O32R37r4j055k70R83P51m02j279J96J162M16j147o68Q29J062l27j121
2159b07j62J152N17j226p44N45J131k86r23o04R22Q97m78j253K8J354K00j034
$$ plain form
2022 -538 -759 82 633 114 -1001 -640 619 458 -536 -768 -91 400 -18 -753 -487 231 456 -395 -904
2041 -904 -243 819 -27 -769 -525 217 450 -300 -978 -216 637 230 -789 -633 311 580 -155 -576 -206
2060 -206 727 686 -584 -555 237 737 -25 -753 -306 596 581 -315 -600 111 1120 321 -516 -331 618 874
2080 874 -110 -683 -22 961 507 -390 -343 644 870 124 -510 -293 605 710 -418 -745 540 1051 210 -664
2100 -664 -405 425 532 -123 -777 -231 475 151 -734 -646 20 454 -415 -1107 -405 477 1 -833 -832 -45 420
2121 420 -500 -1045 -348 383 144 -630 -799 61 545 -123 -811 -275 679 381 -521 -617 305 1035 13 -812
2141 -812 -180 757 663 -392 -662 321 1072 670 -609 -413 749 1165 18 -650 179 1241 914 -207
2159 -207 -369 783 1300 74 -670 -125 1006 720 -203 -807 115 1012 534 -719 -691 663 863 -171
2177a71q65Q62Q79n9j478j01P97P58o34j020M27O89L57q88n90P17N75l98o18j38
2197h99R06J56j032n2O41O83o05o02J97O85n0l62m24P52L75k07n65N2P93N7n99
2218a00n94Q11P56k93q79O2J070L6o60n62N10P22j33q42k82R48O17o11j057K90
2238a91J108J44j116o77O21J092k81j318P7J122K52p98n73M8J074l2r62n83O37
2257c56J022p74q05K76Q18J57o89o78O80N83l16p56N5N63O1qo48J75O94m5m70
2278d61k17M54M26m49m08M74N23l13l82K35N53j45k19k57L88M34l64k97j14N84
2298D45M56q63m41P48O89l41j120K66R68J79q50n00J83J071j87o80m72N52R02
2317A005m45j237K64J140K78j119q22O42R37J0j045n15P58O04m44q62M5J029M44
$$ plain form
2177 -171 -1036 -174 705 646 -832 -933 -136 622 -12 -1032 -605 84 441 -447 -1037 -320 255 -143 -761 -899
2197 -899 7 163 -869 -921 -280 403 -202 -804 -607 78 28 -334 -758 -6 369 162 -403 -351 442 499 -100
2218 -100 -694 117 873 580 -299 -237 833 869 209 -353 157 879 746 -96 -378 570 1187 576 -481 -191
2238 -191 917 1061 -55 -732 -111 981 700 -618 -541 581 833 35 -538 -490 584 552 -410 -993 -356
2257 -356 666 -108 -913 -637 181 338 -351 -1029 -349 234 -82 -838 -783 -220 -159 -167 -815 -640 54 9 -461
2278 -461 -678 -224 202 -247 -655 -181 342 29 -353 -118 435 290 71 -186 202 636 272 -25 -139 445
2298 445 901 38 -403 345 1034 693 -427 -161 807 986 136 -364 -181 890 703 23 -449 103 1005
2317 1005 560 -677 -413 727 1005 -114 -936 -294 643 653 -392 -907 -149 455 11 -851 -806 223 667
2336F67r46p93O10R53j46j269k48J073L38n15m66L80N03R1o96k43M71N95l74l76
2356c91p2O94K6m20l40N00N91o68k97K59O48l34k74q0N00J42k68l76K63N96n8
2377F41o19l67P90K83m53n67Q3R51J37j035k81P35O46l51j151N4J093L91r11r82
2397i13N94J058n5j037n39J134Q63r59j001k3J301L85r64o79M67O77kq05m50R39
2417iN32l70r63J2J198K06j037m07M50Q15k43o51j61N54L72k15m72K2M75L06m28
2438a4n17O54M54m51n00L20M30k34m9j88L24M6l79m3O49k4m13k81P3L40L00m00
2460I7n32O73J72q8r66M52O77R6o96o63P51P47k98q44j5M53O64m15q02J07Q29
2481C99L55q43p66N87J067k45j044l7N97P22q09o54K25O79M99r56m98M84O14J51
$$ plain form
2336 667 -279 -1072 -462 491 345 -924 -1172 -99 239 -276 -742 -362 141 232 -464 -707 -236 359 -15 -391
2356 -391 -463 231 257 -163 -503 -3 588 -80 -377 -118 530 196 -78 -158 342 484 216 -160 103 699 641
2377 641 22 -345 445 728 275 -292 -209 742 879 -156 -437 298 944 593 -558 -504 589 980 69 -913
2397 -913 -319 739 684 -353 -892 242 1105 146 -855 -878 423 808 -156 -835 -368 309 307 -498 -948 -9
2417 -9 523 153 -810 -798 400 606 -431 -838 -388 427 184 -467 -628 -74 298 83 -389 -367 108 414 -14
2438 -14 -531 123 577 126 -374 -54 376 142 93 -95 229 275 -104 -147 502 478 65 -216 -143 197 497 97
2460 97 -435 238 410 322 -644 -192 485 581 -115 -778 -27 720 422 -422 -437 16 680 265 -537 -430 399
2481 399 754 -89 -855 -268 799 554 -490 -527 70 792 -17 -671 -446 233 732 -224 -722 -238 376 527
2501E27r63k17Q26M61o72o10M33O44J1o05pJ65L96k53m27j51N79K40l84k06J34
2522g9K31l0k73L1L53j69k97rN26j54m18lL31K23k39k56k87P99K74m22o79M94
2544e3Q36l55q79j43R23M78r07o67K79J102K85j131k41M01Q62j97j073j22R20
2563C18N83o01j170M67J035R7r45m00N77R08m93r70l5P44O04l17j094K71R96J72
2583G47j018n05O76Q73l93q93j87R52J27m89k90Q0M45Q4n09p4L73L49j85n29L
2604c63N98k52k45k37M93J62l80j89N06J45l88j08m1N94r8m54K5L14L28j30q24
2625e44K22P32J60o21n08L35J015n01o00k62R66M44n67q30L76Q59J02p85p39P76
2645C0Q61k40j128j30J001N23p05r51M12Q90q8o41m68N48O07q4r93j60P99M10
$$ plain form
2501 527 -436 -653 173 634 -38 -648 -215 429 440 -165 -172 -7 389 136 -291 -442 137 377 -7 -213 -79
2522 -79 152 122 -151 -120 233 64 -233 -242 284 130 -288 -291 40 263 24 -232 -519 280 554 132 -547 -53
2544 -53 783 428 -451 -594 329 807 -100 -767 -488 614 899 -232 -473 -72 790 593 -480 -602 318
2563 318 901 300 -870 -403 632 729 -216 -616 -39 869 376 -594 -629 115 719 402 -692 -421 575 747
2583 747 -271 -776 -100 773 380 -513 -700 252 379 -110 -400 -320 125 209 -300 -374 -1 348 163 -366 -363
2604 -363 235 -17 -262 -499 -6 156 -224 -413 93 238 -150 -258 -299 295 197 -257 -232 82 410 280 -544
2625 -544 -322 410 570 -51 -559 -224 791 290 -310 -572 394 838 271 -559 -183 676 778 -7 -746 30
2645 30 891 651 -477 -607 394 917 212 -739 -327 563 475 -166 -634 -86 521 437 -556 -716 83 493
2665D93m73p01N8P45J06q22j07L09N09j34n08K4L70L24k32l66J38M34j25k88m8
2686b94K11K60n03L75j37J33j60j83M82K87m22l12J58K71J39l02k07L49N44j65
2706E24n29l01O86L64n20n88M06O69Q8j124j15Q22L95m68m94p2P11M36o92o88
2726d90M90O04J37j135l47Q33O35m45p39j19P32L63o50o94M00O52j1n87m89P94
2746f6N07m53n87j0N25K41m29k54M06K51j94l8l26M62rk00j46K11k6J84l48J07
2768a92L03k95P1j53K28K51j05l93L86L95j54l69J12K75J38l36l90J71M91R3n14
2789A3j81L06O93m51n34k09P68L52o85n49M03P29j28r12l18Q65N46q7j361L13
2809d27O92M47r18n31L47O94j1n84m58N26O77n46n43K5P22K83n57m26J40O26P4
$$ plain form
2665 493 20 -681 -623 122 228 -594 -701 -392 117 -17 -525 -501 -131 193 -39 -405 -267 167 42 -246 -294
2686 -294 -83 177 -326 49 -88 45 -115 -298 184 471 49 -263 -105 166 305 3 -204 145 689 524
2706 524 -5 -306 380 744 224 -364 42 711 799 -325 -440 382 777 309 -185 -257 454 890 198 -490
2726 -490 0 604 741 -394 -741 92 727 282 -457 -576 156 519 -131 -825 -425 227 216 -371 -860 -66
2746 -66 441 -12 -599 -609 -84 157 -272 -526 -120 131 -63 -101 -427 35 26 -174 -320 -109 -135 49 -299 -192
2768 -192 111 -184 -113 -266 -38 213 108 -285 101 496 342 -27 85 360 498 162 -228 -57 434 527 13
2789 13 -168 138 831 380 -154 -363 405 757 72 -477 -74 655 527 -385 -703 162 708 621 -740 -427
2809 -427 265 712 -206 -737 -390 304 293 -291 -749 -223 454 -92 -635 -610 112 395 -162 -588 -448 178 252
2830B52p32j15M33N09n09l17m5O56P8k60l65L27M80l70j67MK58Q6j03k6K27l4
2852B67j78j75l7M17N5l49j07L84K25k81l95K62N45j94m24p0L41J21k39l06o7
2873b05O39K44q42k07M01N02k59p04j40P05M85q09n40M51P31m3p81j02K55M60
2893B41j86n71J36O01M8l51n18K86N33K0o89k62O35M43l34l74K7L51J73l33k38
2914c62J87L47j96j86k6L99J13l99P1J12J60j90k1l8J03O1oQ9N4j17J40m57J33
2937b9L10p7k95j21L14K20k98o9r4N57nm54k84M15M38l38n73K43N29Q8o48m01
2959e72O22K73j0o70j88O06K34k85q17N39M55K26q10j87M05N58l85m01l4L85M12
2980C56l47n32J84N15K95o97m23O32J90Rm35j66O65rl59k95M61J49j20k80J61
$$ plain form
2830 252 -480 -595 -162 347 -162 -479 -524 132 210 -50 -415 -88 392 22 -145 -141 117 203 100 74 301 267
2852 267 89 -86 -123 294 349 0 -107 277 502 221 -174 88 633 439 15 -55 286 407 168 -138 -205
2873 -205 434 678 -164 -371 30 532 273 -431 -571 134 619 -190 -730 -279 452 409 -372 -474 -219 241
2893 241 55 -516 -380 221 269 -82 -600 -314 219 239 -450 -712 -77 366 32 -342 -315 36 209 -124 -362
2914 -362 -175 172 -24 -210 -236 163 276 -123 -52 60 220 30 9 -29 74 135 129 218 272 155 295 -162 -29
2937 -29 281 204 -91 -212 102 322 24 -45 -139 418 413 -41 -325 90 528 190 -383 -140 389 477 -171 -572
2959 -572 50 323 313 -357 -545 61 295 10 -807 -268 187 413 -397 -584 -179 379 -6 -407 -441 -56 356
2980 356 9 -523 -339 176 471 -226 -649 -17 173 182 -253 -419 246 237 -122 -417 44 193 73 -207 -46
3001d6P0K48j89k86L41R4km94K17K64k7k87qk6L70o4j18J31l2L05l16m45J31N70
3025D01k8m48j05M49N6l75l13J67O43k39m81l08P22J39J0o78k46R42P2m77o22
3046g19N38O07j28n85j17N55J82j59n21R6M10K33m90l34K54P62k80o05q1M74L61
3067D53m47l35J13O60m86j75j85L61J42j62j72k3L30K91k73l84K92N7m1j13j17
3088b14L64lk25p6L15N0n2m12J10K3K50j20j75Q0L78j95m07K20K58j6k75j38L88
3111A28L92m86k29n1L51Q1p6m39K54M30l9m21K6J55M56l29m65J01N69o9n01l28
3133d90M31L94j73m38Q5L06N3P9n27K6M79Q8m96j04L09K81l20l20K44J60O9m15
3155b79K2K27J0m9m03L10J32r1r7j50R9L51j0l85J61L54M9n09K06J2L38k16m28
$$ plain form
3001 -46 24 272 83 -203 138 232 230 -264 -47 217 190 -97 -105 -131 239 175 57 188 156 461 145 -300 -169 401
3025 401 373 -75 -180 269 325 -50 -363 -196 447 208 -273 -581 141 280 290 -388 -634 308 380 -97 -719
3046 -719 -181 426 298 -287 -404 151 333 174 -347 -251 159 392 -98 -432 -178 584 304 -301 -382 92 453
3067 453 6 -329 -216 444 -42 -217 -402 -41 101 -61 -233 -256 74 365 92 -292 0 57 16 -97 -214
3088 -214 150 147 -78 -154 161 211 159 -253 -143 -120 130 10 -165 -85 293 98 -309 -89 169 153 -122 -260 128
3111 128 520 34 -195 -246 105 186 110 -329 -75 355 316 -105 -79 76 532 203 -262 -161 408 339 -162 -490
3133 -490 -59 335 162 -276 -191 115 168 247 -280 -254 225 313 -183 -287 22 303 -17 -337 -93 67 136 -279
3155 -279 -257 -30 -20 -69 -472 -162 -30 -121 -218 -368 -269 82 72 -313 -152 202 251 -258 -52 -40 298 82 -346
3178c46J86M09j19j40p1J21L42j11l24j33M37J76k67m47M25J59J1m44Q9K09K38
3199D00j6n83K1L42K30l52n33N19O47m52m39j40N27J12j48l97Q0M42n9l57k95
3220d51M68L08k28l46j89L64M27o84j34L63K69r8n37J66L59m2j68l95L61K77J24
3241B14l76j39J55K22P2o25J99M62K74m48l68M40K82l21k14J17L53P6l25k04Q0
3262g4L98j01k98K4M71K7m72r4J68L65N0n49R2J42L55n61j13J75L10j46k71k85
3284c87N13K50k29j72k22L43K24l31l75K93K64k89k41K9M73j00l28no1K94Q0k09
3306a86j49M01K2j43k45P4L39Kl89P9K06n3lm69M31K21o1m2j68J58K70j41k69
3329a15j69L09K28k64k09R3L55p1l84K27K85p2o2j61P8J25J96m58L6K35J63j61
$$ plain form
3178 -346 -160 249 130 -10 -81 40 382 271 -53 -186 251 427 160 -287 138 297 308 -136 -47 162 400
3199 400 384 -199 -178 164 394 42 -491 28 675 223 -216 -356 171 283 135 -262 -182 260 201 -156 -451
3220 -451 17 325 97 -249 -438 -74 353 -331 -465 -102 167 69 -468 -302 57 15 -153 -548 -187 90 214
3241 214 -162 -301 -146 76 148 -477 -278 184 458 10 -358 82 364 43 -171 -54 299 375 50 -154 -74
3262 -74 324 223 -75 -51 420 447 -25 -119 49 414 464 -85 7 149 504 -57 -170 5 315 169 -102 -387
3284 -387 126 376 147 -25 -247 96 320 -11 -386 -93 171 -118 -359 -330 143 43 -285 -290 -351 -57 23 -186
3306 -186 -335 66 88 -55 -300 -226 113 115 -274 -195 11 -42 -45 -514 -83 138 77 35 -133 25 295 154 -115
3329 -115 -284 25 253 -11 -220 -127 228 157 -227 0 285 213 151 -10 68 193 389 -69 -33 202 365 204
3351B04l11K56K10o6k95j72L75J08l17l19L21J54o4k50j03K62K07J5l45j70L42
3372D2R6l09k70L74K60j96k84j29L24N6l7k53J74K96m4m08N2L50J62j17m57J20
3394a98M40l52k81J75R1L12j09l0k28L51M6l66K7R2L25o6l56j82M92J75j7m24
3416h3L25J05j51k67o4L71lk28j91J13M35j08k82j86K54L13r1m95j67P09P4m53
3438g0k97L18N05k89m06M4K8L34l38r0J73J48J14n26L2J25L87k97k52J33M01k0
3460A57k16k96J66N08m41k58J66K67J83j74k73lK96J8l35r5L80J43r6l66R9K31
3482F1O0o4o3Q9K17n5l93J97Q7J23j34l57R8M21n3l32jL02P3m86K01R7K01k42
3506D7j15r4K15L4j01mj24L14N6n03j7K63K29k18k98K57N1J75k74P3K08l10J95
$$ plain form
3351 204 -107 149 359 293 -2 -174 201 309 -8 -327 -6 148 84 -166 -269 -7 200 215 -130 -300 42
3372 42 138 -171 -441 -67 193 -3 -287 -416 -92 -36 -73 -326 -152 144 100 -308 -256 94 256 139 -318 -198
3394 -198 242 -110 -391 -216 -125 187 78 48 -180 171 217 -149 -122 -30 295 229 -127 -309 183 358 341 -83
3416 -83 242 347 196 -71 -135 236 233 5 -186 -73 362 254 -28 -214 40 353 262 -233 -400 309 383 -70
3438 -70 -367 -49 456 167 -239 -195 -167 167 -171 -261 -88 60 174 -352 -320 -195 192 -105 -357 -224 177 157
3460 157 -59 -355 -189 319 -122 -380 -214 53 236 62 -211 -214 82 100 -235 -330 50 193 97 -269 -170 61
3482 61 121 57 -6 83 300 245 -148 49 136 259 125 -232 -134 287 234 -98 -99 203 276 -210 -9 88 289 47
3506 47 -68 -162 53 87 -14 -18 -142 172 228 -275 -292 -29 200 -18 -316 -59 -8 167 -107 -34 174 -136 59
3529E9l99J32K62K8j9j63j01K17J63m24N2J92J54k84k64K58K16J59k47j38K41
3550I4j3j57kj66L66J03k55j51P7L34j20m74K04K21N4j83j4k1M70l22n04J84J99
3573g6K06J52m33K49P9j1l9l40K99L02m26k12J41K42j08k96J51K24J40l60m9K7
3595a38K26P4j30k67J65L15j94j76J13Q7K7Lm03J76P0K25j98j06L8M01m08M9j4
3618f5O0K29k57l40L47R3j8m29J62M28J08m44j50L51J91Lm28%J61K97k83m03K02
3641a85L53O1m92J11N21k94k4l00j6K34J95k07j66K31J24j63j20j95M29N4k80
3662a29k67N70J01r8l02o7L00L15m13k89K53q7J85k57j1M08J70l64k69J44L16
3683B09n5j91k78N13j01M5m67m3K96J76j46j32K8M39j01m94J83R6K56l05k30J24
$$ plain form
3529 59 -340 -208 54 82 63 -100 -201 16 179 -245 -193 -1 153 -131 -395 -137 79 238 -9 -147 94
3550 94 81 -76 -78 -244 122 225 -30 -181 -104 230 110 -364 -160 61 115 -68 -82 -103 367 45 -459 -275 -76
3573 -76 130 282 -151 98 177 166 127 -213 86 388 -38 -250 -109 133 25 -271 -120 104 244 -116 -165 -138
3595 -138 88 162 32 -235 -70 245 51 -125 -12 75 102 105 -298 -122 -52 173 -25 -131 -93 308 -100 -51 -65
3618 -65 -5 224 -33 -373 -26 67 49 -380 -218 210 318 -126 -276 75 266 269 -159 -159 2 299 16 -387 -185
3641 -185 168 229 -263 -152 369 75 51 -249 -265 -31 164 -43 -209 22 146 -17 -137 -332 97 151 -129
3662 -129 -396 174 275 177 -125 -192 108 423 10 -279 -26 -113 72 -185 -196 212 382 18 -251 -107 209
3683 209 154 -37 -315 198 97 142 -325 -368 -72 104 -42 -174 -146 293 192 -302 -119 -23 233 -72 -302 -178
3705a78K49O3k64j72L33J93k92n5k2J79J01l61Q4J68J42j99r0k7K07J88j98j85
3727a36J59J1j04k58J84L49M3k96j71J47J28o0M4j26J55K29j85j28n9K06O2r5
3749I9j45ML37j6o59L63K69l4j43n6J58M3j59j74N9L49j57J77m10L0K20O5k01
3772A9k08K44J4Qm37L54Q1O4l24K16j63K49j24p0r5L88k26pj37J71J81l25J33
3795FO0J33k55Qk01K14K96k78q0p3L14J00l75l2J09K87j4l46RJ88K13j95l17J12
3819a17J91qj47J35k5J62n5k02o5J90L57l39j65J90K53q6m04R9L9M72m85j40J43
3842gPO8j57j2L8K56N2n01r2L98J29k55l73M36L93m58j91J48K24p8J11l58Q8K81
3866A47J13m62J32N5L00k91k33R9M60k41l28N8L71Jj64j55K77k06K60k21j65J67
$$ plain form
3705 -178 71 134 -130 -302 31 224 -68 -123 -145 34 135 -226 -142 26 168 -31 -121 -148 59 247 49 -136
3727 -136 23 34 -70 -328 -144 205 248 -48 -219 -72 56 -4 40 -86 69 298 113 -15 -74 132 194 99
3749 99 -46 -42 295 279 -380 -17 252 218 75 19 177 220 61 -113 -54 295 138 315 -95 -65 155 220 19
3772 19 -189 55 69 77 -360 -6 75 139 -185 31 -132 117 -7 -77 -172 216 -10 -17 -154 17 198 -127 6
3795 6 66 199 -56 -48 -249 -35 261 -17 -97 -170 144 244 -131 -163 -54 233 219 -127 -118 70 283 88 -229 -117
3819 -117 74 66 -81 54 29 191 136 -66 -131 59 416 77 -88 102 355 269 -135 -36 3 475 -10 -150 -7
3842 -7 0 68 -89 -101 -63 193 245 -256 -348 50 179 -76 -449 -13 380 -78 -269 -121 103 25 136 -222 -134 147
3866 147 260 -202 -70 -15 285 -6 -239 -140 320 79 -249 -191 180 181 17 -138 139 -67 193 -28 -193 -26
3888b6J81J03j62j08M7J41k34K1J08j69K34k20j43K18J59j39P6m7J66k20J02p5
3910A3J17K65l15j76k4K66R3m44j7N3M19k35j92J02K59K6l39k9N7J64J54o20J06
3933b97R4J39p8j05J90J31k82rj33L58N6j12k77J94P2K46k40j14L50n9J28l80
3955a28o2J36P9L2k86R5M05j58n0l60K79O3k1J4j33J22K22l88M7K00R4o0o3k99
3979b20K15J77j78L5j1q5J04R5j11J96o1l63Q4P9J80j09k59k3L76k3k90J23J64
4002I5M5j52l55K14P9K07j58m57M32J08m2j15o3J25n1Lo6l8L55j32m34K79J36
4025A5K40l30jN7N5L21m06j52K35O1N8r1k05L7L99q8m77J31J74O7j08k68M06K1
4049A51m8k92L4L59M3k57k31L10J57j13j81k38L64J79l61Q0q5M68j46m77J42K04
$$ plain form
3888 -26 155 258 96 -12 35 176 -58 -37 71 -98 136 -84 -227 -9 150 11 87 40 206 -14 88 13
3910 13 130 395 80 -96 -120 146 239 -205 -222 -169 250 15 -177 -75 184 210 -129 -158 -101 63 217 -403 -297
3933 -297 -203 -64 -142 -247 -57 74 -208 -217 -350 8 64 -48 -325 -131 -59 187 -53 -167 183 124 252 -128
3955 -128 -190 -54 25 57 -229 -134 271 113 63 -297 -18 45 24 38 -95 27 249 -139 -92 108 202 142 79 -220
3979 -220 -5 172 -6 29 18 -67 37 132 21 217 156 -207 -123 -44 136 27 -232 -255 121 98 -192 -69 95
4002 95 140 -12 -367 -153 -74 133 -25 -482 -50 58 16 -99 -162 -37 -88 -85 -151 -189 166 34 -400 -121 15
4025 15 255 -75 -76 -19 36 357 -49 -201 34 95 153 62 -143 -106 293 205 -272 -141 33 100 -8 -276 130 151
4049 151 103 -189 -155 204 247 -10 -241 69 226 113 -68 -306 58 237 -124 -44 -129 339 193 -284 -142 62
4071F2L3J0k52Q9J35M5j94j43M34p5J08l10k08L87L0j30j70K29R1k67m5m3L22
4094A38k3k90K1K7L64k34k1j66L13O1k68j06J11J05J48j67J1j13J73p8k52K79
4116C3J60j00j07O4j02K21j21p5j9O9J75k49o2K40pM1k83N4J07N9j9k71J93R6
4140I7J34k32k02M26j79p2r6J36j23L98k90Q6N6j7j64J0j30J70J83k39k9J42J91
4163B56l26o4J7K38j48j70K57j24L1K5J9j03j55M28m8j76j61L01q2M4j04K48N8
4186B61k15j61J00O2Q0k58J03oN9j49J92l63K14L13l11q4Q1K89j91j53n7L75l45
4209a64J82m0j04M44j32k99n4j2K60p2O8j92K51M7k34j46L83r8M7m41L82J4J4
4232A04j44j04J69J6M9o2j99N01j90k13%M5L10k05j9j84L55k39J12m08K73K5j7
$$ plain form
4071 62 95 105 -147 -58 77 122 -72 -215 219 144 252 -58 -266 121 151 21 -149 80 171 -96 -141 -184 138
4094 138 115 -175 -154 -127 237 3 -18 -184 129 190 -78 -184 -73 32 180 13 24 -89 84 6 -246 33
4116 33 193 93 -14 50 -52 169 48 -27 -46 23 198 -51 -113 127 120 161 -122 -68 39 98 79 -192 1 97
4140 97 231 -1 -203 223 44 -28 -124 12 -111 287 -3 83 139 122 -42 -32 -162 8 191 -48 -77 65 256
4163 256 -70 -134 -117 121 -27 -197 60 -64 -33 -8 11 -92 -247 181 133 -43 -204 97 15 59 -45 203 261
4186 261 46 -115 -15 47 127 -131 -28 -34 25 -124 68 -295 -81 232 -79 -163 -82 207 16 -137 -194 181 -164
4209 -164 18 -22 -126 318 186 -113 -167 -179 81 9 77 -115 136 183 -51 -197 186 88 135 -306 76 90 104
4232 104 -40 -144 25 41 90 28 -171 330 140 -73 -73 -28 282 77 58 -126 229 -10 102 -306 -33 -8 -25
4255b5j14n7L42k0P7l96J69m1J14Qk60K09J79j7k60j6K56J19k37k68J94K30N8
4278B44m43R1rL39j24l17O1K81p3j14r9L12p2QJ48k35J60K16l27l81K36L10L5
4301B47l61j47N33Nk00r8J22M9k07K26j04R2m9j12K3j65J42j9J13m14L46k7l2
4324c7j2o0M3L71l78p4K00j13J88n6k52J02L64j62%k09P4J80k59Rj5K24j90r7
4348a59K62J10r2j13k1o7J77j0k62RQ1K75k71j61J56P1p5ol2J96K49l60j45K04
4372A6k8K98j28k94K49K42l32p7j8J36K17k01j5jJ06Kl58K28QM4l5k32K58r8O6
4397E3J1j20J10q4J65j30n3P7J14j19j59k6P0J97k41K04j58R4o2k50J07K04j11
4420a07k2j4J96L2k7l12K34K5jm4j42K21o3L3l21L06k6R8q4j60R3J38j1k49J69
$$ plain form
4255 -25 -139 -196 146 126 203 -193 -24 -65 49 57 -203 6 185 168 -92 -108 148 267 30 -238 -44 186 244
4278 244 -199 -108 -117 222 98 -219 -158 123 50 -64 -163 149 77 85 233 -2 158 374 47 -334 -98 212 247
4301 247 -114 -261 272 277 77 -21 101 150 -57 169 65 157 108 -4 19 -146 -4 -23 90 -324 22 -5 -37
4324 -37 -49 -109 -66 305 -73 -147 53 -60 128 72 -180 -78 286 124 124 -85 -11 169 -90 -81 -96 128 -62 -159
4348 -159 103 213 121 8 -13 -80 97 87 -175 -166 -85 190 -81 -242 -86 -15 -90 -96 -128 68 317 -43 -188 16
4372 16 -12 286 158 -136 113 355 23 -54 -72 64 281 80 65 64 170 172 -186 42 50 94 59 -173 85 -13 53
4397 53 64 -56 54 -30 135 5 -48 29 143 24 -135 -161 -91 106 -135 69 -89 5 -57 -307 -200 4 -107
4420 -107 -129 -143 53 85 58 -254 -20 5 4 -40 -182 39 -24 9 -312 -6 -32 66 -18 -178 -85 53 42 -207 -38
4445c8J07op1k55L41n5q6r6r3L35j6o8j99J25K23q4j66R1K27k30Kl20L68J63k09
4470a0k34NK81m7O4l19J87R0R1l46l2Q0Q1J25j07J4J22j02J4k65J85L43q8r1l73
4495c32L60O0l17P0R3p3K76j98l8J15n7K25l06l8K16K3l06P4J13mJ89l08n9J26
4519i6K51j25k67K54L57k77j86K8Q9k1J0j15M4qJ08j3j01K9K55r1j35q5K44m5
4543A04n5k38K29J98l45M9P4rR7n2j33l6J82O6q3j23J18j37K62k48k0L0qL1L5
4568a2n2J29k65P9O9J42j27p6O7j08K19M5q0k21K30k5j16j0K08j42J80l30J40
4591e6J37j02K06m71J48J03K03j21l2R7j23q0J6n9K21r2k34J87L38j95k3m21K16
4614a37J47K31k30MnP8Qo7j49K18K15l12j03Q5K04J0l55J24P1K1j06OQ1k22J44
$$ plain form
4445 -38 69 63 -8 -263 78 23 -63 -159 -252 83 67 -1 -200 -75 148 64 -102 -11 216 -14 -12 -332 36 199 -10
4470 -10 -244 -239 42 -5 59 -260 -73 17 108 -238 -270 -190 -109 16 -91 -77 45 -57 -43 -308 -123 220 132 41 -332
4495 -332 28 88 -229 -159 -66 -139 137 -61 -99 16 -41 184 -122 -160 56 79 -227 -153 -40 -44 145 -163 -222 -96
4519 -96 155 30 -237 17 374 97 -89 -61 28 7 17 -98 -54 -62 46 33 -68 -39 216 125 -10 -95 149 104
4543 104 49 -189 40 238 -107 -58 16 7 104 52 -81 -117 65 131 48 -75 43 -94 168 -80 -100 -70 -78 -47 -12
4568 -12 -64 65 -200 -121 -52 90 -37 -113 -46 -154 65 110 30 -191 39 14 -102 -112 96 -46 134 -196 -56
4591 -56 81 -21 185 -286 -138 -35 168 47 15 112 -11 -91 -75 -134 87 -5 -239 -52 286 91 68 -353 -137
4614 -137 10 241 11 15 10 88 96 29 -120 98 313 1 -102 -17 187 197 -158 -34 37 58 -48 -42 39 -183 -39
4639c9oK1k8l3P5J0p6L37l22j0o4K74n8p8k03J18J45J34k74K7J10J33k35J8j11
4664a35J69J11k40L0n4N63l33l64N0K29L5J0k57l2L32n2l8r0Q8J95l3k43l6L67
4688B72L0m04j57K14O0O7j37o5j4J44K5j16J84J9O1k35J00J65k00r8kqJ45J7j96
4713a29J1J11J10j16o1J2J30l9l5n5J60m4l8j04j13J80j8%j00j14K58K21l62J44
4737IJ64Q4l4m02J86M8J89m48J48J82j67K68n12K36J84r5m5q4R3Nj1K8l47J64
4761a57K20jl20J47R4J08q2N0o4o7R3q9J9O4nQ8l23J62J45J04k79r9J31J88l3
4786I4j50J01jk00m1R9J88N6M5j41j47K22K2j53Q8l5j13J23k23K74K06n7k78Q1
4810F0qJ10m7j65N4KR2k16J26K35k67J5k12J56J10J1l51Q1J91L62j47k94N5M4
$$ plain form
4639 -39 -45 -24 -52 -85 -10 0 -76 261 -61 -71 -135 139 81 3 -200 -82 63 197 -77 -50 60 193 -42 -24 -135
4664 -135 34 145 -95 -65 -119 444 111 -253 -203 26 61 71 -186 -218 114 62 24 -66 22 217 184 -59 -95 272
4688 272 302 -102 -259 -45 15 82 -55 -120 -134 10 35 -81 103 122 183 -52 48 213 13 -85 -87 -95 50 67 -129
4713 -129 -118 -7 103 -13 -74 -62 68 29 -6 -61 99 55 17 -87 -200 -20 -38 -38 -138 -252 6 227 -135 9
4737 9 173 257 223 -179 7 55 244 -204 -56 126 -41 227 -285 -49 135 40 -5 -89 4 9 -2 26 -321 -157
4761 -157 63 62 -258 -111 -17 91 9 59 -5 -72 21 -68 -49 15 10 98 -225 -63 82 186 -93 -192 -61 127 94
4786 94 -56 45 44 -156 -197 -98 90 146 191 50 -97 125 147 -6 82 47 -66 57 -166 108 314 257 -21 60
4810 60 52 162 115 -50 4 6 98 -118 8 243 -24 -9 -221 -65 45 56 -295 -214 -23 339 192 -102 -47 -3
4834cKj4m9n5K55j26J55l55J36K26j40k6Q8Q3k20K78l25K4K10k26q3J54J6J26
4858A31k69J9J07OJ30N6m03M44l9j60rq8J33l9k8k00L09o1J65k21OJ29m2j13j88
4883b25J08K79r1qr7Q5N7j57M2P4J75j91k01J86j18J3k24J86P1L08j58j74R6j53
4907a17K89j62q3lM4K8q4q4K1L00J9k90KK51j17J57l20o1L09J50n50K24L9J80
4931A42j09j04M6Q2J15o6p6j06R7M9j11r9K01M8n2j4j06K27j48j06J8j6J87l9
4955F0m2J11j05n7K14l7l15K81j79L6J53j60O3j47Q3J44J6l51L0K83K4N7k69J6
4979i1L6J09j07r9J35O6J8n7j09K45n6r6m4j99L27r5j14J20j2O8M5r3r7K28q0
5004D8K8j90J7Q3R0l00J48n4P9L14l21Q4q1r0J56j8k43L12j76J07p8J43p0p2j81
$$ plain form
4834 -3 -1 -15 -64 -119 136 10 165 -190 -54 172 32 6 94 177 -43 235 -90 -66 144 -82 -165 -11 5 131
4858 131 -138 -119 -12 -6 124 180 -223 221 182 22 13 -75 58 19 -9 -209 100 39 204 -17 -11 118 76 -37 -225
4883 -225 -117 162 71 63 -34 51 108 -49 -7 67 242 51 -150 36 -82 -69 -293 -107 -36 272 114 -60 36 -117
4907 -117 172 10 -73 -76 -32 -4 -88 -172 -151 149 168 -122 -120 131 14 171 -149 -210 99 249 -301 -77 -38 142
4931 142 33 -71 -25 57 172 106 30 -76 21 70 -41 -140 61 109 57 43 -63 164 16 -90 -72 -88 99 60
4955 60 18 129 24 -33 181 144 -171 110 -69 -33 120 -40 23 -124 -41 103 119 -232 -202 81 105 162 -107 -91
4979 -91 -55 54 -53 -152 -17 49 67 10 -99 146 90 -6 -50 -249 78 -17 -131 -11 -23 45 90 -3 -100 128 48
5004 48 76 -114 -97 -14 76 -224 -76 -130 -51 263 -58 26 -55 -145 11 -7 -250 62 -114 -7 -85 58 -12 -84 -265
5029b65K35J63p8j4j51J19J61j60l46K87N1k36m8K91j01K42l57l8K9L21Oj64j48
5052b01J32J46q6k12K39j07J58j04J93j96Q3O9m26Q9R6J56K3k16L61M6r3k22k65
5075c37K61L40k84q2J51j13K77l71n0J04J30K55l01j66K91P6j14k08J48K2P7l70
5097b64J19J87k7j93K29j2p9j71J09O2m1K26k12N0J72k54J73N4m36K36j31K66
5119F3k80J81l7MKJ92r8qJ23k17j3R9k9m5j21L59j87j6j9k3N0J16J8j60M4L1J62
5146A91k36r1M7K77j79l43K12K92l3k86J09O5k6J79l26R7Q6K04r1j92p4J77K19
5169B78k46j62O4l6J06j9J7p3L17k39j71J1L8J70k17K18j02jP3k11K74J96k23
5192F2j69m4P2R9K3j5R1k29K83q7j36R0M1r8j62O5K47j14j1mJ88l07QJ73j87K96
$$ plain form
5029 -265 -30 133 55 41 -110 9 170 10 -336 -49 2 -234 -282 9 -92 150 -207 -245 -216 105 111 -53 -201
5052 -201 -69 77 -9 -221 18 -89 69 -35 158 -38 45 114 -312 -223 -127 29 52 -164 197 243 150 -72 -337
5075 -337 -76 264 -20 -102 49 -64 213 -158 -208 -104 26 281 -20 -186 105 181 67 -141 7 29 106 -264
5097 -264 -145 42 15 -178 51 39 -40 -211 -102 -40 -81 145 -67 -17 155 -99 74 128 -308 -72 -203 63
5119 63 -217 -36 -73 -69 -67 125 27 19 142 -75 -88 11 -18 -63 -184 175 -12 -28 -47 -70 -20 96 114 -46 -2 29 191
5146 191 -45 -136 -89 188 9 -334 -122 170 137 -149 -40 25 -1 178 -148 -51 35 239 148 -44 -118 59 278
5169 278 32 -130 -66 -102 4 -15 2 -71 246 7 -164 -153 -115 55 -162 56 -46 -47 26 -185 89 285 62
5192 62 -107 -151 -79 20 43 28 119 -110 173 86 -50 40 81 -17 -179 -114 133 19 8 4 192 -115 -107 66 -121 175
5218A75m20L66j80k3K14j07p8R9l6PJ26k43O3k2J82k06M4J55M2k5j84J81j56P3
5242D7O3j69J07q5j7k6k7P8pJ06O2k78R9K44k43j05M02ml86O2K0oO1LMl8JPK2
5271cJ50p1L7k30J07J62j49JPo5K14k39j27K48M3n5k08Q4O3J32j03PR6p3m8J13
5297I3j30o3K33m2l62L00j44J71R2k58J27R7J04j86j00k3J20J6q9J05k32K52Q7
5320A68j93K3J2J66j66J5m3Q5n2k3j12J35l0j32O5J57o2j0J8j05J21q1J14o6O5
5345F9Pl6R6k06J14K3r3K15l11K30j27N4q3J40j94J08j39J7R5j35L07k2nj49J08
5370H3k93qL63j38j15J26n7R1K2K3j16o0K79k00r9N7N6Jj42J52j22J50j71L9p5
5395a54J67J29j27j71J03J26qq3r5J67j17J93k50k3K15j65J58j40P9j38J32MJ8
$$ plain form
5218 175 -245 121 -59 -82 132 25 -53 46 10 17 143 -100 -37 -59 123 -83 -39 116 158 133 -51 130 -26 47
5242 47 110 -59 48 -37 -54 -80 -107 -29 -36 70 132 -146 -47 197 -46 -151 251 247 -139 -77 -57 -63 -2 1 5 -33 -32 -25 -3
5271 -3 147 76 113 -117 -10 152 3 4 11 -54 160 -79 -206 42 85 30 -178 -94 -31 101 -2 5 101 28 -20 93
5297 93 -37 -100 133 91 -271 29 -115 56 148 -110 17 114 218 32 -68 -91 29 45 -44 61 -171 81 168
5320 168 -25 -2 10 176 10 25 -18 67 15 -8 -120 15 -15 -147 -82 75 13 3 21 -84 37 -44 70 4 69
5345 69 76 40 136 -70 44 67 -26 189 -122 108 -19 35 -48 92 -102 6 -133 -116 -21 -156 151 129 124 -25 83
5370 83 -210 -218 145 7 -108 18 -39 52 74 97 -19 -79 200 0 -99 -42 14 15 -127 25 -97 53 -118 -79 -154
5395 -154 13 142 15 -156 -53 73 65 -18 -113 54 -63 130 -120 -143 72 -93 65 -75 4 -134 -2 2 20
5418B0p4J44k0m3j86J35J05N8k64J5M06j23k19P8o6K5J16j11p9Q1K2J12J4k32
5442h6J55j26j60K87K7r0J7k97M52l05J0M1K26j29j2j34J55j69L1M1R7J9J34k16
5466c2r2J99r7J48R4k19Q5m7O4l95K06R7J48j78j40M3N1N5k7N2j27K82j57J9j07
5491g5LK23k32R0l7j17J01K0k3o9M2N8j51n2K0L64k08j3K41j35o0L4J31o6k8m0
5517B1k07N5pK75j13k42L54j92j4J65k06R2q0J23j56k9MP1m8j14L69Jj80l4l7
5542a29J11L8k62j00L29N8R5m12K21K5J11o8j79K40l11J08N5J18K7p4J18k76J54
5565cR6k00k34J91J57N3j66Q3J89k21J31m5M2r1P9j5j02N0k18J86j26K51O4j49
5589BM4k39M5K75j80M9j18M5L7K28k73Q2j51K10K6m8l2r9M1M7M3J42o8j23l7L6
$$ plain form
5418 20 -54 90 70 27 -159 -24 81 139 -125 -110 296 173 -46 32 -34 -9 107 -4 -83 -2 20 132 146 -86
5442 -86 69 -57 -217 70 97 7 24 -273 179 -126 -116 -75 151 22 10 -124 31 -138 -107 -66 31 50 184 -32
5466 -32 -124 75 -22 126 220 1 86 39 103 -292 -86 11 159 -19 -159 -116 -65 -10 -37 15 -112 170 13 32 -75
5491 -75 -72 151 -81 9 -28 -145 -44 -24 -47 -116 -74 -16 -167 -219 -199 165 -43 -56 185 50 -10 24 155 89 61 21
5517 21 -186 -131 -138 137 24 -218 136 -56 -70 95 -111 -19 -99 24 -132 -161 -157 -86 -134 -248 121 122 -58 -92 -129
5542 -129 -18 20 -242 -342 -13 45 140 -272 -51 -26 85 17 -162 78 -233 -125 -70 48 75 1 119 -157 -3
5565 -3 93 -107 -341 -150 7 60 -106 -23 166 -55 76 31 73 -18 61 46 -56 -6 -224 -38 -164 87 151 2
5589 2 46 -193 -148 127 -53 -4 -122 -77 -40 188 -85 -3 -154 56 82 34 2 -97 -56 -9 34 176 108 -15 -52 -16
$$ [...]
8191g1
##END NTUPLES=NMR FID
##END=
