##TITLE=1H_CG-1120-a
 CDCl3, 24 sc, 
 24.9.2019
##JCAMPDX= 6.0         $$ Bruker NMR JCAMP-DX V2.0
##DATA TYPE= NMR FID
##DATA CLASS= NTUPLES
##ORIGIN= UXNMR, Bruker Analytische Messtechnik GmbH
##OWNER= root
$$ XWIN-NMR		Version 3.5
$$ Tue Sep 24 14:37:28 2019 Russian Standard Time (UT+4h)  she@DPX200
##.OBSERVE FREQUENCY= 200.1315
##.OBSERVE NUCLEUS= ^1H
##.DELAY= (6, 6)
##.ACQUISITION MODE= SIMULTANEOUS
##.ACQUISITION SCHEME= undefined
##.AVERAGES= 24
##.DIGITISER RES= 18
##SPECTROMETER/DATA SYSTEM= spect
##.PULSE SEQUENCE= zg30
##.SOLVENT NAME= CDCl3
##.SHIFT REFERENCE= (INTERNAL, CDCl3, 0, 15.7039)
##AUDIT TRAIL= $$ (NUMBER, WHEN, WHO, WHERE, WHAT)
$$ ##TITLE= Audit trail, XWIN-NMR		Version 3.5
$$ ##JCAMPDX= 5.01
$$ ##ORIGIN= Bruker BioSpin GmbH
$$ ##OWNER= she
$$ F:/spectra/data/she/nmr/H-F/1/audita.txt
$$ ##AUDIT TRAIL=  $$ (NUMBER, WHEN, WHO, WHERE, WHAT)
(   1,<2019-09-24 14:36:33.18 +0400>,<she>,<DPX200>,
      <continue with go, POWCHK disabled, PULCHK disabled
       configuration hash MD5:
       00 E9 B6 7A A2 85 ED C7 34 08 36 98 17 FE 4E 26
       data hash MD5: 16K
       C3 AF 6F 69 8A 31 F7 33 D1 D0 51 77 63 87 5B 07>)
$$ ##END=
$$ 
$$ hash MD5
$$ C3 86 B5 7A 0A 8B 63 AF 5C AD 8E 44 CC D4 37 FB
##$RELAX= 
##$RELAX= 
##$RELAX= 
##$RELAX= 
##$RELAX= 
##$RELAX= 
$$ Bruker specific parameters
$$ --------------------------
##$DU= <F:/spectra>
##$EXPNO= 1
##$NAME= <H-F>
##$PROCNO= 1
##$TYPE= <nmr>
##$USER= <she>
##$AMP= (0..31)
100 100 100 100 100 100 100 100 100 100 100 100 100 100 100 100 100 100 
100 100 100 100 100 100 100 100 100 100 100 100 100 100 
##$AQSEQ= 0
##$AQ_mod= 1
##$AUNM= <au_zg>
##$AUTOPOS= <>
##$BF1= 200.13
##$BF2= 200.13
##$BF3= 200.13
##$BF4= 200.13
##$BF5= 200.13
##$BF6= 200.13
##$BF7= 200.13
##$BF8= 200.13
##$BYTORDA= 1
##$CFDGTYP= 0
##$CFRGTYP= 5
##$CHEMSTR= <none>
##$CNST= (0..31)
1 1 145 1 1 1 1 1 1 1 1 1 1 1 1 1 1 1 1 1 1 1 1 1 1 1 1 1 1 1 1 1 
##$CPDPRG= <>
##$CPDPRG1= <>
##$CPDPRG2= <>
##$CPDPRG3= <>
##$CPDPRG4= <mlev>
##$CPDPRG5= <mlev>
##$CPDPRG6= <mlev>
##$CPDPRG7= <mlev>
##$CPDPRG8= <mlev>
##$CPDPRGB= <>
##$CPDPRGT= <>
##$D= (0..31)
0 1.2 0 0 0 0 0 0 0 0.06 0 0.03 0 0 0 0 0.0002 0 0 0 0 0 0 0 0 0 0 0 0 
0 0 0 
##$DATE= 1569321290
##$DBL= (0..7)
120 120 120 120 120 120 120 120 
##$DBP= (0..7)
150 150 150 150 150 150 150 150 
##$DBP07= 0
##$DBPNAM0= <>
##$DBPNAM1= <>
##$DBPNAM2= <>
##$DBPNAM3= <>
##$DBPNAM4= <>
##$DBPNAM5= <>
##$DBPNAM6= <>
##$DBPNAM7= <>
##$DBPOAL= (0..7)
0.5 0.5 0.5 0.5 0.5 0.5 0.5 0.5 
##$DBPOFFS= (0..7)
0 0 0 0 0 0 0 0 
##$DE= 6
##$DECBNUC= <off>
##$DECIM= 24
##$DECNUC= <off>
##$DECSTAT= 4
##$DIGMOD= 1
##$DIGTYP= 9
##$DL= (0..7)
0 120 120 120 120 120 120 120 
##$DP= (0..7)
150 150 150 150 150 150 150 150 
##$DP07= 0
##$DPNAME0= <>
##$DPNAME1= <>
##$DPNAME2= <>
##$DPNAME3= <>
##$DPNAME4= <>
##$DPNAME5= <>
##$DPNAME6= <>
##$DPNAME7= <>
##$DPOAL= (0..7)
0.5 0.5 0.5 0.5 0.5 0.5 0.5 0.5 
##$DPOFFS= (0..7)
0 0 0 0 0 0 0 0 
##$DQDMODE= 0
##$DR= 18
##$DS= 0
##$DSLIST= <SSSSSSSSSSSSSSS>
$$ [...]
##$SUBNAM2= <"">
##$SUBNAM3= <"">
##$SUBNAM4= <"">
##$SUBNAM5= <"">
##$SUBNAM6= <"">
##$SUBNAM7= <"">
##$SUBNAM8= <"">
##$SUBNAM9= <"">
##$SW= 24.0689530833862
##$SWIBOX= (0..15)
0 0 2 0 0 0 0 0 0 0 0 0 0 0 0 0 
##$SW_h= 4816.95568400771
##$TD= 16384
##$TD0= 1
##$TE= 0
##$TE2= 300
##$TE3= 300
##$TEG= 300
##$TL= (0..7)
0 120 120 120 120 120 120 120 
##$TP= (0..7)
150 150 150 150 150 150 150 150 
##$TP07= 0
##$TPNAME0= <>
##$TPNAME1= <>
##$TPNAME2= <>
##$TPNAME3= <>
##$TPNAME4= <>
##$TPNAME5= <>
##$TPNAME6= <>
##$TPNAME7= <>
##$TPOAL= (0..7)
0.5 0.5 0.5 0.5 0.5 0.5 0.5 0.5 
##$TPOFFS= (0..7)
0 0 0 0 0 0 0 0 
##$TUNHIN= 0
##$TUNHOUT= 0
##$TUNXOUT= 0
##$USERA1= <user>
##$USERA2= <user>
##$USERA3= <user>
##$USERA4= <user>
##$USERA5= <user>
##$V9= 5
##$VALIST= <valist>
##$VCLIST= <CCCCCCCCCCCCCCC>
##$VD= 0
##$VDLIST= <DDDDDDDDDDDDDDD>
##$VPLIST= <PPPPPPPPPPPPPPP>
##$VTLIST= <TTTTTTTTTTTTTTT>
##$WBST= 1024
##$WBSW= 4
##$XGAIN= (0..3)
0 0 0 0 
##$XL= 0
##$YL= 0
##$YMAX_a= 71285
##$YMIN_a= -122713
##$ZGOPTNS= <>
##$ZL1= 120
##$ZL2= 120
##$ZL3= 120
##$ZL4= 120
##$ABSF1= 10
##$ABSF2= 0
##$ABSG= 5
##$ABSL= 3
##$ALPHA= 0
##$AQORDER= 0
##$ASSFAC= 0
##$ASSFACI= 0
##$ASSFACX= 0
##$ASSWID= 0
##$AUNMP= <proc_1d>
##$AZFE= 0.1
##$AZFW= 0.1
##$BCFW= 1
##$BC_mod= 2
##$BYTORDP= 1
##$COROFFS= 0
##$CY= 11.3945322036743
##$DATMOD= 1
##$DC= 2
##$DFILT= <>
##$DTYPP= 0
##$F1P= 20.1720416913024
##$F2P= 0.152960286110954
##$FCOR= 0.5
##$FTSIZE= 0
##$FT_mod= 4
##$GAMMA= 1
##$GB= 0.15
##$INTBC= 1
##$INTSCL= 1
##$ISEN= 128
##$LB= 0.24
##$LEV0= 0
##$LPBIN= 0
##$MAXI= 10000
##$MC2= 0
##$MEAN= 0
##$ME_mod= 0
##$MI= 1.114404
##$NCOEF= 0
##$NC_proc= 0
##$NLEV= 6
##$NOISF1= 3.799351
##$NOISF2= 2.8
##$NSP= 1
##$NTH_PI= 0
##$NZP= 0
##$OFFSET= 15.70392
##$PC= 1
##$PHC0= -9580.712
##$PHC1= 35.60095
##$PH_mod= 1
##$PKNL= yes
##$PPARMOD= 0
##$PSCAL= 0
##$PSIGN= 0
##$REVERSE= no
##$SF= 200.130013532006
##$SI= 16384
##$SIGF1= 3
##$SIGF2= 2
##$SINO= 400
##$SIOLD= 16384
##$SREGLST= <1H.CDCl3>
##$SSB= 0
##$STSI= 0
##$STSR= 0
##$SW_p= 3612.71676300578
##$SYMM= 0
##$S_DEV= 0
##$TDeff= 0
##$TDoff= 0
##$TI= <>
##$TILT= no
##$TM1= 0
##$TM2= 0
##$TOPLEV= 0
##$USERP1= <user>
##$USERP2= <user>
##$USERP3= <user>
##$USERP4= <user>
##$USERP5= <user>
##$WDW= 1
##$XDIM= 8192
##$YMAX_p= 0
##$YMIN_p= 0
$$ End of Bruker specific parameters
$$ ---------------------------------
##NTUPLES= NMR FID
##VAR_NAME=  TIME,          FID/REAL,        FID/IMAG
##SYMBOL=    X,             R,               I
##VAR_TYPE=  INDEPENDENT,   DEPENDENT,       DEPENDENT
##VAR_FORM=  AFFN,          ASDF,            ASDF
##VAR_DIM=   8192,          8192,            8192
##UNITS=     SECONDS,       ARBITRARY UNITS, ARBITRARY UNITS
##FACTOR=    0.0002076,     1,               1
##FIRST=     0,             0,               0
##LAST=      1.7004516,     0,               0
##MIN=       0,             -122713,         0
##MAX=       1.7004516,     71285,           0
$$ Real data points
##PAGE= N=1
##DATA TABLE= (X++(R..R)), XYDATA
0@%%%%%%%%%%%%K3m7M8m8M8n2P6r6R9j23J45j66J92k18K52k82L21l67M14m63N17
33B73n83O55p31Q13r02J001j111J231j361J508j672J851k052K279k534K826l163
50a672L553m018M584n286O181p371R045j1586J5958k5518P8035l6165r1609J34124
64F8255j9142n9618L6496R232n1495O4298K3259p3356j290M9642l5289l007J9548
77B7533m5059Q044P6177m3150n8351O0228J5765o0422K3219J5180n3948K9675
89e109N5612o0322k0721O3054j8745m0864L5417j1797l3993N0108O789o0023L4081
102f513M2708n7152l482M6856m4519j7008O3598k8272m9648O9548J7347p6170
114d2707K3260N0308n4637j1534N0988k8522k1457N3102q753m2765L1792J2168
$$ y = [0, 0, 0, 0, 0, 0, 0, 0, 0, 0, 0, 0, 0, 23, -24, 24, -24, 24, -28, 48, -48, 51, -72, 73, -93, 99, -119, 133, -149, 172, -195, 219, -244, 273, -310, 345, -386, 427, -475, 526, -585, 646, -715, 793, -879, 972, -1080, 1199, -1335, 1491, -1672, 1881, -2137, 2447, -2839, 3342, -4029, 5016, -6570, 9388, -16130, 61905, 25740, -65869, 68255, 49113, -10505, 25991, 35223, -16272, 48026, 71285, -2071, -3361, 46281, 10992, 7985, 27533, -17526, -9482, 66695, 23545, -34806, 25422, 41187, -19235, 3984, 19164, -34784, -5109, 50503, -9819, -30540, 32514, 13769, -27095, 8322, -3475, -37468, 12640, 19429, -40594, -6513, 36195, -20957, -24439, 22417, -22102, -39110, 24488, -3784, -53432, 16116, 33463, -42707, -19447, 30861, -23776, -35310, 15678, -12844, -34301, 18801, 10048, -32717, -925, 11243]
126A1243l3116J5752L514l0123L5929K4099n8909N694O0429l5293l4087M7044
138A2176j3300l7622N2821J1100o5071K5263N2425m2475j7909L1797k0958k988
150a4741M2361l2272l4023N8496R757n3449K0910K1887m1638K1187L8967n6964
162a9522j4296P0202j2167m9474L0762J0829k9977K6139R194m5878J8676M1433
174C5921l3701j4827L0150j6847o874L4660k4895l0721M8124R420m8919J9213
186G04K5022l8044J0232L5117m2469j3320N5556j6736m2201L7419J0345l9587
198a7962K1227J8514l8927J1709L3103l4499q587L8230k2088k2826L7310q186
210G018l3596L7316J0055m6378K0265L4523m2980q957M0548j9293k0141L4399
$$ y = [11243, -21873, -6121, -2607, -32730, 3199, 27298, -31611, -25917, 34512, -781, -34868, 12176, -1124, -38746, 14075, 25175, -39896, -14633, 37792, -4683, -22592, 9205, -11753, -14741, 27620, -4652, -38675, 19821, 29578, -23871, -2961, 18926, -22712, -1525, 37442, -19522, -33818, 36384, 24217, -25257, 5505, 16334, -13643, 12496, 21690, -24188, -5512, 35921, 2220, -12607, 17543, 696, -6178, 28482, 3587, -27134, 20990, 30410, -18509, 704, 25726, -12318, -2086, 33031, -9438, -22758, 32798, 16062, -26139, 11280, 21625, -17962, 3265, 21779, -17148, -5439, 27664, -6835, -15422, 22808, 720, -22106, 15204, 7018, -26578, 10738, 20793, -25585, -5320, 29203, -13777, -22734, 17814, -1479, -21620, 12779]
222A2779r424k6378L4320M590m0259J8211K1105l2419Q235K5637l3513M72M5482
235B8838k6776l4508M0248M763l6938K2288J3738l5590K0392L2484m0811j2192
247b4064M0330j4812k1915K8162r756k3268L8528P232m4196J6059K8781l0977
259i896k418K4295k6855m129M3648j7633l2988L5311Q553l4945J6476J2296l5043
272b3328J5978L4615l3339j1879L8778j2001k2319K5867q815k7473L2765J2151
284B1000l8766J5848K8405l0115j523K8989k9733j4965M1450q557l2503L1181
296A0711J2328l2334J6366J5913l6445N168L2025k6931j1054L4778j2077j9802
308a1354L3120n619l6375K4708J6529l6194R282K7686k6739j345L3744k3121k1926
$$ y = [12779, 3355, -23023, 11297, 15887, -24372, -6161, 14944, -17475, -9240, 16397, -17116, -16644, 28838, 2062, -32446, 7802, 12565, -24373, -2085, 11653, -23937, -3545, 28939, -11872, -24064, 16266, 1454, -20461, 7701, -2055, -25323, 13205, 20437, -23759, -7700, 21081, -9896, -12314, 11981, -14874, -19003, 24645, 7012, -25976, 9335, 17888, -17057, -581, 11715, -23328, -7350, 27265, -6074, -17953, 20825, 8824, -13495, 12372, 3557, -23916, 8849, 21000, -17766, -1918, 26487, -3628, -5151, 23838, -5895, -20860, 20590, 12033, -20470, 10711, 23039, -9295, 7071, 22984, -13461, -8293, 23732, -3199, -14253, 20525, 8448, -11354, 21766, 16147, -20228, 4480, 21009, -15185, -5903, 21783, -4956, -6301, 27443, 4322, -17604]
321a7604L2678n111k9853K5428Q516l0918K1263K2325l5966j461L1509k3081j5408
334a7683L0368j1632k1265L3866L597l4577J7957J7299l1921N572K3192k8639
346a3866k595L7332j6505k4008L1063r73k9542K1016Q505l2989J4834K7383k8913
359i258l759K9782j9507j4028L0285j2485k8762L1010J0137l1900J5363J9259
371A6137k9677N140K7596k9329j3311L5078q202k2074K6988j048k6691K5317J2228
384A8152l8376O930L0505k3830p035K8285j7678j3835L5226o947l4351K2915J4985
397A4946k7585J0364J6755k7825P891L1292k7699j8839L3825l855k4003K2424
409G691J568k6588K4116J7130l6326J947L0388j9289j0861K4788j4468j5041L3443
$$ y = [-17604, 15074, 9963, -19890, 5538, 14054, -16864, 4399, 26724, -9242, -10703, 20806, -2275, -17683, 12685, 1053, -20212, 13654, 17251, -17326, 631, 17930, -13991, -8419, 14773, -13866, -16461, 20871, 4366, -19642, 11421, 10448, -19094, 1922, 10427, -22562, -7728, 19655, -9258, -13017, 16765, -2742, -16770, 13515, 1030, -27732, 3278, 13415, -18485, -3122, 16137, -13540, -8400, 19196, -10133, -23444, 11634, 3432, -18642, 8346, 7298, -19393, 5924, 18152, -20224, -13294, 17211, -6619, -13654, 14631, -3047, -16882, 18344, 11397, -22954, -39, 14946, -12639, -2275, 14480, -13345, -5454, 25838, -1861, -20700, 13125, 9270, -14733, 7691, 9259, -17329, 6787, 23917, -12409, -10462, 19926, 637, -10224, 14564, 96, -14945, 18498]
422A8498l704l3427K1507J7525k8662N569J9812k4487O11L0138k0862j8563L0543
435A4498l173k4750K1473O031k8169J7814J8684l1588P92K9985k1217j4377K9926
448A5929q409k2480K5700K986k7399J7227J3754k9881P091K4913k4784o794K8705
461A6558j5282j5780K9087o997l0168K5280J4940l2170N955K2707k1624o96K3658
474A5468k2613j4336L2765l961k7264J9014Q021k1296J6197J0534l3277O773L2144
487A8169k3168j6442K6274n280j3674K5146o365l0187K4138J9092l2594j116K4221
500H214j4296j702K2436k0676j4698L2866j604l0529J4987J1686j7942J3846J1020
513A3608k9786O298L2162k2733k0820K7368j787j8257K2171J275k7768J9859J9981
$$ y = [18498, 14794, -18633, 2874, 20399, -8263, -2694, 17118, -7369, -6758, 23380, 2518, -16045, 14498, 11325, -13425, 8048, 14079, -14090, 3724, 22408, -9180, -8388, 21597, 380, -13997, 15929, 7520, -14960, 10740, 13726, -13673, 3554, 17308, -12573, -5482, 19431, -5353, -12147, 16558, 1276, -14504, 14583, 7586, -22582, 2698, 17638, -14532, -8577, 14130, -7494, -8190, 15468, -7145, -21481, 11284, 7323, -19941, -927, 7094, -14202, 1995, 12529, -20748, -13975, 18169, -4999, -21441, 4833, -447, -14121, 11025, 4660, -25527, -1389, 17703, -14891, -16007, 8214, -6082, -7784, 14652, -6024, -20722, 12144, 10540, -19989, -5002, 6684, -11258, 2588, 13608, -16178, -9880, 22282, -451, -21271, 6097, 4310, -13947, 8224, 9499, -18269, 1590, 21571]
526B1571l0539m821K3506j2320o488K0798j3681j2341K8519k989k8064J7819J1245
539A2215k5668R387J8772k4879K73L0085j7869j8910K7303j598k5334J7753R316
552A0846k2178J1964J5781k3778K671K3474k0174j2627K5708o820j6819K2465
564A0513l96k2519K1197J2402l2210K753K6683j8287r661K2037j0253j1678K6887
577A7468l382k9456J6148J5734k1137J856J1936j6216O826K1373k2302j4189K8178
590A2837l252k2077J5848K266k0751K0474J4516l2507KK9808j4433j7302J7912
603C341n343j1212K2673k185k5402J6469J5029k1900R93J3080j7981L995K4017
616A5574k0473j5742L0478M69k6676J4386R205k1859J0962J6682k3805j975K6038
$$ y = [21571, -8968, -13789, 9717, -2603, -9091, 11707, -1974, -14315, 14204, 11215, -16849, 970, 12215, -13453, -4066, 14706, -10173, -9900, 20185, 2316, -16594, 10709, 9111, -16223, 1530, 10846, -11332, 632, 16413, -7365, -4694, 18780, -1394, -14021, 11687, 4867, -11952, 10513, 10117, -12402, 8795, 21197, -11013, -8260, 18423, 136, -9525, 12512, 2259, -9419, 17468, 14086, -15370, 778, 16512, -4625, -2769, 9167, -7049, -223, 21150, -1152, -15341, 12837, 9585, -12492, 3356, 5622, -15129, 5345, 19861, -12646, -12644, 17164, 2731, -14571, 3341, -2002, -13214, 9459, 7274, -18128, -1659, 13370, -8530, -7537, 5543, -12438, -8443, 15574, -4899, -20641, 9837, 10306, -16370, -1984, 7221, -14638, -3676, 13006, -10799, -12774, 13264]
629A3264j1387j4958J8117m355j3747J9149m96k1246J6361J3035k3479M045J9466
642A3769j9862n229K4479j2800j6099K5649L09k4800J6313J2874k4114L502J8732
655A2723j7216l514K0189j2713j0752K3097m252j9780J5467O059j8937J1750J0932
668A3053k4177N746K4991j9391j4337K3962k885j6283J6595Q21k1429J5619J5284
681A7569k3325k288J8594j0135l257J4000j4542p813K6171n656k4045J6701R918
694A1892k0440R392J2631k4187K551K7477j6973j9012K2927J709j7035J3137K360
707F429k0186J4431J4358k3455j285J9023j2011n900J7483j1901j2341K4220o11
720H254k4369J4101J1978k0739M565J6076j9525k887K3921j1227j5296J9023p4
$$ y = [13264, 1877, -13081, 5036, 681, -13066, 6083, 5587, -15659, 702, 13737, -9742, -5697, 13769, -6093, -11322, 13157, 357, -15742, 9907, 10216, -14584, 1729, 14603, -9511, -6009, 12723, -4493, -8007, 12182, -531, -11283, 11814, 7562, -12218, 3249, 9308, -9629, 2121, 13053, -11124, -5378, 19613, 222, -14115, 9847, 6962, -9321, 7274, 8095, -13334, 2285, 17569, -5756, -8044, 10550, 415, -2842, 11158, -3384, -11197, 14974, 9318, -14727, 1974, 11892, -8548, 844, 13475, -10712, -8161, 19316, 2343, -16669, 6258, 7967, -9068, 4069, 6429, -13757, 674, 15032, -8423, -9708, 9315, -2696, -8596, 8887, -3014, -15355, 8865, 8254, -16115, -2014, 9964, -10775, -6210, 9866, -9659, -12546, 11375, 148, -15148, 3875, 3801]
733C801j7153J4298M488j9619R811J4570j8960N56J7601j4949o942K2404r416
746D90j8382K1191N451k1907J1394J2612k2042K633K0942j6426j0207K0977m411
759B315j2546J5613j453j6821J5411P418k1487N563J5399j5885k52J8437j5074
772c362r644K3646m501k1337J5227P991j8267R122J1978j9706J921K0690j4792
785a034j0635J8428n002j2700J8016p46j9567J5590J1637k2398K923J7301j6480
798d667l402K0618j2045j3385K2222Q80k0527J2051Q761j8745P266J4136j8714
811e551j577K0592j0487j0366J7221n915j3875J7454K423k0576J1528J2647j8724
824e206K590J6194j6450o127K2073q362j7119J7744L810j7257J1176P474j9512
$$ y = [3801, -13352, 946, 5434, -14185, -4374, 10196, -8764, -8208, 9393, -5556, -12498, 9906, 490, -17892, 3299, 8750, -13157, -1763, 10849, -11193, -8560, 12382, -4044, -14251, 6726, 2315, -10231, 5382, 3929, -12892, 2519, 9937, -11550, -5987, 9412, -6473, -6725, 11712, -3362, -13006, 10640, 6139, -15198, 29, 8020, -10247, -1125, 10853, -8853, -6932, 13758, -1034, -11669, 6759, 1757, -10943, 7073, 6327, -13240, 2350, 13987, -8411, -5488, 11813, -4667, -8069, 12549, 504, -12881, 9341, 10221, -10306, 1745, 10506, -8239, -973, 13163, -5551, -7128, 13464, 2977, -7389, 9832, 3917, -9958, 7496, 9919, -10657, 871, 13518, -5206, -2616, 13578, -2872, -8999, 13074, 4712, -12407, 5337, 9147, -8110, 3066, 10540, -8972]
837h972O292J6394j7471n764J8393q318q409J7377o005j7515J8018Q054k2871
850a0797M564J5804j5116K75J6386j5369p909K2048m480j8914J3829M810j5269
863a0138J0972P394j9901N167J9455j6373q657J7942o028j0882J6930l008j7984
876a5111J6571R513k1469L802J4957j4871j992J7840j2287j0199K0405k288j7660
889a2789J3592O131j7702Q001J1812j7168J295J6708j3124p018J9232o864j5005
902a2899J7351L003j8115J0173R683j7790M823J5960j6421n735J9889o346j2485
915h909J4255j100j3321J4829M712k0953O943J7010j5540l975J5252j0397n394
928f588J8521o985j8204J7299Q320j8109M764R336j3772N251J4589j7997p220
$$ y = [-8972, -2680, 13714, -3757, -9521, 8872, 554, -7855, 9522, 3517, -13998, 4020, 12074, -10797, -6233, 9571, -5545, -5270, 11116, -4253, -12162, 9886, 5406, -13508, 321, 5131, -10138, 834, 8228, -11673, -6506, 12949, -3424, -12081, 5861, -167, -11049, 5881, 2873, -15111, 1460, 10973, -10496, -6694, 8263, -6608, -8600, 9240, -3047, -13246, 7159, 4871, -12789, 803, 6934, -10768, -2767, 9045, -8123, -6828, 9880, -3244, -10262, 8970, 2106, -12899, 4452, 7455, -10660, -487, 9196, -8594, -3771, 12189, -4232, -9967, 9922, 3576, -8909, 5346, 4246, -9075, 5754, 10466, -10487, -3544, 13466, -2074, -6049, 9203, -1194, -6588, 11933, 4948, -13256, 4043, 12363, -5746, -982, 8354, -5418, -167, 14422, -3575, -10795]
941a0795K2398l853j6122J2366J389j3222J4257N721k1959N083J9408j3738p799
954f866J4377p413o169J7630o815j8127J6601R686j9139L067J1912j3430J799
967b887J5295j5365q708K0543k343j6335J1654L210j4054J0952P091j8931L305
980f573J7784j3516q009J5952n358j0813J5074j022j6419J2642Q362j8482M278
993f100J3213j3473k584J5771j0506p694J7208m440j5445J5026N613j7438N419
1006e430J1900j3838J005J3992j3551n580J9242n469j5071J3679M184j3993R277
1019C47O039j7673P104J6874j5934q101J7647l716r696J2873l832j3354J6204
1032D782O875k1015L766J5229j1215j428J1528j2273m847K0440n399j8642J3383
$$ y = [-10795, 11603, 7750, -8372, 3994, 5383, -7839, 6418, 12139, -9820, -4737, 14671, 933, -6866, 7511, 98, -6071, 11559, 4744, -13383, 3218, 12904, -6235, -3168, 8744, -4686, -2887, 12408, -2957, -11665, 8878, 6535, -9800, 1854, 5064, -8990, 1962, 9053, -9878, -6573, 11211, -2305, -10314, 5638, 280, -10533, 4541, 3519, -12900, -258, 8104, -10378, -6100, 7113, -6360, -8944, 6827, -3679, -11373, 5835, 1395, -14050, 976, 6589, -10849, -5430, 6470, -7368, -6363, 7629, -5922, -11502, 7740, 2271, -12800, 879, 5063, -8930, 347, 6386, -11287, -4183, 12691, -3243, -11344, 6303, 2587, -7109, 5764, 1932, -11422, 4782, 11657, -9358, -5592, 9637, -1578, -3006, 8522, -3751, -8598, 11842, 6443, -12199, 1184]
1045A184Q357j4024N360O252j5346O046J6318j6381q767J8739k335j1532J1304
1058E175j713j3191J4117P686j9860J695J6301j0613m367J2461q733o799J7258
1071I417l913j6771J3236P574j5777N288J0173j4360R67J5624j2212q831J7424
1084G839k896j3346J2424L106j4994Q976Q013j5626L184J4184j3779m521J6328
1097H892o656j1296J4188J40j5283J2400O336j8016M862J4468j3266m162J3810
1110F417p747p086J5225n531j4520J5054O197j7079M659J0142j2586K795J2619
1123H559j4722n889J9431m611j4181J1618K688j2261J0754N008j8152M920J7068
1136A0230j3219p540J4659m884o935J4029m805j4977J4576Q077j7479K834J1406
$$ y = [1184, 9541, -4483, 877, 7129, -8217, -2171, 14147, -2234, -11001, 7738, 5403, -6129, 5175, 3462, -9729, 4388, 12074, -7786, -6091, 10210, -403, -4770, 7691, -1042, -7841, 9417, 5504, -11267, 1969, 9543, -6234, -946, 9227, -5133, -4166, 11458, -754, -9585, 7839, 4943, -8403, 4021, 7127, -7867, 1109, 9122, -6504, -3320, 10864, -2915, -7436, 8892, 2236, -9060, 5128, 5268, -10015, 2385, 8721, -9295, -4433, 10035, -3231, -7393, 6417, -1330, -8416, 6809, 1278, -13242, 1812, 8009, -9070, -4411, 5731, -6855, -4060, 8559, -6163, -12052, 7379, 2768, -11413, 205, 2893, -9368, 1386, 6394, -11758, -6838, 10230, -2989, -10529, 4130, -754, -7689, 6340, 1535, -13442, 1134, 9211, -8268, -5434, 5972]
1149E972j0594J130J2877j3405p378J9569k429j6090J0550N736j2714P554P763
1162H541j6247K514J6060j1091p927J3585l703q556J3180j593j4405J1691Q336
1175A0385j6612K992J2842j2791j694J5067r195r496J6157j715j3947J1296N209
1188H498j5141O532J1153j4785l38J4567j0446n908J5178n456j2434J4649K885
1201H954j5221P624Q048j4397L784J2901j3837m804J6406m955j1602J2271M21
1214E593j2378J0647M868j6220N115J2872j2191l391J2201q463n285J4785n828
1227B325j3801J4079N458j5366M912R077j3451K244J3548j3029p007J7118k973
1240C134j2400J0898J349j2393R852O577j6297K598J4153j1036m033J3354p321
$$ y = [5972, -4622, -3492, 9385, -4020, -11398, 8171, 5742, -10348, 202, 5938, -6776, 778, 8541, -7706, -5192, 10868, -223, -8150, 5435, 1732, -6824, 6356, 4763, -9642, 2049, 10385, -6227, -3235, 9607, -3184, -4878, 10189, 994, -8502, 7655, 5940, -8007, 3289, 8498, -6643, -111, 11042, -3743, -4081, 10486, 40, -5868, 9310, 3854, -8580, 6069, 8954, -6267, 1357, 9405, -4992, -1208, 11693, -2144, -6948, 9458, 4503, -7099, 5172, 5593, -6785, 3862, 8730, -7490, -2375, 10497, -1694, -5085, 7116, -1347, -6632, 8153, 2325, -11476, 2603, 8061, -7305, -2393, 6684, -6767, -4523, 9025, -4004, -11011, 6107, 3134, -9266, 1632, 2981, -9412, 440, 7017, -9280, -6682, 7471, -3565, -7598, 5756, -1565]
1253a565q351J5180j807j4891J0380P707j3501L757R999j2956K09J4146r467q581
1267i741J4122j661j0905J1580J674j3806Q909R313j5004L21J2952j0287l414
1280e947J4406p754r950J5069J268j5232Q447O907j3517M646J1431j3490k890
1293f606J6163o691j0016J1952j478j1284J2058L225j5686P331J1540j2901j536
1306c929J1908r431n125J4571m965j2056J3195M458j3933O026P032j2778L634
1319a393J0897j2166l408J4607n200r054J2324j446j2521J1068M934j5980N429
1332a909J1683j2052j513J3071q660p112J3872l370j2351J1330L899j3589P121
1345D20R016j4043M37J3280j0145o036J3332n499q797J3083P20j4480Q714P806
$$ y = [-1565, -9916, 5264, 3457, -11434, -1054, 6653, -6848, -3091, 6908, -6048, -5839, 8307, -1160, -9741, 4381, 2720, -8185, 3395, 5069, -8737, 172, 9485, -5519, -5198, 7754, -2533, -5947, 8459, 705, -9245, 5824, 7092, -8140, 307, 7214, -6303, -1657, 9774, -3716, -6606, 9557, 2866, -7150, 4802, 3324, -7960, 4098, 7323, -8363, -1032, 10508, -2393, -3929, 7979, -1452, -6577, 7994, 3029, -9027, 4168, 8626, -5307, 719, 7751, -5027, -1393, 9504, -2662, -6070, 8537, 3337, -5717, 6607, 5161, -7360, 3708, 8642, -7338, -1909, 9774, -2278, -3791, 9280, 620, -6492, 7380, 4010, -8341, 2989, 6888, -6701, 420, 9436, -4607, -4170, 9110, -1035, -7071, 6261, 762, -8035, 5048, 5768, -8712, 2, 7808]
1359G808j3310K226R149j1247q47J4867q301j0341J4052M20j2177Q137K619j2274
1373i219P680R877j4525j281J3988o427p077J0841n098q635J4245J524j6569P429
1387c247J1614j2017m96R295j0009k092J4881p498j1289J2925L719j1678O341
1400D49L838j2001O400J0717j4670k880J5286n251q222J0833k202r924J1406L174
1414F953j5371N839J0875j0617j130J0167q208l797J3670o387j0768J3046K505
1427F777j3174P087O980j2546K987J0906j0906l266J3461o181q823J2513k59j1812
1441f256R199M442j3151N618R452j2565j272J3278p331p521J1742k369q930J0101
1455D437J638j3328P535R323j2944o83J1161q452l169J2241p069r104J3754K161
$$ y = [7808, -5502, -3276, 5873, -5374, -6221, 8646, 345, -9996, 4056, 4476, -7701, 436, 3055, -9219, -1539, 8338, -6187, -7468, 6520, 93, -6984, 3857, -1241, -9876, 4369, 5893, -10676, -3247, 8367, -3650, -4146, 5149, -4860, -6952, 7929, 431, -10858, 2067, 5786, -5892, 449, 4287, -7714, -1314, 9403, -5267, -8147, 7139, 1888, -6334, 4499, 2297, -7627, 3779, 6953, -8418, -2579, 8296, -2321, -3451, 6716, -1492, -5289, 8381, 1994, -8774, 4272, 6777, -6397, 690, 7670, -4876, -1889, 9017, -1889, -5155, 8306, 2125, -6698, 5815, 5556, -6256, 2943, 7385, -5766, -148, 9304, -3261, -4533, 8745, 1414, -6107, 5635, 3266, -5664, 4437, 6075, -7253, 282, 9605, -3339, -4022, 7139, -1313, -4482, 7759, 690, -8414, 5340, 7501]
1469G501j4057N217P021r658L764P117j2116m73J5084p229j0362J0907L69r000
1483e915R279Q24j3272P539J1677j3389l868J1844n172m362R977o160q799J3731
1497C934K747j4159M528Q450j0118K020P822j1103j478J4844o011j1391J1450
1510A535K315j0178O341L324j1999N885J0510j2495k606J3197n496o922J0395
1523C806l335r744J1263K954j3084O099R392j1021m15J0362q331l806J1424m858
1537G06q965J2567J885j2780P041P345j1674J568Q744r666j596J2912n849r212
1551f974J2211J104j0637O289K731j0317O172Q666j2956p20J3535n735p575R338
1565E132l435p432J1381P90j4042O854J0695j0299j592P915p740j534J1822p910
$$ y = [7501, -6556, -1339, 5682, -3976, -212, 6905, -5211, -5684, 9400, 2171, -8191, 2716, 3085, -5915, 3364, 4188, -9084, -1545, 10132, -3257, -7125, 4719, -453, -4815, 5162, -998, -9797, 3934, 6681, -7478, -2950, 5500, -4618, -2598, 5224, -5879, -7357, 7487, 1476, -9915, 1535, 3850, -6328, 13, 3337, -8662, -2777, 7733, -4762, -7368, 5829, 333, -6589, 3806, 471, -9273, 1990, 4944, -8140, -2041, 7351, -3670, -4085, 6277, -2054, -5860, 5564, 706, -8259, 4308, 6193, -6587, 454, 7799, -3875, -2307, 6437, -3229, -4825, 8087, 2238, -6974, 5237, 6341, -4296, 1993, 4724, -5593, 579, 9245, -3711, -4431, 9104, 3369, -4206, 5132, 1697, -5735, 5646, 6436, -7606, -752, 9943, -356, -1948, 5967, -1773, -3307, 8515, 605]
1579F05r372J2742M017j2114M896M442j0043M669Q242j2545k595J4358l817q433
1593d948Q958j292q016R883R77j3774O035J0970j0579k524J0099o071l706J1126
1607G138o090j0411J1474L520j1543N042O232r188K274Q862j1163k889J2314m862
1621G10q342J0321P80r774P749L753j1747L697Q805j0187j704J1449n768o309
1635f567J0887k329r301R268J718j1806O097Q276j1096l48J1239p213l946R602
1649D481m470q063J1198J038j1334O079O861r560K335P405j0050q27J2159o483
1663G69q500J0751J552r007O714K080j0682O267Q567j1919k294J2239m959n272
1677c694Q821l867p345J0836J719j2672M884Q760r577L06Q737r035k240J2205
$$ y = [605, -8767, 3975, 7992, -4122, 774, 5216, -4827, -158, 8084, -4461, -7056, 7302, 3485, -4948, 4010, 2718, -5298, 4585, 5562, -8212, -2177, 8793, -1786, -4310, 5789, -282, -3988, 7138, 1048, -9363, 2111, 5631, -5912, -870, 5362, -3826, -1552, 7310, -3853, -6742, 5572, 710, -7632, 2689, 3469, -6305, 1444, 5197, -6550, -2853, 5952, -4235, -5939, 5510, -258, -6567, 4320, 1991, -7310, 1958, 3676, -8130, -2033, 6243, -4853, -5201, 6038, -1175, -5121, 4481, 11, -8052, 3146, 4184, -7150, -1071, 5790, -3770, -1435, 5970, -4080, -4907, 7252, 769, -7731, 3020, 4572, -4435, 2279, 4359, -6323, -56, 8511, -3408, -5702, 6537, 1578, -3694, 5127, 1260, -6085, 4751, 6470, -6202, -1318, 7442, -2135, -1829, 6908, -2127, -4367, 7838]
1691G838n480r404J0428J956r546N855L604r759L926R026j0588k733J1404m954
1705A573n669R092j769r196R479L220j1758M097P894q937j2R323p698m355J1034
1720F318l446q577R023J545r443N551N606j0300J177R363q257k795R806m921o216
1735e566J0308o21j0525P423M451j0479L037P257r449j52J0617o113o937R833
1749C084j272q452P534J469r555N744P025j0118m78R648o831l341R106m964p200
1764h601J1116J095j0181N127O087r110J879P355r491j279J1760n223o884R644
1778C294n33q146P494K119j0924M755Q274r311j005R569n119m482R951l745r129
1793f938R397K334r556M664O154q757K205Q190q837l701J0626m034o948Q974j0
$$ y = [7838, 2358, -7046, 3382, 5338, -4208, 1647, 5251, -4508, -582, 8444, -2144, -4877, 6527, 1573, -4096, 4996, 3227, -5969, 3510, 6730, -5028, -931, 6963, -1974, -1986, 7337, -361, -4716, 6318, 2872, -5705, 3318, 4863, -4580, 971, 6577, -3723, -2546, 6817, -1440, -4235, 5571, 650, -5566, 4742, 4121, -6404, 1019, 5470, -5009, -1972, 5285, -4164, -4316, 6301, 188, -6749, 3084, 1812, -6640, 894, 2363, -7192, -1448, 5577, -4541, -5019, 4629, -2202, -5543, 3563, -1401, -8601, 2515, 3610, -6571, -1444, 4643, -4467, -2588, 4767, -4724, -6003, 5757, 534, -6350, 3294, 2761, -5385, 2109, 4228, -6696, -1941, 6333, -2978, -3983, 5586, 467, -4015, 5936, 2191, -6938, 2459, 4793, -4763, -99, 6055, -2702, -497, 7693, -1144, -4845, 5781, 1747, -5201, 3773, 3763]
1808C763q430P592M341j0772J692Q043p827j496Q710n270m901J0835j439j0043
1822e202P043L187q837M230M897q970J200J0284o958n355R209k263o795P486j59
1837B997r360P106O644j0274K18Q927o662k811P988n011o027J0502k7r701O409
1852I18M176q321K790N131r216K66J0011o095n469R701j212p613O948J259r907
1867f633M769O660r156N11Q374n786l551Q998m174p100Q671N91q886N922M789
1882C999q918K343P814q227k217R214m570n823R053n58q737P585L757r453K246
1897b492O200p545N87P690o117m325J0321k100p429O476J077p642N458M211r586
1912e216J993R871o950m186Q391l537n090Q768j446r104P323N926r405J003O394
$$ y = [3763, -4667, 2925, 7266, -3506, -1814, 6229, -1598, -3094, 5616, 346, -4555, 6280, 4841, -5202, 1841, 5028, -3809, 421, 5318, -3652, -2452, 7832, 874, -4481, 4728, 2465, -4330, 3156, 2997, -6363, 743, 7387, -2887, -2669, 6258, -404, -3215, 4773, -238, -6265, 4237, 4210, -5491, 918, 5094, -3227, -437, 4694, -4522, -4256, 5755, -340, -5809, 3892, 2680, -4933, 2015, 3274, -6633, -1864, 4796, -4360, -3849, 4525, -1261, -4812, 4186, 12, -7088, 1583, 2174, -6712, -790, 3999, -4919, -2576, 5238, -2989, -5206, 4008, -562, -6385, 2668, 2110, -6627, 958, 4715, -4738, -2492, 3708, -3837, -3250, 4440, -1677, -6002, 4319, 2219, -5210, 1266, 2343, -5299, 159, 4370, -5216, -3223, 6648, -302, -4488, 3903, 366, -4724, 4044, 2598, -6506, 817, 6743, -2662, -1659, 4735]
1927D735o633j05P811o599m647R977l72q367N750K369p305M659M930r834N82J0102
1943G053n981n050Q054j723n788P792p05q871O095N779q723M11O689n916j226
1958b110Q017n672n496R800k22q407N168L739q144K689O220q107o18Q771n278
1973C50m824Q217j109p425O549J679q003M298N381q728R56Q131o585l996Q670
1988C561k774n795O873K64p828O098M970r955J411P483o200k081P630m906m030
2003e279R212j084r051N627M095p379J947M464p142J411Q910o699n384R185n13
2018B320o913N431K44p348O528M852r454L40Q660n020l395N978l986l753Q787
2033C271p34q831O055N286p435P18N039p117M63Q567n601n339Q818N28p681N662
$$ y = [4735, -1898, -2003, 5808, -791, -5438, 4539, 4167, -4200, 1550, 3919, -3386, 1273, 6203, -3631, -3049, 7053, 1072, -3978, 4076, 2353, -3435, 4357, 3652, -5219, 876, 6655, -2068, -1657, 5032, -884, -2110, 5907, 235, -5261, 4539, 4317, -4090, 1078, 4817, -3327, -638, 5582, -2525, -3143, 5628, 350, -4474, 3743, 2634, -4791, 1758, 3437, -4566, -268, 5113, -3615, -2659, 5472, -1113, -5109, 3561, 787, -5008, 1865, 2129, -5699, 399, 5369, -4586, -3175, 4308, -1892, -3973, 3657, -1249, -5279, 3933, 2849, -6202, -575, 3520, -3859, -1912, 2552, -4590, -3179, 5731, -968, -6352, 2833, 2320, -4593, 838, 1082, -6266, 262, 5114, -4340, -4000, 4660, -360, -3755, 2223, -1763, -5516, 3271, 2537, -6294, -239, 5047, -2388, -1670, 3369, -3748, -3285, 5282, -319, -5658, 3160, 3688, -3993, 1669]
2049A669J229p315M248N532q600L06Q611m945l480P248k969n672P560K70q596
2064d904N234N331p392J422O452o621k127P503m023n121P672j05p023O180L231
2079E709q143K009N522o717r30P423n005l272Q413j543p109N800J612p405M045
2094D09L860q015J930Q186o210l673P263k154n236O173q17p161N799M913q463
2109c196Q41O749n500j462O425n754m242R542n62q234N474L609p150L099L943
2124C582q062O36Q254n240m774P646o43n412N584l91p108N499M536q447L16P333
2140C309m406k360O819m249m855Q002P7q385N182M049o924K210N373o772r78P676
2156C768m317m814P112k7o242O050J602p280L463N240p649O30O847n721k548Q141
$$ y = [1669, 2898, -4417, -169, 5363, -3237, -2931, 5680, 735, -2745, 4503, 1534, -4138, 3422, 3692, -4904, 330, 5661, -1731, -309, 6143, -478, -2605, 4898, 875, -4246, 3426, 3321, -3702, 2478, 5709, -2434, -425, 5097, -1620, -2550, 4873, -132, -3404, 5009, 3466, -3643, 2157, 3769, -3636, 409, 4269, -3746, -1816, 6370, 160, -3513, 3750, 1596, -3640, 2533, 1716, -5445, 354, 5267, -3196, -2355, 4394, -1106, -2568, 3857, -1897, -6139, 3403, 2841, -5393, 81, 3690, -3460, -361, 3582, -4480, -3844, 4410, -830, -5604, 2042, 1399, -4013, 1571, 1180, -5928, -429, 4107, -4340, -4024, 3309, -1097, -3457, 3362, -887, -5742, 2260, 2337, -6048, -866, 3183, -3741, -1531, 3842, -2930, -3908, 3768, -549, -5363, 1749, 1722, -4520, 1530, 3132, -4148, -685, 4555, -3094, -2464, 4383, -1338, -3886, 4255]
2172D255k665n685O620N37o775M720L406p491J826O818n834k410O604l138l863
2187c075P202j765o778O280L278p770K361N137n965l92O894n687l937Q337r21
2202C199o951M822K012o208L779L687p629J211P171n120l376O741k172m631O293
2217B828N4p358M785M340p231R32N590n601j279P250m173m794P687k86o852N005
2233H97K398o869K991M906o983l73P128m301l340O618k223n111O084J096p659
2248d741L579M750o535J232N797o022j825P472l575n227O292K57n725M770K537
2263C036p694K562O274o767j995O951l777l157P129j777o490O257K635p508K112
2278b209M349n617P29O416n945k578Q027j571o499N911J31n681M908K855p136
$$ y = [4255, 1590, -4095, 2525, 3062, -3713, 1007, 4413, -3078, -1252, 5566, -268, -2678, 3926, 788, -3075, 4127, 2362, -4416, 1864, 5142, -2628, -267, 4870, -1095, -1487, 5407, -280, -4217, 4120, 3199, -3752, 1070, 3082, -3126, 653, 4340, -3289, -2078, 5093, -27, -3403, 3338, 1166, -3465, 2828, 2882, -4476, 309, 4649, -2582, -1650, 3940, -1661, -2940, 4310, 137, -4657, 3030, 2744, -4108, 897, 3295, -3574, -583, 4323, -2660, -3033, 4095, -206, -3546, 3072, 849, -4262, 1822, 2918, -4741, -1162, 3588, -2947, -1715, 4082, -1940, -3765, 3707, 132, -5095, 1197, 1454, -4271, 499, 3036, -4658, -2096, 4178, -2589, -4584, 2367, -1410, -4567, 2562, 785, -5705, 552, 3187, -4321, -2209, 2140, -3477, -2748, 3668, -2277, -4855, 3172, 1601, -4898, 1013, 1144, -4537, 371, 3226, -3910]
2293c910J338P738n408l047N848k938l240O637j158o777O257L615p149J430M774
2308D010n480J46N563m560l671P901r10o248N320J187o118L774L662p522J455
2323a491O991n546k567P015k868n121O111L43o404M408L241o470J993N470n999
2338h94j392O624l682l801O045j464n469O038K228p616K534N532o380n64N534
2353C273m492k254P231j857o426N949J755o319K516K740o077K552O257o243k958
2368d353P651j906n209N028q98n239N863K840q245J915O564n115k016N093l650
2383a677k862P540k245o517N942L205o666J785L449n562J148N916n445l022P427
2398B416j226n252M894O06n687M692K804p477J720O294n094j918O032l098l628
$$ y = [-3910, -2572, 5166, -242, -3289, 2559, -379, -3619, 3018, 1860, -4917, 1340, 4955, -2194, -764, 4010, -1470, -1324, 4239, -321, -3992, 3909, 2999, -3249, 2071, 3258, -2860, 914, 4576, -2946, -1491, 5500, -46, -2613, 4402, 1534, -3587, 2524, 2867, -3537, 871, 4112, -2358, -365, 5105, -894, -2286, 4338, 656, -3145, 2900, 1436, -4033, 2005, 4233, -3383, -849, 4683, -1697, -2261, 3273, -1219, -3473, 3758, 1901, -4525, 1424, 3179, -3140, -624, 2116, -3961, -1409, 4848, -1395, -4353, 3298, 1392, -3817, 1211, 313, -4926, 937, 3777, -4468, -2553, 4011, -1104, -3120, 1973, -1677, -4539, 3001, 756, -5761, 181, 3386, -3280, -1495, 1954, -3608, -2460, 3456, -1989, -5011, 2416, 1190, -4062, 832, 1438, -4249, 443, 3247, -4230, -2510, 3784, -1310, -3228, 2804, -294, -3922]
2413c922O462r65o530N609K783o623K534M472n847j89O168m596l472P488j496
2428A876o536O085K502o893K419M478o053J083N193n647j584P181k401m934N348
2443B117K31n140M056K461p185K742O346n821k737O375k139l461N534j941n565
2458d127O405K231p237J505N020m808N35M417n029k433Q004j732o488M521J996
2473B780n019L254K060o741K065P323n871l528O404j049m223M856j212n595N446
2488I50L269p533J321N461m683m29M566m386k642P428j803o290N156K223o123
2503c515L015L307o244O76O756n482k388O440j337n131M955K80n569L943L339
2518C045o973J705N938n858r62O004l197l943N978q97n410N166K442o717K378
$$ y = [-3922, 2540, 1575, -4955, 654, 3437, -3186, -652, 3820, -2027, -2216, 3952, -644, -4116, 3372, 1876, -4660, 1425, 3927, -2966, -547, 3931, -2122, -1039, 4154, -1493, -3077, 4104, 1703, -3231, 2117, 2348, -2792, 1264, 3725, -3460, -718, 5628, -193, -2930, 3445, 1306, -2155, 3379, 1438, -4127, 2278, 4509, -2728, -1223, 3797, -1011, -476, 3941, -1088, -3521, 4483, 2751, -3737, 784, 2780, -2239, 1015, 3075, -3666, -1601, 5722, -149, -3677, 2727, 1678, -2545, 2311, 1099, -4496, 950, 4219, -3314, -1993, 3468, -1215, -1644, 2922, -1464, -4106, 3322, 1519, -4771, 385, 2608, -3515, -500, 2807, -3437, -2761, 3995, -1487, -3875, 2565, 1228, -3903, 1052, 1332, -4237, -294, 3045, -3928, -2223, 3715, -2143, -3105, 2899, -298, -4241, 1737, 840, -4570, 596, 3038, -3679, -1301]
2533a301M788n128j211N680l999k280O320j929n484N857J718o121K691K942n507
2548b964J685N305n636k058P610k150m997M785J6n115M632K450p335J843O650
2563D721m632k562N307k753k301N680j877o098O164K787o276J287L878m845P06
2578h14N835o080k459P163j031n464M546Q60m910L945K556p497J670O001m628
2593c07k076N527k941k763N794j624n734N006K703o289J811M660n173j28N391
2608C857m543k988O271r83n635M833J647n604L132L516o154P13N195m434k039
2623c216O389k359m535N186P27n857L720K622o457J850N454n396j801O165k634
2638a42l628N525q08n608N300K105o695J911N147m827q05N242m411k269O710k041
$$ y = [-1301, 3487, -1641, -2852, 2828, -1171, -3451, 2869, 940, -4544, 1313, 3031, -3090, -399, 2543, -2964, -1279, 4026, -1610, -3668, 3942, 1792, -3205, 1580, 1596, -3519, 1113, 3563, -3772, -1929, 4721, 89, -2473, 2834, 81, -2220, 3460, 1583, -4515, 1649, 4436, -1840, -553, 3325, -1520, -814, 5021, -1059, -3518, 3645, 2614, -2850, 1696, 2556, -2354, 1591, 4147, -3350, -1680, 4321, -307, -2383, 3144, 203, -2560, 3234, 1610, -4124, 882, 3585, -2704, -893, 3767, -1406, -1534, 3857, -686, -3674, 2597, 1614, -4021, 812, 2459, -3145, -13, 3503, -2651, -1938, 3257, -1177, -3216, 3173, 814, -3721, 1465, 2192, -3665, 55, 2677, -3780, -1930, 3524, -1872, -3673, 2492, -142, -3770, 1755, 947, -4661, 639, 2744, -3951, -2040, 3107, -1720, -2525, 2717, -1694, -3963, 2747, 706]
2654G06n572N575J695n849K845L040n887J719N681n668k655O933k000m206N210
2669A567k21n509M868K684o655J680N069m648j342N886l694l104O630j231n775
2684c795M544K732o311L012L288n674J079N690m508k859N897j485m089N054K01
2699B776n842M072L523o451Q43N077m466j600O128l152m290O481k56n837L980
2714I86K123n841K474M349n788m50O166l475l443N340j159m765N135J652o915
2729c611L367M142o044M5N404m821j201N869k508m896N687O77n429L696J943n701
2745c381K100N260n912r62N902l125l310N527r68n093M608K344o363J920M907
2760C454n543l16N422m008k700N994j389n083N358J130n681K954L368n853Q23
$$ y = [706, -4866, 709, 2404, -3445, -600, 2440, -3447, -1728, 3953, -1715, -4370, 2563, 563, -3643, 1567, 1346, -4163, 705, 3389, -3266, -1586, 3483, -1165, -2507, 3379, -315, -3419, 3211, 1980, -3795, 749, 3481, -2830, 182, 3470, -2204, -1125, 4565, 57, -2802, 3095, 1610, -2479, 2575, 2776, -3066, 1006, 4529, -1922, -1079, 3998, -468, -2068, 4060, 908, -3382, 3099, 2843, -2994, 986, 3109, -2732, -258, 4091, -1697, -2147, 4019, 544, -2899, 2441, 1282, -3483, 1652, 3304, -3611, -244, 3898, -2146, -2101, 3303, -1518, -2719, 3150, 642, -4254, 1433, 2110, -3319, 377, 2320, -3381, -1281, 3979, -1933, -2895, 3007, -118, -3428, 2099, 1131, -3962, 646, 2990, -3373, -1453, 3454, -2089, -2405, 3017, -991, -3691, 2303, 914, -4169, 1189, 2319, -3362, -408, 2960, -2893, -2070]
2775b070N378m594j963N679k628l659N887n18n839M097K974n714J764M245n370
2790b331m4N611l085m445N763k8m976M588J039n633L044M458n989n87O028l489
2806g6k635N238k091l954O178N30o814L331L836n005J143L733m671q68O464k975
2822A364m949N974L33n169L903J370n683L153M554o188q39N729k898k793M840
2837B701j216m475N662P01o296K898L850m838K0M347m216j294N467j976m652N300
2853A983P50n737L391K780n540J298M458m527r55N531l095m043N678m36m860M075
2869G51J965n755K789L802n732j96N597l569l054N338j431l810M928q2n660L942
2885a77L620n732j81M953m209q13N731l685m034O007P27o080L335K173m617J853
$$ y = [-2070, 3308, -1286, -3249, 2430, -198, -3857, 2030, 1512, -4327, -230, 2744, -2970, -1206, 3039, -2331, -2375, 3236, 151, -4294, 1469, 1441, -3535, 1053, 2092, -3541, -497, 3961, -2028, -2615, 3413, -76, -2711, 2527, 436, -3518, 2660, 3190, -3624, -293, 3543, -1462, -319, 3414, -1257, -2125, 4339, 1364, -3585, 2389, 2722, -2447, 1456, 2826, -2857, 296, 4850, -1338, -2177, 3552, 654, -2139, 2701, 1485, -2990, 2672, 3373, -2923, -25, 3825, -1013, -993, 3354, -862, -2156, 3311, 1335, -3317, 1983, 2733, -3004, 387, 3167, -2373, -1075, 3383, -1144, -2099, 3432, 337, -3706, 1972, 1536, -3324, 751, 2716, -3039, -250, 3552, -2180, -2376, 3221, -348, -3402, 1936, 505, -3305, 1623, 1541, -4119, -177, 3443, -2289, -2470, 2483, -1726, -2539, 3192, -493, -4527, 1480, 2207, -3873, -538, 1635, -2982, -1129]
2901a129L938n659j46O186l074l872M781o77l561M532N62o033L124M880n662o08
2917b418M837l257j556N210l004m382O402J241o175K467L253m640J899L695n590
2932b018r93P053k763m656M940N00m526M226J040n722K577M461n047j010N418
2947C480k964k536M936j315m742N470J011o016K685L877n081L52M545m226j428
2962a952N701k834l893N317K94n387L218L122n192R21M505n268m57N867l399l549
2978b986N319j94m564L604J346n777L333M132o167m92N818k986k896N085k221
2993C54l719N654K18o158K512M318m893P8L518l528q93N964l327m418N355J066
3009B101m723K808J515m683K085M397o256o62O188k480l244M064j184l696M999
$$ y = [-1129, 2809, -2850, -2996, 3190, 116, -3756, 1025, 348, -3213, 1319, 1881, -4152, -1028, 3852, -1810, -2418, 2419, -838, -2394, 2816, -188, -4570, 1832, 3073, -3102, -635, 2618, -2022, -123, 3572, -2018, -3011, 4042, 1279, -3377, 1563, 2063, -2463, 1763, 2803, -2919, -342, 4119, -928, -1938, 3480, 516, -2020, 2916, 1601, -3141, 2329, 3340, -2676, 9, 3886, -1195, -843, 3702, -524, -1952, 3749, 915, -2978, 2339, 2633, -2754, 464, 3586, -1606, -685, 3820, -1448, -1905, 3962, 563, -2986, 2333, 2139, -2425, 1179, 2525, -3252, 81, 4213, -1954, -2446, 3372, 386, -2510, 2575, 354, -3365, 2289, 2507, -3651, -1139, 3179, -1714, -1636, 1882, -1646, -2539, 3425, 98, -4320, 1035, 2101, -2622, 186, 1701, -2982, -897, 3500, -2756, -3418, 2770, 290, -2954, 1110, -74, -3770, 1229]
3024A229R30o170K754M528n088k69L836l306j312O079l027m430N039J209m837
3039b835K527K325m637J255M744n148j804O389k510l502M985m26m197L664J831
3054B661n336J661M791n577JM769l232k241N050j321m129M699Q97n520K607L771
3070C551m965O2M509l500j877N525k578l683M937Q60m980K330K849m714J789L379
3086C494m674o22N831k599m427M980m4l893L921J043n612K603L928n092r62M715
3102B590k351j770M790k903l633N245J038n926K318L547m593J199L661m499j140
3117b427N874k393m580M706J77m208L432J445n012J980M734n129j196M894k550
3132b53k391M596j468m276M907R38n483K249L845m799N29M187m485r85N514j873
$$ y = [1229, 2159, -4011, -1257, 3271, -1817, -2086, 1750, -1556, -2868, 3211, 184, -4246, 793, 2002, -2835, -308, 2017, -2620, -1365, 3379, -1769, -3573, 2816, 306, -3196, 1789, 1363, -2834, 830, 2661, -2675, -1014, 3777, -1800, -1799, 2970, -262, -2503, 2547, 1226, -2903, 1796, 2693, -2827, -220, 3551, -1414, -1352, 3157, -343, -2220, 3305, 727, -2956, 1981, 2841, -2139, 191, 3040, -1674, 115, 3494, -1180, -1802, 4029, 1430, -2997, 1983, 1939, -1954, 1967, 3010, -2602, 1, 3929, -1163, -2125, 2590, 239, -1531, 3259, 356, -3277, 1968, 3006, -2920, -602, 2945, -1648, -449, 3212, -1287, -2427, 3447, 1054, -3526, 1180, 1357, -2851, 581, 2026, -2986, -1006, 3728, -1401, -2597, 2297, -253, -2644, 1952, 484, -3792, 1115, 2053, -3430, -1181, 2664, -2135, -1606, 2581, -1904, -2889, 2625, 752]
3148G52m348M367R40m988L003K186m695J226M199l737j455M874k432k940M635
3163A587k63n020L965J906m987J929L580m739O1M872l427k360M770r98l610L854
3179A120P01m767L019L251n146K10M302l342j276N004k451l666M751R00m967K782
3195D25K432m887J504L915m350j123N204k183l354M495m69l506L631J408n672
3210b530K497M016m621n87M661l360k034N081j848m115M544J227m719K057K653
3225B922m588J187M081m125j584M942j701l521M301m68m250L589J754n112J477
3240a096L706l703m72M130l073k105M985j048m415L603J588m631K266K584m420
3255b101L66M463l379k186M499j816k620L755k07m400L430K826m638J63M142l709
$$ y = [752, -3596, 771, 1711, -3277, -274, 1912, -2783, -1557, 2642, -1095, -2550, 2324, -108, -3048, 1587, 1324, -3696, 269, 2175, -2812, -883, 2697, -2042, -1981, 2891, -536, -2896, 1874, 876, -2734, 1120, 1821, -2946, 73, 3324, -1822, -1612, 2690, -652, -1928, 3076, 625, -3041, 1710, 2610, -2357, 425, 2857, -2030, -526, 3389, -961, -2084, 3120, 937, -2417, 2078, 1609, -1897, 1734, 3142, -2530, -33, 3983, -638, -1225, 3436, 76, -1958, 3123, 1275, -2840, 1704, 2931, -1788, 269, 2922, -1666, -479, 3602, -523, -2107, 2835, 1134, -2387, 1914, 1446, -2804, 785, 2539, -2573, -1096, 2610, -1093, -1565, 2565, -508, -2613, 2372, 1324, -3091, 512, 2100, -2531, -265, 2319, -2101, -1735, 2728, -651, -2837, 1662, -154, -2774, 981, 774, -3626, -196, 2630, -2008, -1845, 2297, -1412]
3271a412o62M737l209k864M785K50m758L342J698m253J576L274m858N40L886k441
3287c69k529M483r81l424L906N12m650K622L004m264J44L984l026k088N199k248
3303B75l029M428l7m290K826K270m541J409L771m042j123M646k332k851M748j047
3319A081m155L950K006m676K080K548m360L29M575l576k286N154p40l922L614
3334A622L40l912K948K095n154R52M697l228j883M408k447k313M762j053m737
3349b903L472K933m576K15L594l829K0M227l291k657M709l34l730K984J019m018
3365b165K572K635n024l2M809l144k025M066j360k805M294j8m962K993K743m682
3381b105N57L792l674l54M379k664l407N314r40l838L127J365m026J978K818l906
$$ y = [-1412, -2074, 2663, -546, -3410, 1375, 1625, -3133, 209, 1907, -2346, -770, 2504, -2354, -1814, 2072, -369, -2898, 1585, 604, -2820, 1086, 1598, -3052, -430, 2574, -1690, -1546, 2438, -588, -2676, 2523, 275, -2754, 1674, 1637, -2653, 173, 2443, -2098, -689, 3082, -960, -2083, 2563, 231, -2620, 2128, 1081, -3074, 876, 2882, -1794, 286, 2834, -1526, -1197, 3378, -198, -2484, 2670, 1930, -1992, 1622, 1962, -1950, 998, 3093, -2061, -1109, 3588, 360, -1523, 2885, 438, -1875, 2887, 1834, -2903, 569, 3502, -1074, -859, 2735, -1094, -1074, 3153, -138, -2795, 1914, 1580, -2150, 834, 1853, -2165, 407, 3042, -1982, -2014, 2795, -349, -2374, 1692, 332, -2473, 1821, 1803, -3159, -166, 2577, -2105, -1548, 2244, -1430, -1784, 2595, -69, -3476, 1838, 898, -2940, 187, 1552, -2474, -496, 2322, -1584]
3397a584l90L998k719k106M564j414l423L602R20l834K253K394m494O88M008l906
3413a443q76L762j457k733L903r3m135L101K022m303O16L918l224p46L694k385
3429c79k319M565n79m022K433J861l003J164K549m025N52M772l482k869M441k15
3445A444k916K767P9m015L386K697n328M95M195k486j318L407k578k012N101m61
3461B457m687K581K525l547K74K928l907K81M633l539k657M472j41k998K856j49
3477A382l389K567K642m793o9M710k844j813L778j990k313M034l12m334K850K382
3493B488m240Q60L297l125j104M111k556k146M040n82l847L083J775m252J516
3508f82K472l504O1M017l025k301M402o42l176K526R78l853K514K293m519Q09
$$ y = [-1584, -1974, 2024, -695, -2801, 1763, 349, -3074, 528, 1448, -2386, -133, 2261, -2233, -1545, 2463, -1443, -2319, 1443, -14, -2747, 1156, 1063, -3072, 29, 2051, -2252, -1636, 2282, -942, -1688, 2006, -379, -2698, 1867, 1288, -2734, -301, 1560, -1443, -279, 2270, -1755, -1203, 3569, 87, -2782, 1659, 1444, -1472, 1295, 1374, -2641, 745, 3442, -1886, -1391, 2804, 318, -1000, 2407, -171, -2183, 2918, 2457, -2230, 351, 2876, -671, -397, 2531, -1376, -1095, 3538, -1, -2658, 1814, 1673, -1325, 1531, 1382, -2007, 560, 3202, -1591, -1660, 3050, 206, -1607, 2171, 181, -2132, 1902, 1590, -2744, 106, 2488, -1752, -892, 2405, -720, -1824, 2287, -269, -2415, 1625, 1043, -2804, 279, 2054, -2198, -682, 1790, -1714, -1653, 2364, -661, -2962, 1440, 798, -2378, 148, 1126, -2727, -213, 2080, -2439, -1630]
3524a630M035k950j640L591j698k172L768m13m208L159K446m491N72L017k575
3539a189k16L832l164k502M583P1m165K889J314l349K094K239m510K69M362k769
3555b11k293M028j052k201L647k57m642L047K991m337j68L643k557p32L480k126
3571B60k460L625N69m459K542K232l531J464K593l935k29M031k203k780L691l69
3587A041k732L207P91l950J925K657m108O0L726k655j355L604j160k932L725K0
3603A864l977K560K165m132P79L537l250j115L948k214k317M287o28m063K492
3618f4K002l339R57K727l981N55L636k678k599M416j089l035L297J85l479K930
3634D41J860m323J53M013k873j732L917j652k240L863J50m339K149K663l812O09
$$ y = [-1630, 2405, -545, -2185, 1406, -292, -2464, 1304, 891, -3317, -158, 2288, -2203, -1631, 1386, -1189, -1405, 2427, -737, -3239, 1344, 1415, -2750, 139, 1453, -1896, 198, 2437, -2073, -1804, 2558, -211, -2504, 1524, 472, -1729, 1918, 1661, -2981, 66, 3057, -1280, -1448, 2195, -362, -1094, 2386, 260, -2200, 1425, 1994, -2465, 77, 2309, -1222, 242, 2835, -1100, -1329, 2702, 499, -2281, 1410, 1041, -1691, 1516, 2307, -1643, 282, 2939, -1169, -1109, 2617, -38, -1393, 2211, 1051, -1881, 1844, 1864, -2113, 447, 2612, -1520, -741, 2796, -454, -1569, 2379, 165, -2152, 2135, 1507, -2556, -64, 1938, -1401, -444, 2283, -1698, -1143, 2493, -185, -2784, 1632, 543, -2492, 805, 990, -2489, 441, 2301, -2022, -1869, 2144, -729, -2461, 1456, -196, -2436, 1427, 1577, -2762, -613, 2050, -1762, -1153]
3650a153K466k884PL990k704k484L588p6l097K227Q08l341K378K244l603n23M191
3667B034k404j653L135j274k341L494N02m199K273K861l885N57K878l066j056
3682b144M087j650k701L436N36l951K967J268m034J475L379l385q19L696k030
3697A30k061L557n09l288L116Q59l540J758K690l529K78L379l078j198L532j195
3713I01k530L159J61l516K399K342m269R35L140k823j227L705k190j925L611k99
3729A574l460L025J228l463P92K857l623N9L568k874j541L511q73l043K991N44
3745A272l580K210K452l729O11K820k833p90L566j781k685L669O4l795K623J780
3761A874l843J262K827l296r80L827j702k593L603p99l103L584J099m163J670
$$ y = [-1153, 1313, -1571, -1564, 2426, -278, -2762, 826, 750, -2347, -120, 688, -2653, -275, 1969, -1634, -2157, 2034, -370, -2023, 1112, -162, -2503, 991, 1493, -2706, -433, 2428, -1457, -900, 1978, -1088, -2144, 1943, 293, -2408, 1028, 1564, -2387, 580, 1848, -2186, -711, 2668, -717, -1536, 2160, 130, -1931, 1626, 1117, -2171, 945, 1804, -1736, 22, 2712, -817, -539, 2840, -238, -1436, 2096, 901, -1629, 1530, 1691, -1825, 574, 2916, -1353, -418, 2722, -101, -1328, 2377, 187, -1738, 1873, 1574, -1886, 1139, 2367, -1096, -304, 2553, -1070, -1011, 2557, -317, -1858, 1653, 780, -2263, 728, 1272, -2308, -98, 2354, -1375, -764, 2056, -777, -1567, 1999, 218, -2467, 1202, 1266, -2529, 94, 1874, -1969, -707, 2120, -1176, -2156, 1671, -31, -2624, 979, 180, -2923, 661, 1760, -2403, -733]
3776g33K393k883k23L056k768j452M397j554l156L337O56k925J386K273l863J071
3792i88K946l199r44L486j269j736K447Ll324L030J486m209J103L227k662o00
3808a203L098k665j319L886n50l961L198J469l244J170K051l626J026L381l042
3823c31j639L884p22l081L208p9l132K595J402l470M15L241k680r72L517j870
3839B86j859L591m12l427K399J956m146J467K902l108m27L628k757j873L322m16
3855A126l272L364R06l704J682J998l070L75L133l350j050M109j438k530K630
3870I09J90k883K222J399m208J534L436l178j286L341j670j662L640j281l208
3885b705L389J272l815P19K549k882P45K810k880j901M191p52l715L272O71k943
$$ y = [-733, 1660, -1223, -1446, 1610, -1158, -2610, 1787, 233, -2923, 414, 1070, -1855, -469, 1804, -2059, -988, 1958, -1241, -2185, 1301, 32, -1704, 743, 746, -2578, 452, 1938, -2271, -1168, 2059, -603, -1203, 1895, -770, -2089, 1797, 1247, -2714, 484, 1953, -1291, -121, 1930, -1696, -670, 2711, -331, -1970, 1914, 1192, -1889, 1319, 1240, -1892, 703, 2105, -1365, -950, 2291, -389, -1361, 2156, 286, -1573, 2018, 1606, -1821, 578, 2534, -1612, -145, 2757, -351, -778, 2850, 93, -1780, 1542, 1126, -2146, 1218, 2124, -1580, 102, 2100, -970, -595, 2538, -812, -1862, 2247, 809, -1721, 909, 1099, -1784, 438, 1837, -2371, -837, 2599, -579, -1865, 1476, -194, -1856, 1784, 503, -2705, 684, 1956, -1859, -1140, 1409, -1473, -728, 2082, -798, -2699, 1492, 740, -2975, 297, 968, -1975]
3901a975K054J451l791P73L793l193j697L468p98k138L304p70l510L081K238m309
3917b019O44L085k314o34K678k221j079L623q55l442K513J327l005J206K284l695
3933a904P77L395k682j876L836q42k802L078J38l103K435J871m229J130L250k770
3949b98j537L609j817j738L407p14k906K769J257l710R49K931k865n89L508k244
3965A2j587L641p64l531K958J295l083J072J729k815O14L335l175j793M159j056
3981A011k549K913r4k716K177J683m017Q36L121k439j098K817j908j616L932r71
3997A082l474L141J253l516J053K384l306Q10K822k705k135M177p31k889K506
4012D72K20k744K159J819l935M56L647k427j423L117j521j764L394m43l463K338
$$ y = [-1975, 79, 1530, -2261, -1488, 2305, -888, -2585, 883, 85, -2053, 1251, 481, -3029, 52, 2290, -2019, -1375, 1710, -604, -1238, 1440, -781, -1860, 1763, 908, -2534, -21, 1306, -1699, -493, 1791, -1904, -1127, 2268, -414, -2290, 1546, 704, -2098, 980, 1118, -1985, 450, 2321, -1908, -778, 2472, -298, -1835, 1774, -43, -1781, 1626, 912, -1994, 775, 2032, -1678, -729, 2202, -663, -1252, 2256, 12, -1575, 2066, 1302, -2229, 729, 2024, -1059, 13, 1742, -1073, -459, 2876, -299, -2092, 2067, 1011, -1538, 1375, 1281, -1435, 742, 2425, -1592, -756, 2365, -74, -1172, 1645, -263, -1879, 2053, 1082, -2392, 749, 2002, -1514, -461, 1923, -1383, -573, 2249, -456, -2591, 1586, 855, -2034, 472, 692, -2052, 107, 1926, -2009, -1553, 2094, -333, -1756, 1361, -160, -1924, 1470, 1027, -2436, -98]
4028i8J722l480P41K900l282j52L868k924j835L636k54l115K304J026l403J939
4044d07K239l593J45L426k635j401L635j081k352K938M39l340K132J678l528O32
4060a073L196l245q95L800j609j935L425m42l823K809K036l861P42K847k370k51
4076f49K585k036j864L905o24l651K898R80k722J152J815l223P17L299k663j509
4092a590L327m36k294K624j85l013K459J825l696J0L051k587l56L170k402j634
4108a727L667l40l611K626J194l193J471K096l481m3M116k994j777L365n65k720
4124a916K965J94l513K621K028l846O65K513k262q22K953j743k164L529L10l229
4140a717J666J655l439J179K293l096j47L014j393j968L122p09k654K333J158
$$ y = [-98, 1624, -1856, -1115, 1785, -1497, -1649, 2219, -705, -2540, 1096, 842, -2273, 31, 1057, -2346, -407, 1832, -1761, -1616, 1810, -825, -2226, 1409, 328, -2024, 914, 1353, -1987, 145, 1823, -1705, -1073, 2123, -1122, -2017, 1783, 174, -1761, 1664, 1222, -2601, 208, 2244, -1617, -875, 1972, -398, -649, 1936, -100, -1964, 1941, 1317, -2334, 564, 1544, -1178, -26, 1789, -1434, -717, 2582, -81, -1590, 1737, 1301, -993, 1631, 1446, -1567, 892, 2717, -979, -969, 2082, -505, -861, 2309, -93, -1727, 1940, 1600, -2011, 615, 1809, -1384, 87, 2183, -1298, -1341, 2775, -219, -1996, 1369, 804, -1916, 1049, 1243, -2270, 351, 2379, -1467, -802, 1711, -551, -1373, 1580, -163, -2327, 1202, 1512, -1717, -51, 1604, -1835, -656, 1637, -1459, -1606, 1408, 15, -1953, 1169, 460, -2194, 139, 1297]
4155A297l788J548K768l247L21K848k848r86L727j324k938L084N50l166K128J883
4171A857m128R41L356l135o02K929j301k093L468m01k962K494J204l235O79K702
4187A773l029j77L648k213k281L912m93l486K921N54l232K258K186l833N85L372
4203B465k637r39K942j077k602L416j13l596K430K039l434N76K468k577m35L293
4219B219j761k090L213l41k933K705P36l293J446K740l449n33L577k069j568L251
4235A850j227k475L315J47l714J886J855k396K46K384k522j005L798j318k792
4250a968L270L23l322K381J058l697J362K724k814q39L241j600j911L397j188
4265D17k689L078N98l378J265K567l096N9L074k451j396L592j223l029L451L49
$$ y = [1297, -2491, -943, 1825, -1422, -1101, 1747, -1101, -2087, 1640, 316, -2622, 462, 1012, -2154, -26, 1857, -2271, -1330, 2026, -1109, -1711, 1218, -83, -2176, 1292, 891, -2071, 423, 1627, -1608, -929, 1773, -1256, -1433, 2215, 2, -2279, 1633, 1140, -2346, 575, 1129, -2103, 155, 2341, -1492, -907, 2465, -172, -1111, 1831, 754, -1848, 1568, 1455, -2141, 289, 2328, -1106, -530, 1938, -639, -1074, 2219, 458, -1632, 1581, 1240, -1693, 1012, 1748, -1545, -99, 2641, -808, -1341, 2236, 167, -1401, 1850, 623, -1852, 1463, 1610, -2104, -218, 1637, -759, -513, 1871, -651, -1656, 2142, 824, -1968, 1302, 1625, -1697, 684, 1742, -1955, -593, 2131, -683, -1522, 1719, 119, -1792, 1605, 417, -2272, 806, 1404, -1974, -709, 1858, -1238, -1179, 1895, -556, -1952, 1640, 417, -2612, 839, 1188]
4281A188l048J646J748l377Q49K972l258q08L519j706j973L303j31l155K289J605
4297A663l595J143K853l550R7L223j962j866K699k71k600L322k9l557J901K602
4313B073l282K26K664k328j015L592j839k280L083O03l120J584J455k966P91K841
4329B082l272j13L153j038k368K749l65k099K567P00m195J836K837l054n29K959
4345A850j629j172L182j879k346K832J151l368J121K180l171Q33K791l244q40
4360a709L856j534k510L218k02k659K459J104l856J497K564k777o43L077j481
4375D04j927L086p93k749K768Q57l467J477K162k833Q0K779k299j190L488j568
4391B75k789L590K11l148J913J367k668N56K484k878n02L121j664k087K942o9
$$ y = [1188, -1860, -214, 1534, -1843, -994, 1978, -1280, -2088, 1431, -275, -2248, 1055, 924, -2231, 58, 1663, -1932, -789, 2064, -1486, -1389, 1834, -128, -1994, 705, 434, -2166, 1156, 1127, -2430, -529, 2073, -1209, -983, 1681, -647, -1662, 1930, 91, -2189, 894, 1497, -1623, -39, 1416, -1550, -759, 2082, -1190, -1303, 1850, 812, -1556, 1193, 828, -1271, 1296, 1996, -2199, -363, 2474, -580, -1109, 1850, 221, -951, 2231, 352, -1994, 838, 1989, -1379, -258, 1922, -1249, -416, 2375, -869, -1709, 2147, 613, -1897, 1321, 1119, -1540, 919, 2023, -1833, -336, 2228, -549, -1192, 1885, 404, -1523, 1563, 770, -1979, 789, 1646, -1821, -344, 1818, -1015, -935, 1844, -455, -1645, 1843, 275, -2514, 1076, 1287, -1861, 52, 1419, -1249, -693, 1791, -1087, -1589, 1532, -132, -2219, 723, 654]
4407F54k651K357P52l425J477L095l359o14L055j154k045K812p82k467K982Q64
4423A551l673J399K523k731K57K403k559q64L807j600k931L317M62k893J758R95
4439A221l213J555K878l239r55L639j420k248K892l86k608K973P12l582J096K851
4455B166k889l91L022k186r55L050j313k692L135R89l214J144J972l322J075K708
4471B299k780r95L464j145k360K628m1k714K404J365l405J032K498k976l47L159
4487B086j784k027L382p92k353K589P09l201J055K818l295m01L112k272j086L444
4503A984j447k648K854O62k893J442J280k859J024K540k956q05L717j583k439
4518b127K932j98k233K232P70l349J529K226k681p38K533j210j562L497j628k900
$$ y = [654, -1997, 360, 1112, -2313, -836, 2259, -1100, -1714, 1341, 187, -1858, 954, 172, -2295, 687, 1551, -2122, -723, 1800, -931, -674, 1729, -830, -1694, 2113, 513, -2418, 899, 1361, -1532, 226, 1221, -1992, -437, 2441, -798, -1753, 1886, 466, -1782, 1110, 724, -1884, 1089, 1801, -1781, -685, 2166, -723, -1114, 1908, -278, -1233, 1817, 504, -2188, 947, 1936, -1278, -134, 1838, -1484, -409, 2299, -481, -1476, 1988, 843, -1517, 1111, 1070, -1644, 760, 2125, -1280, -248, 2250, -726, -1073, 2086, 302, -1725, 1657, 865, -1488, 1101, 1810, -1391, -336, 2482, -813, -1214, 1898, -374, -1460, 1984, 537, -2111, 743, 1405, -1488, -46, 1234, -1625, -601, 1939, -1017, -1822, 1895, 312, -2127, 805, 607, -1626, 606, 1376, -1973, -444, 1782, -899, -1637, 896, -314, -1876, 1621, -7, -2907]
4534b907L419J035l520J341J955k616N93K438k743j023L377q60k971K900M28k601
4550a755K091J141l348J259K638k684j285L145j368j497K842r29k586K982J229
4565A875l463P33K282k239J83K463k197j415L595j149k805L009N17k938J642J485
4581A578k903J152K553k630j315L484j527k249L268k87k978K296J455l233J121
4596b15K068k505m61K736j231j672K706l44k470K229J083l487J467K249k770k76
4612h93K847k093j015L285j380k588K604P14k609J711J119k782N29K675k570r17
4628a363L282j216k159K331j38k305K618N97l418R98K047k026m16K745j817j269
4644a509K505o60k422K387J183k946R08K243l103M71K749k497p39K530n76k126
$$ y = [-2907, 512, 1547, -1973, -632, 1323, -1293, -700, 1738, -1005, -2028, 1349, 489, -2482, 418, 846, -1755, 336, 1477, -1871, -612, 2026, -658, -1943, 1202, -166, -1663, 1179, 250, -2336, 646, 1875, -1588, -855, 1427, -812, -629, 1834, -363, -1778, 1817, 668, -2137, 872, 1389, -1549, 93, 1578, -1325, -173, 2380, -250, -1565, 1919, 392, -1857, 1411, 1124, -1854, 442, 1897, -1336, -215, 1853, -652, -1113, 1623, 392, -1280, 1426, 1082, -1388, 841, 1924, -1563, -96, 2153, -617, -893, 1954, -139, -1154, 2131, 751, -1837, 767, 1481, -1128, 583, 1702, -1080, -551, 2124, -446, -1363, 1919, 703, -1456, 875, 737, -1568, 1050, 1647, -1771, -773, 1274, -752, -1168, 1577, -240, -1509, 996, 336, -2086, 301, 1484, -1462, -554, 1689, -1414, -943, 1806, -691, -1430, 1100, 524, -1602]
4660a602J896L36k603K079J751l628Q20K175k256n81L251k016j685L200n24k738
4676b125K069J266l017J528J729k696q5L141k193j229K490n28k131K387L51k768
4692a811J378J769k367j26K798k142j102L401j436k044K367O00l050K412J241
4707A888l191J180J820k233p39K839j309j921L202o22k227K188Q03l023J465J535
4723A655k261n7K749k147j228L279j005k782K523P03k644J706J371l066R90K401
4739B187k571p09K766j340j722K571J28l200K301J034k830R40K285k580n08L139
4755A891k036j516L150m95k236J734N16k441J174J902l047L71K679j627j305K595
4771A309j265k216K964L13k971J381K177l281P13K321k193l92K835k145j837L110
$$ y = [-1602, 294, 630, -1973, 106, 1857, -1771, -951, 1224, -1032, -1613, 1638, -378, -2063, 1137, 613, -2125, -56, 1210, -1807, -279, 1450, -1246, -1331, 1810, -383, -1612, 878, 350, -1781, 606, 957, -1811, -433, 1336, -1031, -1157, 1641, -501, -1603, 1798, 362, -1682, 685, 1285, -1765, 647, 1888, -1303, -123, 1697, -536, -1275, 1564, 255, -1666, 1536, 914, -1313, 875, 1678, -1345, 120, 1655, -606, -663, 2086, -61, -1289, 1990, 985, -1797, 726, 1429, -1215, 491, 1862, -1204, -214, 2187, -384, -1093, 1673, 333, -1389, 1182, 1310, -1890, 411, 1445, -1385, -445, 1840, -740, -1248, 1891, -145, -1661, 1489, 994, -1242, 492, 1008, -1433, -259, 1643, -1404, -1033, 1646, 19, -1286, 1309, 44, -2172, 792, 1105, -1866, -485, 1692, -1589, -876, 1445, -748, -1140, 1695, -450, -2287, 823]
4787H23J96k436J528J023k646J153K000k967l49K858j464j281K395p28j946K733
4803H92j55k591J567J901k642j69K477j780j096K853j139j846K663j10k493J702
4819C4J198k632P09K453k550l70K724j281j521K445n44k346K078J104l245J562
4835a82J847k374k63K985j861j083K606j050j932J972N90k724J692J257k113J45
4851d88K527k120p03K226r99j978K677K77k524J208J377k139O46J567k371k35
4867a052L132j658k184K710l20j703J887L78k761J724K093l017l10K507j641o79
4883h94K138j035j642K579N67l219J402J119j994O80J917k304o73L175j865j879
4899a928K675n5k212J719Q10k739J072K234k349m18K385j487j369K513o92k093
$$ y = [823, 1019, -1417, 111, 1134, -1512, -359, 1641, -1326, -1675, 1183, -281, -1562, 833, 105, -1841, 892, 737, -1854, -287, 1614, -1028, -1197, 1280, -500, -1596, 1257, 118, -1728, 935, 825, -1668, 34, 1232, -1400, -691, 1762, -788, -1158, 1566, 285, -1236, 1209, 665, -1681, 397, 1501, -1744, -182, 1665, -709, -972, 2013, 152, -931, 1675, 625, -1307, 665, 1255, -1469, 223, 1480, -633, -488, 2039, -81, -784, 1442, 443, -1535, 1142, 1419, -1105, 103, 1480, -659, -13, 1554, -817, -1052, 2080, 422, -1762, 948, 628, -1075, 812, 1190, -1571, 153, 2246, -771, -1081, 1426, -215, -894, 1244, 209, -1433, 1146, 1713, -1506, -104, 1015, -979, -299, 1618, -686, -1359, 1816, -49, -1928, 747, 692, -1520, 199, 1009, -1730, -658, 1576, -773, -1191, 1194, -293, -1662, 851, 159, -1934]
4915a934K743L81l010J516J590k175k65K530k029q90K848j116k214K502N80k808
4931a751J557J570k864M18K335k289k1K561j310j539K110m02j999K099M02k071
4947a194J093J837k750M7K556j531j175K097j79k186K240M49l170J710J630k328
4963h54K66J856j774k56K403j470k062K883L03k443J598Q15k362J203J735k381
4979e40q8K385j175j386J620k54j732K381L25k820J149J832j883l23K136j855
4995b28o39K592j025k157K165N27k404J440J194k514N05K217k065r32L011j150
5011E37k046K144K16k232J709R80k698J283J541k393J7K277j446j234K390o47
5027C98k069K101P67k605O67K147k614L23K233j710j081K211p32j885K306k5j553
$$ y = [-1934, 809, 1190, -1820, -304, 1286, -889, -1154, 1376, -653, -1543, 1305, 189, -2025, 477, 1057, -1751, -194, 1376, -1488, -1070, 1265, -1024, -1045, 1516, 206, -1333, 777, 375, -1624, 475, 877, -1194, -101, 1736, -1014, -967, 1589, 58, -1117, 980, 801, -1385, 855, 1304, -1866, -156, 1474, -854, -588, 1268, -506, -762, 1641, 171, -1891, 992, 1295, -1148, 450, 1265, -1097, 106, 1841, -540, -628, 1757, 582, -804, 816, 562, -1170, 1211, 1536, -1284, -135, 1697, -186, -509, 1627, -228, -867, 1725, 700, -1457, 708, 1235, -1169, 271, 1465, -1049, -544, 1673, -392, -1324, 1687, 537, -1509, 635, 851, -1381, 328, 1308, -1390, -107, 1434, -959, -942, 1335, -111, -1345, 1045, 398, -1671, 430, 1197, -1408, -741, 1406, -1208, -885, 1348, -362, -1443, 768, 36, -1849, 457, 432, -1121]
5044a121P07J626k524P91J517j810k52K464j753j246K207j65j977J824K15j685
5060a182R87J220k042l22K239j102r59K067q79j285K138j92k541J692J494k036
5076g03M56J558k007m59K827j589j609K178N88k268J486O05k253J026J844k011
5092c31n86K607j463j048J984n27j836K030O85k581J002J619j956J63K017j595
5108A84j366K789p80j965K369k35j867R16J643k306J93K056j857n83K351j346
5124A96j452K326k20k175J612J164k486R25J768k316J27K010j362j251J934j10
5140F90k016J773N21k392J465J360k246L8J994j631p77K259p53k046K211K92k172
5157a430J549Q53j889J50K253k352n01K351j220j155K266o91j804K085N97k648
$$ y = [-1121, -414, 1212, -1312, -521, 996, -814, -1066, 1398, -355, -1601, 606, 441, -1536, 288, 503, -1182, -195, 1025, -1017, -1339, 900, -202, -1161, 906, 27, -1258, 880, 688, -1853, -161, 1333, -703, -247, 1311, -696, -1155, 1672, 83, -1526, 652, 1240, -1028, 458, 1063, -1190, -164, 1680, -331, -917, 1690, 227, -821, 1163, 636, -1200, 830, 1515, -1066, -64, 1555, -401, -238, 1779, 184, -1182, 1607, 827, -1138, 1231, 996, -871, 45, 1688, -618, -425, 1631, -226, -809, 1542, 196, -1256, 1070, 850, -1325, 287, 1451, -1035, -110, 1658, -658, -531, 1479, 117, -1134, 800, 690, -1326, 447, 968, -1424, 41, 1401, -845, -807, 1187, -444, -1221, 1038, 285, -1761, 450, 742, -1430, 119, 972, -917, -767, 1486, -866, -1367, 984, -236, -1391, 875, 184, -1620, 465, 1062, -1586]
5173a586R45K060k509j45K174j169j188K485r27j945K201K71k082J003J705k190
5189h97L64J589j579n33J957o30j692K063j46j737J425J206k001K1J805k120J43
5206g62K044j551j068K614n39k151J652J164k163O86J486k039P8K203j873o62
5222h81K026k72j774J996m26j751J047J514k237L02J986j985l95K409j401j413
5238a255K631l95k155J259J225k089P10J423j943j76K527j769j117K243j25k126
5254a132J931L24k316J356J468k317j20K440j708j171K458r18j607K028J99k078
5270a163J506R92k543J010J738k159n36K269j114j332K141q0k317J561Q31j962
5286a158O33J660k071K59J811j475j001K177n96j621J370Q61k395J337J373k362
$$ y = [-1586, -641, 1419, -1090, -1235, 939, -230, -1418, 1067, 140, -1805, 396, 667, -1415, -412, 1293, -897, -533, 1056, -523, -1056, 901, 271, -1421, 642, 496, -1241, 184, 1390, -611, -590, 1215, -905, -762, 1282, -269, -1337, 1277, 738, -1413, 239, 1403, -760, -74, 1412, -627, -549, 1654, -219, -881, 1145, 873, -901, 1095, 669, -1082, -35, 1479, -758, -456, 1530, -455, -850, 1559, 158, -1255, 1376, 981, -1174, 85, 1310, -779, -69, 1354, -589, -765, 1762, -7, -1124, 1119, 994, -1132, 799, 1123, -1193, 163, 1631, -686, -806, 1634, -74, -1245, 1213, 295, -1312, 716, 915, -1163, 343, 1335, -1208, -198, 1540, -619, -1155, 1114, 0, -1332, 809, 729, -1588, -27, 804, -1158, -525, 1135, -936, -677, 1134, -341, -1342, 835, 239, -1382, -12, 849, -1546, -209, 1164, -1198]
5302a198Q9K428j779q08J828r36j291K327L88k689J691J321k598P18J289j533
5318g53q3K138j691j414K406J28k159J594O78k022J619O31k119J02K624j609r94
5335i24J937o59j507K136J09k328J007J546j570k59J748j348n83K101j271j640
5351a505K469r0k058J451Q70k065P38J705j894m57K445j349j372K464o77j676
5367a001J769M88k433J377J342k047j00J966j425o55K056p65j680K077K39k460
5383a252J708J368k621M67J673j567m95J781q10j676K477m82k098J647R72k065
5399i73R27J295j995L1K299j941p35K074l41j701J003Q67k655J907J272k546K47
5416i65K262j424q10J786j058j027K377l77k247J150J349j755L56J167j691l5
$$ y = [-1198, -1109, 1319, -460, -1268, 560, -376, -1667, 660, 1048, -1641, 50, 1371, -1227, -509, 780, -753, -836, 1302, -389, -1803, 603, 731, -1428, 166, 844, -1178, 441, 1072, -1047, -945, 1679, 70, -924, 1013, 354, -1153, 983, 1092, -1236, -229, 1317, -253, -512, 1236, -112, -695, 1406, 135, -1505, 964, 874, -1184, 267, 1137, -928, -190, 1515, -379, -836, 1609, 260, -1112, 1352, 675, -1001, 768, 1256, -1177, 200, 1542, -505, -605, 1361, -64, -719, 1337, 572, -1108, 969, 1208, -1252, 456, 1824, -797, -330, 1343, -224, -719, 1062, 252, -1424, 1053, 571, -1527, 120, 1092, -973, -46, 1249, -746, -715, 1584, -357, -1092, 982, 641, -1060, -57, 810, -1845, 62, 1334, -1212, -965, 1297, -127, -937, 849, -209, -1236, 1141, 764, -1483, -333, 1016, -739, -383, 784, -907, -942]
5432i42K355j372j748K410K0j985J310R03k315J035J333j721o00K640j489j221
5448a387K242o95j287J733M80k394J310J165j989p1K156k055j17K214q42j866
5464a403K255J28j998J560Q47k177N59J624j975m83K479j326j105J821k86j813
5480a293J791K99j630R99J207k031J45K066j252j180K096p80j525K285J60k400
5496a043R95J393k057M68J364j099n94J938j350j138K118k23k057J221J119k184
5512a129J235J321k269P9K126j325q84J771m95j286J587L02k183J231J466k467
5528i20K49J798j421m56J764j080j397K193j66j958J284J234k069M65J586j938
5544h32l61K550j229j452J893m79j392J869K99k293R15J538k080K0J777j531n22
$$ y = [-942, 1413, 41, -1707, 703, 723, -1262, 48, 951, -1364, -329, 1004, -717, -1317, 1323, -166, -1387, 855, 160, -1127, 606, 1086, -1308, 2, 1167, -822, -893, 1263, -792, -909, 1305, 463, -1403, 852, 980, -1018, 542, 1389, -788, -229, 1395, -580, -1063, 1416, 90, -1015, 806, 520, -1293, 498, 797, -833, 166, 1373, -658, -513, 1553, 301, -879, 1217, 437, -1088, 1197, 1357, -1043, -48, 1345, -712, -244, 1120, 21, -573, 1365, 15, -1123, 995, 772, -1285, -64, 1055, -1129, 106, 1427, -842, -763, 1363, 38, -846, 925, 430, -856, 731, 1033, -1150, 81, 1547, -920, -671, 1127, -294, -750, 1014, -66, -1463, 730, 564, -1394, -110, 1124, -945, -480, 1106, -832, -1193, 1357, 128, -1324, 569, 90, -1302, 567, 866, -1427, -512, 1026, -1054, -1034, 743, -788, -1310]
5561a310K304n28j799J655M37k047J242J318k495L37K046j750k96J773n44j611
5577a268K163l92j704J309J199k334M29J711j758J36J621r36j276K173k09j961
5593a097J459N44k154J205J556k260J00K096j447o52J980p24j498J811J27j958
5609i12J092J230j788K06J852j911n42K256j225j431K146l4k071J218Q04j935
5625a045J039J635k195l05J963j146q05J976m16k147K465J57k129J121J361k287
5641g58M31J836j818o08J904r59j306J718N78k144J105J038k145Q46J637j780
5657d25q11K316j202j272J965l22j649J579R13k324O85J455j568M2J376j212j097
5674a551K272k95k259J942M03j244O55J053j844M77J499j808m09K259j243j437
$$ y = [-1310, 994, 466, -1333, 322, 759, -1288, -46, 1272, -1223, -886, 1160, -590, -886, 887, 343, -1268, 895, 503, -1201, 108, 1307, -1027, -598, 1113, -645, -509, 1112, 176, -1100, 1073, 864, -1097, 362, 906, -1248, -43, 1513, -747, -647, 1449, 2, -650, 1330, 606, -892, 919, 1046, -912, 180, 1410, -378, -172, 1680, -231, -773, 1483, 258, -1173, 973, 939, -1132, 86, 890, -1045, -6, 1629, -566, -871, 1092, -54, -859, 1117, 701, -1446, 1019, 1176, -953, 168, 1529, -758, -327, 1509, -309, -917, 987, 28, -1278, 440, 1018, -1126, -21, 1017, -1128, -282, 1355, -425, -1236, 1080, -122, -1394, 571, 249, -1400, 179, 1092, -1232, -547, 908, -660, -618, 758, -454, -1551, 721, 426, -1833, 109, 512, -732, -77, 976, -868, -391, 1108, -700, -1109, 1150, -93, -1530]
5690a530K060J43k038J532J188k125J69J695j300p78K077j490j015K245r9k457
5706a723K012Q29k404J083J514j976OK037j554j113K322n11j648J299P68j697
5722g56Q64J000j956N56J949k054l49K050j057j264K012M1k528K219M71k323N31
5739e94K149j976l1J494p93j040K059k71k168J700O25k254J137J210j879R6K595
5756B059k449l37K140q49j599J674M28k211J597P28k383K77K713k042o01J799
5772I44j050j084J943r7k082J256J271k030L62J619j660j29J853j491r41K101
5788G85k48j917J769N8j485R12J225k285L85K013j678p92K107r73j258J816l74
5805F0j537J585J126k210M66J574k052O9J906j112j273K146l72k124K203L55j961
$$ y = [-1530, 530, 673, -1365, 167, 1355, -770, -601, 1094, -206, -984, 1093, -397, -1412, 833, 734, -1723, 289, 1118, -1286, -203, 1311, -665, -659, 1378, -176, -1289, 1033, 522, -1126, 173, 941, -756, 108, 1108, -848, -292, 1657, -397, -746, 1304, 247, -1017, 995, 1036, -1492, 727, 1198, -1125, -594, 1555, -421, -452, 1042, 249, -791, 1268, 997, -1171, 529, 1154, -1100, 37, 1247, -632, -536, 2059, -390, -727, 1413, 564, -1035, 639, 1067, -1144, 453, 1181, -1202, -925, 1788, -254, -855, 944, -106, -1190, 753, 656, -1426, -170, 1101, -929, -567, 1052, -608, -737, 1116, -375, -1316, 785, 537, -1380, 389, 447, -1038, -126, 1099, -1186, -801, 1212, -466, -1258, 849, -124, -1382, 434, 60, -1477, 108, 1234, -976, -510, 1064, -988, -919, 987, -125, -1398, 748, 376, -1748, 455, 810, -1151]
5822a151Q33J349k061M26J937j605p65K175p67j295J440P63k292J003J210k489
5838a289P94K221k029r00K161p14j184J651n3k048J829J021k110L33J636j535
5854b16j03J679j621p44K005l2k000J111P81j544O51J276k039K07K188j873j044
5871a318K302m27j195J620j52j693J320P95k168J88J874j088m79J753j213r96
5887h77J910lk248J458Q59j776N87J268j998K06K187j800q83J816j99j685J717
5904E39j3j157N03J203j812N3J909j799n23J864p19j360J709K39k009J749R87
5921A363k587Q77J512j704l41J765j038j417K468m97j762J459O51j562K59J422
5937H68j709L04J558j350r01K162p03j553J950K9k048J583O56j932J55J749p08
$$ y = [-1151, -318, 1031, -1030, -604, 1333, -272, -1037, 1138, 371, -924, 516, 1279, -1013, -10, 1200, -1289, -495, 1726, -303, -1203, 958, 244, -940, 711, 658, -1390, 439, 1460, -650, -317, 1319, -216, -319, 1360, -261, -1005, 1000, 968, -1032, 79, 860, -684, -33, 1243, -796, -589, 1599, -274, -1318, 984, 557, -638, 982, 830, -863, 457, 1252, -916, -728, 1146, 58, -421, 1332, 119, -877, 1033, 1030, -1218, 240, 1099, -677, -90, 1178, -820, -614, 1573, -227, -1110, 706, 507, -1178, 539, 526, -631, -128, 1075, -737, -684, 1225, -574, -1097, 767, 48, -1312, 397, 636, -1373, 376, 1363, -1224, -347, 1165, -539, -880, 885, -153, -1570, 898, 401, -1361, 98, 749, -813, -554, 868, -841, -537, 1021, -329, -1230, 932, 229, -1324, 626, 655, -1393, 190, 846, -1086, -931, 818, 110]
5954A10j299K225j409q18K058k11j916J353J316k616R09J129k011P24J530j086
5970a2q72J840k55j981J743J29j331O64J359k086M21J912j291j312J941m65j203
5987g99J934l81j963J325J554k447N40J604j538n99K072r77j270J512K09k168
6003a392J684P98k152P54J451j507O5J650j501q48J951m19j306J415j8j461R06
6020G0J004j866N10J528j761k56J423p47j143J660J07j842J737Q72k439O66J533
6037A056j591o8J506j130q18J730r6j961J069R34k109J550Q02j649J45J701j389
6054c18j100K005l97j783J840k52j515J511J114k146K09J686j300k91J413p64
6070h8j232J839M2j643J148J050j938O67J016j426q2K020j488j053J654l65q74
$$ y = [110, -1189, 1036, -373, -1191, 867, 656, -1260, 93, 1409, -1207, -298, 831, -1180, -456, 1074, -12, -884, 956, 701, -1280, 463, 592, -739, -75, 1284, -802, -381, 1531, 240, -1072, 869, 404, -799, 1135, 754, -1209, 116, 1670, -777, -237, 1367, -171, -770, 1302, 325, -945, 567, 776, -1392, 292, 1090, -1062, -308, 1143, -364, -299, 1351, -150, -998, 953, 534, -772, 643, 625, -836, 70, 1074, -792, -282, 1246, -515, -771, 652, -95, -1238, 422, 529, -1313, 424, 1296, -1143, -477, 1056, -535, -603, 903, -227, -1045, 685, 589, -1372, -303, 631, -1478, 72, 874, -775, -630, 1071, -318, -1418, 587, 190, -1593, 247, -5, -1520, -9, 1105, -1041, -832, 854, -446, -737, 676, -88, -1320, 519, 561, -1082, 66, 1116, -822, -155, 861, -565, -647, 1373, -115, -1168, 486, 121, -753]
6087g53J147N85k318J333J218j927p8J672j179p10J696k49j512J753L85j921Q08
6104e0Q24j408N30J471j458r39K131r56q69J639k07j355J165Q18k162N90J543
6121A307j608k66J755r58m71J446m39j918J606L00j648R09J453j956K15J780j454
6138E3j324K207p60j130J863l52j765J419P87j683O99J029j839J48J562j048q71
6155a005J859k08j593J461o9j365N74J310j459m96K158j160j115J742o06j399
6171a371K096J34k343J399J124j617q5J732j507p09J803q33j016J828j27j331
6187h23Q77O24j603P44J133j562j64J574j104r77J975p18j252J573P58k189J138
6204DQ87j817J95J426j127n94J617m78j426J691L90j654R00J026j856N16J736
$$ y = [-753, 394, 979, -1339, -6, 1212, -715, -793, 879, -300, -1010, 686, 437, -1075, 678, 1063, -858, -50, 774, -634, -104, 1367, -91, -1030, 1101, 145, -724, 915, 708, -647, 518, 1336, -826, -236, 1307, -301, -567, 1188, 230, -241, 1205, 766, -1152, 454, 754, -894, 15, 1468, -488, -273, 1507, 53, -1271, 936, 176, -954, 909, 557, -1208, 211, 998, -685, 14, 1043, -796, -648, 914, -134, -1005, 854, 646, -947, 514, 445, -920, -346, 964, -495, -991, 1167, 7, -1108, 634, 28, -1371, 725, 859, -1484, -85, 1039, -578, -663, 1069, -438, -1147, 656, -177, -1193, 635, 508, -823, 54, 678, -925, -181, 952, -610, -774, 800, -304, -1281, 694, -24, -1276, 297, 1055, -1134, 4, 891, -926, -731, 695, -432, -1026, 591, 113, -1313, 378, 768, -886, 14, 1040, -816, -300, 1436]
6221A436j723n9J361q34j129J931q02j239J708J58j597P64J005j208l95J560p96
6238A41j113J973n55j502J638M25j733R38R63j468j87J714j390p16K015p38j532
6255a127J698M28j694P00J125j571N01J101j452l66K078j118j046J898l77j609
6271h31J240O38k078N42J734j660m17J956j235q64K037m40j782J803J21k069J124
6288a81J103j481k1J601j586n20K145r03j178J394J40j687J435O99k297R87J457
6305A107j459n15J571p45j170J553R7j832J465O91j702M73J205j490O7J645j940
6322i79n9J819n40j605J534J71j411J357M26j696O16J330j294n10J811r36r34
6339i00J197K14j519R26N89j441P09J375j617K1J607j482n91J977p96j317J443
$$ y = [1436, -287, -346, 1015, 181, -948, 983, 181, -1058, 650, 808, -789, -25, 980, -228, -623, 937, 141, -972, 1001, 446, -1056, 582, 1007, -726, 212, 1175, -293, -480, 1234, -156, -872, 1143, 405, -1127, 571, 999, -695, 5, 1130, -441, 60, 1161, -291, -657, 1421, 303, -743, 1155, 778, -831, 409, 1047, -1031, -489, 1245, -415, -832, 1124, -111, -975, 1062, 622, -1160, 643, 764, -1305, -181, 922, -559, -580, 1021, -565, -1085, 1060, 157, -1021, 373, 513, -1174, 261, 960, -1337, -350, 1107, -352, -867, 704, -41, -1211, 342, 439, -1393, 72, 763, -939, -466, 739, -751, -684, 961, -979, -1038, 781, 241, -1364, 170, 341, -1070, 287, 713, -983, -367, 963, -331, -841, 970, 34, -900, 297, 511, -1008, -82, 507, -934, -225, 1150, -467, -446, 1161, -321, -912, 1065, 269, -1048, 395]
6356C95M55j745J120O46j266M13J228j696n6J607l12j580J319N2j723J503M85
6373H45j453N60J094j203m54J413n14j010J756j09j878J581O46k038M35J791j882
6390d20K78J106j277o32J828p87j356J430Q20j779P02Q56j590M97J700j516r26
6407a066J938o28r24J304m09j038Q80O08j393K57J639j346n67J654j051o85J497
6424F70k88j453J423K70j788N43J269j306n9J527j452l08J446k29j367J209K39
6441C46j634J159O70j639O54J286j466r5J332o62j189J572k01j092J195M42j458
6458g80N67J383k005j75J927j274l88J383m48j399J543M83j728P17R32q75j99
6475c36J316j337o18K081q81j415J645N71j636J150L86j893R79J227j130q10J565
$$ y = [395, 850, -895, 225, 871, -395, 18, 1246, -450, -506, 1101, 789, -791, 528, 580, -1143, 360, 845, -608, -48, 1046, -157, -611, 802, 288, -722, 1034, 925, -953, 628, 1274, -764, -329, 1462, -420, -142, 964, -313, -945, 883, 96, -1260, 170, 990, -789, -87, 769, -821, -324, 1376, -140, -1066, 872, 244, -680, 624, 215, -823, 57, 665, -728, -471, 1168, -178, -745, 909, -142, -827, 670, 382, -1071, 352, 622, -1166, -623, 646, -660, -719, 808, -644, -952, 494, 265, -1102, 107, 346, -1288, -129, 541, -1098, -444, 842, -624, -719, 613, -49, -1238, 334, 133, -959, 236, 678, -780, -213, 1170, -835, -1010, 917, -357, -745, 638, 190, -1209, 334, 817, -911, -194, 738, -137, -336, 980, -357, -975, 1106, 225, -1190, 455, 1026, -610, 540, 926, -967, 12, 1239, 109, -701, 864]
6492H64r55l01J190l74j165J151M81j222M05Q55j491L54J380j001q94J887p16
6509D48j225J274J10j445J121O97j720O31J283j208o38J454m73j157J413R1j616
6526i60J607N59j752L5J774j580l17J301r06n81J529m73j383J549O34k122R85
6543a01M77j009J44J364j168p81J801l22j375J326o7j244P19J117j338j72R69
6560C40m27o71J594o48j681J885j45j451J665K46j632L73J201j422j74J543p07
6577a11q10J644p68j244J626L27j321M80P27j209L36R37r89l51J491q67o53J131
6595C76M39j596R96M07j280N09J012j202q2J272r81p21J703l53j659J531P43j661
6613e47M23J028j190k67J515j056p21J939m96j305J104N71j863J022Q96j689K95
$$ y = [864, -91, -392, 798, 424, -741, 410, 891, -331, 74, 929, -562, -208, 1172, 171, -723, 1164, 448, -777, 497, 607, -838, 283, 980, -740, -109, 1174, -34, -672, 782, 309, -848, 565, 656, -960, 647, 1206, -546, -511, 1263, -317, -634, 667, -239, -820, 709, 236, -1147, 402, 1036, -1086, -101, 376, -633, -489, 875, -293, -1074, 727, 405, -970, 356, 289, -955, -236, 881, -457, -629, 340, -87, -758, 836, 188, -1493, 392, 247, -1204, 461, 707, -925, -552, 649, -773, -947, 596, -111, -921, 723, -45, -1289, 337, 664, -657, -177, 550, -659, -323, 614, -375, -726, 765, -102, -755, 376, 815, -781, 215, 622, -658, -149, 863, -339, -421, 851, -130, -851, 852, 499, -1160, 371, 1114, -547, -124, 904, -286, -553, 962, -94, -815, 1124, 628, -677, 427, 998, -865, 157, 1053, -636, -341]
6630c41J487j286o41J406l70j000J166K49j451Q87Q12j269K79R99j145NQ80m49
6648B18j087J295n0j140R97R42k049R04J084j685o5J556q53p32J559p76r45R86
6666A59M94j748J019P92j503Q58Q08j343m45J884r34j012J560l03j293J240M51
6683F84j859J228O57j020p31K099j239j059J704k95j142J350L14j608O47P01j248
6700h17M26R73o02q10J411l66j336J889l55j081P28Q29j718L89J350j078o06J721
6718I47j091o86J380j31j253P47P41j312N30J086j399j08J643j031n52J022l27
6735B06j053J462M6j105N89J039j700K79J430j524r9J422p47j353J567M02j394
6752e33Q69O06j421L12J023j022m58J526q46n95J255l41j184J065P40j616M53
$$ y = [-341, 1146, -140, -781, 625, 255, -745, 421, 670, -781, 106, 918, -351, -72, 927, -218, -213, 667, 218, -869, 426, 376, -764, 233, 1175, -874, 30, 1114, -571, -636, 920, 67, -665, 894, 118, -827, 159, 653, -1095, -76, 716, -787, 71, 879, -464, -909, 975, 41, -971, 589, 286, -1007, 233, 684, -1175, 53, 710, -310, -1041, 1058, -181, -1240, 464, 169, -973, 377, 691, -917, -270, 431, -817, -391, 582, -20, -830, 581, 215, -1121, 768, 413, -668, 60, 889, -829, -440, 910, -168, -774, 947, -144, -830, 550, 419, -834, -87, 654, -658, -128, 958, -441, -549, 1094, 63, -489, 533, 206, -847, 615, 661, -444, 145, 1184, -516, -237, 1193, -331, -430, 992, 245, -1108, 459, 861, -533, 336, 942, -479, -167, 856, -166, -624, 902, 56, -539, 716, 375, -809, 256, 996, -620, -167]
6769a67J164j163K06J066r00n75J499q22r38J060M47j761J230N50j441M47P88
6786F90j031n25J794r78r45J760k63j668J095O63j526O33J290j492k69J572n65
6803B35j412J715n64q17J105J40j212M97J055j338P1J660j536l08J242n72j255
6820a294J393O47j739Q57N53j115K53J311j624j19J798o89j201J174J69j372J158
6837A60M57j644P92J324j855J08J708r26q28J165n30q17J460J31j499M25J393
6854A024j302j64J270j005m08J252m24r78J034O70j627J075N07j641M22J313j251
6871b33k90J742p87q99J153j37j205R74L68j522O16J166j001j62J314j270m41
6888f14J572o67r56J367K49j686R98M94j280J63J337j341k10J582p52p88N82K74
$$ y = [-167, 997, -166, 40, 1106, 206, -369, 1130, 308, -630, 430, 877, -884, 346, 896, -545, -98, 690, -341, -866, 928, -50, -995, 765, 502, -1166, -71, 592, -934, -301, 989, -503, -772, 800, 235, -1177, 538, -26, -843, 262, 402, -810, -313, 742, -596, -525, 1135, -401, -709, 533, -39, -1294, 99, 746, -993, -136, 417, -698, -445, 866, -758, -877, 921, 232, -969, 205, 374, -998, 160, 617, -1027, -235, 1089, -766, -658, 1050, 124, -704, 461, -69, -886, 574, 705, -794, -369, 1024, -278, -442, 828, -177, -585, 667, 243, -735, 299, 969, -658, 417, 924, -717, -295, 1018, -233, -523, 1219, 432, -467, 686, 549, -656, 318, 686, -836, -220, 946, -55, -217, 1097, -173, -614, 958, 291, -665, 702, 951, -735, 263, 757, -523, -360, 977, -364, -574, 1008, 256, -532, 50, 324]
6906C24p47O61O63k007J123O59j118jJ174n69j173J534M5j750J664M01j500O71
6924E4R57j559L38O99r65k43J406o88r11J091K16j282P93Q19j300M99J037j180
6942b19p27J440q58m35R77j34q61R93J93j446Q53R12j170q3J261r51m94J183l73
6961F1j036J044K82j254O59P80q37J71J014j371k07J486p55j100J498K55j208
6978e18P04P62j661M14J544j583k97J615q75o18J135k83r60R68N61j644O40J007
6996I11j274L2J291r67m51J297l31j194J027K90j079N52O34j488N89J283j137
7013a5o47J744p34j035R57J47j158J115Q40j956N59J190j292m19J622o59j072
7030h13J362k58j078J278K28j847J152Q61j561L25J149j148k82J384n17j172J094
$$ y = [324, -423, 238, 901, -1106, 17, 676, -442, -443, 731, 162, -1011, 523, 568, -1182, 482, 883, -617, 54, 1011, -548, -210, 489, -476, -719, 687, -1, -912, 179, 395, -887, -94, 725, -575, -76, 961, -219, -946, 494, -364, -799, 178, 44, -817, 176, 369, -1077, -224, 688, -482, -565, 696, -255, -749, 434, 61, -975, 69, 351, -903, -244, 536, -301, -130, 884, -487, -694, 792, 37, -1063, 435, 690, -518, 186, 948, -713, -299, 1245, -338, -635, 980, 105, -513, 622, 339, -621, 347, 908, -736, -96, 911, -363, -331, 960, -7, -458, 839, 508, -686, 341, 631, -448, 104, 738, -750, -161, 1122, -15, -662, 1082, 348, -687, 270, 417, -741, 374, 1214, -742, -183, 1007, -285, -704, 918, 259, -813, 549, 291, -787, 491, 719, -1128, 24, 885, -676, -351, 798, -350, -632, 752, 235, -937, 157]
7047A57K63j223O28P64j232M20J006j129o33J480p26o44J585n10j389J323P63
7064I03j811L35J496j614J3J587j382p10K009p32j316J297M63j472P30J112k073
7081a165L93J345j166m01J807p72p65J166j73q20M64M48j158N68R54r81m08J355
7099F91q21p43J464l46j172R53P22j379N00J033j317K40J210j219p53J664o54
7116G3j166J536L43j329M75J254j458k92J605j293j20R95m13q62J252j05j278
7133g83O88R82j572L54J114j284k03J526p03q92J627l83j203R94P73k212J114
7150f3J169j410j93J457r74l60J267o08p73J070J3j219J044M91j149K5J313q98
7168B02p09J503j012p38J370l14j385J301L98j253K4J349q73n03J519j268o05
$$ y = [157, 420, -803, -175, 589, -643, -223, 783, -346, -979, 501, -225, -869, 716, 206, -1183, 140, 903, -908, -573, 923, -691, -678, 909, -473, -1183, 826, 94, -1222, 75, 538, -934, -204, 908, -1165, -772, 573, -593, -994, 813, 41, -724, 442, 269, -551, -87, 361, -797, -229, 725, -256, -664, 691, -130, -873, 591, 245, -927, 26, 748, -631, -131, 902, -415, -175, 1035, -184, -937, 727, 73, -1093, 443, 786, -543, -68, 1186, -272, -564, 1041, -252, -372, 623, 210, -652, 600, 495, -783, -95, 887, -685, -331, 783, -501, -704, 822, 119, -773, 854, 471, -732, 262, 1035, -1177, -63, 1106, -304, -497, 960, -14, -374, 893, 285, -488, 582, 595, -624, 420, 911, -238, -213, 1100, 202, -507, 996, -16, -754, 616, 302, -1083, 218, 616, -637, -613, 736, -137, -640, 879, -389, -994]
7185i94J308L5j482J440K57j542N59J298j677J17J334q49p80J784n30j409J348
7202B17L50j294N72Q85j404J9J234j060j71J489q78r66J626j45j831J377N13j416
7220h83N33J183j500J49J312r63q89J788l77j074J253l49r02Q76J018k023J70
7237f78J611r90n55J336m44r71J591o51j323J330N66j267P3J100r70k26J553r80
7255A05q99J175L01j226O58L26r75O03J035j576p8J289o25q45J542n68o95O12
7273A59N27j509R47J046j382m9P86k78q23J330o13j066J683J09j470R47P1o02
7291a87L47N93j122J60J217q28j007J522l88j018J190Q9j452Q96Q25j373R8J242
7309H04q43o97J291o41q00J454l15j177P74R65j540J74J003r42j99J637q61j096
$$ y = [-994, 314, 349, -1133, 307, 564, -978, -419, 879, -798, -681, 653, -196, -976, 808, 278, -1131, 217, 567, -727, -155, 730, -674, -655, 579, -481, -652, 837, -41, -1007, 619, 474, -1357, 20, 533, -883, -350, 833, -667, -518, 794, -169, -1058, 730, 353, -721, 532, 183, -719, 157, 1175, -848, -678, 933, -57, -612, 724, 280, -691, 900, 249, -1074, 256, 822, -445, -372, 728, -242, -468, 1085, 105, -794, 381, 682, -544, 114, 440, -535, 68, 1103, -473, -551, 738, 113, -732, 810, 242, -453, 159, 686, -823, 124, 1170, -212, -261, 525, 247, -576, 754, 141, -925, 758, 867, -603, 344, 415, -187, 160, 753, -369, -209, 1008, 180, -827, 695, 307, -711, 479, 568, -884, 12, 837, -536, -438, 804, -39, -736, 555, -86, -886, 568, 253, -924, -150, 815, -725, -551, 452, -490, -689, 948, 87, -1009]
7327a009J510k52j189J145K29j346P14J144j444P8J272o60r91J473m41j157J025
7344A01j1q72N78R20j188K19J001p06n34J394r97j064J474M9r80O98O85j585N36
7363b82P88q38J16J053p02q20J624o34j046R87N06j337M24J141j434n6J536j104
7381g8n41J519o81j155J695Q5j748R97R06j505J39J421j213m65J707j094q90J483
7399E82M95j478N19L00r88L34J157j272Q2J283r62o00J238l83q10J299m07j259
7417h70N46J158j072r9J149r68k10J231o70j114J399N3j303N71Q66j271P22P57
7435H75j403q4J329l85j595J793l05j053R01J27r77N55J124j721J70J136q56k00
7453e69Q39j00j080J092J29j263R00J073j802J14J365j181O7Q43m34j312J762
$$ y = [-1009, 501, 249, -940, 205, 434, -912, -198, 946, -498, -420, 852, 192, -799, 674, 233, -924, 101, 90, -782, -204, 716, -472, -253, 748, 42, -492, 902, -95, -1159, 315, 364, -616, 82, 767, -818, -282, 506, -332, -216, 837, 135, -685, 939, 305, -741, 246, 752, -585, -161, 980, -454, -510, 1026, -78, -619, 900, 219, -936, 759, 844, -904, 93, 999, -506, -367, 1054, -159, -624, 1083, -11, -901, 582, 1077, -401, 118, 418, -570, -236, 921, -351, -269, 1014, 52, -548, 690, 307, -503, 796, 389, -870, -324, 834, -238, -337, 812, -156, -366, 865, 195, -919, 480, 533, -770, -199, 667, -604, 118, 875, -528, -612, 717, 332, -1263, 530, 225, -828, 73, 200, -777, -222, 902, -819, -649, 487, -369, -569, 270, 170, -910, 182, 311, -952, -52, 1021, -781, -667, 698, -483, -416, 427, -7, -1319, 443]
7470D43M17j996J193M46j055J1J652j803j68J818r15j081J497o7q25O51K98j270
7488g54N05J289j373k80J457q23q29J604p38q72J276L91j721J074M13r93j03J751
7506A274j583j91J576q09j160J517j20j227J258L19j393L90J417j562k04J136
7522F38m46n07R42j17j298J293N1j050P67P45j214k94J417j116k83J246m46j311
7540i83J546r9r83Q41M88j231K67Q02r51k48J059o08j070J439k61r54J122L63
7558E39j369K04J488j376j90J358m94j019J240j64j199J163L06j224K56J085q85
7575b81k74J136r91j47J332o95j471J520L14j139M68N29p09L94J067j498m7J109
7593F17k02j292R47m3p82Q02M35j431Q07Q21j147p4J171p74m93J256q43p09J452
$$ y = [443, 860, -1136, 57, 503, -552, -541, 1111, -692, -860, 958, 43, -1038, 459, 392, -433, 218, 516, -754, -249, 1040, -333, -613, 844, 21, -808, 796, 58, -814, 462, 853, -868, 206, 619, -374, -477, 1274, -309, -500, 1076, 267, -893, 624, 504, -723, 535, 854, -539, -149, 1268, -294, -498, 638, 192, -315, 627, 510, -788, 505, 556, -494, 273, 1018, -196, -490, 927, -189, -472, 774, 328, -983, 563, 464, -519, 322, 810, -421, -154, 648, -303, -551, 508, -100, -1170, 269, 8, -946, 176, 539, -830, -626, 862, -514, -704, 654, 160, -859, 381, 217, -982, 181, 487, -737, -481, 604, -281, -555, 581, -410, -557, 775, 80, -1391, 129, 443, -696, -228, 301, -408, -14, 1053, -445, -492, 617, 415, -877, 70, 27, -755, 47, 482, -949, -142, 679, -468, -542, 629, -145, -638, 618, -225, -934, 518]
7612E18r9j449Q81J006j337L28R92j123N2R07m97j057J506k58j478J549R7r43
7630d05J12J264r46l06J107r39m62J344k70j178J103L21j555R42P42j201J43R32
7648G48m19j208J738n73j021J021L70j324O28Q98j466O91P09j044k06J257p37
7665F2p43J138j17j118R96P32j525K97J174j227j86J453j130p21J548m7j722J246
7683A10M19j166N84O98q04j86J204j158p30J588p03j021Q90O57j182P78M61j112
7701f73M90J098j216m68J436r26p68J617l79j128J132L33j314M64J313j576j14
7718f79J121n10m69J152l88j032R52N40j255N26Q07j410N09R29j005n12J417p61
7736f8r55J288K25j149J109J38j172M57Q35q55o18J330n07o42Q94M15j485Q84
$$ y = [518, 419, -1030, -149, 857, -480, -152, 840, -283, -231, 676, 179, -878, 628, 370, -1108, 441, 538, -405, -293, 971, 25, -281, 826, -113, -575, 769, 499, -679, 424, 745, -810, 132, 874, -327, -184, 748, 329, -879, 859, 286, -735, 286, 656, -668, -40, 858, -608, 83, 792, -252, -458, 799, 62, -681, 457, 340, -778, 218, 950, -575, -278, 896, -331, -517, 936, -194, -915, 633, 586, -1136, 110, 529, -637, -53, 645, -159, -345, 859, -299, -1029, 559, -144, -1165, -275, 382, -800, -22, 439, -673, -183, 915, -301, -769, 667, -259, -1027, 590, 211, -917, 215, 548, -766, -302, 1011, -565, -679, 442, -68, -537, 615, 227, -805, 147, 687, -568, -42, 765, -645, -136, 793, -212, -724, 693, -68, -1023, 265, 490, -659, 450, 588, -584, -127, 708, -147, -765, 565, 58, -584, 310, 725, -760, 124]
7754A24N38j077M86Q60j708M24J024o22n26J278o01o97Q65J04j124J021M96j272
7772d07K60J150j209N8J182r62n10Q67Qq97N24O37j184N13O26n79n73J219o19
7791A04n10J268m11j305R30N39j026M40N72q73k15J167q15n68J277m44o58J077
7809E49k08j212J121P95j962N49J168j224k30J462j076n27J152J50j204N43O70
7826E16j132N00N69q74R3J162j146n67J269k04j119Q88K27r30M01Q94j187j68
7844h08J782r58r55J358k92j003J440l8j507R86R85j387P8O04o44r1R89n36r77
7863i74J507M0j461J195L58j396P86N57q35j2J156r56p11J622m84r40Q77M02j524
7882g93Q60P00j236J34J212j075m55J312m23r08J085Q2j180R11M73r81o4J546
$$ y = [124, 662, -415, 71, 931, -777, -353, 671, 49, -477, 801, 200, -497, 368, 472, -652, 369, 865, -407, -147, 1003, -206, -148, 1034, 72, -438, 429, 437, -460, 64, 701, -483, 30, 656, 77, -496, 723, 104, -406, 862, 451, -854, 76, 615, -411, 29, 601, -272, -487, 680, -135, -703, 574, 130, -528, 549, 341, -871, 250, 1045, -917, -368, 800, -424, -654, 808, -268, -795, 357, 507, -697, -154, 516, -616, -116, 453, -421, -328, 834, -312, -879, 390, 186, -933, -45, 182, -748, -347, 547, -640, -808, 974, 16, -939, 419, 127, -876, 564, 526, -981, 5, 990, -397, -319, 285, -359, -450, 539, 3, -974, 533, 573, -888, 307, 665, -731, 55, 612, -223, -235, 921, -35, -746, 876, 392, -548, 329, 731, -793, 67, 767, -469, -335, 877, -198, -653, 659, 236, -672, 413, 495, -685, 226, 699, -282, -346, 1200]
7900A200j623L30J015q13p08J405j79j094P33L92j096N40P45j547L22J406q93
7917A35m50R53l21j176J222j07r55O96P93j313K31R49j099j90J123o29n39Q59
7935A82L06j025P28N37j440J91J356j386l9R11j84p97R28m6r60J085K78j150K53
7954b72J022j223K25Q64p62m58J193o86p85J264j7j168M81Q60j450N80P40o23
7972b15m98J396q29p48J338l19o28O76K86r37K30P08p12m32J592j092n81J559
7990G94m26j251J261K03j323Q21Q24j104o30J690q36o08J166l65r00J159O1j317
8008g81R39K48p33L94O44r26M2J097p91n38J189l72r38P57N94j561L09J226j050
8027b51j91J395o75j002J157Jr35J117L4j247O34P40j070k46J310j038l91J563
$$ y = [1200, -423, -93, 922, 109, -599, 806, 627, -467, 266, 658, -438, 102, 847, -700, -378, 1028, 135, -315, 638, 317, -859, 363, 256, -699, -3, 790, -523, -292, 657, -442, -632, 491, -138, -677, 182, 488, -537, 191, 728, -712, -521, 835, -551, -590, 321, 137, -660, 268, 222, -738, 347, 625, -525, -272, 750, -473, -248, 616, -146, -604, 589, -97, -882, 382, 365, -803, -322, 538, -912, -332, 408, -215, -713, 683, -146, -894, 444, 125, -503, 173, 459, -478, -248, 460, -252, -684, 908, -184, -765, 794, 368, -883, 378, 581, -742, 79, 903, -201, -831, 859, 23, -585, 581, 216, -684, 475, 536, -781, 158, 406, -327, 67, 711, -215, -173, 924, 133, -405, 784, 412, -526, 231, 825, -736, -427, 799, -251, -442, 953, 278, -724, 433, 434, -501, 616, 650, -597, 37, 777, -293, -539, 771, -267, -658, 905]
8045I05r22q09J457m6r15N05L95j170K86J056j457K76R45o99j69Q77m19p30R52
8064C18o5j107O17P86q30K71O58n26o79J305o61n01O55J26r32O19O21j469N29
8083b65R75j117l07J281o90o48R22L59j546Q33P78j416O22Q03q73k31J226q41
8101a35q70J301k08q18R50M9j213O86P90j134L30Q26r59k42J067m91l34P45L5
8120C75j188N25J173j346K07Q54j050L01R54p76l93O52O7p61N54P60j406P8J043
8139F23r47q0R65m55m40Q31k95r14J125J80j643J325J67j034N08R02o59o36Q21
8158C44k32o20J151m6j027P24N07j205K60J049j002j30R42j080J42J088l05j124
8176e64P78L48o17M23P2r15K33R61q71m04Q80k8o55P35k47
$$ y = [905, -17, -826, 631, 585, -330, 175, 570, -600, -314, 742, -715, -439, 506, -193, -362, 515, 96, -634, 318, 253, -854, -237, 549, -281, -10, 648, 122, -557, 748, 87, -414, 241, 367, -565, 54, 675, -794, -265, 710, -407, -714, 567, -123, -771, 151, 510, -1036, -203, 575, -841, -219, 584, -289, -520, 706, -135, -1005, 296, 88, -730, 220, 269, -944, -258, 532, -602, -272, 554, -405, -647, 420, -71, -405, 340, 375, -813, -288, 885, -461, -254, 600, -450, -149, 805, 29, -364, 288, 355, -406, 148, 908, -498, -420, 623, -324, -404, 561, 106, -334, 497, 202, -712, 413, 593, -1050, 275, 442, -592, -84, 818, 159, -477, 344, 112, -508, 643, 597, -430, 294, 801, -404, -144, 905, -97, -227, 715, -365, -223, 865, 560, -564, 214, 562, -55, 368, 440, -475, -242, 719, -152, -556, 324, 296, -359, 376, 129]
8191A29
$$ Imaginary data points
##PAGE= N=2
##DATA TABLE= (X++(I..I)), XYDATA
0@%%%%%%%%%%%%%%%%%Pk3L9m6M7m8M8n1O3p7Q6r5J08j20J34j54J69j90K13k35
37a25K59k87L19l52L93m34M77n29N92o58P31q20R23j044J193j377J610j923K358
56A306l004M062o072J1113l8077r2041J42061K5405r2351L0079M0230m8863L3050
69F898L7623p4186j4797O6048k1298k6187L1765k0162o743O5973k6323p2520N2258
82a651L8201o5961M818M1608m0608Q739N9377m7584m1469O3734o38n6791K9376
95h849J5917l7084L4387K3538n9156J3910N3944m9882k5806N5247k2172l3820
107c9826N8663l937n9861N1349L5699p8094K718O5799m1591l1704N7398q169l7278
120b8834M4471O241n1930K2480K8612l6039K958K2331k4058J7113L0896m9959
$$ y = [0, 0, 0, 0, 0, 0, 0, 0, 0, 0, 0, 0, 0, 0, 0, 0, 0, 0, 7, -16, 23, -23, 24, -24, 24, -27, 36, -41, 45, -50, 58, -62, 72, -82, 87, -103, 110, -125, 134, -153, 166, -186, 207, -227, 250, -279, 313, -345, 386, -434, 489, -555, 638, -739, 871, -1052, 1306, -1698, 2364, -3708, 7405, -30672, -122713, 19348, 44753, -47598, -17519, 22711, -26152, 6898, 44521, -29665, -44462, 21586, 288, -25899, 5866, -14296, -21039, 44934, 18611, -53909, -1651, 36550, -29411, -24593, 17015, -23593, -14854, 44523, -3061, -44530, 19204, 18566, -38225, -8849, 7068, -30016, 4371, 27909, -31247, -17337, 36607, -13275, -39081, 16166, -6006, -39826, 18837, 14900, -44961, 6388, 42087, -36007, -33289, 32510, -9081, -40785, 16613, 8444, -28834, 15637, 21878, -30052, -7572, 21040, -14999, -12041, 10290, -13768, 3345, 34241, -15718]
132a5718j0630O2888k2056n0249M4412J1411m3936L5613K6726o2354Q525O1202
144D5834l7152l7055M0315k458j8745L5873j5023m0809M8177K3253o0338N770
156a2358M0483l4122k18M3304m0966k7618O6804P02o3292K3124L1136l3148Q295
169B126K2200l8966N179M7842k8980l0516L4314j552k0763K8634q676l5558L8770
182A4054K1204n1962N177L9958l1015p961L8890k7904k6026N2521k535n1884K8308
195H25K6999m1199O467L1116l2894l625L8784k4912k3529L8804p832l3156L1971
208G819Q101l8301K4226K3816m4758L893M2686l4126k3588M5099n760l2656K9873
221F324N537l3342K2621J6681m0723P262L3396k7757o241L2189k1978j3703M1911
$$ y = [-15718, -26348, 36540, 14484, -35765, 8647, 20058, -23878, 11735, 38461, -23893, -15368, 45834, 8682, -28373, 11942, 9484, -9261, 26612, 11589, -29220, 18957, 42210, -18128, -12358, 28125, -5997, -6215, 37089, -3877, -31495, 35309, 36011, -27281, -4157, 26979, -6169, 2126, 24326, -14640, -9461, 38381, 9401, -21115, 13199, 11647, -9116, 19518, 10842, -24716, 14054, 35258, -16704, -11527, 28431, -2584, -10545, 28345, 441, -25585, 26936, 24401, -27483, 825, 27824, -13375, -6908, 24208, -8686, -12311, 26473, 1561, -21968, 16836, 9004, -24152, 7819, 15920, -22381, 1845, 25661, -19097, -15204, 27482, -6644, -30232, 14867, 9107, -23549, 6324, 11861, -21481, 1140, 17821, -22902, -15640, 17756, -10001, -16242, 15947, -6031, -19734, 22177]
234B2177j5003m2924L5502K0916m0935J0131K7754l0856M092L6403l3259k4082
246c0084M3299j726l3117K3994P328k7001K6115J6621m4664M264L8607k5654j6558
259a8576L0697j2720j4889L8841p110m1323K7695K1572l8263M540K5531k6648
271a0653K469L7857k5955k5108L8216r54l3168J9695P473k8398K3228K2459l8136
284a0975K118L5361k4685j7474L0776j5274k2873L8795M207l9115K1757K3478
296B6096l4584J836K4758k8817o257L7529j6662k2558L3798q11l0468K3821P396
309A5077l8101J5888K8110l2255k849L4718j9331j5948L1995j2361l1002K9612
321C553Q804l3287J7203K0829k9310O195K7928l1221j3868L6136j2036k5051K8953
$$ y = [22177, 7174, -35750, -248, 20668, -20267, -10136, 17618, -13238, -9146, 27257, -6002, -30084, 13215, 11489, -21628, 2366, 9694, -17307, 8808, 25429, -19235, -14971, 23636, -2018, -18576, 12121, -599, -15488, 23353, 16243, -25080, 2615, 24187, -14076, -9536, 15995, -10653, -8184, 29673, 3718, -21390, 16826, 15872, -17296, 2399, 9872, -18526, 4702, 27161, -10975, -8857, 26504, 1819, -15655, 15121, -153, -23026, 15769, 19976, -19139, 2618, 26096, -8488, -6652, 18106, -10711, -16968, 20561, 3899, -18659, 15139, 14328, -16140, 7681, 15077, -23024, -7136, 20974, -11281, -14130, 20588, 1257, -14691, 17304, 4943, -26059, 3553, 12357, -20930, -3727, 17102, -12208, -6013, 21915, -9306, -23174, 12962, 926, -24125, 4828]
334D828K934k7420K4513J3008l6943P325K7106k7486o461L0583j7885j3366L6078
347A6814p645l3010K5019J1915l3002J1853K1001k8631L934L3112k3366j6151
359a8157L1020r269k3870K6498J250l1383K4391K1494l3648L279K7523k4615p763
372a3250K9982j8075k1595L4918L452l0270J9686J1356k9395J4084K0870l4990
384a3227k562L7434j5948j9308K8474n709k2988K7871L769l7385J6207K6913k6835
397c294k597K4418k0109n141L1764j8984k7304L2842P900l0873J4712J4049k6457
410i074J1949K3281l2244q626L5285j1477k1996K4303k395k1548K5638O127l5965
423a6742J2887K6873k6728o176K5846j6519j0361K9411j1784k6679K7873P651
$$ y = [4828, 7762, -19658, 4855, 17863, -19080, -11755, 15351, -12135, -18596, 11987, -5898, -19264, 16814, 9169, -23841, 1178, 13093, -19909, -8056, 12945, -15686, -11752, 21360, -2006, -18157, 12863, 3594, -20276, 6222, 7472, -23911, 480, 21974, -11674, -8395, 19128, -5487, -13250, 16732, -1343, -22938, 11980, 15432, -14838, 4848, 16204, -13191, 893, 21763, -13227, -15789, 21645, 5697, -13611, 14863, 9154, -13834, 14037, 17806, -19579, -3372, 23541, -3294, -5891, 18527, -1582, -6723, 25041, 6057, -21247, 11595, 19495, -11378, 3334, 17383, -9074, 2875, 26156, -6088, -14714, 20571, 9094, -12902, 11401, 9006, -12542, 13096, 19223, -16742, -3855, 23018, -3710, -9886, 15960, -559, -10920, 18491, 6707, -19972, 7901, 15552]
435A5552l0052J3733J6492k7288O237K5106k6485j0149L2803j2009k3312K7276
447G904K964k8090J8241J3726k8951P800K1889k5701l812L0049j6957j6861K8214
460A0415m371k4242K3425N038l1625J6986K4329l0690m778L0159j5891j2703K4682
473A0734j1725k1075K9629N875l1947J2879J8389k1595M593J6498k6682k092L4319
486A7800j5340k5288K6694N844k1424J6243M215k9962J5794K6293l0036j0148
498a9315L1026p106j3528J9822j0174k0281K8022P494l3159R194K3093j7432J451
511h93J6126k3186k988L2728j5371k7864K7390J0003k3577J3775J0583k7286R915
524f45K5499k7231j3191K9299m267j5895J9165m144j7931K2224M753l0705J0925
$$ y = [15552, -14500, -767, 15725, -11563, -5326, 19780, -6705, -16854, 15949, 3940, -19372, 7904, 10868, -17222, 1019, 14745, -14206, -6406, 15483, -10218, -14030, 16019, -938, -17799, 10415, 6044, -18198, 5227, 10265, -21360, -4374, 19955, -10735, -15513, 14646, -1245, -13948, 10734, -991, -22066, 7563, 13438, -18509, -5630, 12759, -8836, -4243, 12255, -14427, -16519, 17800, 2460, -22828, 3866, 9710, -11714, 4529, 8744, -21218, -5424, 20869, -9167, -19315, 11711, 4605, -8923, 10899, 725, -19556, 8466, 15960, -17199, -8005, 15088, -2344, -893, 15233, -7953, -10941, 21787, 6416, -21448, 5942, 15945, -7632, 6143, 16726, -10560, -645, 24854, -2377, -15568, 13731, 9464, -6431, 12734, 8590, -9341, 12883, 17636, -13069, -2144]
537b144K0676k3095j098K4769j8564j0057K9123j0183k6726K3707Q747k8404J0590
550b659J8846k1616J504K0112j9129p707K4082j2673j9136K4872K969k2691J5739
563B513R223k4362J0328J8955k9286n486L2100j1079j8816K1456N0j8565J9766
576F797M218l0258J0370K3620j9709o916J9015r749l307K0653j5562j9768K6670
589F074N866k6292J0171J3424j9017R839J8355k8023p983L2973q363k4887J7726
602a37O470j5727J5384N151k6075R678K1012k0747p573J9528j0288n228K2782
615A4230j2315k1524K6573Q344l0580P597J9081j9209J156K1141j8466r833K6914
628A3109n545k2248J5998N780j7103J2784P934k1620R124J8432k1377m642K2479
$$ y = [-2144, 18532, -4563, -5661, 19108, 544, -9513, 19610, 9427, -17299, 6408, 15155, -13249, -2659, 16187, -5429, -3925, 16187, -2942, -10649, 13433, 760, -18376, 6496, 9465, -13226, 2513, 11736, -12626, -2298, 16657, -12629, -18115, 13985, 2906, -15910, 5546, 5596, -12969, 6797, 11015, -19243, -8873, 14747, -4962, -11878, 7137, -2612, -5919, 14734, -828, -20596, 6074, 11940, -14352, -4181, 9243, -9774, 65, 18420, -9603, -17586, 15387, 7024, -17863, -137, 6333, -9394, 5990, 11141, -14934, -5256, 15756, -4991, -12564, 6964, -3324, -8552, 14230, 1915, -19609, 6964, 15308, -15272, -7675, 11406, -7803, -6647, 14494, -3972, -13805, 13109, 7564, -14684, 1314, 7094, -10009, 2775, 10709, -10911, -1787, 16645, -4732, -9374, 13105]
641A3105j2374j3023K3967m040k1136K0316R069k6653Q911J9566k1862m933K2989
654A3902j0787j1972K0793m871j7404J9196M103k3432J0072J4226j8435L297J5968
667A4656j9256l111K6145j3667k0716K3035N730k1756J0786R541k1205P929J9508
680A7619k0904r296K2592n272j1500J3475n937j2302K1674J331k7006J1797J7880
693A4151j9674p62J7925j7488n504K7052j0607k4363K0868J0830k1776O548J0418
706G618j7555N995J8373k0147q388K2758o367j3637J6718l460j6168J8906O669
719A1315k5732P532J8878j8937l223J9293j2813j0111K2936m310k1092J6235Q033
732H004j9405P657J1800j8360L339J8431j5688p326J9770q861j3101K0590j160
$$ y = [13105, 731, -12292, 11675, 7635, -13501, 6815, 15884, -10769, -1858, 17708, -4154, -9087, 13902, 3115, -8857, 11936, 7065, -10339, 8857, 12960, -10472, -400, 13826, -4609, -1312, 14656, -4600, -7711, 18434, 4767, -15949, 7086, 12816, -8940, 1846, 11387, -9818, -1889, 17619, -3285, -12581, 10011, 4739, -6761, 6714, 777, -11525, 10149, 11480, -15526, -3729, 14151, -5523, -6285, 11640, -5848, -11352, 15700, 5093, -19270, 1598, 12428, -9348, -2800, 7618, -9937, -3942, 14431, -5716, -14104, 8654, 2287, -11350, 5368, 1908, -14260, 4646, 11315, -14417, -6885, 11993, -6944, -10167, 9126, -3687, -13798, 9138, 4828, -16264, -29, 8004, -11401, -3744, 8056, -10304, -6965, 11466, -4222, -11548, 8222, -639, -13740, 6850, 5690]
745E690k2075J7088J2632k2828L647J8095j7370n145K2715r966j5500J9664L293
758I940j8024J1155O253j7696Q759J3332j9400j160K0268j0999q213J8908q636
771D487j5074K0765K949k4412J0501J6146j7737R23J6153j6106n588K1915r260
784E662j7100J7662L226j6317J2417N770k0131R118J6370k0707n064K0603r724
797A785j1513K0064m689j8544J8031P944k3190N731J5163j6086r60J7579j3686
810b371q672K0546m825j6351J4579K096j6307J2034Q916k0394M344J8251j6069
823d223n739J8536j0678j1994K0641j012k0914J3990J1407j8794L571J2934j6511
836h786q31J9380j2504j1972J9439j201j4551J3768J654j9132J2927J3476k2170
$$ y = [5690, -16385, 703, 13335, -9493, -5846, 12249, -5121, -10266, 12449, 2483, -13017, 6647, 9940, -8084, 3071, 9324, -8372, 387, 13719, -5681, -6841, 13427, 2428, -5785, 13123, 4487, -10587, 10178, 13127, -11285, -784, 15362, -2375, -1452, 14701, -1405, -6993, 14922, 5662, -11438, 6224, 9450, -6867, 5550, 11320, -8811, 307, 16677, -4030, -9094, 11509, 1785, -9728, 10336, 5647, -12897, 5134, 13078, -10112, -4381, 10782, -5304, -6264, 11315, -2371, -11043, 9503, 4678, -11673, 2906, 5002, -11305, 729, 9645, -10749, -6405, 11846, -4223, -9962, 8574, -2104, -14098, 6543, 5531, -15383, -1393, 10014, -8780, -5209, 7725, -8786, -9617, 9763, -2741, -14713, 4726, 3525, -11026, 2742, 4396, -14736, -1809, 11667, -10503]
849a0503r56K0351j0541p941J6668q021j3249J9798J858k1653R931J2525j5274
862g007L077J2890j6616j094K0682j1652j4309J8107J593j5349J2807M468j8946
875a1349J0370J4785k0130l161J9760r715r460J8022n572j4670J7459M144k0059
888i576Q544J2658j6716J183J5942j3471n825J8579p642j2757J7202J83j8443
901a0139J2966R885j8801L634J5049j4869k725J7857j1273j1715J9572m69j7237
914h265J1052O187j5150Q398J0024j9386J209K0010j2463j0615J6337l269j1187
$$ y = [-10503, -11459, 8892, -1649, -9590, 7078, -943, -14192, 5606, 7464, -14189, -4258, 8267, -7007, -3930, 8960, -7656, -8750, 11932, 280, -14029, 4078, 5671, -9678, 3129, 7597, -11349, -979, 13806, -6324, -9485, 10275, 560, -8900, 9122, 3550, -11120, 6339, 10483, -9576, -1032, 11626, -5090, -3907, 12035, -1436, -7261, 11318, 3676, -9081, 8121, 8304, -10139, 2827, 12712, -6089, -2455, 12594, -2275, -5000, 12857, 1584, -10131, 9441, 8972, -8265, 2787, 8974, -6176, 2222, 12246, -7140, -5931, 14079, 1616, -8999, 7338, 4069, -7118]
$$ [...]
8191d19
##END NTUPLES=NMR FID
##END=
