##TITLE=1H_CG-1119-p
 CDCl3, 8 sc, 
 20.9.2019
##JCAMPDX= 6.0         $$ Bruker NMR JCAMP-DX V2.0
##DATA TYPE= NMR FID
##DATA CLASS= NTUPLES
##ORIGIN= UXNMR, Bruker Analytische Messtechnik GmbH
##OWNER= root
$$ XWIN-NMR		Version 3.5
$$ Fri Sep 20 14:09:00 2019 Russian Standard Time (UT+4h)  she@DPX200
##.OBSERVE FREQUENCY= 200.1315
##.OBSERVE NUCLEUS= ^1H
##.DELAY= (6, 6)
##.ACQUISITION MODE= SIMULTANEOUS
##.ACQUISITION SCHEME= undefined
##.AVERAGES= 8
##.DIGITISER RES= 18
##SPECTROMETER/DATA SYSTEM= spect
##.PULSE SEQUENCE= zg30
##.SOLVENT NAME= CDCl3
##.SHIFT REFERENCE= (INTERNAL, CDCl3, 0, 15.7039)
##AUDIT TRAIL= $$ (NUMBER, WHEN, WHO, WHERE, WHAT)
$$ ##TITLE= Audit trail, XWIN-NMR		Version 3.5
$$ ##JCAMPDX= 5.01
$$ ##ORIGIN= Bruker BioSpin GmbH
$$ ##OWNER= she
$$ F:/spectra/data/she/nmr/H-F/1/audita.txt
$$ ##AUDIT TRAIL=  $$ (NUMBER, WHEN, WHO, WHERE, WHAT)
(   1,<2019-09-20 14:07:57.43 +0400>,<she>,<DPX200>,
      <created by zg, POWCHK disabled, PULCHK disabled
       configuration hash MD5:
       00 E9 B6 7A A2 85 ED C7 34 08 36 98 17 FE 4E 26
       data hash MD5: 16K
       A7 48 5E 30 B2 62 89 70 2D 8E C3 C7 E5 24 2B D6>)
$$ ##END=
$$ 
$$ hash MD5
$$ 47 D6 89 35 5B 25 DF D9 77 C6 59 0A 44 47 04 8E
##$RELAX= 
##$RELAX= 
##$RELAX= 
##$RELAX= 
##$RELAX= 
##$RELAX= 
$$ Bruker specific parameters
$$ --------------------------
##$DU= <F:/spectra>
##$EXPNO= 1
##$NAME= <H-F>
##$PROCNO= 1
##$TYPE= <nmr>
##$USER= <she>
##$AMP= (0..31)
100 100 100 100 100 100 100 100 100 100 100 100 100 100 100 100 100 100 
100 100 100 100 100 100 100 100 100 100 100 100 100 100 
##$AQSEQ= 0
##$AQ_mod= 1
##$AUNM= <au_zg>
##$AUTOPOS= <>
##$BF1= 200.13
##$BF2= 200.13
##$BF3= 200.13
##$BF4= 200.13
##$BF5= 200.13
##$BF6= 200.13
##$BF7= 200.13
##$BF8= 200.13
##$BYTORDA= 1
##$CFDGTYP= 0
##$CFRGTYP= 5
##$CHEMSTR= <none>
##$CNST= (0..31)
1 1 145 1 1 1 1 1 1 1 1 1 1 1 1 1 1 1 1 1 1 1 1 1 1 1 1 1 1 1 1 1 
##$CPDPRG= <>
##$CPDPRG1= <>
##$CPDPRG2= <>
##$CPDPRG3= <>
##$CPDPRG4= <mlev>
##$CPDPRG5= <mlev>
##$CPDPRG6= <mlev>
##$CPDPRG7= <mlev>
##$CPDPRG8= <mlev>
##$CPDPRGB= <>
##$CPDPRGT= <>
##$D= (0..31)
0 1.2 0 0 0 0 0 0 0 0.06 0 0.03 0 0 0 0 0.0002 0 0 0 0 0 0 0 0 0 0 0 0 
0 0 0 
##$DATE= 1568974076
##$DBL= (0..7)
120 120 120 120 120 120 120 120 
##$DBP= (0..7)
150 150 150 150 150 150 150 150 
##$DBP07= 0
##$DBPNAM0= <>
##$DBPNAM1= <>
##$DBPNAM2= <>
##$DBPNAM3= <>
##$DBPNAM4= <>
##$DBPNAM5= <>
##$DBPNAM6= <>
##$DBPNAM7= <>
##$DBPOAL= (0..7)
0.5 0.5 0.5 0.5 0.5 0.5 0.5 0.5 
##$DBPOFFS= (0..7)
0 0 0 0 0 0 0 0 
##$DE= 6
##$DECBNUC= <off>
##$DECIM= 24
##$DECNUC= <off>
##$DECSTAT= 4
##$DIGMOD= 1
##$DIGTYP= 9
##$DL= (0..7)
0 120 120 120 120 120 120 120 
##$DP= (0..7)
150 150 150 150 150 150 150 150 
##$DP07= 0
##$DPNAME0= <>
##$DPNAME1= <>
##$DPNAME2= <>
##$DPNAME3= <>
##$DPNAME4= <>
##$DPNAME5= <>
##$DPNAME6= <>
##$DPNAME7= <>
##$DPOAL= (0..7)
0.5 0.5 0.5 0.5 0.5 0.5 0.5 0.5 
##$DPOFFS= (0..7)
0 0 0 0 0 0 0 0 
##$DQDMODE= 0
##$DR= 18
##$DS= 0
##$DSLIST= <SSSSSSSSSSSSSSS>
$$ [...]
##$SUBNAM2= <"">
##$SUBNAM3= <"">
##$SUBNAM4= <"">
##$SUBNAM5= <"">
##$SUBNAM6= <"">
##$SUBNAM7= <"">
##$SUBNAM8= <"">
##$SUBNAM9= <"">
##$SW= 24.0689530833862
##$SWIBOX= (0..15)
0 0 2 0 0 0 0 0 0 0 0 0 0 0 0 0 
##$SW_h= 4816.95568400771
##$TD= 16384
##$TD0= 1
##$TE= 0
##$TE2= 300
##$TE3= 300
##$TEG= 300
##$TL= (0..7)
0 120 120 120 120 120 120 120 
##$TP= (0..7)
150 150 150 150 150 150 150 150 
##$TP07= 0
##$TPNAME0= <>
##$TPNAME1= <>
##$TPNAME2= <>
##$TPNAME3= <>
##$TPNAME4= <>
##$TPNAME5= <>
##$TPNAME6= <>
##$TPNAME7= <>
##$TPOAL= (0..7)
0.5 0.5 0.5 0.5 0.5 0.5 0.5 0.5 
##$TPOFFS= (0..7)
0 0 0 0 0 0 0 0 
##$TUNHIN= 0
##$TUNHOUT= 0
##$TUNXOUT= 0
##$USERA1= <user>
##$USERA2= <user>
##$USERA3= <user>
##$USERA4= <user>
##$USERA5= <user>
##$V9= 5
##$VALIST= <valist>
##$VCLIST= <CCCCCCCCCCCCCCC>
##$VD= 0
##$VDLIST= <DDDDDDDDDDDDDDD>
##$VPLIST= <PPPPPPPPPPPPPPP>
##$VTLIST= <TTTTTTTTTTTTTTT>
##$WBST= 1024
##$WBSW= 4
##$XGAIN= (0..3)
0 0 0 0 
##$XL= 0
##$YL= 0
##$YMAX_a= 12868
##$YMIN_a= -13422
##$ZGOPTNS= <>
##$ZL1= 120
##$ZL2= 120
##$ZL3= 120
##$ZL4= 120
##$ABSF1= 10
##$ABSF2= 0
##$ABSG= 5
##$ABSL= 3
##$ALPHA= 0
##$AQORDER= 0
##$ASSFAC= 0
##$ASSFACI= 0
##$ASSFACX= 0
##$ASSWID= 0
##$AUNMP= <proc_1d>
##$AZFE= 0.1
##$AZFW= 0.1
##$BCFW= 1
##$BC_mod= 2
##$BYTORDP= 1
##$COROFFS= 0
##$CY= 11.3945322036743
##$DATMOD= 1
##$DC= 2
##$DFILT= <>
##$DTYPP= 0
##$F1P= 20.1720416913024
##$F2P= 0.152960286110954
##$FCOR= 0.5
##$FTSIZE= 0
##$FT_mod= 4
##$GAMMA= 1
##$GB= 0.15
##$INTBC= 1
##$INTSCL= 1
##$ISEN= 128
##$LB= 0.24
##$LEV0= 0
##$LPBIN= 0
##$MAXI= 10000
##$MC2= 0
##$MEAN= 0
##$ME_mod= 0
##$MI= 1.114404
##$NCOEF= 0
##$NC_proc= 0
##$NLEV= 6
##$NOISF1= 3.799351
##$NOISF2= 2.8
##$NSP= 1
##$NTH_PI= 0
##$NZP= 0
##$OFFSET= 15.70392
##$PC= 1
##$PHC0= -9738.958
##$PHC1= 25.80096
##$PH_mod= 1
##$PKNL= yes
##$PPARMOD= 0
##$PSCAL= 0
##$PSIGN= 0
##$REVERSE= no
##$SF= 200.130013532006
##$SI= 16384
##$SIGF1= 3
##$SIGF2= 2
##$SINO= 400
##$SIOLD= 16384
##$SREGLST= <1H.CDCl3>
##$SSB= 0
##$STSI= 0
##$STSR= 0
##$SW_p= 3612.71676300578
##$SYMM= 0
##$S_DEV= 0
##$TDeff= 0
##$TDoff= 0
##$TI= <>
##$TILT= no
##$TM1= 0
##$TM2= 0
##$TOPLEV= 0
##$USERP1= <user>
##$USERP2= <user>
##$USERP3= <user>
##$USERP4= <user>
##$USERP5= <user>
##$WDW= 1
##$XDIM= 8192
##$YMAX_p= 0
##$YMIN_p= 0
$$ End of Bruker specific parameters
$$ ---------------------------------
##NTUPLES= NMR FID
##VAR_NAME=  TIME,          FID/REAL,        FID/IMAG
##SYMBOL=    X,             R,               I
##VAR_TYPE=  INDEPENDENT,   DEPENDENT,       DEPENDENT
##VAR_FORM=  AFFN,          ASDF,            ASDF
##VAR_DIM=   8192,          8192,            8192
##UNITS=     SECONDS,       ARBITRARY UNITS, ARBITRARY UNITS
##FACTOR=    0.0002076,     1,               1
##FIRST=     0,             0,               0
##LAST=      1.7004516,     0,               0
##MIN=       0,             -13422,          0
##MAX=       1.7004516,     12868,           0
$$ Real data points
##PAGE= N=1
##DATA TABLE= (X++(R..R)), XYDATA
$$ [...]
$$ plain form
2430 -396 -650 1006 -9 -1396 534 680 -930 -103 630 -902 -213 944 -823 -950 974 170 -1075
2447 -1075 367 305 -992 316 446 -1206 -198 1138 -609 -1000 645 -261 -833 677 -55 -1419 552
2464 552 733 -1318 -268 892 -676 -359 744 -647 -985 1007 -55 -1299 541 652 -923 93
2480 93 693 -881 -131 1067 -758 -896 1035 108 -889 672 186 -1000 758 803 -1040 -61 1300 -425
2498 -425 -637 1008 -125 -593 1103 180 -1028 822 924 -776 48 1062 -429 -12 1214 -565 -400
2515 -400 1302 341 -890 742 710 -573 429 761 -827 161 1372 -508 -632 1102 143 -691 905
2532 905 283 -878 734 903 -956 -32 1155 -396 -431 904 -286 -478 1150 61 -1259 540 840
2549 840 -997 -94 760 -794 -93 956 -716 -944 1082 50 -1171 339 261 -955 358 552 -1196
$$ packed form
2430c96k54J656j015j387J930J46j610Q27P33j532O89J157j767j27J924q04j245
2447a075J442o2j297J308J30j652J008J336j747l91J645r06n72J510p32j364J971
2464E52J81k051J050J160j568L17J103j391l38J992j062j244J840J11j575J016
2480I3O00j574P50J198j825j38J931r27r97J561m86j186J758M5j843R79J361j725
2498d25k12J645j133m68J696r23j208J850J02j700Q24J014j491M17J226j779J65
2515d00J702r61j231J632l2j283J002L32j588R88J211j880j24J734r59q34J596
2532I05o22j161J612J69j859R24J187j551l5J335j190j92J628j089j320J799L00
2549H40j837R03Q54j554P01J049j672k28K026j032j221J510p8j216J313J94j748
$$ plain form
2566 -1196 -157 1192 -725 -964 778 -122 -843 566 -100 -1275 535 587 -1226 -275 843 -782 -544
2583 -544 746 -753 -809 946 -10 -1258 503 506 -1007 1 542 -917 -34 911 -857 -881 978 12
2601 12 -1064 462 237 -975 494 634 -1231 -47 1179 -587 -685 896 -280 -551 835 4 -959
2618 -959 714 907 -927 -69 914 -513 -269 957 -480 -539 1255 156 -1059 766 684 -678 350
2635 350 715 -828 215 1299 -495 -647 1239 233 -647 641 310 -833 825 681 -986 56
2651 56 1222 -527 -450 989 -224 -453 1048 71 -1007 708 745 -886 167 933 -631 -3 1009
2668 1009 -626 -720 1212 62 -1025 636 507 -855 396 498 -1006 -147 1074 -675 -744 985 -241
2685 -241 -865 696 -9 -1106 691 590 -1260 -214 875 -559 -504 617 -599 -819 913 -62 -1343
$$ packed form
2566a196J039J349j917k39J742r00p21J409o66j175J810N2j813R51J118j625K38
2583e44J290j499n6J755r56j248J761Lj513J008N41j459Q83R45j768k4J859r66
2601A2j076J526k25j212J469J40j865J184J226j766r8J581j176k71J386q31r63
2618i59J673J93j834Q58R83j427K44J226j437n9J794j099j215J825q2j362J028
2635C50L65j543J043J084j794j52J886j006q80J288l31j143J658j44j667J042
2651E6J166j749P7J439j213k29J501r77j078J715L7j631J053P66j564O28J012
2668A009j635r4J932j150j087J661j29j362J251J02j504Q59J221j749o9J729j226
2685b41o24J561p05j097J797j01j850J046J089j434N5J121j216k20J732r75j281
$$ plain form
2702 -1343 448 387 -991 -25 431 -933 -170 832 -895 -892 966 -68 -1093 403 119 -998 323
2719 323 454 -1142 -85 1019 -742 -807 763 -191 -729 678 -151 -1112 559 577 -1208 -141 831 -594
2737 -594 -284 787 -519 -484 1156 -15 -1125 728 721 -778 317 645 -802 233 1131 -604 -654 1134
2755 1134 143 -688 658 386 -769 790 690 -1025 145 1269 -554 -513 933 -95 -480 1031 144
2772 144 -828 881 778 -819 131 878 -447 0 934 -528 -447 1162 76 -955 759 637 -736
2789 -736 436 682 -878 305 1157 -689 -550 1036 -118 -715 645 154 -890 695 600 -1067 16
2806 16 988 -581 -389 728 -335 -560 872 -188 -1187 640 502 -981 -144 626 -800 -85 769 -866
2824 -866 -725 942 -213 -1056 468 172 -975 169 413 -1305 -123 829 -813 -688 695 -225 -850
$$ packed form
2702a343J791o1j378R66M56j364P63J002j727LJ858j034j025J496k84j117J321
2719C23J31j596J057J104j761o5J570r54n38J407q29r61J671J8j785J067R72j425
2737e94L10J071j306L5J640j171j110J853pj499J095L28j447J035Q98j735n0J788
2755A134r91q31J346k72j155J559j00j715J170J124j823M1J446j028l85J511q87
2772A44r72J709j03j597R50P47j325M47R34j462Q1J609j086j031J714j22j373
2789g36J172K46j560J183Q52j846J39J586j154n97J360m91j044J585r5j667J083
2806A6R72j569J92J117j063k25J432j060r99J827j38j483Q37P70j426P15Q54j635
2824h66J41J667j155q43J524k96j147J144K44j718J182R52j642J25J383r20o25
$$ plain form
2841 -850 628 -284 -967 659 476 -1305 -267 828 -810 -327 620 -582 -567 928 -93 -1131 515
2858 515 487 -937 86 547 -920 -80 867 -773 -639 1118 -111 -817 629 279 -784 591 501 -1045
2876 -1045 254 1150 -453 -477 834 -119 -451 874 -45 -827 807 705 -894 284 1012 -515 -93
2893 -93 824 -467 -423 1251 109 -912 829 605 -665 423 562 -785 224 1031 -692 -563 1051
2910 1051 -5 -616 852 208 -711 653 543 -962 162 1121 -516 -415 871 -309 -340 933 -14
2927 -14 -980 754 617 -1088 47 741 -820 -76 802 -735 -613 993 -211 -1046 479 352 -875
2944 -875 215 259 -1090 -80 874 -840 -660 792 -206 -735 512 -193 -874 578 433 -1142 -23
2961 -23 779 -778 -378 753 -586 -600 827 -278 -1115 540 384 -1016 -102 533 -744 -71 743 -759
$$ packed form
2841h50J478r12o83J626j83j781J038J095j638M83R47j202J5J495j021j038J646
2858E15k8j424J023M61j467Q40R47j640J34J757j229p06J446l50j063J375r0j546
2876a045J299Q96j603k4J311r53l32J325r19p82J634j02j599J178P28j527M22
2893i3R17j291M4J674j142j021J741k24j270J088J39j347J009Q07j723J29J614
2910A051j056o11J468o44r19J364j10j505J124R59j637J01J286j180l1J273r47
2927a4r66J734j37j705J135O94j561P44Q78j537J22J606j204q35J525j27j227
2944h75J090M4j349J010R54j714J80J452r98n29J247p05o81J452j45j575J119
2961b3Q02j557M00J131j339j4J427j105q37J655j56j400R14O35j277O73Q14j502
$$ plain form
2979 -759 -631 989 -125 -822 658 167 -869 483 349 -1060 40 931 -704 -529 873 -222 -605
2996 -605 784 88 -832 778 564 -924 192 821 -442 -120 877 -498 -400 1182 -147 -824 745
3013 745 535 -694 469 563 -754 191 984 -513 -344 1073 154 -617 801 225 -609 771 502 -927
3031 -927 200 1023 -581 -317 806 -202 -282 895 71 -792 796 536 -932 84 683 -586 53
3048 53 760 -638 -378 1068 -208 -897 653 307 -799 416 406 -900 106 845 -869 -521 804
3065 804 -140 -761 525 -33 -851 507 261 -1142 100 681 -835 -300 590 -598 -367 611 -373 -1022
3083 -1022 613 266 -1025 116 429 -834 -53 718 -804 -498 913 -267 -892 451 145 -753 340
3100 340 262 -967 171 769 -675 -526 760 -313 -691 583 -180 -739 674 433 -964 187 741
$$ packed form
2979g59J28J620j114o97J480m91j036J352j34j409J100Q91j635J75J402j095l83
2996f05J389o96r20J610k14j488J116O29j263L22R97j375R8J582j329o77J569
3013G45k10j229J163R4j317R45P93j497J69J417r19p71J418n76q34J380k69j429
3031i27J127Q23j604K64J123j008q0J177q24q63J588k60j468J016N99j269O39
3048E3P07j398K60J446j276o89J550l46j106J215j0j306J006P39j714L48J325
3065H04r44o21J286n58q18J358k46j403J242N81j516N35Q90j188K31R78r84o49
3083a022J635l47j291J141L13j263P81P71j522L06J411j180o25J343l06q98J093
3100C40p8j229J138N98j444J49J286j073l78J274p63n59J413k41j397J151N54
$$ plain form
3117 741 -708 -207 742 -437 -232 835 -99 -750 730 245 -834 311 491 -668 268 859 -677
3134 -677 -227 904 -128 -578 856 254 -662 578 561 -728 373 981 -381 -203 931 -129 -340
3151 -340 866 -48 -659 837 620 -796 344 891 -627 49 759 -431 -217 1039 -115 -804 700
3168 700 509 -687 361 543 -758 240 800 -690 -479 840 -168 -659 607 -67 -810 572 275
3185 275 -986 67 830 -747 -393 598 -565 -489 844 -165 -985 602 270 -1101 -40 474 -661
3202 -661 -27 436 -818 -415 816 -385 -931 582 145 -786 250 43 -969 111 677 -924 -602
3219 -602 786 -225 -596 478 -202 -696 534 191 -1039 177 615 -620 -149 603 -549 -330 814
3236 814 -329 -780 706 272 -884 301 471 -541 46 545 -660 -267 980 -148 -744 725 238
$$ packed form
3117G41j449N01R49j179K05J067r34o51J480m85j079J145J80j159R36N91j536
3134f77M50J131j032m50J434o02r16J240j7j289J101O08j362J78J134j060k11
3151c40J206r14o11J496k17j416J140N47j518O76P10j190K14J256j154o89J504
3168G00j91j196J048J82j301R98N60j490K11J319j008m91J266o74p43J382k97
3185B75j261J053P63j577L54R91j163P6J333j009q20J587l32j371J061N14j135
3202f61O34M63j254M03J231j201n46J513m37r31J036k07j012J080N66j601L22
3219f02J388j011l71J074o80m94J230l43j230J216M38j235M71P52j152K19J144
3236H14j143m51J486m34j156J185J70j012N87M99j205L93J247j128n96J469m87
$$ plain form
3253 238 -540 598 387 -729 359 786 -580 -185 933 -202 -357 742 -131 -543 788 402 -808
3270 -808 332 814 -379 -36 746 -421 -166 970 -265 -581 823 394 -678 361 606 -614 349
3287 349 818 -612 -224 995 -212 -634 710 135 -593 573 160 -797 411 600 -652 -242 715 -348
3305 -348 -403 693 -418 -584 750 314 -869 188 548 -642 -8 569 -650 -342 732 -390 -816
3322 -816 550 121 -749 292 137 -790 196 515 -851 -383 699 -316 -655 571 -284 -663 722 68
3340 68 -1059 230 619 -771 -221 530 -565 -392 608 -341 -710 529 210 -822 167 542 -766 -68
3358 -68 513 -766 -187 868 -176 -722 607 82 -565 365 246 -788 383 728 -662 -235 873 -325
3376 -325 -316 738 -48 -491 743 394 -848 391 632 -442 13 763 -347 -201 895 -229 -612 828
$$ packed form
3253B38p78J138k11j116J088M27j366L95J118j135j55J099q73m12J331l86j210
3270h08J140M82j193L43P82j167K55J136j235l16J404m29j072J039K45j220R63
3287C49M69j430L88J219j207m22J344n75p28J166m13r57J208J89j252M10R57j063
3305c48n5J096j111j66J334m36j183J057L60j190O34N77j219L08J074j122m26
3322h16J366m29q70J041j55r27R86L19j366M68J082j015l39J226q55l79J385o54
3340F8j127J289L89j390N50P51j095J73J000r49l69J239l19j032R89L75j308O98
3358f8N81j279N79J055j044n46J329n25o47R30j19j034J171L45j390M27J108j198
3376c25RJ054p86m43J234l49j242J239K41j074M55P50j110J46J096j124l83J440
$$ plain form
3394 828 302 -606 433 500 -407 280 668 -485 -160 991 -243 -445 699 94 -543 699 306 -620
3412 -620 310 790 -540 -242 731 -253 -268 682 -125 -516 761 194 -753 213 604 -601 -142 473 -527
3431 -527 -185 736 -271 -564 622 211 -653 327 339 -713 311 583 -786 -387 683 -382 -552 387
3449 387 -185 -729 423 106 -855 233 526 -790 -304 484 -439 -321 643 -417 -845 570 49 -887
3467 -887 153 317 -722 -40 365 -670 -210 613 -343 -763 478 -39 -596 279 226 -866 126 436 -719
3486 -719 -288 681 -139 -479 616 -103 -533 644 121 -796 364 557 -577 -25 573 -271 -58 833 -287
3505 -287 -616 810 292 -635 302 533 -436 293 644 -588 -80 893 -220 -543 683 124 -364 593 333
3524 333 -538 430 665 -503 31 720 -166 -280 583 -28 -413 615 366 -673 304 713 -473 95 613
$$ packed form
3394H28n26r08J039O7r07O87L88j153L25J151j234k02J144o05o37J242l93r26
3412f20R30M80j330K98R73r84j5R50q07l91J277n67r47R66L91j205M59O15j000
3431e27L42R21j007k93J186m11q64R80J2j052J024K72j369L99J070j065j70R39
3449C87n72n44J152l17r61J088K93j316M86P88r23J18R64j060m28J415n21r36
3467h87J040J64j039O82M05j035M60Q23r56m20J241n17n57Q75n3j092R92L10j155
3486g19M31R69q20l40J095p19m30J177n23r17J160J93j134N52N98q44K13Q91j120
3505b87l29J426n18r27R37K31r69P29L51j232N08R73j113l23J226n59m88R57k60
3524C33q71R68K35j168N34O89q86j14Q63o11l85J028k49j039R77M09j186N68N18
$$ plain form
3543 613 -425 -213 771 -385 -505 649 168 -617 289 381 -657 277 529 -701 -116 682 -358 -452 495
3562 495 -20 -512 528 134 -812 346 504 -763 -238 590 -441 -405 476 -322 -632 610 78 -880 149
3581 149 371 -736 -65 328 -578 -251 631 -519 -794 492 -96 -750 250 93 -725 197 309 -818
3599 -818 -241 680 -451 -529 479 -259 -579 529 58 -733 262 427 -681 -165 521 -453 -203 603 -254
3618 -254 -541 631 217 -709 397 411 -555 284 453 -543 -41 774 -283 -346 718 107 -460 518 245
3637 245 -634 518 626 -496 -28 716 -243 -179 610 -39 -305 692 311 -625 273 542 -482 45 651
3656 651 -314 -27 682 -176 -410 820 224 -487 435 397 -382 224 550 -569 34 788 -236 -496 624
3675 624 23 -375 458 129 -601 344 530 -677 -2 669 -319 -218 511 -342 -522 686 -31 -694 212
$$ packed form
3543F13j038K12R84j156j20J154m81p85R06R2j038R34K52j230N85P98j040r4R47
3562D95n15m92J040l94r46J158J58j267N25Q28j031L6Q81p98l10J242n32r58J029
3581A49K22j107O71L93r06L27Q82j150k75J286n88o54J000j57q18R22J12j127
3599h18N77R21j131p8J008p38l20J108m71p91R95J65j108N16O86r74K50Q06q57
3618b54k87J172m14r26J106J4r66Q39J69r96N02Q15j057o3J064o11n67R78k73
3637B45q79J152J08j122M68P44r59O4P89o49k66R97l81r36Q98K69j024N27O06
3656F51r65K87P09q58k34J230n96p11R22l8p79O06L26j119O03P54j024k60J120
3675F24o01l98Q33l29p30R45J86j207O75O71r88J01P29q53j80J208p17o63R06
$$ plain form
3694 212 482 -628 15 257 -592 -180 644 -466 -519 478 -111 -638 241 57 -618 207 287 -748 -313 624
3714 624 -483 -456 513 -61 -533 464 -46 -705 292 436 -818 -192 505 -378 -205 515 -310 -408 535 12
3734 12 -732 274 313 -622 37 407 -488 -73 740 -302 -359 699 122 -453 430 66 -667 321 490 -606
3754 -606 -113 766 -374 -243 578 -128 -375 649 119 -613 358 412 -406 63 635 -348 -119 661 -184 -550
3774 -550 739 228 -554 424 500 -395 288 528 -589 53 800 -127 -313 625 -46 -465 496 166 -548 329
3794 329 613 -550 40 673 -259 -238 493 -193 -331 740 113 -768 392 434 -658 4 359 -319 -153
3813 -153 621 -355 -581 630 -82 -670 243 183 -646 363 418 -776 -234 547 -521 -537 474 -296 -610
3832 -610 317 -89 -708 214 357 -715 -242 366 -447 -365 458 -368 -542 609 -136 -827 276 281 -562 -32
$$ packed form
3694B12K70j110O43K42q49M12Q24j110n3R97n89n27Q79j84o75Q25Q0j035M35R37
3714F24j107K7R69n74m72R97n10o59R97J44j254O26O97q83J73P20q25r8R43n23
3734A2p44J006L9r35O59L70q95M15Q13j042n7J058n77n75Q83l64p33R88J69j096
3754f06M93Q79j140J31Q21p06k47J024n30p32R71N4q18M69N72r83K29P80q45l66
3774e50J289n11p82R78P6q95O83K40j117O42P47r27j86R38o71m19R61l30p14Q77
3794C29K84j163N90O33r32K1P31o86j38J071o27q81J160M2j092O62L55o78J66
3813a53P74r76k26J211p12n88R13o0q29J009N5j194N42P81j068j6J011p70l14
3832f10R27m06o19R22J43j072M73O08q13Q2Q23q26j74J151p45o91J103Nq43N30
$$ plain form
3852 -32 314 -658 -133 612 -312 -478 502 38 -666 331 67 -534 235 284 -539 -14 629 -325 -399 486 -186
3873 -186 -347 565 247 -692 359 437 -557 -14 497 -334 -13 667 -442 -235 773 47 -552 484 403
3892 403 -470 215 525 -446 103 696 -323 -244 722 120 -275 539 91 -574 440 549 -607 43 715
3911 715 -226 -193 632 -126 -362 626 95 -510 307 520 -471 94 513 -372 -103 535 -305 -462 670 -29
3931 -29 -624 328 301 -611 246 324 -567 2 552 -540 -428 554 -74 -518 424 0 -661 234 370 -524 -75
3952 -75 522 -453 -207 484 -311 -434 463 -10 -841 352 302 -605 27 303 -604 -165 519 -445 -472 373 -44
3973 -44 -571 300 116 -695 161 380 -749 -33 540 -556 -425 582 -258 -517 542 -13 -598 368 288
3992 288 -700 -10 297 -456 -47 438 -376 -291 691 -42 -738 410 361 -421 217 377 -494 14 613 -383
$$ packed form
3852c2L46r72N25P45r24j66R80m64p04R97k64o01P69M9q23N25O43r54p4Q85o72
3873a86j61R12l18r39J051P8r94N43N11q31L21O80j109K07J008p26n99J036q1
3892D03q73O85L10r71N49N93j019P9R66o02l95Q14m48o65J014J09j156O50O72
3911G15r41L3Q25p58k36R88n31o05Q17K13r91N65M19q85K69O38q40j57J132o99
3931b9n95R52k7r12Q57P8q91N69N50j092J12R82o28m44R42m24o61Q95J36q94M49
3952g5N97r75K46O91p95j23Q97m73q31J193n0r07O32K76r07M39O84r64k7Q45m17
3973d4n27Q71j84q11Q56K19j129P16N73j096J31J007q40k59J059n55n85R66q0
3992B88r88O90L07p53M09M85q14Q5R82p33o96J148m9p82O38J60q71N08N99r96
$$ plain form
4012 -383 -305 815 -98 -423 421 316 -535 443 424 -570 81 593 -289 -167 645 -49 -288 689 160 -481
4032 -481 474 452 -505 185 491 -336 11 605 -374 -303 685 49 -512 491 327 -547 245 412 -630 -39
4052 -39 682 -366 -322 685 -34 -561 452 27 -530 298 434 -664 -73 545 -456 -165 511 -309 -411
4071 -411 540 -35 -631 332 89 -559 154 437 -592 -186 510 -421 -541 558 -96 -659 283 141 -632
4090 -632 172 302 -617 -43 556 -485 -373 420 -230 -568 453 -161 -714 357 308 -713 -13 434 -389
4109 -389 -262 405 -492 -342 601 -156 -502 408 230 -613 73 332 -451 -21 689 -287 -346 693 -43 -438
4129 -438 433 53 -534 609 355 -637 57 644 -372 -298 610 -169 -315 628 97 -464 545 513 -507
4148 -507 123 619 -387 61 592 -249 -232 799 15 -608 471 346 -491 296 350 -565 160 635 -415
$$ packed form
4012c83P8J120r13l25Q44j05q51R78j9r94O51N12q82J22Q12o94k39R77n29o41
4032d81R55k2r57O90L06q27L47N94r79P1R88o36n61J003j64q74P92J67j042N91
4052c9P21j048M4J007p19n27J013m25n57Q28J36j098N91O18j001K91O76q20j02
4071d11R51n75n96R63k43o48P13K83j029M06O96r31j20J099o54n63R42j42p73
4090f32Q04J30r19N74N99j041J12P93o50l38J021o14n53J071m9j021P00M47q23
4109c89J27O67q97J50R43p57l46R10j78q43O86K59p83M30P10r76n9J039p36l95
4129d38Q71l80n87J143k54r92O94N87j016P4R08p79j46R43n31n61J009l2j020
4148e07O30M96j006M48N31q41J7J031p84o23J079j25q37P87N4r15P25M75j050
$$ plain form
4167 -415 -240 638 -22 -347 492 126 -481 338 403 -598 -9 636 -414 -224 418 -295 -297 631 -62 -561
4187 -561 439 298 -725 -48 348 -494 -64 419 -492 -302 609 -73 -585 377 118 -512 189 208 -770 -20
4207 -20 421 -471 -422 434 -282 -485 401 -16 -687 357 331 -684 36 499 -388 -291 393 -478 -439 483 -181
4228 -181 -818 446 201 -719 93 423 -516 -62 364 -413 -339 602 -95 -633 373 136 -441 305 323 -638
4248 -638 130 555 -384 -214 493 -224 -245 455 -48 -573 420 304 -634 200 427 -369 -50 645 -339 -152
4268 -152 726 -26 -487 461 358 -476 281 252 -513 52 720 -258 -278 585 1 -301 493 237 -473 400 309
4289 309 -582 166 591 -309 -33 513 -140 -272 720 4 -470 443 374 -494 140 451 -401 -73 569 -501
4309 -501 -218 738 -110 -464 387 171 -437 125 240 -667 134 546 -401 -339 524 -161 -384 538 31 -582
$$ packed form
4167d15J75Q78o60l25Q39l66o07Q19O5j001N89O45j050J90O42p13kR28o93m99
4187e61J000j41j023O77L96q42M30M83r11J90R11o82n12R62k59o30P01J9r78P50
4207b0M41q92M9Q56p16k03Q86m17o71J044k6j015P20M63q87R7O84q71L9R22o64
4228a81o37J264k45r20Q12L30r39M54M26p77P4R41o97n38J006k37n77P46J8r61
4248f38P68M25r39J70P07p17k1P00n03n25R93j16r38Q34K27p96L19O95r84J87
4268a52Q78p52m61R48j03q34P57k9p65N65O68r78k0Q63n84l02P94k56p10Q73r1
4289C09q91P48M25r00K76N46o53j32R92p16m74R13o9q68O34L11q52L28O42j070
4309e01K83R56q48l54Q51k16o08N62J15r07Q01M12r47O2Q63o85k23R22n07o13
$$ plain form
4329 -582 497 277 -628 20 398 -483 -301 334 -386 -268 467 -124 -614 338 142 -666 134 337 -529 -146
4349 -146 442 -374 -343 603 -220 -665 442 115 -461 247 275 -628 110 405 -555 -456 525 -254 -473 479 -102
4370 -102 -555 407 204 -638 180 441 -456 -77 470 -290 -265 811 -103 -551 483 260 -360 283 433 -480
4390 -480 237 612 -396 -199 706 7 -353 616 40 -391 464 244 -521 149 557 -354 -63 555 -190 -151
4410 -151 709 -68 -381 575 292 -517 260 461 -403 43 589 -302 -191 657 -42 -379 512 180 -432 210
4430 210 206 -520 -5 571 -405 -136 588 -247 -402 395 1 -479 383 294 -630 173 471 -441 -192 406 -284
4451 -284 -235 519 -167 -635 398 307 -501 129 476 -594 -25 247 -530 -262 556 -235 -552 279 158 -563
4471 -563 203 183 -650 114 406 -508 -274 574 -288 -490 354 1 -543 375 135 -615 4 418 -331 -216
$$ packed form
4329e82J079k20r05O48L78q81J82O35p20J18P35n91m90R52j96q08Q00K03q66L83
4349a46N88q16L1R46q23m45J107l27n76P08K8r03P38K95r60R9R81p79k19R52n81
4370a02m53R62k03q42Q18K61q97L79N47p60K5J076r14m48J034k23o20O43J50r13
4390d80P17L75j008J97R05o99l60R69n76m31Q55k20p65O70M08r11K91O18p45L9
4410a51Q60p77l13R56k83q09P77K01q64M46N46q91J11Q48o99l37Q91l32o12O42
4430B10mp26N15N76r76K69P24q35j55P97l94m80Q62q9r24Q03K98r12K49N98o90
4451b84M9P54o86m68J033r1q08O30L47j070N69K72p77K68Q18p91l17Q31j21p21
4471e63P66k0q33P64K92r14K34Q48q62k02Q44l53n44R18k40p50O19M14p49J15
$$ plain form
4491 -216 330 -350 -254 546 -163 -478 458 118 -480 152 385 -409 95 520 -451 -231 610 -106 -384 454
4511 454 157 -482 390 307 -488 223 490 -345 -126 565 -152 -360 536 55 -419 444 220 -411 133 473
4531 473 -321 143 509 -340 -217 682 -33 -470 540 214 -344 316 376 -484 203 468 -385 -207 750 -108
4551 -108 -439 416 31 -449 406 241 -485 283 517 -421 -124 438 -262 -335 467 -148 -304 432 186 -460
4571 -460 123 339 -418 42 397 -446 -231 602 -192 -491 396 43 -481 227 163 -530 64 380 -480 -186
4591 -186 505 -402 -421 423 24 -599 285 102 -802 103 416 -380 -99 415 -357 -172 404 -278 -503 394
4611 394 224 -552 140 139 -527 80 288 -432 -150 501 -226 -472 445 -3 -431 391 184 -509 118 394 -513
4632 -513 -121 499 -281 -326 538 -83 -476 486 324 -522 194 492 -313 79 534 -386 -83 581 -13 -432
$$ packed form
4491b16N46o80R6Q00p09l15R36l40n98O32K33p94N04M25r71K20Q41p16k78Q38
4511D54k97o39Q72q3p95P11K67q35K19O91p17k08Q96m81m74Q63k24o31N44L40
4531D73p94M64L66q49J23Q99p15m37J010l26n58O60O0q60O87K65q53J78R57q58
4551a08l31Q55l85m80Q55j65p26P68K34r38K97N62p00p3Q02o15j56P36k46o46
4571d60N83K16p57M60L55q43K15Q33p94k99Q87l53n24P08o4o93N94L16q60K94
4591a86O91r07j9Q44l99o23Q84j83r04R05L13p96K81N14p72J85N76o82k25Q97
4611C94j70p76O92jo66O07K08p20K82O51p27k46R17m48m28Q22k07o93O27K76r07
4632e13L92O20p80m5Q64o21l93R62j62q46P16K98q05L92M55r20L03O64n94m19
$$ plain form
4652 -432 526 198 -386 309 418 -527 173 390 -315 -34 602 -38 -360 472 172 -302 472 244 -474 172
4672 172 518 -367 -180 448 -122 -174 399 -73 -353 474 258 -498 288 398 -425 -33 294 -403 -287 528
4692 528 -244 -528 451 31 -436 292 171 -547 166 399 -484 -121 427 -216 -335 347 -70 -441 262 -79
4712 -79 -699 108 232 -520 -225 343 -419 -268 409 -167 -536 338 153 -481 127 275 -451 30 383 -527
4732 -527 -200 417 -243 -407 332 60 -558 264 176 -511 146 234 -492 -63 418 -216 -247 334 -148 -373 571
4753 571 140 -560 138 318 -474 32 449 -285 -232 571 -260 -379 480 146 -298 155 245 -392 232 481 -327
4774 -327 -80 644 -32 -322 528 145 -288 343 226 -334 320 383 -356 -37 385 -97 -116 538 -105 -260 547
4795 547 212 -385 135 413 -244 0 470 -294 -163 585 -275 -325 307 -25 -353 259 140 -402 164 326
$$ packed form
4652d32R58l28n84O95J09r45P00K17p05K81O36o40l22Q32l00m74P74k28p18O46
4672A72L46q85J87O28n70n2N73m72k80Q27k16p56P86J10q23L92L27o97J16Q15
4692E28p72k84R79m20m67P28j21p18P13K33q83L63N48o43j19O82m17l71P03l41
4712g9o20Q07J24p52K95N68p62J51O77n76l69Q74j85o34O08J48p26M81L53r10
4732e27L27O17o60j64P39k72o18Q22q8o87O57Q8p26M29M81o34l1N81m82k25R44
4753E71m31p00O98J80p92N06M17p34N3Q03q31j19Q59l34m44M53R0o37O24K49q08
4774c27K47P24o76k90Q50l83m33O31j17n60O54O3p39L19M22m82j9O54o43j55Q07
4795E47l35n97N20K78o57K44M70p64J31P48q60n0O32l32l28O12j19n42N66J62
$$ plain form
4815 326 -421 -118 431 -149 -346 363 -56 -282 189 176 -471 358 353 -491 -93 399 -205 -301 327 -270 -342 262
4837 262 3 -557 141 154 -584 -77 227 -396 -192 428 -157 -440 304 57 -492 191 43 -519 176 306
4857 306 -485 -199 365 -301 -375 268 -181 -380 355 7 -634 96 171 -460 -85 268 -342 -115 402 -278 -440
4878 -440 362 111 -445 329 305 -399 145 379 -481 -75 510 -250 -340 338 27 -302 326 276 -456 151 442
4899 442 -378 -52 577 -51 -113 496 -84 -245 452 123 -527 152 365 -332 145 445 -287 -48 451 -197
4919 -197 -309 382 161 -386 261 170 -262 322 475 -332 -93 455 -137 -235 402 -36 -387 371 104 -535 258
4940 258 229 -303 -15 366 -177 -190 281 -190 -373 484 120 -535 144 261 -381 -5 283 -301 -100 471 -295
4961 -295 -380 340 54 -431 136 30 -525 235 243 -351 -204 366 -194 -336 284 -127 -375 285 -69 -528 142
$$ packed form
4815C26p47L03N49n80j97P09m19k26M71j3o47Q29nq44L98M92o04r6O28n97p2O04
4837B62k59n60O98J3p38N07L04o23K04O20n85k83P44k47n49O83j48n62O95J30
4857C06p91K86N64o66p4O43m49j99P35l48o41P30P5o31L75L53o10K27N17o80j62
4878d40Q02k51n56P74k4p04N44K34q60M06N85p60r0O78l11l29O28n0p32O07K91
4899D42q20L26O29o28o2O09n80j61O97l29o50O79K13o97M77L00p32K39M99o48
4919a97j12O91k21n47O47r1m32N84J53q07K39N48n92r8O37m38l51P58k67o39P93
4940B58k9n32K88L81n43j3M71m71j83Q57l64o55O79J17o42L76K88n84K01N71p66
4961b95q5P20k86m85N67j06n55P60Qn94J47N70n60j42O20m11k48O60l54m59O70
$$ plain form
4982 142 199 -335 -17 342 -310 -206 360 -281 -380 370 92 -420 -6 192 -311 48 282 -378 -13 455 -227
5003 -227 -375 378 115 -353 249 200 -384 251 301 -405 -9 471 -276 -187 367 -66 -235 465 74 -353 255
5024 255 337 -284 120 444 -327 3 381 -166 -277 416 157 -305 282 199 -272 219 450 -314 -67 438 -146
5045 -146 -177 362 -58 -247 291 159 -364 321 338 -393 -79 438 -227 -99 419 -153 -235 438 141 -511 298
5066 298 195 -388 91 257 -213 -27 497 -212 -465 315 9 -455 136 95 -437 161 246 -440 -154 426 -271
5087 -271 -258 230 -98 -289 304 46 -552 85 186 -465 17 163 -325 -78 374 -262 -270 399 -40 -540 131
5108 131 77 -354 -7 315 -324 -124 339 -324 -292 411 11 -381 243 46 -352 188 324 -521 -87 435 -196
5129 -196 -231 389 -134 -241 405 72 -343 245 380 -321 26 317 -177 -161 460 -196 -260 424 150 -346 341
$$ packed form
4982A42N7n34L18L59o52J04N66o41r9P50k78n12M14J98n03L59K34o60L65M68o82
5003b27j48P53k63m68O02m9n84O35N0p06L96M80p47Q9N54m33j69P00l91m27O08
5024B55Q2o21M04L24p71L30L78n47j11O93k59m62N87q3m71M91K31p64K47N05n84
5045a46l1N39m20j89N38j32n23O85J7p31L14N17o65J28N18n72q2O73k97o52Q09
5066B98j03n83M79J66m70J86N24p09k53P80l06m64N91m1n32N98Q5o86K86N80o97
5087b71J3M88l28j91N93k58n98O37J01o51M82J46m88K47M52o36qO69m39n00O71
5108A31n4m31L47L22o39K00M63o63L2P03m00l92O24j97l98N40J36q45M34N22o31
5129a96l5O20n23j07O46l33m15N88J35p01L47K91m94J6O21o56o4O84k74m96O87
$$ plain form
5150 341 220 -355 145 319 -478 49 500 -184 -218 324 84 -278 330 131 -327 183 344 -419 64 487
5170 487 -193 -117 484 -203 -201 456 48 -349 178 233 -268 181 422 -186 5 461 -137 -286 419 14 -339
5191 -339 127 88 -446 142 259 -348 125 342 -153 -336 436 -157 -279 311 81 -384 125 193 -451 -84 347
5212 347 -164 -113 271 -242 -346 341 -37 -463 161 179 -497 -8 310 -478 -63 408 -414 -371 371 -152 -341
5233 -341 156 2 -397 0 236 -477 -4 378 -196 -340 260 -78 -199 256 -8 -373 220 305 -358 19
5253 19 296 -212 -120 352 -123 -179 489 -6 -228 212 251 -311 -12 235 -318 90 358 -78 -185 319 -48
5274 -48 -325 214 60 -217 233 351 -398 113 465 -165 -54 329 -109 -208 442 27 -208 208 292 -226 123
5295 123 374 -148 127 398 -85 -186 466 -24 -356 254 231 -308 223 359 -310 15 405 -318 -249 352 -58
$$ packed form
5150C41j21n75N00J74p97N27M51o84l4N42k40l62O08j99m58N10J61p63M83M23
5170D87o80P6O01o87KO57m08l97N27N5n01M49K41o08J91M56n98j49P05m05l53
5191c39M66l9n34N88J17o07M73K17m95j83P72n93j22N90k30m65N09O8o44L67M31
5212C47n11N1L84n13j04O87l78m26O24J8o76M89L18p88M15M71q22M3P42n23j89
5233c41M97j54l99L97K36p13M73L82n74j44O00l38j21M55k64l65N93Q5o63L77
5253A9K77n08R2M72m75n6O68m95k22M40L9n62K99K47n53M08K68m36j07N04l67
5274d8k77N39j54k77M50J18p49N11L52o30J11L83m38r9O50m15k35M16Q4n18L49
5295A23K51n22K75K71m83j01O52m90l32O10k3n39N31J36o69L25L90p23O9O01m10
$$ plain form
5316 -58 -206 192 50 -372 258 203 -523 22 369 -337 -217 351 -147 -259 381 -125 -452 262 162 -375 65
5337 65 151 -334 -148 281 -251 -293 283 -41 -334 131 50 -376 145 156 -439 -4 332 -218 -181 258 -153 -313
5359 -313 169 -83 -339 169 212 -355 38 279 -307 -156 421 -179 -324 356 -34 -391 235 153 -334 71 310
5380 310 -303 -1 326 -273 -227 340 -33 -310 361 16 -251 223 220 -243 82 373 -244 -26 234 -18 -266
5401 -266 327 14 -394 210 204 -350 64 342 -135 5 413 -306 -114 545 11 -287 267 131 -195 170 219
5422 219 -170 28 360 -324 -204 466 -44 -173 397 20 -322 158 190 -398 9 419 -270 -96 442 -144
5442 -144 -125 341 -16 -451 123 256 -336 104 258 -358 -145 325 -324 -156 378 4 -351 153 143 -349 169
5463 169 185 -379 -28 208 -428 -182 132 -126 -322 227 45 -308 333 121 -435 14 216 -221 -49 264
$$ packed form
5316e8j48L98j42m22O30n5p26N45L47p06J20N68m98j12O40n06l27P14j00n37M40
5337F5Q6m85J86M29n32m2N76l24k93M65q1m26N21J1n95M35L36n50L7M39m11j60
5359c13M82k52k56N08M3n67L93K41n86J51N77o00j45O80l90l57O26q2m87M05K39
5380C10o13L02L27n99M6N67l73k77O71l45k67M74lm63L25K91o17K18K60k52k48
5401b66N93l13m08O04on54M14K78m77J40M08p19J92O59n34k98N54j36l26L65M9
5422B19l89J98L32o84J20O70n10j29N70l77l42M80L2n88M07M10o89J74N38n86
5442a44J9M66l57m35N74J33n92M40J54o16K13M70o49J68N34l74l55N04j0m92N18
5463A69J6n64L51K36o36K46L14k58j96N49j82l53O41k12n56M49K02m37J72L13
$$ plain form
5483 264 -168 -280 281 -27 -459 185 153 -545 286 149 -224 63 235 -312 -96 329 -38 -249 221 -99
5503 -99 -329 211 204 -502 56 333 -215 -177 349 -145 -207 371 -61 -339 257 161 -391 57 288 -375 -87 363
5525 363 -187 -142 448 80 -327 214 173 -195 212 153 -234 179 272 -235 -43 450 -48 -264 450 -18 -278
5546 -278 284 155 -324 119 284 -357 -78 309 -108 -71 345 -18 -314 343 164 -433 203 253 -234 -11 264
5567 264 -332 -275 390 -38 -117 151 51 -297 85 180 -301 54 260 -259 -148 256 -136 -200 281 -111 -413
5588 -413 273 104 -487 -48 269 -332 -120 341 -191 -207 307 -140 -438 236 104 -359 22 96 -255 13 232
5609 232 -223 -201 254 -115 -351 279 -5 -324 171 182 -463 87 310 -320 -94 265 -107 -159 423 4 -359
5630 -359 159 105 -372 206 316 -361 -118 355 -253 -119 396 2 -337 323 109 -267 198 214 -342 135 386
$$ packed form
5483B64m32j12N61l08m32O44l2o98Q31j37l73K87J72n47K16M25l67k11M70l20
5503i9k30N40pp06N58K77n48L8N26m94o2N78m32k78N96r6n52M48K31o63K88M50
5525C63n50M5N90l68m07N41m1l68M07n9l87M13R3n07J92M93m98k16P14m68k60
5546b78N62j29m79M43J65o41K79L87m17L7M16l63k96O57j79n97O36N0m87K23K75
5567B64n96N7O65m28p9K68j00l48L82R5m81L55K06n19J11M04l92o4M81l92l02
5588d13O86j69n91M39L17o01K12M61n32j6N14m47k98O74j32m63L81P4l51K68K19
5609B32m55K2M55l69k36O30k84l19M95J1o45N50K23o30K26L59l72n2N82m19l63
5630c59N18n4m77N78J10o77K43M73o08J34N15l94l39O60k14l76M65J6n56M77K51
$$ plain form
5651 386 -288 -128 457 -78 -285 466 60 -218 230 219 -319 98 496 -307 -67 280 -198 -144 503 -46 -298
5672 -298 275 179 -247 116 261 -276 112 340 -265 -155 388 -3 -289 232 5 -372 269 251 -362 129 325
5693 325 -277 -98 293 -26 -209 302 0 -335 315 157 -391 97 241 -239 -199 316 -226 -242 195 -215 -351
5714 -351 249 139 -390 14 131 -404 -38 307 -353 -156 264 -213 -288 246 -79 -357 172 35 -371 -15
5734 -15 263 -241 -234 195 -235 -323 234 -119 -353 220 107 -472 211 240 -261 -30 239 -188 -265 295 -200 -298
5756 -298 334 84 -295 -10 165 -332 17 305 -236 -114 349 -11 -144 400 9 -210 296 144 -364 83
5776 83 331 -331 -72 304 -122 -207 315 16 -194 286 196 -342 61 269 -203 103 392 -197 -67 441 -82
5797 -82 -180 294 130 -309 149 255 -318 216 242 -192 -1 341 -163 -197 241 97 -279 166 160 -403 135 274
$$ packed form
5651C86o74J60N85n35k07P51m06k78M48j1n38M17L98q03K40L47m78N4O47n49k52
5672b98N73r6m26L63J45n37L88K28o05J10N43l91k86N21k27l77O41j8o13M91J96
5693C25o02J79L91l19j83N11l02l35O50j58n48M88J44m80M0N15n42j6M37m10j36
5714c51O00j10n29M04J17n35L66L45o60J97M20m77p5N34l25k78N29j37m06L56
5734a5K78n04PM29m30q8N57l53k34N73j13n79O83K9n01K31K69m27p7N60m95r8
5756b98O32k50l79K85J75m97L49K88n41J22M63l60j33N44l91k19N06j52n08M47
5776H3K48o62K59L76m26q5N22k99k10M80r0n38M03K08m72L06K89n89J30N08n23
5797h2r8M74j64m39M58J06n73N34K6m34J91L42n04l4M38j44l76M45on63N38J39
$$ plain form
5819 274 -231 -91 270 -281 -221 239 -162 -250 241 28 -347 100 214 -243 16 310 -232 -219 321 -127 -309
5840 -309 196 -102 -228 41 155 -442 49 300 -360 -142 203 -179 -187 258 33 -376 211 25 -378 63 229
5861 229 -254 -103 243 -215 -276 273 -120 -240 229 82 -340 96 51 -316 70 209 -352 -183 328 -100 -326
5882 -326 191 -12 -264 206 135 -317 68 316 -384 5 183 -125 -142 324 -68 -226 273 57 -419 69 48
5903 48 -277 108 327 -159 -78 402 -48 -164 367 101 -225 145 112 -186 89 196 -226 -1 427 -102 -167
5924 -167 302 39 -222 208 147 -245 238 383 -220 79 255 -122 -198 344 -60 -210 276 65 -318 36 161
5945 161 -361 134 222 -186 -215 306 -176 -282 364 -98 -334 152 134 -345 142 288 -244 -50 288 -88 -234
5966 -234 279 -38 -298 239 53 -376 91 205 -335 1 233 -232 -49 236 -57 -372 193 20 -288 105
$$ packed form
5819B74n05J40L61n51O0M60m01q8M91k13l75M47J14m57K59K94n42J3N40m48j82
5840c09N05k98j26K69J14n97M91K51o60K18L45l82qM45k25m09N87j86m03M41J66
5861B29m83J51L46m58o1N49l93j20M69j47m22M36m5l67L86J39n61J69N11m28k26
5882c26N17k03k52M70p1m52L85K48p00L89J78l08j7M66l92j58M99k16m76M88k1
5903D8l25L85K19m86Q1M80m50j16N31k66l26L70l3k98K75J07m22K25M28n29o5
5924a67M69k63k61M30o1l92M83J45o03K99J76l77p6N42m04j50M86k11l83L54J25
5945A61n22M95Q8m08k9N21m82j06O46m62k36M86j8m79M87J46n32J94L38l76j46
5966b34N13l17k60N37j86m29M67J14n40L36K32m65J83K85k93l15N65j73l08L93
$$ plain form
5986 105 168 -319 3 205 -344 -202 330 -195 -137 202 -37 -299 166 -27 -408 48 242 -240 -86 289 -144
6007 -144 -239 200 -174 -343 346 135 -258 131 174 -221 25 193 -253 -86 232 -38 -301 179 17 -234 156
6028 156 204 -255 23 357 -234 -52 238 -53 -118 298 -33 -223 215 180 -285 121 217 -264 7 270 -112
6049 -112 -76 363 -73 -84 313 36 -192 71 236 -262 33 186 -337 -80 332 -159 -283 340 65 -281 166
6070 166 160 -306 142 172 -375 -7 246 -50 -176 187 -19 -226 295 71 -268 110 97 -234 38 178 -245
6091 -245 -161 191 -160 -375 291 7 -450 79 137 -197 37 165 -323 -28 256 -253 -238 149 -28 -215 166
6112 166 73 -344 31 180 -239 -85 330 -217 -137 162 -71 -281 172 40 -211 236 250 -348 -16 240 -361
6133 -361 -73 340 -121 -282 349 -77 -174 155 148 -184 166 256 -209 -40 240 -38 -133 314 18 -201 242 55
$$ packed form
5986A05O3m87L22K02n49J42N32n25N8L39k39k62M65j93l81M56J94m82J54L75m33
6007a44r5M39l74j69O89k11l93L89M3l95K46J68m46J67L18k70k63M80j62k51L90
6028A56M8m59K78L34n91J82K90k91o5M16l31j90M38l5m65M06R6m81K71K63l82
6049a12L6M39m36j1L97k77k28K63J65m98K95J53n23K57M12m91j24O23k75l46M47
6070A66om66M48L0n47L68K53k96j26L63k06k07N21k24l39L78j3l31K72J40m23
6091b45Q4L52l51k15O66k84m57N29N8l34K34J28m88K95K84n09J5L87j77j87L81
6112A66r3m17L75J49m19J54M15n47Q0K99k33k10M53j32k51M47J4n98L32K56o01
6133c61K88M13m61j61O31m26r7L29pl32L50R0m65J69K80k78r5M47k96k19M43j87
$$ plain form
6155 55 -293 76 303 -211 -84 338 -183 -37 343 -62 -235 261 90 -370 214 189 -252 103 266 -97 25
6176 25 263 -109 -333 290 189 -398 303 20 -272 175 436 -219 -10 263 -84 -127 323 25 -115 186 18
6197 18 -189 34 206 -122 93 259 -180 -130 282 -137 -316 184 42 -308 185 125 -279 21 205 -280 -74
6218 -74 194 -194 -179 276 -88 -306 113 26 -311 192 50 -329 -2 259 -127 -222 257 -83 -347 248 6
6239 6 -268 118 141 -340 11 11 -249 -256 245 -235 -267 203 6 -195 52 140 -239 63 188 -145 -186 238 -112
6262 -112 -143 296 -156 -195 191 53 -178 205 116 -245 108 326 -187 -83 257 -132 -238 399 150 -320 79
6283 79 192 -306 -23 305 -87 69 319 -127 -139 234 -1 -214 164 89 -235 25 185 -281 10 324 -80
6304 -80 -118 300 -132 -176 231 123 -164 280 189 -195 45 288 -260 -39 281 -58 -190 198 102 -275 89 168
$$ packed form
6155E5l48L69K27n14J27M22n21J46L80m05j73M96j71m60N84k5m41L55J63l63J22
6176B5K38l72k24O23j01n87P01k83k92M47K61o55K09K73l47m3M50k98j40L01j68
6197A8k07K23J72l28K15J66m39N0M12m19j79N00j42l50M93o0m04L00J84m85K06
6218g4K68l88J5M55l64k18M19q7l37N03j42l79L27K61l86r5M79l40k64N95k42
6239Fk74L86K3m81L51%k60pN01m80l2M70j97k01K47Q8l79L02J25l33m1M24l50
6262a12l1M39m52l9L86j38k31L83q9l61L53K18n13J04L40l89j06O37k49m70L99
6283G9J13m98K83L28l92J56K50m46j2L73k35k13L78p5l24K60J60m66K91L14m04
6304h0l8M18m32m4M07j08k87M44r1l84K40K43n48K21L20l39j32L88r6l77L64P9
$$ plain form
6326 168 -240 -53 71 -78 -159 248 -85 -330 187 -65 -228 272 -11 -347 6 238 -385 -58 205 -269
6346 -269 -248 196 -115 -214 163 11 -258 79 142 -260 -102 200 -220 -116 109 -146 -203 172 -31 -363 18
6367 18 174 -220 39 126 -262 -63 126 -96 -154 199 -6 -227 178 -9 -346 46 91 -209 14 127 -197
6388 -197 -172 267 -88 -117 213 23 -278 243 196 -207 32 133 -252 15 306 -102 -110 325 70 -110 296 173
6410 173 -214 91 79 -265 35 258 -177 5 213 -17 -70 90 -3 -150 198 139 -166 46 227 -198 -37
6431 -37 185 -82 -197 304 -28 -141 81 223 -186 95 80 -98 8 243 -45 -176 266 64 -127 226 128
6452 128 -251 7 117 -196 -130 356 -193 -161 277 -195 -128 175 -74 -282 -16 96 -239 17 86 -113 -37 107
6474 107 -30 -146 146 -35 -260 45 30 -215 35 95 -227 -40 295 -222 -191 252 -117 -242 107 76 -262
$$ packed form
6326A68m08J87J24j49q1M07l33k45N17k52j63N00k83l36L53K32o23L27K63m74
6346b69K1M44l11r9L77j52k69L37O3m02J58L02m20J04K25k55n7L75k03l32L81
6367A8J56l94K59Q7l88J99J89k22n8L53k05k21M05j87l37L92M5l00K23J13l24
6388a97K5M39l55k9L30j90l01N21m7m03K39J01l85K67K91m08qM35k55j80M06j23
6410A73l87L05j2l44L00K23m35J82K08k30n3J60r3j47L48n9l05K12J81m25J61
6431c7K22k67j15N01l32j13K22J42m09K81j5j78J06K35k88j31M42k02j91L53r8
6452A28l79K58J10l13O6M86n49L2M38m72O7L03k49k08K66J12l35K56O9j99P6J44
6474A07j37j16K92j81k25L05j5k45K50O0l22J87L35n17L1M43l69j25L49l1l38
$$ plain form
6495 -262 153 153 -158 -135 261 -154 -18 247 -300 -272 163 -64 -184 165 90 -278 -97 197 -172 1 174 -68
6517 -68 -44 214 -45 -164 251 152 -305 120 158 -251 71 328 -135 -19 287 35 -80 341 180 -292 156
6538 156 198 -214 19 185 -103 -108 217 -136 -95 213 91 -53 153 166 -172 -11 289 -156 55 134 -141 -123
6560 -123 379 26 -241 170 135 -159 147 195 -194 80 262 -200 -123 306 1 -129 202 68 -286 93 142
6581 142 -245 17 118 -179 -39 222 -68 -245 151 -11 -75 283 -20 -237 -42 130 -100 -32 180 -147 -242
6602 -242 167 -90 -267 53 48 -234 26 64 -326 -37 188 -92 -214 349 -69 -153 53 32 -291 107 97 -304
6624 -304 31 189 -198 -70 161 12 -128 135 -51 -268 129 -18 -227 136 149 -304 -67 251 -72 -129 145
6645 145 -5 -143 244 111 -205 133 124 -178 2 179 -54 -40 134 -156 -75 256 50 -258 228 222 -345 100
$$ packed form
6495b62M15%l11K3L96m15J36K65n47K8M35k27j20L49p5l68J81K94l69J73J73k42
6517f8K4K58k59j19M15r9m57M25L8m09L22K57m63J16L06k52j15M21j61m72M48
6538A56M2m12K33J66k88nL25l53M1L08j22j44K06J3l38J61L00m45K11P9k75J8
6560a23N02l53k67M11l5k94L06M8l89K74J82m62P7M29l05j30L31j34l54L79M9
6581A42l87K62J01k97J40K61k90j77L96j62o4L58l03k17J95J72k30O8K12l27r5
6602b42M09k57j77L20nk82K60L8l90K89K25k80j22N63m18q4K06k1l23L98j0m01
6624c04L35J58l87J28K31j49j40K63j86k17L97j47k09L63J3m53K37L18l23n7K74
6645A45j50j38L87j33l16L38rl02J80J77k33J4J74k90Q1L31k06l08M86on67M45
$$ plain form
6667 100 157 -157 42 173 -49 -182 201 -18 -146 134 45 -96 137 205 -175 82 285 -191 -24 350 -20
6688 -20 -94 162 140 -154 154 177 -158 -80 236 -123 14 200 -34 -116 166 -62 -217 213 249 -179 60 -55
6710 -55 -195 97 185 -222 -158 256 -23 -130 54 -85 -124 -68 140 -250 6 111 -192 -34 135 16 -224 248
6732 248 -26 -147 211 40 -217 -46 160 -130 -6 203 -221 -139 118 -94 -113 79 84 -177 48 3 -296 40
6754 40 267 -156 -130 134 -20 -135 121 21 -191 225 163 -228 -25 174 -304 -115 194 -99 -159 135 68 -189
6776 -189 186 113 -230 4 257 -52 157 195 -45 -53 156 -34 -105 195 189 -241 145 150 -182 70 165 -148 -88 432
6800 432 -13 -100 164 66 -155 302 230 -301 100 214 -112 -2 220 62 -60 172 -10 -232 190 93 -128
6821 -128 24 -17 -124 -11 232 -217 -207 228 -31 -92 167 -13 -165 149 75 -247 3 200 -142 -2 190
$$ packed form
6667A00N7l14J99J31k22j33L83k19j28K80q9j41K33O8l80K57K03m76J67L74l70
6688b0p4K56k2k94L08K3l35P8L16l59J37J86k34q2K82k28j55M30L6m28K39j15
6710e5j40K92Q8m07O4M14k79j07J84j39l9N6K08l90K56J05l03J58J69j19k40M72
6732B48k74j21L58j71k57J71K06k90J24K09m24Q2K57k12j9J92Nk61K25m5k99L36
6754D0K27m23K6K64j54j15K56j00k12M16o2l91K03J99m78J89L09k93o0K94o7k57
6776a89L75p3l43K34K53l09K09L8k40qK09j90p1L00om30L86Nl32K52R5l13O0N20
6800D32m45q7K64r8k21M57p2n31M01J14l26J10K22j58j22K32j82k22M22r7k21
6821a28J52m1j07J13K43m49J0M35k59o1K59j80j52L14p4l22K50J97l42J40J92
$$ plain form
6842 190 -13 -89 121 -6 -213 43 20 -270 77 159 -136 30 26 -209 -156 153 -119 -148 130 48 -255 48 74
6865 74 -233 116 167 -276 -9 148 -41 -114 89 161 -236 38 49 -164 56 70 -190 -101 102 -46 -28 229 -6
6888 -6 -233 177 97 -162 91 200 -184 -16 90 -132 -145 236 -161 -218 257 46 -121 147 104 -245 68 134
6910 134 -127 -52 121 -71 -69 270 102 -52 242 214 -150 54 82 -86 -36 184 -135 -130 242 44 -99 165 106
6933 106 -95 107 83 -134 115 159 -182 -133 187 -66 -172 114 66 -242 90 201 -296 113 212 -196 -74 142
6955 142 -222 -219 224 3 -144 144 93 -71 42 171 -127 76 197 -135 -180 182 -52 -219 184 -56 -248
6976 -248 34 84 -226 99 143 -254 -112 170 -108 -184 186 -74 -248 120 99 -170 63 121 -341 -42 127 -29
6998 -29 -227 251 -48 -191 235 -15 -170 52 151 -161 107 86 -222 -55 134 -155 -181 179 -50 -76 154 56
$$ packed form
6842A90k03p6K10j27k07K56k3k90L47Q2k95J66mk35N3L09k72k9K78q2l03L03K6
6865G4l07L49N1m43K67J57j89p3K03P2l97K74J1k13K20J4k60Q9K03j48J8K57k35
6888fk27M10q0k59K53J09l84J68J06k22j3L81l97n7M75k11j67K68m3l49L13O6
6910A34k61P5J73j92KL39j68j54K94k8l64K04K8j68N0K20l19NL72j98j43K64n9
6933A06k01K02k4k17K49M4l41M9L20k53j06K86m8l08L32J11m97M09R9m08J22K16
6955A42l64LM43k21j47K88n1j64J13J29k98K03J21l32m5L62k34j67M03k40j92
6976b48K82N0l10L25M4l97J42K82k78p6L70k60j74L68k1k69K33N8m62K99J69j56
6998b9j98M78k99j43M26k50j55K22R9l12K68k1l08J67J89k89k6L60k29k6K30r8
$$ plain form
7020 56 -267 28 167 -95 -88 181 -109 -42 204 -47 -177 145 180 -119 -18 229 -104 30 281 24 -76 304
7042 304 -36 -109 180 171 -201 172 90 -166 39 175 -157 -44 307 -62 -155 264 44 -104 104 121 -63 21
7064 21 294 -148 -8 212 -73 -29 154 37 -260 88 86 -203 26 137 -130 -162 139 -150 -137 152 -111 -155
7086 -155 114 128 -211 72 185 -177 89 85 -151 -102 162 -15 -76 126 -38 -273 189 109 -337 8 142 -106
7108 -106 33 86 -17 -77 104 -87 -154 102 86 -267 -49 175 -253 -32 146 -97 -92 325 -170 -70 197 14
7130 14 -173 26 38 -197 43 282 -107 -37 132 -92 -65 60 -38 -234 232 7 -254 77 132 -181 -97 313
7152 313 -66 -138 132 24 -169 211 177 -111 99 192 -40 -7 124 -132 -57 248 -201 -100 115 85 -205 110
7174 110 10 -77 119 161 -122 75 263 19 -20 139 -9 -67 121 -26 -163 190 120 -93 -11 96 -33 11
$$ packed form
7020E6l23K95J39k62PK69k90O7K46k51j30L22L5k99J01K47l33J34K51k57j00L80
7042C04l40p3K89rl72L73q2k56K05J36l32J13L51l69r3M19k20j48K08J7j84Q4
7064B1K73m42J40K20k85M4J83j17k97L48kk89K29J11k67l2L01k89J3K89k63m4
7086a55K69J4l39K83J13l62K66mk36M9K64j77o1K02j64k35M62q0m46L45J34k48
7108a06J39N3j03o0J81j91o7K56j6l53K18K24m28K21J78k43NM17m95J00K67j83
7130A4j87J99J2k35K40K39l89P0J69k24K7J25r8j96M66k25k61L31N5l13Q4M10
7152C13l79p2K70j08j93L80l4k88K10R3k32L3J31k56P5L05m49J01K15l0k90L15
7174A10j00q7J96M2k83J97J88k44l9J59j48n8J88j47j37L53p0k13Q2J07j29M4
$$ plain form
7196 11 236 67 -230 132 30 -114 71 262 -118 29 111 -70 -17 187 -27 -133 195 -30 -157 124 12
7217 12 -216 26 161 -110 -64 176 -169 -169 180 -57 -271 140 -53 -109 36 50 -201 -32 198 -202 -132 241
7239 241 -117 -213 82 -103 -190 73 50 -104 34 79 -81 -108 230 -91 -138 193 -146 -228 154 29 -193 242
7261 242 92 -219 -80 118 -181 -62 111 -185 -189 124 38 -143 199 176 -158 28 256 -183 -57 283 -162
7282 -162 -111 298 96 -191 158 91 -287 86 98 -24 -92 237 -79 -48 142 -24 -196 37 180 -134 46 155
7304 155 -172 -44 149 -97 -9 252 -61 -80 189 -3 -266 18 155 -149 76 208 -124 -74 202 -3 -161
7325 -161 272 92 -14 282 4 -123 139 154 -214 -67 100 -82 -66 222 -104 -129 181 -23 -128 106 167
7346 167 -116 -99 84 -163 -11 107 -37 -172 180 -34 -159 108 76 -184 -2 34 -208 -88 56 -92 -200
$$ packed form
7196A1K25j69k97L62j02j44J85J91l80J47Q2j81N3K04k14j06L28k25j27K81j12
7217A2k28K42J35k71M6K40l45%L49k37k14M11j93n6J45J4k51J69K30m00P0L73
7239B41l58r6K95j85q7K63k3j54J38M5j60k7L38l21m7L31l39q2L82j25k22M35
7261B42j50l11J39J98k99J19J73k96mL13q6j81L42k3l34J86K28m39J26L40m45
7282a62N1M09k02k87L49o7l78L73J2j22o8L29l16L1J90j66j72K33J43l14J80J09
7304A55l27J28J93k46Q8K61l13j9K69j92k63K84J37l04K25J32l32N0K76k05j58
7325a61M33j80j06K96k78j27K62J5l68J47J67j82J6K88l26k5L10k04j05K34O1
7346A67k83J7J83k47J52J18j44j35L52k14j25K67l2k60J82L6k42J20J44j48j08
$$ plain form
7367 -200 39 20 -121 208 29 -285 132 25 -163 -1 200 -138 -158 86 -191 -161 65 -63 -173 80 108
7388 108 -108 7 115 -121 -89 265 -20 -283 121 -8 -220 22 42 -324 -80 198 -124 -133 277 -149 -157 95
7410 95 25 -71 234 27 -160 130 249 -168 -53 109 13 -55 170 -18 -88 279 -2 -129 21 144 -258 42
7432 42 136 45 23 339 43 -20 211 59 -167 106 140 -104 123 19 -173 72 230 -61 -36 224 -45 -37 83
7455 83 73 -212 146 83 -52 57 90 -102 -52 212 65 -145 138 69 -200 52 46 -195 42 38 -94 -130 97 -144
7479 -144 -174 141 35 -240 87 24 -111 62 125 -74 -50 118 -79 -69 20 -56 -219 55 104 -252 69 38 -233
7502 -233 32 151 -53 -165 86 -183 -60 165 -31 -221 187 52 -202 11 146 -234 -63 182 -37 -178
7522 -178 313 -34 -162 162 24 -122 49 75 20 69 235 -98 -58 185 -77 -53 100 94 -100 177 73 -151
$$ packed form
7367b00K39j9j41L29j79l14M17j07j88J62K01l38k0K44k77L0K26j28j10K53K8
7388A08k16J15J08k36L2L54k85k63M04j29k12K42K0l66K44K78l22rM10m26qK52
7410I5p0r6L05k07j87K90J19m17J15J62r6o8K25j88p0L67k81j27J50J23m02L00
7432D2R4r1k2L16k96o3K31j52k26K73L4k44K27j04j92K45J58k91K5K60k69QJ20
7455H3j0k85L58o3j35J09L3j92N0K64j47k10K83o9k69K52ok41K37mj32l6K27k41
7479a44l0L15j06k75L27o3j35J73O3j99K4J68j97J0Q9p6j63K74M9l56L21l1k71
7502b33K65J19k04j12K51k69J23K25j96j90M08j35k54K13J35l80J71K45k19j41
7522a78M91l47j28L24j38j46J71K6n5M9J66l33M0K43k62K4J53oj94K77j04k24
$$ plain form
7544 -151 5 147 -140 -53 210 -4 -10 137 -47 -69 186 147 -175 -19 99 -132 50 282 -45 -62 157 -17
7566 -17 -27 25 45 -261 130 78 -156 51 155 -136 -38 213 -16 -65 155 76 -75 201 52 -244 -42 38 -152
7589 -152 -76 124 -193 -294 80 120 -133 143 -16 -244 103 48 -165 42 93 -194 -164 140 -154 -127 86 42
7611 42 -161 45 166 -196 -10 144 -67 44 201 -166 -72 82 110 -222 90 129 -89 8 48 -107 71 204
7633 204 -204 -114 86 -99 -302 117 61 -207 94 78 -236 -51 83 -97 11 189 10 -157 120 -40 -156
7654 -156 88 43 -19 13 81 -79 -28 69 -145 -95 53 49 -200 54 22 -38 35 78 -80 -90 204 -40 73 156 -38
7679 -38 -30 199 178 -45 121 140 -128 20 167 -78 -157 168 -64 -98 159 55 -220 93 95 -200 73 126 -134
7702 -134 -83 204 2 -9 229 -115 -114 176 63 -187 98 127 -152 -57 143 -192 -28 237 -14 -143 96 62
$$ packed form
7544a51J56J42k87Q7K63k14oJ47j84k2K55l9l22J56J18k31J82K32l27j7K19j74
7566a7j0N2K0l06L91n2k34K07J04k91R8K51k29m9K20p9j51K76j49k96K02Q0j90
7589a52P6K00l17j01L74M0k53K76j59k28L47n5k13K07N1k87L0L04k94K7K13m4
7611D2k03K06J21l62J86J54k11J11J57l67R4J54K8l32L12L9k18R7M0j55J78J33
7633B04m08R0K00j85k03M19n6k68L01j6l14J85J34j80J08J78j79j67K77j60j16
7654a56K44m5o2L2O8j60N1R7k14N0J48mk49K54l2o0P3M3j58j0K94k44J13Q3j94
7679c8QK29k1k23J66J9k68J48J47k45p9L25k32l4K57j04k75L13Kk95K73N3k60
7702a34N1K87k02j1K38l44JK90j13k50K85K9k79R5K00l35J64K65k51j29K39l4
$$ plain form
7724 62 -202 99 7 -329 11 116 -202 83 133 -181 -39 99 -47 -96 56 25 -73 70 105 -49 -66 99 -189
7747 -189 -87 110 -13 -188 95 0 -240 123 113 -204 60 111 -107 -103 48 -119 -175 25 23 -237 4 39 -245
7770 -245 115 223 -73 83 147 40 -144 182 56 -159 173 91 -92 107 33 -62 105 233 -168 -107 110 -2
7792 -2 -36 171 65 -184 109 143 -143 -42 115 -104 18 117 -33 -91 218 -34 -236 73 54 -179 91 78 -80
7815 -80 49 250 -139 -5 54 -6 -117 60 -44 -34 139 71 -90 -18 101 -92 -60 152 -51 -24 75 103 -242
7838 -242 200 -27 -68 -33 93 -140 -95 135 -135 -20 100 65 -248 176 37 -189 21 13 -160 28 51 -96
7860 -96 -164 154 -4 -206 71 145 -153 216 70 -176 19 31 -51 -95 151 -100 -103 -16 -1 -116 22 141 -129
7883 -129 16 237 -190 -11 190 -63 -34 73 -22 -159 229 161 -66 77 59 -149 -115 82 24 68 279 9
$$ packed form
7724F2k64L01r2l36L40J05l18K85N0l14J42J38j46m9J52l1r8J43L5j54j7J65k88
7747a89J02J97j23j75K83r5k40L63j0l17K64N1k18MJ51j67n6K00kk60K41L5k84
7770b45L60J08k96J56O4j07j84L26j26k15L32q2j83J99p4r5J67J28m01O1K17j12
7792bl4K07j06k49K93L4k86J01J57k19J22R9j50n8L09k52k02L09j9k33K70j3j58
7815h0J29K01l89J34N9o0j11J77j04J0J73o8j61P2J19j93L2K12k03K7R9K8l45
7838b42M42k27m1L5J26k33M5K30k70J15J20l5l13M24j39k26K10qj73J88K3j47
7860i6o8L18j58k02K77P4k98L69j46k46J95J2q2m4K46k51lQ7J5j15J38J19k70
7883a29J45K21m27J79K01k53K9J07r5j37L88o8k27J43j8k08L4J97n8M4K11k70
$$ plain form
7905 9 -27 59 24 -166 64 94 -35 4 105 2 18 238 -79 7 98 33 -104 130 54 -139 64 140 -45 13 178
7930 178 -178 -37 238 -74 -141 134 -82 -149 77 118 -88 -4 179 -178 -28 61 -35 -160 161 19 -211 53
7952 53 94 -183 52 94 -63 -49 70 -70 -108 209 32 -53 -22 25 -48 2 145 -84 -23 168 -134 -185 85 -33
7976 -33 -133 144 -57 -154 26 -59 -161 -23 110 -18 -18 80 -127 -200 65 25 -70 148 43 -86 -10 26 -132 145
8000 145 63 -78 -73 102 -75 -187 141 9 -195 73 46 21 -43 51 -77 -92 170 -71 -117 89 -90 -172 31
8023 31 7 -88 -36 74 19 -14 70 -146 -22 84 -49 -145 91 55 -77 187 107 -12 -59 116 -190 -97 139 -16
8047 -16 16 78 122 -62 157 71 -79 93 105 -45 22 154 -1 -76 81 98 -195 123 41 -171 -78 179 -216 72
8071 72 95 -54 -15 135 -38 -32 232 87 -142 44 127 -62 89 131 -4 -74 199 -150 -97 171 -114 -167 28
$$ packed form
7905Il6Q6l5j90K30L0j29L9J01j03J6K20l17Q6R1o5j37K34p6j93K03P6j85N8J65
7930A78l56J41K75l12o7K75k16o7K26M1k06Q4J83l57J50Q9r6j25L21j42k30K64
7952E3M1k77K35M2j57J4J19j40l8L17j77q5L1M7p3N0J43k29O1J91l02n1K70j18
7976c3j00K77k01r7J80q5j02J38J33j28%R8k07p3K65m0r5K18j05j29P6L6j58K77
8000A45q2j41NJ75j77j12L28j32k04K68k7k5o4R4j28j5K62k41m6K06j79q2K03
8023C1k4r5N2J10n5l3Q4k16J24J06j33r6K36l6j32K64q0j19m7J75l06R3K36j55
8047a6L2O2M4j84K19q6j50J72J2j50O7J32j55p5J57J7k93L18q2k12R3K57l95K88
8071G2K3j49L9J50j73OK64j45k29J86Q3j89J51M2j35p0K73l49N3K68k85n3J95
$$ plain form
8094 28 81 -145 176 112 -73 -89 159 -71 -115 137 -85 -160 102 17 -180 -63 160 -173 -121 135 -59 -54 196
8117 196 -9 -79 4 -13 -107 76 168 -76 27 163 -31 -165 50 100 -170 160 85 -173 50 92 -120 -15 80
8140 80 -87 -59 112 -223 -4 95 -12 -68 38 40 -115 30 64 -60 59 112 -41 -70 137 -40 -179 99 -42
8163 -42 -60 101 21 -18 94 109 -139 -109 70 12 7 28 127 -116 73 73 -158 82 188 -55 71 52 -21 -70 123
8188 123 -47 -149 132
$$ packed form
8094B8N3k26L21o4j85j6K48k30m4K52k22p5K62q5j97J17K23l33N2K56j94NK50
8117A96k05p0Q3j7r4J83R2k44J03J36j94j34K15N0k70L30p5k58K23M2k12J05R5
8140H0j67K8J71l35K19R9j07n6J06Kj55J45L4j24J19N3j53k9K07j77j39K78j41
8163d2j8J61q0l9J12J5k48L0J79n8nK1R9k43J89%k31K40J06k43J26j9p3m9J93
8188A23j70j02K81
8191A32
$$ Imaginary data points
##PAGE= N=2
##DATA TABLE= (X++(I..I)), XYDATA
$$ plain form
0 0 0 0 0 0 0 0 0 0 0 0 0 0 0 0 0 0 0 0 0 0 0 0 0 0 0 0 0 0 -2 2 -2 3 -4 4 -4 4 -4 7 -8 8 -9 10 -13 13 -13 14 -16 17 -20 22 -25
51 -25 27 -30 33 -37 40 -43 43 -25 -52 -1521 12868 -1062 -8301 3327 -1200 -3716 6604 -626 -9577
70 -9577 5398 7165 -8272 -2766 6158 -3548 -1710 5626 -5848 -5659 9862 1669 -10277 2565
84 2565 6011 -4323 1102 3232 -6862 1220 9943 -4802 -6932 8238 3213 -4802 4197 1689
98 1689 -5046 6653 6828 -7626 -305 10350 -826 -2743 6376 -86 -1405 9303 1390 -6998
112 -6998 6992 9048 -4799 277 7276 -1306 1908 8476 -3299 -3175 10991 3786 -6254 4004
126 4004 5374 -2839 4365 5093 -6134 1401 10412 -3089 -5349 6979 1667 -3811 4683 184 -6452
141 -6452 5494 5499 -8725 -2069 7128 -2896 -3858 3628 -3891 -4343 6829 -1336 -10181 2045 4220
$$ packed form
0@%%%%%%%%%%%%%%%%%%%%%%%%%%%%kMmNpQqQqJ1j5J6j7J9k3K6k6K7l0L3l7M2m7
51b5N2n7O3p0P7q3Q6o8k7j469J4389j3930p239J1628m527k516J0320p230q951
70i577J4975J767j5437N506Q924r706J838P336j1474J89J5521q193j1946J2842
84B565L446j0334N425K130j0094Q082Q723j4745k130J5170n025q015Q999k508
98A689o735J1699J75j4454P321J0655j1176j917R119o462j319J0708p913q388
112f998J3990K056j3847N076O999q582L214O568j1775J24J4166p205j0040J0258
126D004J370q213P204P28j1227P535R011j3501k260J2328n312n478Q494m499o636
141f452J1946Nj4224O656R197j0024r62P486p519m52J1172q165q845J2226K175
$$ plain form
156 4220 -6973 -2096 1874 -6615 -1458 5139 -7237 -7830 5384 -377 -8607 56 -4 -6591 1493
171 1493 1271 -10008 -2170 6531 -5414 -7311 2944 -1758 -4895 3254 -2300 -8685 3648 4320 -8310
186 -8310 -3063 4604 -3215 -2050 3670 -4866 -4089 7454 184 -8410 2842 4926 -4319 722 3331
201 3331 -4693 1469 7681 -4299 -4815 7575 2551 -4207 3471 1751 -3301 5716 4888 -6990 480
216 480 9262 -1290 -2888 5414 273 -1126 7008 420 -5915 6043 6743 -4957 139 6019 -1607
231 -1607 836 5950 -3517 -2628 8650 1765 -6454 3170 4466 -2989 2174 2988 -5366 1457 7716
246 7716 -3918 -4885 5819 1225 -3949 3038 -36 -4999 4324 3615 -7424 -1148 6222 -2855 -3641
261 -3641 3081 -2573 -3154 5315 -1449 -7973 3108 4211 -6097 -1800 2519 -4241 -685 4053 -5596
$$ packed form
156D220j1193M877L970q489N157O597j2376n93J3214n761q230Q663o0o587Q084
171A493k22j1279P838Q701j1945j897J0255m702l137Q149n554o385J2333O72j2630
186h310N247P667p819J165N720q536P77J1543p270q594J1252K084r245N041K609
201C331q024O162O212j1980n16J2390n024o758P678j720n052R017q28j1878P470
216D80Q782j0552j598Q302n141j399Q134o588o335J1958P00j1700N096N880p626
231a607K443N114r467Q89J1278o885q219R624J296p455N163Q14q354O823O259
246G716j1634r67J0704m594n174O987l074m963R323p09j1039O276P370r077p86
261c641O722n654n81Q469o764o524J1081J103j0308M297M319o760L556M738r649
$$ plain form
276 -5596 -5008 6007 4 -7138 1138 1269 -4719 1531 1587 -7180 -527 6210 -4404 -5465 3835 -635
292 -635 -4039 3018 -1110 -6024 3924 3666 -7156 -1596 5170 -2417 -1928 3469 -3074 -2680 6590 -137
308 -137 -6968 3365 4356 -4210 447 3138 -3566 1198 6124 -3847 -3595 6828 1727 -4305 3100
323 3100 2034 -2736 4281 3660 -5535 1091 7819 -1624 -2796 5051 664 -1181 5451 153 -4584
338 -4584 5320 5453 -4599 56 5433 -1210 336 4703 -2658 -1849 7347 983 -5760 3315 4260 -2723
354 -2723 1469 2711 -4050 1613 6216 -3772 -4013 5712 1217 -3654 2403 237 -3898 3958 2936
369 2936 -6626 -540 5973 -2578 -3342 3006 -1716 -2479 4543 -1452 -6407 3382 3627 -5698 -1364 3057
385 3057 -3241 -539 3365 -4675 -3717 5805 -214 -6402 1722 2010 -3788 1043 1389 -5696 293 5370
$$ packed form
276e596N88J1015o003p142Q276J31n988O250N6q767O653O737j0614j061R300m470
292f35l404P057m128m914R948k58j0822N560O766p587M89N397o543L94R270o727
308a37o831J0333R91q566M657K691o704M764M926r971K52J0423n101o032P405
323C100j066m770P017o21r195O626O728r443j172P847m387j845O632n298m737
338d584R904J33j0052M655N377o643J546M367p361Q09R196o364o743R075R45o983
354b723M192J242o761N663M603r988k41R725m495m871O057k166m135P856j022
369B936r562O086O513q551p64O348m722p63P022n995m955R789K45r325M334M421
385C057o298K702L904q040R58R522o019o188Q124K88n798M831L46p085N989N077
$$ plain form
401 5370 -4244 -4599 4114 -49 -3587 2536 -750 -4487 3640 2903 -6295 -748 4937 -2314 -2257 2704
417 2704 -2355 -2137 5026 -1000 -6034 3062 3744 -4249 -538 2570 -3064 346 4188 -4133 -3444 5560
433 5560 494 -4865 1873 1267 -3200 2282 1876 -5387 352 5569 -3040 -3729 3749 -85 -2485 3080
449 3080 -827 -4634 3657 3265 -5434 -787 4341 -2085 -1164 3160 -2887 -2180 5509 -200 -5597 2716
465 2716 3203 -3461 492 2322 -3500 901 4923 -3520 -3215 5310 835 -3732 2275 985 -2838 3367
481 3367 2503 -5145 390 5869 -1993 -2668 3374 -431 -1439 4299 -485 -4576 3878 3879 -4316 -357
497 -357 3652 -1794 25 3442 -2937 -2143 5705 290 -4991 2244 2750 -2684 1059 1741 -3933 1021
513 1021 4877 -3440 -3661 4148 615 -3159 1977 -184 -3531 3099 2168 -5624 -664 4475 -2217 -2414
$$ packed form
401E370r614l55Q713m163l538O123l286l737Q127p37r198N547N685p251N7M961
417B704n059K18P163o026n034R096O82p993L711L108n634L410L842q321O89R004
433E560n066n359O738o06m467N482m06p263N739N217q609o89P478l834k400N565
449C080l907l807Q291l92q699M647N128o426R21M324o047P07P689n709n397Q313
465B716M87o664L953J830n822M401M022q443L05Q525m475m567O007j290l823O205
481C367q64p648N535N479p862o75O042l805j008N738m784m091Q454Jq195L959
497c57M009n446J819L417o379P94P848n415n281P235N06n434L743O82n674M954
513A021L856q317k21P809l533l774N136k161l347O630r31p792M960N139o692j97
$$ plain form
529 -2414 2502 -1784 -2023 3955 -1232 -5437 2921 2890 -4554 -808 2541 -2631 -50 3116 -3656 -2789
545 -2789 4982 -8 -4853 1613 1615 -2893 1553 1401 -4677 666 4948 -2994 -3231 3778 255 -2344
561 -2344 2682 -324 -3383 3647 2714 -4770 -58 4624 -1529 -1084 2969 -1611 -1118 4946 -298 -4385
577 -4385 3194 3618 -2833 618 2555 -2274 1231 4201 -2759 -2180 5189 1022 -3295 2257 1574 -2071
593 -2071 2817 2083 -3996 972 5124 -1991 -2217 3612 64 -1496 3322 -422 -3548 3519 3189 -4191
609 -4191 -268 3548 -1497 -501 2847 -2516 -1714 4725 -146 -4417 2362 2462 -2900 728 1681 -3281
625 -3281 746 3913 -3229 -2917 4041 237 -3237 1693 32 -3071 2595 1618 -5037 -73 4180 -2352
641 -2352 -2477 2236 -1351 -1830 3030 -1277 -4450 2639 2201 -4335 -774 2215 -2526 -552 2311 -3502
$$ packed form
529b414M916m286k39N978n187m205Q358l1p444L746L349n172K581L166o772Q67
545b789P771m990m845O466Km508M446j52o078N343M282p942k37P009l523k599
561b344N026l006l059P030r33p484M712M682o153M45M053m580M93O064n244m087
577d385P579M24o451L451J937m829L505K970o960N79P369m167m317N552o83l645
593b071M888p34o079M968M152p115k26N829l548j560M818l744l126P067l30p380
609d191L923L816n045R96L348n363Q02O439m871m271O779J00n362L628R53m962
625c281M027L167p142L12O958l804l474M930j661l103N666r77o655M964M253o532
641b352j25M713l587m79M860m307l173P089m38o536L561K989m741J974K863n813
$$ plain form
657 -3502 -2513 4083 -527 -4624 1250 1322 -2920 621 702 -4214 526 3603 -3453 -3363 2917 -482 -2881
674 -2881 1404 -852 -3367 2533 1539 -4891 -588 3389 -2141 -1967 1870 -1929 -1483 3450 -1218 -4385
690 -4385 2574 2584 -3424 -241 1930 -2192 591 2967 -2892 -1989 4479 357 -3453 1983 1404 -1931
706 -1931 2331 1655 -3478 1233 4748 -1930 -1863 3796 482 -1062 3186 -72 -2425 3955 2957 -3472
722 -3472 723 4222 -845 -126 3094 -1133 -352 4769 117 -3244 3170 3075 -2057 1071 2354 -1799
738 -1799 1434 3897 -2460 -1598 4596 585 -2550 2091 924 -1986 2607 1678 -3703 760 4099 -2012
754 -2012 -2052 2630 -575 -1470 2759 -868 -3319 2645 2056 -3888 -513 2316 -2016 -649 1951 -2821
770 -2821 -1937 3478 -864 -4311 1399 1346 -3102 212 588 -3499 248 2823 -3331 -2833 2940 -456
$$ packed form
657c502R89O596m610m097N874P2m242L541Q1m916M740L077p056R0O280l399k399
674b881M285k256k515N900r94o430M303L977n530J74L837l799M46M933m668l167
690d385O959J0o008L183K171m122K783K376n859R03O468m122l810N436n79l335
706a931M262o76n133M711L515o678O7N659l314j544M248l258k353O380r98o429
722c472M195L499n067P19L220m227P81N121m652l361O414r5n132L128J283m153
738a799L233K463o357Q62O194m011l135M641j167k910M593r29n381M463L339o111
754b012m0M682l205q95M229l627k451N964n89n944L375K829m332J367K600m772
770b821Q84N415m342l447N710n3m448L314L76m087L747K575o154M98N773l396
$$ plain form
786 -456 -2953 1276 -725 -3034 2168 979 -4582 -314 3050 -2361 -2049 1794 -1640 -1476 2769 -1216
802 -1216 -3754 2456 1941 -3584 -200 1813 -2035 48 2450 -2742 -1643 3961 -156 -3359 1709
817 1709 1238 -2015 1582 1189 -3211 956 3872 -2232 -1999 3310 308 -1407 2232 -16 -2214 3011
833 3011 1910 -3300 435 3543 -1181 -731 2287 -1119 -482 3841 -448 -3064 2890 2579 -2335 671
849 671 1984 -1678 1102 3026 -2524 -1324 4088 436 -2637 1978 1150 -1706 2171 1388 -3192 1015
865 1015 3765 -1975 -1670 2792 -168 -1268 2541 -699 -2671 2942 1938 -3555 32 2862 -1510
880 -1510 -543 1938 -2148 -1055 3476 -794 -3519 1857 1532 -2697 386 948 -2605 531 2592 -2920
896 -2920 -2045 3091 -468 -2859 1265 -120 -2337 1760 731 -3970 170 2925 -2452 -2072 1826 -1196
$$ packed form
786d56k497M229k001k309N202j189n561M268L364n411L12L843l434J64M245l985
802a216k538O210n15n525L384K013l848K083K402n192J099N604m117l203N068
817A709m71l253L597l93m400M167K916o104K33N309l002j715L639k248k198N225
833C011j101n210L735L108m724M50L018l406O37M323m289k616N954l11m914L006
849F71J313l662K780J924n550J200N412l652l073M615q28k856L877p83m580M207
865A015K750n740L05M462k960j100L809l240j972N613j004n493L587K830m372
880a510R67K481m086J093M531m270k725N376l25m229L083N62l553L136K061n512
896b920Q75N136l559k391M124j385k217M097j029m701M140K755n377L80L898l022
$$ plain form
912 -1196 -1582 2092 -1258 -3324 2175 1366 -3374 -416 1818 -2022 -438 1729 -2661 -1523 3197 -735
928 -735 -3495 1577 1073 -2327 763 821 -2836 653 2854 -2601 -1927 2959 -102 -1929 1847 -207
944 -207 -2160 2418 1317 -3574 357 3100 -1434 -948 2165 -1047 -806 3234 -751 -2873 2691 2207
960 2207 -2557 480 1968 -1451 706 2623 -2232 -1088 3869 23 -2507 1826 1250 -1606 1792
975 1792 1226 -2645 1212 3371 -1855 -1430 2797 11 -1064 2304 -245 -1960 2847 1620 -3117 460
991 460 2958 -1200 -407 1967 -1377 -651 3310 -738 -2960 2389 1860 -2229 485 1308 -1985 860
1007 860 2459 -2610 -1403 3385 -40 -2420 1533 251 -1938 1715 714 -3312 610 2864 -2137
1022 -2137 -1664 2101 -778 -1258 1944 -1054 -2671 2395 1240 -3503 -184 1872 -1809 -401 1510
$$ packed form
912a196l86L674l350k066N499q09m740K958K234l840J584K167m390J138M720l932
928g35k760N072n04l400L090N8l657L489K201n455O74M886l061j827L776k054
944b07j953M578j101m891L931K743m534M86L113l212K41M040l985k122N564m84
960B207m764L037J488l419K157J917m855J144M957l846k530M333n76k856L398
975A792n66l871L857K159n226M25M227k786j075L368k549j715M807j227m737L577
991D60K498m158P93K374l344P26L961m048k222N349n29m089K714Q23l293K845
1007H60J599n069J207M788l425k380L953j282k189L653j001m026L922K254n001
1022b137M73L765k879m80L202k998j617N066j155m743L319K056l681J408J911
$$ plain form
1037 1510 -2334 -1340 2898 -1056 -3309 1602 979 -2453 400 723 -2636 482 2242 -2900 -1798 2629
1053 2629 -561 -2364 1252 -228 -2139 1759 612 -3589 371 2555 -2047 -1342 1729 -1009 -1016 2364
1069 2364 -1043 -2759 2355 1547 -2840 291 1732 -1594 232 2083 -2087 -894 3257 -329 -2502
1084 -2502 2016 1316 -1576 1425 1052 -2141 1201 3046 -1961 -1049 3109 208 -1054 2287 103 -1445
1100 -1445 2800 1493 -2674 971 2998 -1234 -181 2208 -932 -207 3143 -411 -2332 2729 1781
1115 1781 -2126 787 1735 -1524 922 2352 -2197 -936 3410 -189 -2253 1594 642 -1680 1568
1130 1568 899 -2856 800 2650 -2162 -1388 2005 -734 -1264 1696 -945 -2324 2158 944 -3308 -125
1146 -125 1839 -1652 -603 1200 -2021 -829 2485 -1143 -3059 1600 857 -2414 243 513 -2252 345
$$ packed form
1037A510l844R94M238l954k253M911o23l432K853L23l359L118J760n142J102M427
1053B629l190j803L616j480j911L898j147m201L960K184m602P05L071k738pL380
1069B364l407j716N114q08m387L131J441l326J826J851m170J193M151l586k173
1084b502M518p00k892L001l73l193L342J845n007R12M158k901j262L341k184j548
1100a445M245j307m167L645K027m232J053K389l140P25L350l554j921N061r48
1115A781l907K913R48l259K446J430m549J261M346l599k064L847r52k322L248
1130A568o69l755L656J850m812P74L393k739n30K960k641j379M482j214m252L183
1146a25J964l491J049J803l221J192L314l628j916M659p43l271K657K70k765K597
$$ plain form
1162 345 1684 -2783 -1624 2555 -660 -2448 1160 -196 -2050 1603 334 -3286 558 2351 -2192
1177 -2192 -1367 1730 -960 -1017 1805 -1030 -2312 2430 1056 -2918 182 1737 -1565 176 1501 -2134
1193 -2134 -660 2962 -707 -2556 1928 893 -1783 1082 872 -2104 1147 2343 -2194 -927 2813
1208 2813 -292 -1459 1758 -142 -1405 2294 1155 -2655 1097 2853 -1336 -522 2010 -798 -342
1223 -342 2704 -734 -2002 2563 1366 -2162 725 1729 -1385 696 1985 -1826 -410 3097 -382
1238 -382 -1996 1850 900 -1341 1672 941 -2206 1217 2648 -1871 -869 2404 -378 -1089 1793 -400
1254 -400 -1593 2355 939 -2670 716 2138 -1621 -330 1625 -1479 -603 2559 -1095 -2511 2052
1269 2052 1055 -2315 500 921 -1968 689 1638 -2444 -1105 2582 -662 -2220 1282 -49 -1820 1412
$$ packed form
1162C45J339m467J159M179l215j788L608j356j854L653j269l620L844J793m543
1177b192Q25L097k690n7K822k835j282M742j374l974L100J555l302J741J325l635
1193b134J474L622l669j849M484j035k676K865k10k976L251J196m537J267L740
1208B813l105j167L217j900j263L699j139l810L752J756m189Q14K532k808M56
1223c42L046l438j268M565j197l528K887J004l114K081J289l811J416L507l479
1238c82j614L846r50k241L013p31l147L423J431m519J002L273k782p11K882k193
1254d00j193L948j416l609L386J422l759J291J955l104Q76L162l654j416M563
1269B052r97l370K815M21k889K657R49m082J339L687l244j558L502j331j771L232
$$ plain form
1285 1412 342 -3008 672 2020 -2300 -1424 1642 -1043 -1237 1531 -1284 -2126 1972 622 -3128 105
1301 105 1524 -1753 -334 1229 -1968 -800 2350 -1071 -2525 1556 560 -2112 528 609 -2032 804
1317 804 1738 -2427 -1001 2384 -464 -1878 1361 -258 -1425 1982 464 -2614 1035 2371 -1742
1332 -1742 -739 2002 -764 -391 2145 -887 -1671 2469 1213 -2277 826 1762 -1242 592 1844 -1642
1348 -1642 -83 3021 -611 -1794 2138 958 -1318 1394 887 -1798 1460 2211 -1937 -574 2717
1363 2717 -254 -949 1777 -269 -1261 2302 718 -2380 913 2150 -1346 -224 1740 -1094 -318 2274
1379 2274 -869 -1861 2164 917 -2205 535 1143 -1618 530 1397 -2213 -670 2567 -873 -2062 1276
1395 1276 329 -1594 1178 100 -2572 712 1770 -2310 -1154 1821 -995 -1195 1371 -918 -1827 1817
$$ packed form
1285A412j070l350L680J348m320Q76L066k685j94K768k815q42M098j350l750L233
1301A05J419l277J419J563l197J168L150l421j454M081r96k672K640Q1k641K836
1317H04R34m165J426L385k848j414L239j619j167L407j518l078L649J336m113
1332a742J003K741k766L73K536l032p84M140j256l490L103R36l004J834J252l486
1348a642J559L104l632j183L932j180k276K712n07k685L258P51m148J363L291
1363B717k971o95K726k046r92L563j584l098L293J237l496J122J964k834P76K592
1379B274l143r92M025j247l122K740O08k761K148Q67l610J543L237l440j189L338
1395A276r47j923K772j078k672L284J058m080J156K975k816k00K566k289r09L644
$$ plain form
1411 1817 299 -2878 395 1423 -1776 -414 1006 -1785 -691 2062 -1393 -2368 1642 412 -2134
1426 -2134 480 540 -1905 610 1300 -2367 -857 2233 -789 -1654 1289 -133 -1573 1508 291 -2562
1442 -2562 856 1905 -1905 -738 1715 -709 -667 1696 -898 -1614 2240 689 -2328 756 1489 -1235
1458 -1235 364 1502 -1583 -88 2560 -682 -1745 1993 816 -1304 1070 866 -1574 1318 1976
1473 1976 -1941 -443 2634 -208 -1081 1678 57 -971 2243 619 -2099 1198 2209 -1333 -291
1488 -291 1743 -786 1 2100 -729 -1494 2194 836 -1898 810 1414 -1138 625 1567 -1756 -377
1504 -377 2607 -722 -1715 1727 444 -1425 1257 383 -1882 1001 1724 -2172 -686 2123 -828 -1125
1520 -1125 1333 -736 -1408 1794 243 -2642 643 1384 -1758 -494 1118 -1496 -554 1827 -1322 -2029
$$ packed form
1411A817j518l177L273J028l199J362J420k791J094K753l455r75M010j230k546
1426b134K614O0k445K515O90l667J510L090l022q65K943j422j440L081j217k853
1442b562L418J049l810J167K453k424M2K363k594p16L854j551l017L084P33k724
1458a235J599J138l085J495K648l242j063L738j177k120K374k04k440K892O58
1473A976l917J498L077k842q73K759j621j028L214j624k718L297J011l542J042
1488b91K034k529P87K099k829p65L688j358k734K708O04k552J763R42l323J379
1504c77K984l329r93L442j283j869K682q74k265K883P23l896J486K809k951k97
1520a125K458k069o72L202j551k885L285P41l142J264J612k614R42K381l149p07
$$ plain form
1536 -2029 1865 396 -2163 476 602 -1874 438 1096 -2191 -602 2108 -1033 -1823 1288 -148 -1349
1552 -1349 1139 70 -2324 839 1626 -1983 -785 1568 -811 -903 1303 -878 -1358 1952 335 -2337
1568 -2337 684 1348 -1324 17 1092 -1500 -208 2240 -1114 -1631 1846 671 -1522 867 636 -1494
1584 -1494 1027 1507 -1923 -371 2234 -502 -1200 1478 4 -1000 1743 338 -1941 1178 1911 -1526
1600 -1526 -296 1688 -719 -285 1831 -801 -1327 2282 627 -1901 739 1364 -1101 486 1378 -1523
1616 -1523 -73 2407 -753 -1387 1806 519 -1176 1103 608 -1442 1167 1538 -1855 -359 2191 -386
1632 -386 -980 1331 -425 -836 1711 205 -2191 934 1615 -1557 -312 1147 -1081 -320 1638 -1142
1648 -1142 -1599 1777 352 -1927 536 582 -1503 439 944 -1927 -406 1886 -1126 -1591 1248 -82
$$ packed form
1536b029L894j469k559K639J26k476K312O58l287J589K710l141p90L111j436j201
1552a349K488j069k394L163P87l609J198K353k379r2K206k181m80L310j617k672
1568b337L021O64k672J341J075k592J292K448l354n17L477j175k193K389k31k130
1584a494K521M80l430J552K605k736o98K678j474j004K743j405k279L119P33l437
1600a526J230J984k407M34K116k632n26L609j655k528K640O25k465J587Q92k901
1616a523J450K480l160o34L193j287j695K279m95k050K609L71l393J496K550k577
1632c86n94K311j756m11K547j506k396L125O81l172J245J459k228P61J958k780
1648a142m57L376j425k279K463M6k085J942N05k871J521K292l012m65K839j330
$$ plain form
1664 -82 -1379 793 -146 -1985 795 1148 -2015 -648 1398 -1035 -980 1135 -1079 -1273 1528 48 -2281
1681 -2281 595 1223 -1617 -296 1088 -1385 -303 1712 -1201 -1500 1738 269 -1724 662 487 -1355
1697 -1355 722 1138 -1904 -290 2054 -829 -1258 1300 -33 -1179 1310 312 -1732 1209 1531 -1518
1713 -1518 -288 1780 -524 -215 1614 -660 -830 2162 633 -1644 1072 1413 -1027 447 1352 -1183
1729 -1183 193 2262 -753 -1050 1801 602 -1084 1230 640 -1246 1164 1467 -1515 -29 2117 -452
1745 -452 -752 1322 -152 -809 1632 270 -1799 1162 1444 -1423 -225 1249 -849 -249 1502 -964
1761 -964 -1211 1814 187 -1851 558 862 -1356 442 891 -1760 -192 1754 -1145 -1479 1308 -26
1777 -26 -1399 728 -137 -1686 841 1041 -2051 -449 1505 -894 -977 952 -813 -1153 1318 -146 -2089
$$ packed form
1664h2j297K172r39j839K780L53l163J367K046k433N5K115k214j94K801j480k329
1681b281K876O28k840J321J384k473J082K015k913k99L238j469j993K386j75j842
1697a355K077M16l042J614K344k883m29K558j333j146K489r98k044K941L22l049
1713a518J230K068k304L09J829k274j70K992j529k277K716L41k440J474R05k535
1729a183J376K069l015k97K851j199j686K314n90j886K410L03k982J486K146k569
1745d52l00K074j474o57K441j362k069K961K82k867J198J474k098O00J751k466
1761i64k47L025j627k038K409L04k218J798M49k651J568J946k899l34K787j334
1777b6j373K127q65j549K527K00l092J602J954k399q3J929j765l40K471j464j943
$$ plain form
1794 -2089 594 987 -1555 -433 754 -1210 -299 1399 -1159 -1408 1682 68 -1742 480 517 -1299
1810 -1299 495 725 -1777 -148 1750 -1001 -1293 1248 -147 -1057 973 15 -1620 1041 1178 -1738
1826 -1738 -277 1409 -678 -623 1294 -719 -954 1688 67 -1716 860 1216 -1216 268 1108 -974
1842 -974 40 1889 -827 -1041 1882 429 -1181 962 546 -979 1132 1310 -1473 137 1982 -638
1858 -638 -799 1414 -66 -678 1519 176 -1515 1211 1410 -1274 -34 1559 -614 -203 1349 -769
1874 -769 -812 1812 343 -1660 779 1028 -1035 399 943 -1238 2 1802 -869 -1210 1478 195
1890 195 -1118 835 185 -1327 862 909 -1719 -346 1508 -760 -1046 1030 -575 -928 1305 -184
1906 -184 -1847 674 919 -1567 -309 770 -1092 -345 1222 -1177 -1199 1415 -33 -1777 360 329 -1271
$$ packed form
1794b089K683L93k542J122J187j964R11J698k558k49L090j614j810K222L7j816
1810a299J794K30k502J629J898k751k92K541j395r10K030r58j635K661J37k916
1826a738J461J686k087N5J917k013k35K642j621j783K576L56k432J484Q40k082
1842i74J014J849k716k14K923j453j610K143m16j525K111J78k783J610J845k620
1858f38j61K213j480o12K197j343j691K726J99k684J240J593k173M11J552k118
1874g69m3K624j469k003K439K49k063J434N44k181J240J800k671l41K688j283
1890A95j313J953o50j512K189M7k628J373J854k268k86K076j605l53K233j489
1906a84j663K521K45k486J258J079j862P47J567k399k2K614j448j744K137l1j600
$$ plain form
1923 -1271 384 616 -1574 -241 1532 -1182 -1277 1085 -149 -1160 676 -197 -1555 885 745 -1861
1939 -1861 -377 1210 -703 -578 1029 -711 -896 1477 -80 -1736 780 1054 -1114 27 906 -949
1955 -949 -95 1420 -934 -1013 1575 262 -1217 815 642 -916 726 884 -1454 161 1737 -576
1971 -576 -795 1283 65 -608 1225 85 -1148 1138 1240 -1218 140 1480 -467 -277 1213 -441
1987 -441 -613 1721 59 -1361 1041 1131 -837 477 937 -969 318 1455 -903 -932 1541 266 -1104
2004 -1104 827 357 -1013 896 940 -1452 -15 1479 -722 -775 997 -325 -718 1193 -141 -1358
2020 -1358 938 982 -1414 -92 987 -850 -271 1074 -998 -964 1420 -170 -1648 561 525 -1262 304
2037 304 489 -1523 -157 1284 -1049 -1209 1174 -220 -1093 703 -53 -1324 803 603 -1804 -178
$$ packed form
1923a271J655K32k190J333J773k714r5K362j234j011J836q73j358K440j40k606
1939a861J484J587j913J25J607j740j85K373j557j656K516K74k168J141Q79j855
1955i49Q54J515k354p9K588j313j479K032j73j558J642J58k338J615J576k313
1971e76k19K078j218o73J833j140j233K286J02k458J358J340j947J90J490j654
1987d41j72K334j662j420K402R0j968J314M60j906J287J137k358k9K473j275j370
2004a104J931m70j370J909M4k392J437J494k201n3J772j322l93J911j334j217
2020a358K296M4k396J322J079j837N79J345k072L4K384j590j478K209l6j787J566
2037C04J85k012J366J441k333j60K383j394q73J796p56j271K127k00k407J626
$$ plain form
2053 -178 1237 -1003 -823 821 -790 -863 1178 -255 -1712 708 789 -1305 -119 829 -1021 2 1169
2070 1169 -945 -1011 1427 -13 -1344 680 457 -1082 641 652 -1430 119 1500 -846 -808 1217 49
2087 49 -622 1013 23 -1035 1159 968 -1428 262 1456 -487 -155 1141 -418 -555 1644 112 -1249
2104 -1249 991 956 -884 250 904 -718 355 1490 -826 -740 1734 118 -993 876 465 -568
2120 -568 956 837 -1208 196 1524 -768 -639 1195 -10 -467 1177 -125 -1136 1036 947 -1318
2136 -1318 -23 1045 -813 -90 945 -828 -615 1394 -169 -1532 762 674 -1006 224 599 -1194
2152 -1194 150 1247 -1085 -955 1132 -47 -1074 699 3 -1215 749 436 -1622 -82 1188 -873
2168 -873 -628 829 -589 -866 950 -419 -1480 719 564 -1404 -198 725 -999 -243 844 -949
$$ packed form
2053a78J415k240J80J644j611p3K041j433j457K420Q1k094J186R48j850J023J167
2070A169k114o6K438j440j331K024k23j539J723J1k082J549J381k346L8K025j168
2087D9o71J635r90j058K194j91k396J690J194j943L32J296j559j37K199j532j361
2104a249K240l5j840J134O54j622J073J135k316Q6K474j616j111J869m11j033
2120e68J524j19k045J404J328k292J29J834j205m57J644j302j011K172q9k265
2136a318J295J068j858P23J035j773K13K009j563j363K294q8j680J230L75j793
2152a194J344J097k332J30K087j179j027J773o96j218J964l13k058J540J270k061
2168h73K45J457j418k77J816j369j061K199j55j968J206R23j724P56J087j793
$$ plain form
2184 -949 -893 1200 -212 -1369 669 271 -987 366 423 -1426 189 1287 -1010 -797 1067 -14 -808
2201 -808 757 -196 -1005 905 666 -1259 -65 1235 -604 -350 906 -498 -487 1303 -81 -1263 830
2218 830 810 -1004 217 810 -715 251 1060 -752 -501 1428 202 -905 886 420 -721 874 646
2235 646 -1197 421 1503 -667 -454 1272 -32 -559 1137 -72 -879 1192 947 -1131 134 1250
2251 1250 -516 -155 937 -618 -395 1366 -68 -1208 839 535 -906 397 734 -911 169 1090
2267 1090 -1015 -710 1416 -156 -1059 660 -10 -938 779 438 -1397 126 1148 -904 -571 829
2283 829 -475 -755 804 -515 -1299 809 540 -1446 -63 711 -894 -278 723 -1109 -665 1190 -392
2300 -392 -1400 580 289 -1148 225 400 -1222 104 978 -1024 -879 1117 -150 -937 603 -103 -1037
$$ packed form
2184i49N6K093j412j157K038l98j258J353N7j849J615J098k297K13J864j081p94
2201h08J565r53q09J910k39j925J194J300j839K54J256j404J1J790j384j182K093
2218H30k0j814J221N93j525R66Q09j812K51J929j226j107J791m66j141J595k28
2235F46j843J618J082k170K13J726j304n27J696j209q07K071k45k078J265J116
2251A250j766L61J092j555K23J761j434j140K047l04j441J303L37j645J080R21
2267A090k105L05K126j572r03J719o70r28J717l41j835J523J022k052L33J400
2283H29j304k80J559j319p84K108k69j986J383P74j605O16J001j832M44J855j582
2300c92j008J980k91j437J373J75j622J326Q74k002J45J996j267p87J540p06r34
$$ plain form
2317 -1037 749 482 -1365 112 1087 -782 -526 817 -488 -542 1069 -247 -1105 989 704 -1121 77
2334 77 876 -750 194 1177 -772 -532 1403 -105 -966 893 513 -770 740 611 -1143 411 1366
2351 1366 -801 -517 1140 -113 -508 1120 47 -781 1243 636 -1152 221 1230 -520 -74 940
2367 940 -585 -291 1388 -79 -1064 896 593 -922 445 779 -607 225 1156 -831 -470 1413 -62
2384 -62 -927 767 298 -738 705 461 -1323 184 1176 -859 -639 843 -290 -592 898 -229 -1007
2401 -1007 767 507 -1268 26 928 -776 -178 616 -899 -415 1070 -419 -1369 642 240 -1033 183
2418 183 375 -1198 72 837 -1063 -731 1027 -279 -1052 527 -166 -1025 572 366 -1481 18 914
2435 914 -866 -470 662 -673 -539 928 -523 -1142 912 591 -1288 174 707 -844 -65 619 -873
$$ packed form
2317a037J786k67j847J477R75j869K56J343j305n4J611j316q58K094k85j825J198
2334G7P99j626R44R83j949K40J935j508q61J859l80j283J510j29j754J554R55
2351A366k167K84J657j253l95J628j073q28K024o07j788J373J009j750M46J014
2367I40j525K94J679j467r85J960l03j515J367L34j386Q32R31j987L61J883j475
2384f2q65J694m69j036J443k44j784J507R92k035K20J482j133l02J490j127p78
2401a007J774k60j775J294R02j704N98P94j515M84J485j489r50K011m02j273J216
2418A83J92j573J270P65j900L32J758j306p73J579o93q59J597k06j847J499Q96
2435I14j780L96J132j335J34J467j451o19K054l21j879J462N33j551P79O84j492
$$ plain form
2452 -873 -504 1218 -199 -1125 816 476 -832 543 466 -1002 417 1094 -858 -477 1223 -160 -694
2469 -694 1027 71 -647 1046 458 -1069 329 1119 -578 -264 949 -425 -272 1273 -272 -850 1067
2486 1067 748 -930 358 902 -675 478 1055 -737 -191 1407 54 -740 879 412 -616 793
2502 793 487 -1030 466 1089 -903 -438 1054 -154 -531 878 -137 -821 1174 485 -1210 100 750
2519 750 -686 -120 754 -803 -436 916 -440 -1107 799 352 -1071 214 365 -900 170 768 -1016
2536 -1016 -595 1087 -361 -1013 528 -165 -1011 554 243 -1317 211 853 -886 -487 767 -549 -587
2553 -587 840 -482 -1188 838 368 -1232 101 567 -806 -143 626 -929 -502 1079 -509 -1049 629
2570 629 201 -1025 322 414 -1042 309 1000 -1102 -345 1094 -245 -751 660 -92 -727 1010 389
$$ packed form
2452h73L69J722j417r26J941l40j308J375p7j468J419O77j952L81J700j383n34
2469f94J721r56p18J693n88j527J398P90j697L14J213j374J53J545j545n78J917
2486A067l19j678J288N44j577J153N77j792N46J598j353p94J619m67j028J409
2502G93l06j517J496O23j992M65J492j208l77J409j015o84J995o89j695J310O50
2519G50j436N66Q74j557L67J352j356o67J906m47j423J285J51j265J070N98j784
2536a016M21J682j448o52J541o93q46J565l11j560J528O42j739L99J254j316l8
2553e87J427j322p06K026m70j600J333M66j373O63P69j555M27J581j588n40J678
2570F29m28j226J347R2j456J351O91k102P57J439j339n06J411p52o35J737o21
$$ plain form
2587 389 -1174 470 926 -676 -141 823 -382 -304 1148 -265 -800 1039 548 -1035 354 838 -576
2604 -576 386 949 -771 -273 1377 -87 -850 883 352 -700 691 473 -845 542 1175 -858 -250
2621 -250 1160 -185 -558 944 -87 -773 1061 466 -1125 386 1076 -719 -119 853 -530 -271 1168
2638 1168 -263 -1048 970 411 -1058 442 529 -920 289 768 -1002 -377 1149 -411 -981 698 62
2655 62 -878 562 201 -1173 215 860 -1032 -486 766 -429 -613 788 -512 -1076 939 231 -1320
2672 -1320 149 648 -927 -311 635 -854 -514 1018 -519 -1019 638 201 -931 164 256 -1058 192
2689 192 702 -1078 -494 1079 -392 -874 748 -90 -743 657 326 -1165 163 942 -912 -343 758
2706 758 -416 -339 934 -560 -981 1043 430 -1019 306 690 -643 143 897 -809 -214 1202 -206
$$ packed form
2587C89j563J644M56j602N35R64j205P8J452j413n35J839m91j583J389M84j414
2604e76R62N63j720M98J650j464p63J733n31j052J391k18j318J387O33k033O08
2621b50J410j345l73J502j031o86J834n95j591J511O90j795O00R72j383K59J439
2638A168j431p85K018n59j469J500Q7j449J209M79j770O25J526j560n70J679o36
2655F2r40J440l61j374J388O45j892N46J252j195j84J401j300n64K015p08j551
2672a320J469M99j575O16R46j489L40J532j537n00J657m37j132J095R2j314J250
2689A92N10j780N84J573j471m82J622q38o53J400l31j491J328P79j854N69J101
2706G58j174P7J273j494m21K024o13j449J325L84j333P86P54j706N95J416j408
$$ plain form
2723 -206 -906 975 333 -590 651 446 -793 491 1198 -913 -146 1302 -69 -464 980 44 -579
2740 -579 1125 399 -1114 566 1010 -698 -73 1003 -350 -58 1031 -334 -862 1148 522 -1028 480
2757 480 689 -629 312 948 -860 -228 1188 -252 -761 844 202 -720 736 205 -1070 371 897
2774 897 -893 -454 945 -501 -575 756 -207 -768 914 243 -1217 210 772 -791 -198 759 -833
2791 -833 -301 935 -425 -1039 758 227 -1103 224 244 -958 284 660 -1170 -335 878 -470 -953
2808 -953 640 -137 -879 624 138 -1260 343 731 -1064 -255 756 -622 -436 938 -398 -932 911
2825 911 313 -1192 302 709 -919 -51 735 -766 -193 1230 -296 -835 853 210 -955 484 329
2842 329 -792 388 933 -893 -221 1219 -150 -523 877 1 -596 1040 394 -962 535 973 -615
$$ packed form
2723b06p00J881o42r23J241k05j239J284P07k111P67J448j371l95J444r36o23
2740e79J704p26j513J680M44j708O25J076j353K92J089j365n28K010o26j550J508
2757D80K09j318R41O36j808O32J416j440n09J605o42r22J456n31j275J441N26
2774H97j790M39J399j446p4J331r63n61J682o71j460J427N62j563N93R57j592
2791h33N32J236j360o14J797n31j330J327K0j202J242L76j830Q35J213j348m83
2808i53J593p77p42J503m86j398J603L88j795Q09J011j378J86J374j336n34J843
2825I11n98j505J494M07j628Q68P86j501N73J423j526n39J688o43j165J439j55
2842C29j121J180N45j826O72J440j369l73J400q76n97J636o46j356J497M38j588
$$ plain form
2859 -615 -65 851 -371 -192 1115 -313 -671 1055 338 -812 535 617 -743 241 831 -705 -94 1249
2877 1249 -284 -735 995 390 -675 696 347 -968 440 962 -849 -208 1041 -359 -409 762 -180
2894 -180 -784 875 241 -1002 456 740 -821 -120 703 -632 -223 890 -454 -900 828 195 -954
2911 -954 296 421 -930 203 668 -1051 -315 969 -414 -849 630 -230 -925 609 15 -1138 244
2928 244 565 -1080 -412 641 -532 -612 657 -456 -962 772 125 -1209 246 647 -884 -166 500
2945 500 -661 -291 1025 -588 -865 892 209 -941 444 314 -799 415 759 -900 -267 1089 -374
2962 -374 -657 884 -22 -599 754 260 -926 552 739 -774 -86 916 -517 -192 945 -347 -666
2979 -666 993 372 -904 658 624 -605 226 808 -657 27 1115 -281 -654 1000 241 -652 590
$$ packed form
2859f15N50R16j222J79J307j428l58J726p17j150J347Q2j360R84N90j536O11J343
2877A249j533m51J730o05j065J371l49j315J408N22j811O41J249j400n0J171r42
2894a80o04J659o34j243J458K84j561P01Q23j335M09J113j344m46J728o33j149
2911i54J250J25j351J133M65j719P36J284j383m35J479q60o95J534n94j153J382
2928B44L21j645O68J053j173q0J269j113n06J734o47j334J455M01j531P18O66
2945E00j161L70J316j613k77J757o83j150J385j30j113J214L44j659O33J356j463
2962c74k83J541r06n77J353m94j186J478J87j513O88J002j433L25J137j292l19
2979f66J659o21j276J562l4j229Q31N82j465O84J088j396l73J654p59q93J242
$$ plain form
2996 590 443 -808 610 764 -780 -47 1111 -393 -325 904 -116 -532 978 299 -972 506 762
3013 762 -747 -100 742 -476 -23 987 -370 -763 1028 175 -869 431 456 -743 255 590 -894
3030 -894 -139 1008 -422 -802 696 -79 -650 592 18 -973 430 667 -1102 -374 699 -546 -454 661
3048 661 -403 -712 888 115 -1265 329 507 -1001 -45 576 -853 -358 707 -652 -798 814 82
3065 82 -973 313 249 -964 246 566 -1011 -30 999 -448 -665 674 41 -672 690 159 -1094
3082 -1094 490 756 -848 -129 824 -436 -286 875 -510 -532 1036 243 -938 583 592 -734 243 700
3100 700 -647 -12 1116 -388 -624 972 99 -637 527 462 -687 519 704 -718 137 1097 -282
3117 -282 -333 937 -135 -510 888 305 -945 588 872 -763 7 703 -429 -12 883 -315 -587 1047
$$ packed form
2996E90j47j251J418J54j544P33J158j504O8J229j020m16J510o79j271J478K56
3013G62j509O47Q42j218M53J010j357l93J791q53j044J300K5j199R98L35j484
3030h94P55J147j430l80J498p75n71J242n74r91J403K37j769P28J073j245R2J115
3048F61j064l09J600p73j380J594J78j508R56O21j429M95J065j359j46J612p32
3065H2j055J286o4j213J210L20j577R81J029j447k17J339o33p13J362n31j253
3082a094J584K66j604P19R53j260J50J161j385k2J568p93j181J521Rj326R77M57
3100G00j347O35J128j504k36J596q73p36J164o5j149J206J85j422Q55R60j379
3117b82n1J270j072l75J398n83j250J533K84j635P70O96j132M17Q95j198k72J634
$$ plain form
3135 1047 218 -943 527 393 -678 261 524 -671 41 1015 -448 -535 768 81 -747 463 49 -886
3153 -886 434 527 -997 -195 771 -533 -587 634 -513 -649 690 32 -1125 356 475 -992 -3 494
3171 494 -676 -292 710 -554 -660 766 -106 -925 409 117 -826 238 575 -932 -133 831 -624
3188 -624 -660 489 -136 -599 610 43 -891 428 507 -931 -131 768 -610 -450 634 -434 -686 930
3206 930 28 -963 474 547 -726 102 638 -643 20 904 -506 -517 962 48 -652 525 214 -727 388
3225 388 620 -791 115 1090 -408 -475 947 -155 -355 838 109 -712 670 792 -662 70 725 -342
3243 -342 -107 701 -308 -355 1022 266 -749 666 527 -532 220 683 -622 -24 938 -390 -423 865
3261 865 7 -633 517 153 -762 577 624 -758 -90 871 -437 -441 628 -247 -480 715 -28 -947 492
$$ packed form
3135A047q29j161J470j34j071R39K63j195P12R74j463q7J303o87q28J210m14r35
3153h86J320R3j524Q02R66j304n4J221j147j36J339o58j157J481J19j467R89M97
3171D94j170L84J002j264j06J426q72q19J334k92r43J064L37j507P99R64j455
3188f24l6J149o25m63J209n67r34J319P9j438Q00Q99j378J60J084j068k52J616
3206I30r02r91J437P3j273Q28N36j281O63Q84j410j1J479r14p00J177l11r41J115
3225C88K32j411R06R75j498o7J422j102k00J193p29q21J382J22j454P32O55j067
3243c42K35Q08j009m7J377p56j015J415j39j059P52M63j305N98R62j328l3J288
3261H65q58o40J150l64r15J339M7j382O68R61j308mJ069q75k33J195p43r19J439
$$ plain form
3280 492 498 -864 -50 477 -620 -173 661 -491 -631 836 -40 -859 342 236 -864 129 434 -900
3298 -900 -146 691 -625 -625 590 -44 -674 392 -10 -1005 363 430 -916 -90 615 -607 -359 486 -516
3317 -516 -551 753 -117 -832 503 464 -686 -56 490 -624 2 672 -557 -536 911 -116 -842 480
3335 480 111 -731 376 492 -815 118 838 -436 -456 681 -161 -393 728 1 -675 629 604 -659
3353 -659 -82 716 -307 -103 724 -361 -309 1011 172 -812 500 649 -517 179 659 -561 87 998
3371 998 -378 -501 855 218 -681 618 344 -510 484 620 -668 189 826 -257 -293 606 -155 -294 727
3390 727 -32 -730 622 415 -696 -14 721 -416 -67 750 -496 -410 760 -49 -795 359 347 -717
3408 -717 218 413 -796 -45 730 -511 -540 740 -137 -715 432 -57 -844 447 495 -849 42 730 -472
$$ packed form
3280D92Oj362Q14N27j097M47Q34j152j40J467q76q19J201j06j100R93L05j334
3298i00P54Q37j316%J215o34o30J066m02r95J368O7j346Q26P05j222K48Q45j002
3317e16l5J304q70p15J335l9j150O30N46j114O26O70j229K1J447j027p26J322
3335D80l69q42J107J16j307R33P20j274k0J137q42k32J121p27o76J304k5j263
3353f59N77P98j023K04Q27j085N2J320q39r84J312J49j166O96M80j220O48R11
3371I98j376j23J356o37q99J299k74q54R94J36j288Q57O37j083l6Q99p61j39J021
3390G27p59o98J352k07j111O82P35j137L49Q17j246Q6J170q09p46J154j2j064
3408g17R35J95j209P51P75j241k9J280q77n78J147m89p87J291M8j344Q91O88j202
$$ plain form
3427 -472 -342 463 -397 -562 663 -123 -880 369 222 -806 -25 339 -584 -206 512 -560 -496 665 -91
3446 -91 -864 466 195 -586 218 325 -893 31 717 -501 -446 677 -52 -491 584 -142 -807 496 478
3465 478 -688 29 595 -498 -165 672 -326 -231 886 27 -643 556 480 -589 206 630 -484 73 730
3484 730 -488 -296 899 148 -423 613 253 -375 694 486 -605 193 882 -362 -122 774 -51 -328
3502 -328 708 80 -660 656 579 -647 124 623 -426 -152 685 -444 -298 690 70 -729 462 262
3520 262 -530 318 410 -592 127 638 -513 -384 727 -107 -637 439 12 -594 393 215 -809 102 785
3539 785 -458 -349 550 -288 -365 536 -173 -743 436 302 -808 -47 408 -559 -173 492 -616 -401 655
3558 655 -191 -723 353 186 -742 185 269 -684 -105 643 -673 -505 637 -232 -472 322 -72 -746 547
$$ packed form
3427d72J30Q05q60j65J225p86p57J249j47j028P81L64r23L78P18j072O4J161p56
3446i1p73J330k71p81Q04J07j218R24O86j218N5J123p29m39J075p26o65J303j8
3465D78j166P17N66j093L33Q37r98R5J117q59o70J199p6j069P95M24j114N57O57
3484G30j218J92J195p51n71J036l60o28J069k08j091P98O89j244K40Q96q25k77
3502c28J036o28p40J316p7j226P71M99j049K74Q37j129J46R88o20p99J191k00
3520B62p92Q48R2j002P19N11j151J29J111q34n30J076m27o06R87j78j024R11O83
3539G85j243J09Q99q38p7R01p09n70J179j34j110P61M55r67L86O65j108K15J056
3558F55q46n32J076j67r28R27Q4r53N79P48j316J68J142q69k40P94l94o74J293
$$ plain form
3577 547 435 -831 -77 628 -513 -297 570 -321 -299 747 -97 -806 520 302 -699 91 591 -444
3595 -444 89 569 -414 -184 753 -56 -505 472 255 -393 451 498 -597 293 783 -287 -271 655 -115 -241
3615 -241 730 133 -481 655 581 -595 102 699 -358 -96 619 -331 -246 825 -54 -558 590 250 -443
3634 -443 358 423 -445 232 742 -534 -233 849 0 -585 480 59 -574 551 179 -616 12 717 -387
3653 -387 -331 617 -300 -261 570 -92 -628 540 349 -800 42 499 -546 -38 589 -488 -435 646 -188
3672 -188 -788 325 181 -609 184 269 -749 3 571 -663 -427 588 -183 -589 239 -128 -669 392 135
3691 135 -859 -37 516 -548 -297 396 -366 -354 505 -248 -737 529 415 -769 120 337 -494 22 563
3710 563 -524 -312 777 -141 -543 527 170 -459 354 317 -633 202 803 -487 -208 797 -128 -313 642
$$ packed form
3577E47j12j266P54P05j141K16Q67q91K2J046q44p09J326k18j001P90N00j035
3595d44N33M80r83K30R37q09m49R77k17o48Q44M7j095Q90M90j070J6R26p70j26
3615b41R71n97o14J136p4j176O97N97j057K62P15r50Q5J071q79n04J148l40o93
3634d43Q01O5q68O77N10j276L01J082q49n85J065m21o33J125l72p95O28P05j104
3653c87N6R48r17L9Q31o62n36J168j91j149Q42M57j045N08O27j077N3J081q34
3672a88o00J113j44p90P93Q5j018P52N68j234K36J015p71m06Q28l67n41J061k57
3691A35r94Q22N53j064K51O93p62J2Q59p53m89J266j14j184Q89K17q31N16N41
3710E63j087K12J089r18m02J070l57o29Q13l7r50Q35O01j290K79J005r25j85R55
$$ plain form
3729 642 37 -484 542 356 -606 211 628 -383 -74 603 -257 -174 697 -38 -559 519 352 -466 296
3748 296 458 -440 90 681 -345 -182 715 36 -457 581 196 -455 520 319 -594 193 640 -570 -163
3767 -163 686 -172 -263 691 50 -585 569 381 -765 120 495 -414 -36 534 -453 -306 641 -114 -600 463
3787 463 153 -599 262 217 -717 -42 528 -584 -470 427 -66 -602 268 -92 -589 269 82 -806 147 523
3807 523 -615 -327 435 -397 -450 514 -257 -740 364 186 -629 141 289 -686 -144 509 -492 -291 610
3826 610 -144 -585 504 165 -587 343 215 -630 147 629 -559 -325 722 -91 -366 443 -54 -547 461
3845 461 261 -695 212 608 -434 -73 559 -247 -166 734 -21 -432 586 269 -616 255 288 -454 150 462
3865 462 -452 -254 762 -101 -442 577 290 -495 411 430 -553 125 813 -355 -152 641 -51 -314 624
$$ packed form
3729F42o05n21J026j86r62Q17M17j011L09O77q60Q3Q71p35n21J078j67q18P62
3748B96J62q98N30N91j026J63Q97o79m93J038l85o51R75k01r13P87M47j210M07
3767a63Q49q58r1R54o41o35J154j88j146Q85L75r09L78N70r87J47R47p55m86J063
3787D63l10p52Q61m5r34O75N70j112J14Q97m93n36Q70l60m97Q58j87q88R53L76
3807E23j138K88P62q32n3R64p71m83J104j78q15P70J48r75N42O53j001K01R01
3826F10p54m41J089l39p52R30j28q45P77M82j188K34J047q13k75Q09m97m93J008
3845D61k00r56R07L96j042L61O32q06Q1R00p55m11J018l17q85Q71L3p42O04L12
3865D62r14J98J016q63l41J019k87p85R06J9r83O78O88j168K03P93o92k63R38
$$ plain form
3884 624 -29 -415 624 278 -417 362 649 -536 -8 575 -316 -177 761 -141 -518 604 289 -522 235
3903 235 277 -479 222 447 -581 -188 731 -208 -580 353 -98 -522 356 196 -789 149 474 -626 -261 529
3923 529 -241 -278 557 -228 -649 400 227 -759 194 304 -615 -122 353 -432 -266 662 -325 -570 369 16
3943 16 -537 148 117 -655 154 631 -636 -330 575 -263 -449 298 -142 -469 433 234 -782 92 547 -559
3963 -559 -183 602 -295 -253 748 -146 -554 657 141 -591 237 404 -516 150 520 -404 -233 829 -73
3982 -73 -526 495 52 -395 381 341 -568 250 625 -382 -70 722 -183 -261 598 -60 -274 541 362 -592
4002 -592 327 578 -343 41 644 -287 -54 677 -123 -486 530 302 -578 305 442 -463 256 563 -387 -115
4022 -115 736 -120 -421 554 235 -494 396 206 -632 149 638 -486 -86 374 -263 -277 438 -229 -620 441
$$ packed form
3884F24o53l86J039l46o95P79K87j185N28N83q91J39R38r02l77J122l15q11P57
3903B35M2p56P01K25j028L93R19r39l72R33m51m24Q78j60r85R38L25j100L65P90
3923E29p70l7Q35p85m21J049j73r86R53J10r19M93M75p85J66R28r87k45R39l53
3943A6n53O85l1p72Q09M77j267L06R05q38j86P47m40l27R02j99j016Q74M55j106
3963e59L76P85q97M2J001q94m08J211n16p32Q28J67r20O66L70r24J71J062r02
3982g3m53J021m43m47P76m0r09Q18L75j007L12P92r05p8Q59o58k14Q15j79r54
4002e92R19K51r21L84O03r31K33P31q00l63J016k28q80Q83J37r05P19L07r50K72
4022a15Q51q56l01R75l19p29Q90j90q38P81M89j124M00M60o37j4P15o67l91J061
$$ plain form
4042 441 153 -725 119 375 -561 -150 469 -517 -231 592 -260 -538 473 104 -658 331 202 -573 132 402
4062 402 -549 -284 570 -245 -477 353 -190 -669 336 266 -618 220 481 -535 -162 543 -454 -296 427 -302
4082 -302 -614 592 217 -692 188 260 -586 67 532 -429 -209 624 22 -483 566 13 -474 398 194 -572
4102 -572 106 672 -548 -63 655 -16 -273 414 11 -237 627 215 -540 384 608 -366 94 459 -273 -93
4122 -93 548 -170 -409 667 257 -600 427 414 -356 293 550 -431 -73 841 -141 -375 505 127 -396 395
4142 395 226 -565 237 560 -515 -125 665 -44 -319 574 -116 -468 465 85 -615 186 446 -531 49 454
4162 454 -500 -87 557 -216 -604 537 105 -652 303 287 -519 235 412 -807 -202 626 -222 -540 414 -19
4182 -19 -470 307 -19 -743 139 397 -590 -127 404 -389 -383 464 -334 -545 535 -13 -548 274 329 -616 -56
$$ packed form
4042D41k88q78Q44K56r36M11O19r86K86Q23q52k78J011l69p62R89j29p75P05K70
4062D02r51K65Q54q15k32Q30n43m79J005p0q84Q38K61j016L73P05r97J58P23p29
4082c02l12J206l75r09Q80P2q46O53M65r61K20Q33o02n05J049n53m87Q72k04p66
4102e72O78N66j220M85P18o71k57O87m03k48Q64m12p55R24K24r74M60L65p32J80
4122i3O41p18k39J076m10q57J027j3p70O49K57r81L58R14r82k34Q80l78n23P91
4142C95j69p91Q02L23j075L90P90p09k75Q93o90l52R33l80p00Q01K60r77N80M05
4162D54r54M13O44p73l88J141m32p57R55j6q06P54J77j219O05Q28q48l18R54m33
4182a9m51P77l26p24Q82K58r87M63N31p93OQ47p98k11J080n48n35Q22N5r45N60
$$ plain form
4203 -56 392 -554 -224 655 -273 -438 551 57 -583 341 243 -465 149 370 -535 -67 694 -223 -314 605 -87
4224 -87 -384 622 140 -579 318 530 -433 -22 656 -208 -101 681 -67 -321 586 223 -425 435 396 -397
4244 -397 215 544 -451 -53 661 -234 -402 692 81 -430 440 238 -458 263 517 -536 -167 658 -215
4263 -215 -266 501 -226 -401 614 156 -562 339 463 -437 110 511 -490 -134 597 -196 -393 595 122 -612
4283 -612 301 186 -493 139 402 -534 -138 521 -319 -480 507 -191 -510 277 82 -679 158 420 -739 -248
4303 -248 409 -419 -305 428 -354 -478 560 109 -746 118 212 -580 -4 289 -509 -116 578 -368 -522 617
4323 617 -23 -619 408 24 -619 157 268 -725 -187 465 -311 -349 339 -161 -498 492 116 -671 182 435
4343 435 -462 -75 401 -390 -56 563 -241 -422 615 166 -495 329 477 -482 32 471 -507 3 593 -230
$$ packed form
4203e6M48r46L30Q79r28j65R89m94o40R24r8p08O14K21r05M68P61r17r1R19o92
4224h7k97J006m82p19Q97K12r63M11O78q64J07P82p48k54R07l63o48Q60l9p93
4244c97O12L29r95L98P14q95j68J094o11n11Q70k02o96P21K54j053L69Q25q73
4263b15n1P67p27j75J015m58p18R01J24r00N47M01j001L56P31p93j97R88m73p34
4283f12R13j15o79O32K63r36L96O59q40j61R87o98l19P87j95p61Q37K62j159M91
4303b48O57q28J14P33p82j24J038m51q55Q64R4p92N76K93p98L93O94r46j54J139
4323F17o40n96J027l84o43P76J11r93N38O52p76l8O88n00l37R90l76p87Q53K53
4343D35q97L87M76p91L34O19q04j81J037m49o61Q24J48r59N14M39r78N10N90q23
$$ plain form
4363 -230 -380 663 56 -358 499 153 -529 263 599 -453 51 589 -259 -146 548 -77 -385 602 197
4382 197 -611 410 446 -531 104 540 -358 -151 662 -208 -448 600 104 -553 334 330 -534 211 384 -512
4402 -512 6 605 -350 -414 521 27 -494 352 -47 -515 234 434 -638 -138 515 -286 -210 371 -173 -533
4422 -533 424 -3 -618 339 310 -494 -62 375 -508 -107 512 -309 -448 440 -68 -582 367 155 -617 106
4442 106 199 -624 -107 551 -309 -306 410 64 -499 341 85 -626 276 382 -588 -110 495 -418 -307 305 -255
4463 -255 -414 455 112 -482 335 358 -542 32 337 -372 -193 589 -323 -419 653 78 -476 372 216 -440
4483 -440 327 529 -528 -12 610 -228 -91 467 -62 -384 528 131 -435 327 517 -507 77 619 -293
4502 -293 -49 553 -283 -426 640 15 -476 316 291 -359 337 414 -377 103 579 -196 -401 582 80 -450
$$ packed form
4363b30j50J043o07m14Q57l46o82P92L36j052N04N38q48J13O94o25l08R87m05
4382A97q08J021L6r77O35M36q98K07Q13q70k40J048m96o57Q87mq64P45J73q96
4402e12N18N99r55o4R35m94n21Q46l99m68P49K00j072N00O53q01P6N81n44l60
4422e33R57m27o15R57k9q04M32M37q83M01O19q21j39Q88n08n14R49k12p72P23
4442A06R3q23N17O58q60LP16l46n63Q40k56p11R02J06r70M78O05r13J11O12n60
4463b55j59Q69l43n94Q17K3r00N74L05p09J79P82r12r6J072n75n54Q48j56o56
4483d40P67K02j057N16O22q38J37N58n29l22R12l97n66P62J90j024N84N42r12
4502b93K44O02q36j43J066o25m91P92k5o50O96P7p91M80M76p75k05R83n02n30
$$ plain form
4522 -450 412 221 -573 305 341 -520 134 501 -409 -189 456 -239 -259 547 47 -671 371 309 -506 164 369
4543 369 -384 -75 577 -388 -342 452 -11 -691 260 139 -567 13 379 -588 -160 465 -455 -523 532 -246
4563 -246 -398 236 -29 -600 185 299 -676 -55 359 -425 -304 323 -360 -455 323 -12 -633 246 176 -554 108
4584 108 405 -394 -81 534 -271 -384 522 29 -521 289 153 -538 206 413 -556 62 587 -266 -241 475
4604 475 -112 -331 496 19 -453 255 435 -377 -83 393 -385 -126 578 -231 -320 500 150 -444 332 226
4624 226 -352 222 479 -395 17 507 -182 -213 473 71 -309 366 138 -511 389 466 -434 167 515 -179 -86
4645 -86 534 -135 -217 508 132 -523 398 474 -444 7 475 -257 -87 487 -269 -347 645 -19 -554 353 182
4666 182 -431 232 348 -416 -60 491 -460 -285 484 -25 -472 357 -44 -548 311 228 -577 17 278 -524
$$ packed form
4522d50Q62j91p94Q78L6q61O54L67r10K20O45o95k0Q06n00p18J042o2q15O70K05
4543C69p53L09O52r65M6P94m63o80R51j21p06N80L66r67M28O25r20o8J055p78
4563b46j52O34k65n71P85J14r75O21M14p84J21O27o83r5P78l35o21Q79p0p30O62
4584A08K97p99L13O15q05j13R06m93n50Q10j36o91P44K07r69O18N25q53K5P16
4604D75n87k19Q27m77m72P08J80q12K94M76p78K59P04q09q9Q20l50n94P76j06
4624B26n78N74K57q74M12M90o89l1O86m02l80O75k28o49R00P7r00O01L48o94R3
4645h6O20o69q2P25l76o55R21P6r18M51M68p32J70N74p56p8R92o64n35R07j71
4666A82o13O63J16p64L56N51r51J75P69n09m47Q29m01n04Q59q3q05N94K61q02
$$ plain form
4686 -524 -313 378 -226 -394 357 -60 -611 244 148 -435 56 285 -461 -99 384 -364 -292 526 -81 -471 379
4707 379 159 -430 189 383 -530 33 444 -448 -292 420 -67 -429 381 -38 -461 297 246 -458 67 360
4727 360 -322 -54 549 -173 -254 484 94 -443 316 315 -366 208 341 -374 36 418 -315 -248 690 -18 -238
4748 -238 375 194 -422 466 328 -416 172 517 -233 -171 507 0 -320 569 53 -352 417 360 -385 101 392
4769 392 -444 -1 513 -252 -257 580 -83 -429 194 245 -483 128 237 -472 -77 445 -378 -230 504 -130 -369
4790 -369 375 24 -426 126 294 -427 72 322 -391 -232 276 -307 -362 391 -24 -544 206 112 -514 -10 278
4811 278 -374 -50 397 -311 -355 438 -67 -520 221 87 -417 75 163 -474 -21 369 -473 -200 392 -167 -370
4832 -370 251 144 -511 163 204 -502 -41 398 -248 -170 344 -175 -190 459 22 -360 323 156 -383 210 266
$$ packed form
4686e24K11O91o04j68P51m17n51Q55r6n83M91K29p46L62M83p48P2Q18o07l90Q50
4707C79k20n89O19J94r13N63M11q92J56P12m87l62Q10m19m23P58n1p04N25K93
4727C60o82K68O03p22q1P38l90n37P59jo81N74J33p15M10L82p33O7R38p08k20
4748b38O13j81o16Q88j38p44N88L45p50O2O78n07l20Q89n16m05P69n7p45M86K91
4769C92q36M43N14p65nQ37o63l46O23N1p28O11J09p09L95N22q23J48P34o34k39
4790c69P44l51m50N52J68p21M99K50p13J59N08n83n5P53m15n20P50r4o26N04K88
4811B78o52L24M47p08m4P93n05m53P41j34n04M92Q8o37M53L90q42K73N92n59k03
4832c70O21j07o55O74M1p06M61M39o46P8N14n19j5O49m37l82O83j67n39N93N6
$$ plain form
4853 266 -367 60 552 -304 -146 582 -31 -335 452 186 -356 308 245 -350 177 518 -175 -128 487 -81 -243
4874 -243 512 69 -226 340 341 -413 70 484 -214 -124 484 -159 -224 539 83 -327 280 204 -360 187 302 -420
4896 -420 162 526 -429 -213 486 44 -305 362 -118 -487 238 332 -440 2 399 -263 -254 340 -234 -257 408
4917 408 -59 -330 181 135 -443 20 254 -389 -76 305 -355 -424 416 -130 -438 331 74 -443 163 207 -538
4938 -538 -22 415 -399 -292 391 -187 -340 352 -139 -427 303 192 -486 61 371 -428 -80 260 -162 -306
4958 -306 404 -193 -539 334 137 -506 136 144 -476 -5 372 -298 -217 359 -58 -481 393 92 -450 265 181
4979 181 -319 21 469 -202 -180 448 -52 -143 344 66 -318 410 223 -386 122 314 -296 2 374 -228 -124
5000 -124 632 -32 -324 534 292 -406 311 242 -316 2 530 -265 -229 483 -79 -238 274 76 -319 117 261
$$ packed form
4853B66o33M27M92q56J58P28o13l04P87k66n42O64o3n95N27L41o93M7O15n68j62
4874b43P55m43k95N66Jp54M83M14o98R0O08o43o5P63m56m10O07p6n64N47J15p22
4896d20N82L64r55K16O99m42l49O67m80l69P25R4p72M42L97o62RN94n74k3O65
4917D08m67k71N11m6n78M63K34o43L13L81o60o9Q40n46l08P69k57n17O06M4p45
4938e38N16M37q14J07O83n78j53O92m91k88P30j11o78N47L10p99L48L40m22j44
4958c06P10n97l46Q73j97o43O42Qo20M71L77o70Q1N76m17m23Q74l01n42P15q4
4979A81n00L40M48o71K2O28n00r1M87k78l84P28j87o09N08J92o10K98L72o02J04
5000a24P56o64k92Q58k42o98P17o9n58L18N28p95L6P12n62j59N12j98l95M36J44
$$ plain form
5021 261 -456 -40 443 -339 -166 423 -158 -193 334 -28 -337 333 255 -428 -22 394 -283 58 303 -275 -107
5042 -107 410 -86 -518 334 138 -413 186 116 -437 138 333 -454 -295 389 -127 -316 269 -37 -560 136
5062 136 55 -563 30 373 -375 -266 231 -308 -144 363 -185 -562 263 168 -502 84 216 -370 2 268 -442
5083 -442 -305 440 -210 -370 348 111 -349 300 84 -402 63 272 -402 -204 406 -200 -249 320 -18 -373
5103 -373 300 144 -447 145 306 -243 -60 387 -214 -131 388 -109 -324 330 258 -263 215 301 -254 141 307
5124 307 -184 -181 512 -163 -208 400 -8 -205 213 228 -330 199 447 -235 -139 359 -186 -203 384 56 -296 422
5146 422 114 -363 104 258 -268 -8 372 -244 -207 429 -109 -375 260 131 -294 105 298 -265 43 413
$$ packed form
5021B61p17M16M83p82J73N89n81l5N27l62l09O70p8o83M06M16o77L41K45n78J68
5042a07N17m96m32Q52j96n51N99p0n53N75J95p87J59O84n16j89N85l06n23O96
5062A36q1o18N93L43p48J09M97n39J64N07n48l77Q25r5o70N86J32n86L72K66p10
5083d42J37P45o50j60P18k37m60O49k16m86M65K09o74J98O10o06m9N69l38l55
5103c73O73j56n91N92J61n49J83M47o01Q3N19m97k15O54p2n21M78Q6n55L95J66
5124C07m91LO93o75m5O08m08j97M18J5n58N29K48o82R6M98n45j7N87l28l52P18
5146D22l08m77M67J54n26K60L80o16L7O36n38k66O35j29m25L99J93n63L08L70
$$ [...]
8191A47
##END NTUPLES=NMR FID
##END=
