##TITLE=1H_CG-1119-b
 DMSO, 8 sc, 
 19.9.2019
##JCAMPDX= 6.0         $$ Bruker NMR JCAMP-DX V2.0
##DATA TYPE= NMR FID
##DATA CLASS= NTUPLES
##ORIGIN= UXNMR, Bruker Analytische Messtechnik GmbH
##OWNER= root
$$ XWIN-NMR		Version 3.5
$$ Thu Sep 19 14:04:09 2019 Russian Standard Time (UT+4h)  she@DPX200
##.OBSERVE FREQUENCY= 200.1315
##.OBSERVE NUCLEUS= ^1H
##.DELAY= (6, 6)
##.ACQUISITION MODE= SIMULTANEOUS
##.ACQUISITION SCHEME= undefined
##.AVERAGES= 8
##.DIGITISER RES= 18
##SPECTROMETER/DATA SYSTEM= spect
##.PULSE SEQUENCE= zg30
##.SOLVENT NAME= DMSO
##.SHIFT REFERENCE= (INTERNAL, DMSO, 0, 15.7039)
##AUDIT TRAIL= $$ (NUMBER, WHEN, WHO, WHERE, WHAT)
$$ ##TITLE= Audit trail, XWIN-NMR		Version 3.5
$$ ##JCAMPDX= 5.01
$$ ##ORIGIN= Bruker BioSpin GmbH
$$ ##OWNER= she
$$ F:/spectra/data/she/nmr/H-F/1/audita.txt
$$ ##AUDIT TRAIL=  $$ (NUMBER, WHEN, WHO, WHERE, WHAT)
(   1,<2019-09-19 14:02:59.43 +0400>,<she>,<DPX200>,
      <created by zg, POWCHK disabled, PULCHK disabled
       configuration hash MD5:
       00 E9 B6 7A A2 85 ED C7 34 08 36 98 17 FE 4E 26
       data hash MD5: 16K
       D2 53 7F 6E 11 B3 1D 84 6E 3F 5A 9D 5E FA 9E 54>)
$$ ##END=
$$ 
$$ hash MD5
$$ E9 7B C6 04 02 B4 1C 79 11 C7 18 5D 86 1B 57 D6
##$RELAX= 
##$RELAX= 
##$RELAX= 
##$RELAX= 
##$RELAX= 
##$RELAX= 
$$ Bruker specific parameters
$$ --------------------------
##$DU= <F:/spectra>
##$EXPNO= 1
##$NAME= <H-F>
##$PROCNO= 1
##$TYPE= <nmr>
##$USER= <she>
##$AMP= (0..31)
100 100 100 100 100 100 100 100 100 100 100 100 100 100 100 100 100 100 
100 100 100 100 100 100 100 100 100 100 100 100 100 100 
##$AQSEQ= 0
##$AQ_mod= 1
##$AUNM= <au_zg>
##$AUTOPOS= <>
##$BF1= 200.13
##$BF2= 200.13
##$BF3= 200.13
##$BF4= 200.13
##$BF5= 200.13
##$BF6= 200.13
##$BF7= 200.13
##$BF8= 200.13
##$BYTORDA= 1
##$CFDGTYP= 0
##$CFRGTYP= 5
##$CHEMSTR= <none>
##$CNST= (0..31)
1 1 145 1 1 1 1 1 1 1 1 1 1 1 1 1 1 1 1 1 1 1 1 1 1 1 1 1 1 1 1 1 
##$CPDPRG= <>
##$CPDPRG1= <>
##$CPDPRG2= <>
##$CPDPRG3= <>
##$CPDPRG4= <mlev>
##$CPDPRG5= <mlev>
##$CPDPRG6= <mlev>
##$CPDPRG7= <mlev>
##$CPDPRG8= <mlev>
##$CPDPRGB= <>
##$CPDPRGT= <>
##$D= (0..31)
0 1.2 0 0 0 0 0 0 0 0.06 0 0.03 0 0 0 0 0.0002 0 0 0 0 0 0 0 0 0 0 0 0 
0 0 0 
##$DATE= 1568887378
##$DBL= (0..7)
120 120 120 120 120 120 120 120 
##$DBP= (0..7)
150 150 150 150 150 150 150 150 
##$DBP07= 0
##$DBPNAM0= <>
##$DBPNAM1= <>
##$DBPNAM2= <>
##$DBPNAM3= <>
##$DBPNAM4= <>
##$DBPNAM5= <>
##$DBPNAM6= <>
##$DBPNAM7= <>
##$DBPOAL= (0..7)
0.5 0.5 0.5 0.5 0.5 0.5 0.5 0.5 
##$DBPOFFS= (0..7)
0 0 0 0 0 0 0 0 
##$DE= 6
##$DECBNUC= <off>
##$DECIM= 24
##$DECNUC= <off>
##$DECSTAT= 4
##$DIGMOD= 1
##$DIGTYP= 9
##$DL= (0..7)
0 120 120 120 120 120 120 120 
##$DP= (0..7)
150 150 150 150 150 150 150 150 
##$DP07= 0
##$DPNAME0= <>
##$DPNAME1= <>
##$DPNAME2= <>
##$DPNAME3= <>
##$DPNAME4= <>
##$DPNAME5= <>
##$DPNAME6= <>
##$DPNAME7= <>
##$DPOAL= (0..7)
0.5 0.5 0.5 0.5 0.5 0.5 0.5 0.5 
##$DPOFFS= (0..7)
0 0 0 0 0 0 0 0 
##$DQDMODE= 0
##$DR= 18
##$DS= 0
##$DSLIST= <SSSSSSSSSSSSSSS>
$$ [...]
##$SUBNAM2= <"">
##$SUBNAM3= <"">
##$SUBNAM4= <"">
##$SUBNAM5= <"">
##$SUBNAM6= <"">
##$SUBNAM7= <"">
##$SUBNAM8= <"">
##$SUBNAM9= <"">
##$SW= 24.0689530833862
##$SWIBOX= (0..15)
0 0 2 0 0 0 0 0 0 0 0 0 0 0 0 0 
##$SW_h= 4816.95568400771
##$TD= 16384
##$TD0= 1
##$TE= 0
##$TE2= 300
##$TE3= 300
##$TEG= 300
##$TL= (0..7)
0 120 120 120 120 120 120 120 
##$TP= (0..7)
150 150 150 150 150 150 150 150 
##$TP07= 0
##$TPNAME0= <>
##$TPNAME1= <>
##$TPNAME2= <>
##$TPNAME3= <>
##$TPNAME4= <>
##$TPNAME5= <>
##$TPNAME6= <>
##$TPNAME7= <>
##$TPOAL= (0..7)
0.5 0.5 0.5 0.5 0.5 0.5 0.5 0.5 
##$TPOFFS= (0..7)
0 0 0 0 0 0 0 0 
##$TUNHIN= 0
##$TUNHOUT= 0
##$TUNXOUT= 0
##$USERA1= <user>
##$USERA2= <user>
##$USERA3= <user>
##$USERA4= <user>
##$USERA5= <user>
##$V9= 5
##$VALIST= <valist>
##$VCLIST= <CCCCCCCCCCCCCCC>
##$VD= 0
##$VDLIST= <DDDDDDDDDDDDDDD>
##$VPLIST= <PPPPPPPPPPPPPPP>
##$VTLIST= <TTTTTTTTTTTTTTT>
##$WBST= 1024
##$WBSW= 4
##$XGAIN= (0..3)
0 0 0 0 
##$XL= 0
##$YL= 0
##$YMAX_a= 65378
##$YMIN_a= -62100
##$ZGOPTNS= <>
##$ZL1= 120
##$ZL2= 120
##$ZL3= 120
##$ZL4= 120
##$ABSF1= 10
##$ABSF2= 0
##$ABSG= 5
##$ABSL= 3
##$ALPHA= 0
##$AQORDER= 0
##$ASSFAC= 0
##$ASSFACI= 0
##$ASSFACX= 0
##$ASSWID= 0
##$AUNMP= <proc_1d>
##$AZFE= 0.1
##$AZFW= 0.1
##$BCFW= 1
##$BC_mod= 2
##$BYTORDP= 1
##$COROFFS= 0
##$CY= 11.3945322036743
##$DATMOD= 1
##$DC= 2
##$DFILT= <>
##$DTYPP= 0
##$F1P= 20.1720416913024
##$F2P= 0.152960286110954
##$FCOR= 0.5
##$FTSIZE= 0
##$FT_mod= 4
##$GAMMA= 1
##$GB= 0.15
##$INTBC= 1
##$INTSCL= 1
##$ISEN= 128
##$LB= 0.24
##$LEV0= 0
##$LPBIN= 0
##$MAXI= 10000
##$MC2= 0
##$MEAN= 0
##$ME_mod= 0
##$MI= 1.114404
##$NCOEF= 0
##$NC_proc= 0
##$NLEV= 6
##$NOISF1= 3.799351
##$NOISF2= 2.8
##$NSP= 1
##$NTH_PI= 0
##$NZP= 0
##$OFFSET= 15.70392
##$PC= 1
##$PHC0= -9739.947
##$PHC1= 23.60096
##$PH_mod= 1
##$PKNL= yes
##$PPARMOD= 0
##$PSCAL= 0
##$PSIGN= 0
##$REVERSE= no
##$SF= 200.130013532006
##$SI= 16384
##$SIGF1= 3
##$SIGF2= 2
##$SINO= 400
##$SIOLD= 16384
##$SREGLST= <1H.CDCl3>
##$SSB= 0
##$STSI= 0
##$STSR= 0
##$SW_p= 3612.71676300578
##$SYMM= 0
##$S_DEV= 0
##$TDeff= 0
##$TDoff= 0
##$TI= <>
##$TILT= no
##$TM1= 0
##$TM2= 0
##$TOPLEV= 0
##$USERP1= <user>
##$USERP2= <user>
##$USERP3= <user>
##$USERP4= <user>
##$USERP5= <user>
##$WDW= 1
##$XDIM= 8192
##$YMAX_p= 0
##$YMIN_p= 0
$$ End of Bruker specific parameters
$$ ---------------------------------
##NTUPLES= NMR FID
##VAR_NAME=  TIME,          FID/REAL,        FID/IMAG
##SYMBOL=    X,             R,               I
##VAR_TYPE=  INDEPENDENT,   DEPENDENT,       DEPENDENT
##VAR_FORM=  AFFN,          ASDF,            ASDF
##VAR_DIM=   8192,          8192,            8192
##UNITS=     SECONDS,       ARBITRARY UNITS, ARBITRARY UNITS
##FACTOR=    0.0002076,     1,               1
##FIRST=     0,             0,               0
##LAST=      1.7004516,     0,               0
##MIN=       0,             -62100,          0
##MAX=       1.7004516,     65378,           0
$$ Real data points
##PAGE= N=1
##DATA TABLE= (X++(R..R)), XYDATA
$$ plain form
0 0 0 0 0 0 0 0 0 0 0 0 -8 8 -8 8 -8 16 -16 16 -24 24 -32 34 -40 48 -56 64 -72 81 -91 105 -115 131 -148
33 -148 164 -185 204 -228 253 -280 311 -345 382 -422 467 -518 574 -639 710 -797 891 -1007 1145
52 1145 -1314 1528 -1805 2188 -2747 3644 -5327 9599 -44986 -59264 39751 52677 3322 -61537
66 -61537 -55053 -7794 32149 21636 -8584 -33929 -33837 -17297 14639 36112 26227 -17977 -49024
79 -49024 -27485 31351 56920 16128 -46311 -54457 -417 54838 49622 -5748 -49981 -39221 7116
92 7116 39412 27806 -12014 -40753 -30961 6791 36228 27195 -12447 -44276 -35123 5579 35667
105 35667 25922 -11659 -38269 -28039 9781 38602 28303 -14030 -46205 -31975 18165 51761
117 51761 28947 -26383 -51595 -18222 33927 44289 3363 -39891 -38624 -1420 27181 23139
$$ packed form
0@%%%%%%%%%%qJ6j6J6j6K4l2L2m0M8n6O6p4Q8j04J20j36J53j72J96k20K46k79
33a48L12l49L89m32M81n33N91o56P27q04Q89r85J092j213J349j507J688j898K152
52A145k459K842l333L993m935O391q971J4926n4585j4278R9015J2926m9355o4859
66f1537O484M7259L9943j0513l0220k5345R2J6540L1936K1473r885m4204l1047
79d9024K1539N8836K5569m0792o2439q146N4040N5255n216n5370m4233J0760M6337
92G116L2296j1606l9820k8739R792L7752K9437r033l9642l1829R153M0702L0088
105C5667r745l7581k6610J0230L7820K8821j0299m2333l2175J4230N0140L3596
117E1761k2814n5330k5212L3373N2149J0362m0926m3254J267L7204K8601m042
$$ plain form
129 23139 -1828 -24013 -30018 -17133 8204 25975 13839 -24379 -48172 -23120 28495 45723
141 45723 3982 -49215 -49620 3968 47682 32721 -17067 -41657 -19007 18816 32231 15533
153 15533 -9150 -21474 -15372 5411 27776 30443 3581 -29468 -30422 6318 41058 31248 -13897
166 -13897 -42686 -21535 23921 41943 14632 -26014 -37918 -12481 21523 30730 9371 -20234
178 -20234 -29663 -9424 21756 31730 8977 -23583 -31383 -5835 26845 33567 8941 -20127 -24854
191 -24854 -2061 25280 30432 6595 -24112 -29002 -945 33158 36001 1427 -34336 -31004 6672
204 6672 34603 21205 -15921 -34452 -16726 14370 25886 11043 -12551 -25416 -19431 779
216 779 20065 19523 -4373 -28841 -24174 10087 37062 22466 -19549 -39855 -14454 26997 37957
$$ packed form
129B3139k4967k2185o005J2885K5337J7771j2136l8218k3793K5052N1615J7228
141D5723m1741n3197m05N3588M3714j4961m9788k4590K2650L7823J3415j6698
153A5533k4683j2324O102K0783K2365K667k6862l3049r54L6740L4740r810m5145
166a3897k8789K1151M5456J8022k7311m0646j1904K5437L4004R207k1359k9605
178b0234r429K0239L1180R974k2753l2560p800K5548L2680O722k4626k9068m727
191b4854K2793K7341N152k3837l0707m890K8057L4103K843l4574l5763L332L7676
204F672K7931j3398l7126j8531J7726L1096J1516j4843k3594j2865N985K0210
216G79J9286n42k3896k4468M667L4261K6975j4596m2015k0306K5401M1451J0960
$$ plain form
229 37957 9611 -22320 -23339 2580 24889 23445 3837 -15546 -19453 -4384 18438 28486 13096
242 13096 -15594 -28185 -7622 24148 29969 1656 -28733 -27044 4355 30606 24018 -5770 -27158
255 -27158 -20473 4716 23658 18540 -5170 -23913 -17751 8085 28171 20307 -8671 -28084 -16888
268 -16888 12097 28057 15533 -10596 -23362 -11086 12937 24806 13031 -12296 -26801 -14840
280 -14840 13909 29113 13007 -18316 -30474 -9587 20716 26092 1191 -24592 -23789 -239 20103
293 20103 18986 407 -17466 -19333 -4348 15669 22219 6125 -18413 -24452 -1902 26215 27305
306 27305 -1441 -28077 -21727 9718 29667 17951 -9451 -22737 -11231 10382 20471 11900
318 11900 -6774 -19392 -14698 5362 22960 17734 -7760 -27123 -17735 11293 27407 11752 -17482
$$ packed form
229C7957k8346l1931j019K5919K2309j444j9608j9383l907J5069K2822J0048j5390
242A3096k8690j2591K0563L1770N821k8313l0389J689L1399K6251o588k9788k1388
255b7158O685K5189J8942n118k3710j8743O162K5836K0086p864k8978j9413J1196
268a6888K8985J5960j2524k6129j2766J2276K4023J1869j1775k5327j4505J1961
280a4840K8749J5204j6106l1323j2158K0887L0303N376k4901k5783Q03K3550K0342
293B0103j117j8579j7873j867J4985K0017O550j6094k4538o039K2550K8117J090
306B7305k8746k6636O350L1445J9949j1716k7402j3286J1506K1613J0089q571
318A1900j8674j2618M694K0060J7598n226k5494j9363R388K9028J6114j5655k9234
$$ plain form
331 -17482 -27079 -7296 18294 23325 4704 -17154 -21299 -5557 14574 20705 7388 -13646 -20861
344 -20861 -5115 18397 24101 3965 -20473 -22851 -23 22644 21508 -599 -19243 -17127 2166
357 2166 18805 16820 -2451 -20445 -18925 2373 22855 20002 -4612 -24941 -18289 7547 23312
370 23312 12381 -11848 -22408 -9343 11791 20080 9804 -8513 -19135 -12568 6467 20580
382 20580 14390 -8068 -23307 -12073 15313 27606 9070 -19495 -25862 -3881 20483 21096 567
395 567 -16716 -14887 359 13416 14024 2365 -13006 -18457 -5998 14778 22717 6022 -19042
408 -19042 -23406 -758 23058 20194 -5519 -24215 -15077 9833 23001 13063 -6674 -17141 -10482
421 -10482 5609 17145 13665 -2658 -16862 -12985 7207 23052 15396 -8516 -22902 -11544 12233
$$ packed form
331a7482r597J9783K5590N031j8621k1858m145J5742K0131O131j3317k1034p215
344b0861J5746K3512N704k0136k4438k378K2828K2667j136k2107j8644K116J9293
357B166J6639j985j9271j7994J520K1298K0482k853k4614k0329O652K5836J5765
370B3312j0931k4229j0560J3065K1134Q289j0276j8317j0622O567J9035J4113
382B0580o190k2458j5239J1234K7386J2293j8536k8565o367K1981K4364O13k0529
395E67j7283J829J5246J3057O08j1659j5371n451J2459K0776P939j6695k5064
408a9042m364K2648K3816k864k5713j8696R138K4910J3168r938j9737j0467O659
421a0482J6091J1536l480j6323j4204L877K0192J5845p656k3912j4386J1358K3777
$$ plain form
434 12233 22509 9227 -12214 -19191 -6452 12018 18246 6477 -12960 -20755 -8590 12492 20606
447 20606 5773 -16860 -22208 -4240 16734 17297 -1766 -18676 -16460 508 14697 13575 -132
460 -132 -13620 -15926 -3381 13919 18286 2639 -18025 -19807 1786 23212 19108 -6587 -23778
473 -23778 -13176 11523 22049 9371 -9686 -15383 -5238 8147 13881 8739 -3314 -13624 -11581
486 -11581 4712 19787 15619 -6568 -22503 -12180 13444 24385 7963 -16001 -19971 -1401
498 -1401 17437 17229 698 -13799 -13941 -1992 10892 14222 4189 -11040 -16558 -4609 13097
511 13097 17316 1180 -18314 -19282 -511 16719 14241 -3751 -18233 -14969 1250 13768 10661
524 10661 -4841 -18019 -15349 2244 17021 12985 -6563 -20515 -13127 7195 17918 7676 -10527
$$ packed form
434A2233J0276j3282k1441o977J2739J8470O228j1769j9437p795J2165K1082Q114
447B0606j4833k2633n348J7968K0974N63j9063j6910K216J6968J4189j122j3707
460a32j3488k306J2545J7300M367j5647k0664j782K1593K1426m104k5695j7191
473b3778J0602K4699J0526j2678j9057n697J0145J3385N734n142j2053j0310K043
486a1581J6293J5075m168k2187j5935J0323K5624J0941j6422k3964l970J8570
498a401J8838k08j6531j4497j42J1949J2884L330j0033j5229n518J1949J7706
511A3097M219j6136j9494r68J8771J7230k478j7992j4482L264J6219J2518l107
524A0661j5502j3178K670J7593J4777m036j9548j3952P388K0322J0723j0242j8203
$$ plain form
537 -10527 -16435 -5634 9475 14685 6748 -6409 -13881 -8904 5431 16425 11395 -6965 -18988
550 -18988 -9158 13072 21619 5803 -16923 -20136 -1216 17162 14964 -2227 -14273 -10681 1443
563 1443 10281 9405 554 -9748 -13256 -4301 11199 16891 3760 -15110 -17971 -43 18287 15571
577 15571 -5294 -19629 -11404 8015 17459 8426 -7515 -14877 -8380 4416 12062 7616 -5305
590 -5305 -15204 -11058 4319 14918 8011 -9911 -19500 -10156 7557 14233 3594 -12169 -16578 -6648
604 -6648 7514 12081 2720 -11571 -16939 -6843 9629 15184 2952 -14221 -16957 -1775 14140
617 14140 13394 -2038 -14450 -11150 2756 12409 9920 -620 -10026 -10307 -620 11251 13329 1681
631 1681 -13098 -14022 1892 17478 14039 -5224 -18201 -10045 9072 17178 6646 -8683 -13018
$$ packed form
537a0527n908J0801J5109N210p937j3157p472M977J4335J0994n030j8360j2023
550a8988R830K2230Q547j5816k2726l213J8920J8378k198j7191j2046L592J2124
563A443Q838q76q851j0302l508Q955J5500N692j3131j8870k861J7928J8330k716
577A5571k0865j4335Q225J9419R444r033j5941p362O497J2796P646m446j2921
590e305r899M146J5377J0599o907j7922r589R344J7713O676j0639j5763m409R930
604f648J4162M567r361j4291n368J0096J6472N555j2232j7173k736J5182J5915
617A4140p46j5432j2412L300J3906R653k489j0540r406k81R687J1871K078j1648
631A681j4779r24J5914J5586l439j9263j2977Q156J9117Q106j0532j5329m335
$$ plain form
644 -13018 -4061 7493 11078 5453 -5007 -11311 -7244 4870 13837 9095 -6783 -16417 -8265 9435
658 9435 16050 4095 -12955 -15863 -2509 11471 11679 -780 -12709 -13064 -2875 8415 9975 -87
672 -87 -12090 -13985 -2743 10421 11044 -2459 -15185 -13046 1151 12461 9337 -3674 -12613 -9117
686 -9117 2645 11501 9318 -2070 -11997 -9458 4254 15416 11593 -3892 -14461 -7579 8909
699 8909 16148 6742 -7989 -11911 -2340 9764 12411 4244 -6193 -10114 -4593 5946 12102 6392
713 6392 -6631 -13438 -5285 9742 15060 3334 -12524 -14573 -613 12876 11809 -1169 -11691
726 -11691 -9224 1766 10213 8849 -686 -9777 -9967 136 11104 11231 -540 -12338 -10944 2644
740 2644 13050 9028 -5016 -13420 -7632 5189 12001 6473 -5291 -12055 -7455 4053 11515 7008
$$ packed form
644a3018Q957J1554L585n625j0460o304M067J2114Q967m742j5878r634Q152J7700
658I435O615j1955j7050k908J3354J3980K08j2459j1929l55J0189J1290J560j0062
672h7j2003j895J1242J3164O23j3503j2726K139J4197J1310l124j3011q939L496
686i117J1762Q856k183j1388r927K539J3712J1162l823j5485j0569O882J6488
699H909P239r406j4731l922R571J2104K647q167j0437l921N521J0539O156n710
713F392j3023o807Q153J5027N318j1726j5858k049J3960J3489j067j2978j0522
726a1691K467J0990Q447j364r535r091j90J0103J0968J27j1771j1798J394J3588
740B644J0406m022j4044q404N788J2821O812n528j1764o764M600J1508P462m507
$$ plain form
754 7008 -5845 -13395 -6967 7383 13745 5067 -9049 -13317 -3008 9699 11529 2349 -7936 -9337
768 -9337 -1689 7996 10682 3697 -6894 -11059 -2921 9933 13676 2988 -10768 -12172 633 13150
782 13150 11223 -2351 -12042 -8114 3752 10973 7396 -2545 -9489 -7557 1696 9717 8819 -1482
796 -1482 -11112 -9038 3372 13000 8577 -5170 -13111 -6531 7093 12591 5003 -6423 -10639 -4191
810 -4191 6213 10514 4729 -6038 -11213 -5044 6932 12178 4107 -8991 -12612 -2784 9409 10848
824 10848 416 -10068 -9928 -316 8357 8403 484 -8270 -9869 -1830 8519 10499 1153 -10350 -11148
839 -11148 963 12574 10225 -3072 -12543 -7738 5298 11767 6235 -4328 -9065 -4810 3588 8986
853 8986 6506 -2460 -9706 -7227 3468 11867 7925 -5257 -12964 -6197 7364 12458 3614 -8733
$$ packed form
754G008j2853p550O428J4350O362q678j4116m268J0309J2707J830r180j0285j401
768i337P648R685K686o985j0591m165Q138J2854L743j0688j3756j404J2805J2517
782A3150j927j3574r691L928J1866P221l577r941o944J932R253Q021q98j0301
796a482r630K074J2410R628m423j3747p941O580J3624N498p588j1426m216O448
810d191J0404M301n785j0767n175O169J1976N246q071j3098l621R828J2193J439
824A0848j0432j0484J40R612Q673M6p919q754j599Q039J0349J980r346j1503p98
839a1148J2111J1611k349j3297r471M805J3036O469n532j0563m737M255Q398N398
853H986k480q966p246K479J0695Q399l942j3182p707O767J3561N094q844j2347
$$ plain form
867 -8733 -11020 -1960 8102 9432 1914 -7023 -9286 -2928 6730 9977 3171 -7537 -10783 -1994 9476
882 9476 11073 499 -10340 -9519 1236 10226 8310 -1326 -8783 -7152 1103 8513 8116 -527 -9556
897 -9556 -9097 1272 11136 8893 -3364 -12327 -7615 5193 11496 4902 -6350 -10325 -3769 5217
911 5217 8450 3632 -4111 -8591 -5464 3494 9812 6280 -4975 -11637 -5503 7433 12528 3443 -9395
926 -9395 -11204 -815 9521 9104 -301 -8050 -7230 199 6829 7372 1361 -6583 -8741 -1777 8228
941 8228 10022 899 -9712 -9589 1410 11136 8237 -3099 -10398 -6112 3676 9291 5707 -2807 -8281
956 -8281 -5899 2519 9194 6991 -2894 -10265 -6612 4845 11199 5472 -6299 -10464 -3250 6835
970 6835 9004 2307 -5902 -7903 -2767 4865 8055 3625 -5026 -9782 -4300 6491 10701 2719 -8873
$$ packed form
867h733k287R060J0062J330p518q937k263O358R658L247o806j0708l246Q789J1470
882I476J597j0574j0839Q21J0755Q990j916r636p457J631Q255P410l97q643r029
897i556M59J0369R864k243j2257q963M712J2808O303o594j1252l975O556Q986
911E217L233m818p743m480L127Q958O318l532j1255o662O134J2936N095r085j2838
926i395j809J0389J0336m17r405p749Q20P429O630N43o011p944k158O964J0005
941H228J794r123j0611J23J0999R726k899j1336p299M286R788N615l584q514n474
956h281K382Q418O675k203r885p371L653J1457O354n727j1771m165P214J0085
970F835K169o697q209k001N136P632L190m430q651m756N482J0791M210p982j1592
$$ plain form
985 -8873 -10862 -907 9662 8874 -1845 -9718 -7030 1931 7510 5431 -1359 -6884 -6613 -554 6535
1000 6535 7639 109 -8848 -9008 1111 10294 7851 -3546 -11042 -6088 5113 10169 4187 -5173
1014 -5173 -8422 -3285 4386 7942 4249 -3340 -7711 -4541 4435 9992 5309 -5065 -9581 -3029 7496
1029 7496 10153 2237 -6770 -7798 -368 7163 7824 1437 -5761 -7125 -1428 6603 8637 1920 -7354
1044 -7354 -8928 -543 8917 8449 -1632 -9779 -7244 2478 8294 4761 -3343 -7749 -5390 1277 5995
1059 5995 4885 -1793 -8093 -7488 599 8340 6440 -3821 -11085 -6401 4856 9774 3422 -6787
1073 -6787 -9438 -2221 5683 7027 1636 -4774 -6667 -2473 4332 7658 3707 -4380 -8130 -2832 6796
1088 6796 9865 2557 -7056 -7888 598 8766 8156 62 -6545 -5424 1467 7391 6844 543 -6136 -6132
$$ packed form
985h873j989R955J0569p88j0719p873K688Q961N579k079o790n525K71O059P089
1000F535J104p530q957j60J0119R183k443j1397p496M954J1201N056n982r360
1014e173l249N137P671L556l693p589m371L170Q976N557m683j0374m516O552J0525
1029G496K657p916r007j028P430P531O61o387p198j364N697Q031K034o717r274
1044g354j574Q385R460m68j0081q147K535R722N816l533q104m406K359O667M718
1059E995j110o678o300O05Q087P741j900j0261p264M684J1257M918o352j0209
1073f787k651P217P904J344n391o410j893M194O805L326l951q087l750N298R628
1088F796L069p308r613q32Q486Q168o10q094o607J121O891N924n47o301o679M
$$ plain form
1104 -6132 925 8057 7496 -910 -8363 -6202 2917 8858 5257 -3591 -8142 -4302 3299 6906 3676
1119 3676 -3068 -7277 -5153 2062 7306 4563 -4025 -9504 -5315 4633 8942 2704 -7033 -9117 -1787
1134 -1787 6293 6674 169 -6343 -6352 -1119 4550 5715 1563 -4915 -7196 -2278 5440 7924 1434 -7217
1150 -7217 -8183 194 8435 7171 -1606 -7964 -5470 2569 7554 4960 -1752 -6221 -4420 2026 6891
1165 6891 5606 -1265 -7079 -5001 2876 8455 5543 -3046 -7639 -3391 4710 8042 3418 -3819 -6564
1180 -6564 -2477 4422 7391 3620 -3726 -7091 -2882 5256 8163 2536 -5968 -7873 -1049 6737 6975
1195 6975 -118 -6578 -6104 -49 5101 5072 -130 -5480 -6054 -1346 5047 6261 9 -7497 -7638 125
1211 125 7354 5948 -2743 -8690 -5464 2968 7014 3047 -3928 -6944 -3736 2262 5648 3493 -2443
$$ packed form
1104f132P057P132n61q406p453K161R119N941l601q848m551L840P601L607l230
1119C676o744m209K124P215N244k743q588n479M189R948M309o238r737k084P330
1134a787Q080L81o505o512rN233N669J165m152o478k281M918P718K484o490q651
1150g217r66Q377Q241j264q777o358K494Q039M985k594o712m469J801O446M865
1165F891j285o871n814K078P877N579k912q589m593M248Q101L332m624p237k745
1180f564M087O899K969l771p346l365M209Q138K907n627q504j905O824P786K38
1195F975p093o460M74O055N150k9n202n350n74M708O393J214o252p506j41P763
1211A25P229j406q691n947L226Q432M046l967o975l016L208N998L386k155n936
$$ plain form
1226 -2443 -6551 -4454 2415 7275 4204 -3608 -7803 -3222 5067 8042 2575 -4845 -6610 -997 5404
1241 5404 6602 1860 -4143 -5651 -992 5485 7068 2077 -5140 -6308 -256 6897 7013 21 -6197
1256 -6197 -5298 1451 6449 4941 -985 -5574 -4840 442 5412 5110 -698 -6573 -6026 786 6931 5000
1272 5000 -3177 -8384 -4846 3229 6731 2552 -4867 -6941 -2715 2804 4879 1768 -3342 -6051 -3505
1287 -3505 2416 6041 3257 -3987 -7588 -3131 4880 7523 1674 -5721 -6718 -338 6000 5721 -61
1302 -61 -5252 -4774 31 4834 5413 705 -4762 -5648 -286 5943 6030 -266 -6325 -5396 1757 6920 4547
1319 4547 -2047 -6169 -3878 2081 5604 3800 -1419 -5621 -4116 1833 6518 4465 -2633 -7135 -3992
1334 -3992 3787 7243 2564 -4753 -6588 -1652 4244 5223 984 -3943 -5143 -1760 3016 5195 2223
$$ packed form
1226b443m108K097O869M860l071p812m195M581Q289K975n467p420j765N613O401
1241E404J198m742o003j508M659O477J583m991p217j168O052P153J16o992o218
1256f197Q99O749M998j508n926m589P34N282M970l02n808n875N47O812O145j931
1272E000q177n207L538Q075L502m179p419k074M226N519K075l111n110k709K546
1287c505N921L625k784p244l601M457Q011K643n849p395r97O380O338k79n782
1302f1n191M78M805M803N79m708n467q86N362O229Q7o296o059R29P153N163k373
1319D547o594m122K291N959L523j804n219m202J505N949M685k053p098m502L143
1334c992P779L456m679p317j835M936N896R79m239m927j200L383M776K179k972
$$ plain form
1349 2223 -3753 -6452 -2492 4441 6538 1015 -6205 -6659 50 6497 5217 -1425 -6089 -4306 1110
1364 1110 4815 3658 -803 -4448 -4244 245 5062 4992 -719 -6140 -5299 1527 6740 4462 -2642 -6709
1380 -6709 -3175 3338 5893 2317 -3147 -5392 -2617 2383 5202 3035 -2577 -5938 -3150 3347 6459
1395 6459 2470 -4378 -6365 -1227 5325 5886 478 -4739 -4574 -125 4072 4427 894 -3562 -4725 -1159
1411 -1159 4317 6007 1091 -5492 -6069 138 6421 5352 -1613 -6505 -4067 2407 5561 2741 -2262
1426 -2262 -4758 -2976 1289 4286 3418 -965 -4983 -4404 1350 6123 4185 -2689 -6683 -3206 3940
1441 3940 6477 2097 -4155 -5328 -1098 3774 4721 1313 -3175 -4772 -1796 3255 5263 1834 -4031
1456 -4031 -5939 -1460 4629 5550 198 -5314 -5147 407 4802 3902 -783 -4408 -4004 14 4117 4357
$$ packed form
1349B223n976k699L960O933K097n523p220m54O709O447j280o642m664J783N416
1364A110L705j157m461l645K04M489M817p0n711n421Q41O826N213k278p104m067
1380f709L534O513K555l576n464k245K775N000K819k167n612l361K788O497L112
1395F459l989o848j987N138O552N61n408n217J65M449M197L55l533m456j163L566
1411a159N476J690m916o583n77O207O283j069o965m892K438O474L154k820n003
1426b262k496J782M265K997q68m383m018N79N754M773j938o874l994L477P146
1441C940K537m380o252j173M230M872R47l408m488j597K976N051K008l429n865
1456d031j908M479O089R21n352n512J67N554M395r00m685l625M04M018M103K40
$$ plain form
1472 4357 -35 -4636 -4932 365 5854 4967 -1483 -6074 -3722 2854 6299 2989 -2944 -4975 -1953
1487 -1953 2622 4324 2403 -1400 -4185 -2786 1663 5107 3438 -2364 -6333 -3287 3599 6389 1901
1502 1901 -4520 -5737 -575 4571 4426 -346 -4285 -4103 -372 3264 3995 851 -3486 -4686 -1366 3906
1518 3906 4916 298 -5040 -5097 502 5336 4227 -1524 -5426 -3684 1257 4327 2947 -1251 -4382
1533 -4382 -3413 990 4663 3592 -1710 -5644 -3762 2153 5705 2698 -2966 -5209 -1794 3191 4483
1548 4483 1470 -2683 -4081 -1617 2355 4543 2498 -2311 -4845 -2006 3441 5780 1759 -4264 -5401
1563 -5401 -184 5147 4786 -353 -4388 -3608 631 3753 3182 -204 -3267 -3467 -298 3754 4252 265
1579 265 -4582 -4603 416 5346 4199 -1523 -5453 -3285 2349 4943 2316 -2434 -4521 -2096 1938 4050
$$ packed form
1472D357m392m601k96N297N489q87o450m591K352O576L445l310n933k031L022
1487a953M575J702j921l803k785J399M449L444j669n802l969L046O886K790m488
1502A901o421j217N162N146j45m772l939J82L731L636P31l144m337j200L320N272
1518C906J010m618n338n7N599M834j109n751l902J742M941L070j380m198l131
1533d382R69M403L673j071n302l934J882N915L552l007n664k243L415M985J292
1548D483l013m153j398K464L972K188k045m809k534K839N447K339m021o023j137
1563e401N217N331l61n139m035P80M239L122n71l386l063k00L169M052M98l987
1579B65m847k1N019M930j147n722l930K168N634K594k627m750k087K425M034K112
$$ plain form
1595 4050 2385 -1833 -4588 -2699 1993 4639 2314 -2970 -5423 -1988 3134 4698 918 -3735 -4519
1610 -4519 -1189 2852 3635 778 -3270 -4398 -1377 3232 4520 820 -4074 -4714 -206 4617 4374 -454
1626 -454 -4319 -3182 1360 4421 3133 -582 -3339 -2422 1107 4054 3839 131 -3604 -3309 1226 5389
1642 5389 4114 -1361 -4848 -2456 3094 5341 2261 -2730 -4282 -1272 2728 3837 1389 -2267 -3618
1657 -3618 -1697 1957 4011 1735 -2968 -5023 -1843 3038 4408 687 -4146 -4628 -674 3420 3295
1672 3295 -584 -3966 -3979 -411 3170 3344 -220 -3996 -4096 -202 3902 3548 -1023 -4490 -3285 1369
1688 1369 4408 2772 -1652 -3857 -2416 1476 3739 2920 -779 -3565 -2426 1634 4833 3281 -1597
1703 -1597 -4717 -2000 3364 5338 2008 -2642 -3794 -326 3629 3817 760 -2512 -3154 -563 2683
$$ packed form
1595D050j665m218k755J889M692K646k325n284k453L435N122J564l780m653p84
1610d519L330M041P83k857m048j128L021M609J288l700m894o40M508M823k43m828
1626d54l865J137M542L061j288l715k757R17L529K947k15l708l735K95M535M163
1642E389j275n475l487K392N550K247l080m991j552L010M000J109k448l656j351
1657c618J921L654K054k276m703k055L180M881J370l721m833m82L954M094j25
1672C295l879l382j3L568L581J74l564l776j00L894M104l54m571l467J205M654
1688A369L039j636m424k205J441L892K263q19l699k786J139M060L199j552m878
1703a597l120K717N364J974l330m650j152L468L955J88l057l272o42K591L246
$$ plain form
1718 2683 3836 1624 -2443 -3952 -1160 3198 4270 479 -4226 -4294 188 3993 3457 -1066 -4230 -3228
1734 -3228 612 3286 2302 -965 -3681 -3207 465 3511 2897 -1141 -4384 -3357 1217 4155 2102 -2086
1750 -2086 -4241 -1932 1985 3659 1586 -2150 -3779 -2022 1705 3811 2151 -2107 -4354 -1842 2777
1765 2777 4521 1237 -3504 -4167 -370 3580 3572 5 -3121 -2949 -12 2734 3058 694 -2301 -3358
1781 -3358 -510 3352 4072 510 -3709 -3767 708 4680 3625 -1193 -4056 -2229 1719 3910 2162 -1470
1797 -1470 -3201 -1904 1166 3275 2537 -812 -3702 -2730 1434 4080 2127 -2325 -4614 -1980 2511
1812 2511 3887 868 -2998 -3876 -1116 2166 3141 869 -2597 -3719 -1549 2326 3619 591 -3551
1827 -3551 -4212 -526 3448 3390 -546 -3783 -2995 564 2973 2310 -458 -2960 -2750 182 3028 3291 132
$$ packed form
1718B683J153k212m067j509K792M358J072l791m705o8M482L805n36m523l164J002
1734c228L840K674r84l267k716M74L672L046o14m038l243J027M574K938k053m188
1750b086k155K309L917J674k073l736j629J757L727K106j660m258k247K512M619
1765B777J744l284m741o63L797L950ql567l126J72K937K746L24k364k995j057
1781c358K848L862P20l562m219n8M475L972j055m818k863J827L948K191j748l632
1797a470j731J297L070K109p38l349k890R72M164K646j953m452k289K634M491
1812B511J376l019l866q78K760L282R75k272l466j122K170L875J293l028m142
1827c551o61L686L974n8l936l237P88L559K409o63k768k502K10K932K846K63l159
$$ plain form
1844 132 -3717 -3340 663 4353 3201 -1393 -4324 -2061 2576 4291 1675 -2020 -3173 -1044 1870
1859 1870 3258 1727 -1154 -2852 -1782 1730 3996 2284 -2038 -4355 -1736 2935 4310 1018 -3307
1874 -3307 -3609 -176 3129 2801 -259 -3008 -3072 -383 2380 2913 465 -3017 -3655 -570 3173 3191 -586
1891 -586 -4087 -3266 732 3680 2483 -1375 -3383 -2283 810 2953 2147 -891 -3209 -2614 813 3690
1907 3690 2811 -1452 -4320 -2420 2174 4105 1429 -2472 -3611 -704 2533 2993 735 -1830 -2824 -1206
1923 -1206 1693 3351 1643 -1882 -3696 -1388 2808 4078 854 -3403 -3782 35 3732 3075 -632
1938 -632 -3314 -2498 567 2700 2111 -216 -2625 -2560 -55 2841 2987 -342 -3607 -3132 890 3871 2527
1955 2527 -1421 -3812 -1968 1651 3391 1494 -1632 -3049 -1731 1233 3093 1875 -1288 -3591 -1989
$$ packed form
1844A32l849L77M003L690j152m594k931K263M637J715k616l695j153K129K914
1859A870J388j531k881j698J070L512K266j712m322k317K619M671J375l292m325
1874c307l02L433L305l28l060k749o4K689K763N33k448l482o38L085L743J8l777
1891e86l501Q21L998K948j197l858k008J100L093K143q06l038k318N95L427K877
1907C690q79m263k868J900M594J931k676l901j139K907L237M60k258k565r94J618
1923a206K899J658j708l525j814K308M196J270l224m257l79L817L697o57l707
1938f32k682Q16L065K133n89k327k409O5K505K896J46l329l265M75M022K981j344
1955B527l948k391J844L619J740j897l126j417J318K964J860j218l163k303J602
$$ plain form
1970 -1989 1924 3718 1444 -2585 -3714 -653 2905 3213 349 -2519 -2781 -409 2211 2600 782 -2009
1986 -2009 -2992 -899 2433 3468 607 -3233 -3581 21 3713 3090 -802 -3539 -2302 1142 3098 1607
2002 1607 -1188 -2852 -1819 553 2552 2302 -446 -3032 -2627 710 3468 2479 -1487 -3849 -1857 2103
2018 2103 3748 1194 -2154 -3123 -941 2065 2845 1037 -1700 -2699 -960 2019 3227 1077 -2219 -3266
2034 -3266 -728 2869 3384 384 -2656 -2709 89 2742 2491 -154 -2521 -2569 -151 2527 2859 108 -2943
2051 -2943 -2991 241 3196 2532 -950 -3621 -2268 1444 3254 1450 -1543 -2901 -1574 1011 2263 1183
2067 1183 -1095 -2733 -2025 755 3082 1844 -1490 -3715 -1855 2020 3643 1156 -2575 -3346 -531
2082 -531 2593 2681 161 -2315 -2455 -157 1936 2596 895 -1808 -2649 -451 2488 2938 381 -2662 -2637
$$ packed form
1970a989L913J794k274m029j129L061L558L08k864k868k62K372K620L89j818k791
1986b009r83K093L332J035k861l840l48L602L692o23l892k737J237L444J956j491
2002A607k795j664J033K372J999k50k748k586M05L337K758r89l966k362J992L960
2018B103J645k554l348r69K182L006P80j808k737r99J739K979J208k150l296j047
2034c266K538L597N15l000l040n3K798K653k51k645k367m8K418K678L32k751l051
2051b943m8L232K955o64l482k671J353L712J810j804k993j358J327K585J252j080
2067A183k278j638P08K780K327j238l334k225J860L875J623k487l731p71K815
2082e31L124Q8k520k476j40K298K093O60j701k703q41K198K939M50k557l043K5
$$ plain form
2099 -2637 325 3160 2700 -335 -2764 -1961 716 2868 2239 -472 -2579 -2197 821 3071 2182 -1001
2115 -1001 -3243 -1823 1334 3056 1363 -1631 -2904 -1152 1409 2376 998 -1361 -2689 -1722 1194
2130 1194 2764 1395 -1825 -3448 -1421 2039 3215 628 -2815 -3082 -269 2625 2437 -374 -2492
2145 -2492 -2053 86 2016 1972 209 -1730 -2244 -325 2229 2696 229 -2742 -2802 413 3172 2553 -808
2162 -808 -2976 -1781 1296 2959 1517 -1304 -2417 -1208 1238 2682 1679 -1017 -2557 -1511 1306
2177 1306 2933 1458 -1542 -2656 -1013 1889 2842 1013 -1662 -2532 -895 1805 2702 876 -1853 -2787
2193 -2787 -588 2313 2920 317 -2742 -2656 248 2672 2146 -629 -2452 -1893 362 1909 1541 -435
2209 -435 -2079 -2095 -382 2049 2270 -275 -2892 -2745 424 2881 1865 -1483 -3443 -1556 1537 2676
$$ packed form
2099b637K962K835m60l035k429Q03K677K152o29k711k107L82L018K250q89l183
2115a001k242J420L157J722j693k994j273J752K561R67j378k359j328R67K916
2130A194J570j369l220j623K027L460J176k587l443k67K813K894j88k811k118
2145b492M39K139J930m4j763j939n14J919K554M67k467k971o0L215K759o19l361
2162h08k168J195L077J663j442k821j113J209K446J444j003k696j540J046K817
2177A306J627j475l000j114J643K902R53j829k675q70J637K700Q97j826k729r34
2193b787K199K901O07k603l059Q6K904K424n26k775j823N59K255J547l68j976
2209d35j644j6J713K431K21k545k617J47L169K457j016l348j960J887L093J139
$$ plain form
2225 2676 789 -1794 -2337 -779 1232 1907 852 -1047 -2098 -1220 1230 2761 1490 -1377 -2826 -931
2241 -931 2270 3193 744 -2136 -2396 124 2356 2468 246 -1928 -1806 58 2267 2465 273 -2071
2257 -2071 -1948 290 2585 2166 -356 -2470 -1879 895 2339 1624 -782 -2312 -1859 356 2094 1542
2273 1542 -785 -2770 -2071 641 2739 1335 -1753 -3373 -1458 1569 2460 431 -2115 -2434 -552 1322
2289 1322 1667 358 -1506 -2178 -1095 1264 2372 1058 -1691 -3023 -833 2427 3055 85 -2700 -2351
2305 -2351 686 2689 1982 -579 -2108 -1260 710 1932 1580 134 -1590 -1470 283 2357 2352 -205 -2505
2322 -2505 -1921 1087 3098 1748 -1073 -2656 -1038 1487 2366 853 -1181 -2191 -1094 1223 2297
2337 2297 1159 -1302 -2532 -1109 1579 2553 775 -1974 -2494 -470 1869 2075 95 -1884 -2030 -357
$$ packed form
2225B676j887k583n43J558K011O75j055j899j051Q78K450J531j271k867j449J895
2241i31L201R23k449k880k60K520K232J12k222k174J22J864K209J98k192k344
2257b071J23K238K295m19k522k114N91K774J444p15k406j530M53K215J738n52
2273A542k327j985O99K712K098j404l088j620J915L027Q91k029k546l19J882J874
2289A322L45j309j864o72J083K359J108j314k749j332K190L260O28k970k785L49
2305b351L037K003p07k561j529Q48J970J222l52j446j724J20J753K074nk557k300
2322b505N84L008K011j350k821j583J618K525Q79j513k034j010J097K317J074
2337B297j138k461j230J423K688R74j778k749n20K024K339K06j980j979j46J673
$$ plain form
2353 -357 1497 1966 267 -1888 -2289 -472 2171 2342 -54 -2608 -2383 508 2538 1739 -949 -2289
2369 -2289 -1343 827 1800 1141 -623 -1869 -1463 192 2200 1938 -411 -2479 -1930 1036 2912 1412
2385 1412 -1580 -2798 -868 1949 2440 541 -1541 -1779 -278 1310 1829 856 -926 -1815 -775 1381
2401 1381 2502 1060 -1700 -2618 -479 2276 2446 -77 -2361 -2025 423 2077 1543 -378 -1881 -1466
2417 -1466 97 1754 1763 -89 -2077 -1972 197 2208 1680 -784 -2675 -1685 942 2366 1205 -1194
2433 -1194 -2353 -1148 890 1984 1114 -974 -2302 -1320 1094 2369 1080 -1517 -2499 -793 1635 2255
2449 2255 443 -1755 -1943 -269 1533 1859 454 -1321 -1828 -484 1536 2245 608 -1870 -2259 -222
2465 -222 2265 2327 -229 -2476 -1764 901 2269 1339 -640 -1807 -1101 534 1701 1394 -183 -1600 -1783
$$ packed form
2353c57J854M69j699k155m01J817K643J71k396k554K25K891K030p99k688j340
2369b289R46K170R73o59j764j246M06J655K008k62k349k068N49K966J876j500
2385A412k992j218J930K817M91j899k082k38J501J588N19r73j782q89J040K156
2401A381J121j442k760r18K139K755J70k523k284L36K448J654n34j921j503M15
2417a466J563J657Rj852j988J05K169K011n28k464j891R90K627J424j161k399
2433a194j159J205K038J094q70k088j328R82K414J275j289k597r82J706K428O20
2449B255j812k198j88J674J802L26j405j775n07J344K020P09j637k478l89K037
2465b22K487O2k556k247P12K665J368r30j979j167P06J635J167l07j577j417j83
$$ plain form
2482 -1783 231 2208 1878 -766 -2501 -1666 1196 2625 1099 -1629 -2410 -548 1472 1926 508 -1349
2498 -1349 -1735 -495 1010 1770 803 -1058 -2058 -903 1318 2190 582 -1674 -2327 -283 2002 1989 -72
2515 -72 -2051 -1901 -16 1882 1653 -207 -1817 -1550 211 2026 1690 -524 -1974 -1375 663 1916 1321
2532 1321 -697 -1844 -1244 592 1903 1321 -577 -1891 -1404 624 2159 1421 -882 -2389 -1341 1400
2548 1400 2440 647 -1740 -2166 -186 1750 1667 68 -1317 -1485 -434 905 1595 630 -881 -1920
2564 -1920 -843 1432 2195 632 -1968 -2338 20 2199 1903 -454 -2239 -1523 773 2008 1047 -651
2580 -651 -1588 -988 430 1466 1311 -192 -1559 -1293 297 1917 1581 -672 -2135 -1465 842 2101 1002
2597 1002 -1149 -2105 -738 1069 1971 616 -1253 -1893 -631 1220 1811 405 -1448 -1868 -300 1347
$$ packed form
2482a783K014J977l30k644j735Q35K862J429j526k728p81J862K020M54j418j857
2498a349l86J240J505P60r67j861j000J155K221Q72j608k256o53K044K285j3k061
2515g2j979J50J885J898k29j860j610K67J761J815l36k214j450N99K038J253n95
2532A321k018j147O00J836J311n82j898j314M87K028J535p38k303j507J048K741
2548A400J040j793k387m26J980J936q3j599j385j68J051J339O90r65j511j039
2564a920J077K275P63j563k600l70K358K179k96k357j785P16K296J235r61j698
2580f51r37O00J418J036j55j503j367K66J590J620l36k253j463O70K307J259j099
2597A002k151r56J367J807R02j355j869o40J262J851N91j406j853m20J568J647
$$ plain form
2613 1347 1546 137 -1415 -1529 -248 1126 1569 359 -1317 -1800 -396 1639 2036 93 -2066 -1928
2629 -1928 411 2241 1530 -815 -2155 -909 1134 1823 742 -658 -1331 -693 447 1418 1183 -53
2645 -53 -1410 -1280 524 2213 1519 -823 -2274 -1088 1468 2491 668 -1577 -2038 -237 1552 1459 28
2662 28 -1303 -1316 -290 969 1297 296 -1335 -1669 -564 1151 1593 118 -1688 -1946 -217 1700 1581
2679 1581 -267 -1994 -1620 113 1586 1379 -604 -1966 -1453 473 1884 1072 -870 -1865 -786 914
2695 914 1619 775 -547 -1266 -656 491 1486 1028 -412 -1560 -1039 913 2353 1347 -1141 -2141 -608
2712 -608 1872 2229 237 -1834 -1606 462 1754 1318 -134 -1066 -944 3 956 1173 368 -965 -1674 -521
2730 -521 1396 1887 60 -1966 -1885 262 1979 1378 -896 -2055 -1124 832 1616 575 -866 -1500 -889
$$ packed form
2613A347J99j409j552j14J281J374M43j210j676m83J404K035L97j943k159J38
2629a928K339J830p11k345j340J246K043O89j081j400o73O38J140R71k35j236
2645e3j357J30J804J689o94k342j451J186K556J023j823k245m61J801J789r3j431
2662B8j331j3J026J259L28j001j631l34J105J715M42j475j806k58J729J917j19
2679A581j848j727L74J733J473k07j983j362N13J926J411q12j942r95J079J700
2695I14P05q44j322p19O10J147R95m58j440j148N21J952J440j006k488j000J533
2712f08K480L57j992k071K28K068J292m36j452r32J22R47R53K17q05j333p09J153
2730e21J917M91j827k026Q1K147J717o01k274j159R31J956P84j041j441o34O11
$$ plain form
2747 -889 460 1311 807 -605 -1661 -1186 470 1590 873 -921 -1721 -864 963 1629 539 -1031 -1680
2764 -1680 -544 1105 1673 579 -1124 -1645 -434 1546 1796 147 -1543 -1419 266 1558 1214 -144
2780 -144 -1208 -1026 145 1159 1225 241 -1000 -1256 -39 1617 1768 80 -1836 -1539 728 2215 1277
2797 1277 -937 -1900 -693 1276 1656 536 -865 -1219 -404 500 1099 813 -424 -1459 -1210 621 1831
2814 1831 1022 -1144 -2137 -816 1402 1841 -18 -1747 -1694 -61 1381 965 -281 -1242 -1258 -185 1049
2831 1049 1216 24 -1397 -1675 -268 1388 1454 -142 -1634 -1262 368 1725 1244 -421 -1489 -993 421
2848 421 1625 1309 -237 -1450 -1007 750 1825 1114 -742 -1699 -585 1240 1752 557 -812 -1207 -301
2865 -301 928 1388 674 -695 -1222 -702 844 1658 741 -1242 -1908 -457 1344 1620 -178 -1721 -1437
$$ packed form
2747h89J349Q51n04j412j056M75J656J120p17j794q00Q57J827O66j090j570o49
2764a680J136J649N68j094j703n21J211J980K50j649j690J24J685J292l44j358
2780a44j064J82J171J014O6r84j241k56J217J656J51j688j916K97K267J487r38
2797A277k214r63J207J969L80j120j401l54Q15R04N99k86j237j035K49J831J210
2814A831q09k166r93J321K218M39j859j729N3J633J442m16j246r61j6J073J234
2831A049J67j192j421k78J407J656O6j596j492L72J630J357m81j665j068M96J414
2848D21J204l16j546j213M43J757J075p11j856r57J114J825N12j195j369l95R06
2865c01J229M60p14j369n27N20J546Q14r17j983o66J451J801K76j798j543K84
$$ plain form
2882 -1437 196 1467 907 -369 -1196 -928 -33 943 954 12 -1208 -1495 -151 1294 1290 -235 -1885 -1518
2900 -1518 582 1747 975 -1082 -1674 -720 831 1420 582 -675 -1211 -647 615 1406 842 -474 -1544
2917 -1544 -839 979 1779 835 -1131 -1543 -219 1317 1497 311 -1137 -1308 -132 1017 1369 354 -1008
2934 -1008 -1263 -263 1269 1483 124 -1421 -1386 241 1365 1142 -345 -1341 -998 355 1260 844 -329
2951 -329 -1290 -1055 151 1312 1145 -300 -1611 -1165 648 1719 753 -851 -1659 -622 950 1252 273
2968 273 -783 -1193 -526 569 1159 647 -744 -1428 -846 891 1760 609 -1169 -1666 -182 1446 1336
2985 1336 29 -1443 -1150 221 1094 982 -67 -1019 -1130 -77 1050 1160 135 -1207 -1323 202 1426
3002 1426 1257 -401 -1500 -875 606 1533 917 -524 -1398 -595 568 1208 752 -554 -1290 -814 727
$$ packed form
2882a437J633J271n60j276q27K68Q95R76J1r42j220k87J344J445mj525j650L67
2900a518K100J165p72k057n92R54J551N89q38j257n36N64J262P91n64j316j070
2917a544P05J818Q00r44j966m12J324J536J80j186j448j71J176J149L52j015j362
2934a008k55J000J532K14j359j545L5J627J124k23j487r96L43J353R05m16j173
2951c29r61K35J206J161j67j445j311M46J813J071r66j604q08J037J572L02r79
2968B73j056m10O67J095N90n12j391o84N82J737Q69j151j778m97J484J628j10
2985A336j307j472K93J371Q73j12j049r52j11J053J127J10j025j342j16J525J224
3002A426j69j658j099O25J481R27o16j441q74Q03J163O40m56j306p36M76J541
$$ plain form
3019 727 1317 754 -813 -1438 -606 841 1363 408 -1031 -1287 -394 833 1155 312 -896 -1339 -367 1017
3037 1017 1326 280 -1166 -1482 -173 1365 1237 -152 -1309 -1017 279 1110 785 -316 -1009 -818 54
3054 54 1011 1035 -126 -1217 -1157 300 1386 1087 -496 -1754 -1004 777 1406 488 -830 -1274 -287 864
3072 864 1078 241 -644 -1048 -618 554 1300 609 -679 -1488 -562 1001 1412 242 -1197 -1321 -118 1223
3090 1223 1189 -63 -1049 -1015 -24 1043 992 17 -954 -1138 73 1125 1010 -279 -1164 -971 325 1335
3108 1335 884 -395 -1179 -729 404 1078 697 -352 -1251 -797 431 1368 755 -693 -1411 -616 801 1355
3126 1355 375 -888 -1200 -185 831 906 125 -650 -983 -387 506 1049 454 -810 -1261 -505 995 1443
3144 1443 129 -1267 -1245 140 1346 899 -444 -1175 -632 288 878 723 -40 -873 -803 -22 984 902 -171
$$ packed form
3019G27N90n63j567o25Q32J447N22r55j439k56Q93J227L22q43j208m43R72J384
3037A017L09j046j446l16J309J538j28j389j157K92J296Q31l25j101o93J91Q72
3054E4R57K4j161j091O0J457J086k99j583j258P50J781O29r18j318m44R87J151
3072H64K14q37q85m04M30J172P46o91j288q09R26J563M11j170j439j24J203J341
3090A223l4j252r86L4R91J067n1r75r71j84J211J052j15j289q85J93J296J010
3108A335m51j279p84M50J133O74l81j049q99M54J228R37o13j448p18P95J417N54
3126A355r80j263l12J015J016P5p81p75l33N96Q93N43n95j264m51P56J500M48
3144A443j314j396K2J385J206m47j343p31N43R20N90j55p63q33P0P81J006q2j073
$$ plain form
3163 -171 -1220 -1012 385 1347 912 -600 -1379 -638 683 1276 462 -588 -998 -306 620 1141 516 -636
3181 -636 -1071 -476 803 1339 454 -842 -1194 -155 1041 1096 7 -854 -964 -3 845 973 245 -728 -1096
3200 -1096 -78 1003 1134 64 -1155 -1133 338 1266 873 -492 -1297 -641 377 1021 390 -387 -858 -674
3218 -674 36 894 858 -103 -1191 -1142 315 1373 745 -827 -1619 -522 880 1287 191 -962 -1190 -68
3236 -68 717 845 289 -562 -862 -283 781 1084 515 -714 -1130 -171 1125 1213 37 -1181 -844 221 1217
3255 1217 926 -114 -833 -795 178 996 910 -70 -1053 -999 313 1303 893 -439 -1341 -747 609 1107 354
3274 354 -752 -992 -522 239 824 468 -457 -1145 -703 329 1151 586 -839 -1428 -524 865 1298 146
3292 146 -1065 -1174 -102 915 858 94 -747 -804 -280 640 757 429 -772 -1015 -196 995 1188 58 -1149
$$ packed form
3163a71j049K08J397R62m35j512p79P41J321N93q14j050m10O92R26N21o25j152
3181f36m35N95J279N36q85j296l52J039J196N5j089q61j10R61Q48J28p28r73l68
3200a096J018J081J31j070j219K2J471R28l93j365q05O56J018O44o31p77m71J84
3218f74P10Q58l6r61j088M9J457J058o28j572p92J097J402M07j096j153k28J122
3236f8P85J28n56q51l00N79J064L03n69j229m16R59J296Q8j176j218L37J065R96
3255A217k91j040p19L8R73Q18q6r80r83N4J312R90m10j332r02N94J356M98p53
3274C54j106k40M70P61N85l56r25o88M42J032Q22n65j425n89R04J389M33j152
3292A46j211j09J072J017n7p64q41n7N24R20J17l28j201k43Q19J191J93j130j207
$$ plain form
3311 -1149 -1000 281 1286 888 -338 -997 -500 482 1091 600 -193 -703 -695 403 1135 973 -324 -1067 -668
3330 -668 574 1297 597 -561 -1048 -405 726 979 244 -657 -944 -407 486 950 313 -503 -1127 -448 822
3349 822 1083 250 -1079 -1153 132 970 823 -219 -1003 -799 138 762 677 68 -691 -767 18 817 980 -69
3369 -69 -1232 -955 273 1183 820 -759 -1081 -599 595 981 408 -501 -872 -518 388 950 657 -394 -912
3388 -912 -607 501 1182 650 -522 -1167 -399 805 1180 213 -874 -950 -45 774 964 284 -692 -754 2
3407 2 824 988 288 -977 -960 53 981 882 -173 -966 -681 219 829 565 -289 -773 -760 143 813 702 -130
3428 -130 -945 -907 184 1029 798 -602 -1242 -629 527 908 256 -832 -1132 -350 439 886 313 -477 -821
3447 -821 -584 508 1046 330 -568 -1145 -313 825 1089 158 -861 -860 120 907 826 20 -717 -549 85 852
$$ packed form
3311a149J49J281J005l98j226o59M97R82O09m91p93n10QJ098P32j62j297p43L99
3330f68J242P23p00j158m87O43J131K53p35r01k87N37Q93M64o37q16o24O79J270
3349H22K61q33j329p4J285Q38j47j042p84K04R37O24q5o09p59p6P85P99J63j049
3369f9j163K77J228R10l63j579l22M82J194L86n73r09l71L54R06N62k93j051n18
3388i12L05J108O81n32j172o45P68J204L75r67j087p6R05Q19J90o80r76o2P56
3407BQ22J64p00j265J7J013R28r9j055p93K85R00O10k64q54m84J3R03O70j11q32
3428a30q15L8J091Q45k31j400o40O13J156L81o52j088l00P82P89M47n73p90l44
3447h21K37J092N38p16q98n77Q32J138K64r31j019JR80P87q1q06p37J68O34P67
$$ plain form
3467 852 867 27 -833 -744 50 1073 917 -116 -995 -632 186 935 586 -388 -871 -545 352 834 527 -208
3487 -208 -941 -526 322 952 664 -691 -1152 -583 576 1022 270 -771 -939 -179 681 802 43 -729 -695
3506 -695 -283 355 780 282 -614 -964 -337 582 1136 58 -933 -852 158 958 607 -158 -934 -670 189 688
3526 688 494 -10 -609 -643 200 803 723 -81 -852 -699 388 1018 626 -532 -918 -347 476 828 441 -447
3546 -447 -732 -322 446 735 441 -494 -912 -391 672 909 267 -640 -878 -138 693 666 -45 -707 -651 38
3566 38 634 603 39 -560 -856 -116 878 817 -81 -898 -744 177 942 789 -410 -867 -482 327 711 257 -266
3587 -266 -626 -430 251 711 571 -231 -996 -569 358 926 458 -575 -958 -325 628 874 226 -556 -717 -145
3607 -145 671 677 149 -513 -745 -310 622 806 93 -648 -809 23 674 788 -35 -773 -673 186 621 544 13
$$ packed form
3467H52J5q40q60Q9P94J023j56j033q79L63Q18P49l49r74m83L26Q97M82l07p35
3487b08p33M15Q48O30k88j355m61N69J159M46p52j041j68P60Q60J21p59p72L4
3506f95M12O38M25m98q96l50O27R19N54j078r91Q1J010Q00l51p65p76K64Q59M99
3526F88j94n04n99l4Q43O03q0q04p71J53J087O30l92j158l86N71Q23L52l87q88
3546d47k85M10P68K89k94r35m18N21J063K37o42r07k38P40Q31k7p11o62N6O89
3566C8N96l1n64n99k96P40R94o1q98q17J54R21P65j53j199m57L85Q09L84m54n23
3587b66l60J96O81M60j40q02p65M27R27N68m68j033l83O33R53K46o48p82j61N72
3607a45Q16On28o62k32M35R32J84p13p41j61Q32O51J14q23p38J00Q59M35p7n31
$$ plain form
3628 13 -520 -682 112 715 672 -86 -926 -720 263 856 570 -368 -940 -365 452 752 209 -430 -585 -227 339
3649 339 696 357 -335 -761 -526 269 790 513 -564 -982 -347 762 838 115 -806 -781 0 587 624 -8
3669 -8 -666 -552 -58 513 690 38 -738 -756 -83 867 751 -246 -851 -698 332 787 522 -344 -699 -446 195
3690 195 748 474 -98 -610 -568 188 933 426 -490 -920 -408 523 872 190 -620 -805 -203 617 627 214 -329
3711 -329 -606 -249 433 877 422 -567 -904 -190 761 890 134 -864 -752 222 821 479 -194 -623 -415 169
3731 169 557 351 12 -564 -575 -109 709 714 -178 -888 -721 233 764 492 -367 -870 -321 442 678 360 -431
3752 -431 -675 -354 230 797 257 -261 -894 -349 473 867 272 -688 -739 -219 688 817 63 -544 -552 -143 532
3773 532 621 243 -462 -718 -125 772 729 62 -754 -686 45 862 494 -209 -759 -348 371 707 555 -173 -493
$$ packed form
3628A3n33j62P94O03m3p58q40K06R83N93k86r38n72N75Q17L00n43o39j55L58N66
3649C39L57l39o92m26K35P95N21k77j077m18O35J109P6p23r21K5P81N87L7o32
3669ho58J14M94N71J77o52p76j8O73R50j16r97o05J53J030M55k65q66l55K53O41
3690A95N53k74n72n12M2P56P45n07r16m30N12R31L49o82q10j85O02Q20J0m13n43
3711c29k77L57O82M44m55r89l37P14R51J29p56r98J12R74N99l42o73m29K08N84
3731A69L88k06l39n76j1M66Q18Nq92p10J67R54N31k72q59n03N49P63K36l18p91
3752d31k44L21N84N67n40n18o33N45Q22L94n95r60n1N20R07J29p54o07qM09O75
3773E32Q9l78p05k56N93Q97m3o67q16O8P31Q17l68p03n50M11P19L36j52p28l20
$$ plain form
3794 -493 -360 165 614 576 -42 -723 -627 390 1026 693 -383 -922 -374 496 814 234 -428 -646 -143 419
3814 419 608 241 -335 -611 -277 469 827 307 -575 -788 -127 634 714 33 -686 -641 -32 649 574 -7 -638
3835 -638 -569 -34 634 476 45 -689 -614 131 786 624 -252 -618 -491 393 824 459 -166 -532 -226 389 687
3856 687 553 -91 -541 -433 373 811 611 -272 -729 -218 685 876 344 -563 -575 -6 500 536 144 -404 -456
3877 -456 -74 417 513 219 -429 -851 -192 625 728 3 -801 -652 118 737 442 -146 -636 -502 151 513
3897 513 403 -99 -541 -495 77 537 423 -146 -826 -396 195 723 269 -383 -691 -254 238 713 285 -233
3917 -233 -415 -128 276 696 470 -404 -604 -288 554 732 238 -568 -636 126 606 684 -32 -361 -373 -33 469
3938 469 382 68 -399 -570 -85 560 653 -15 -704 -527 253 740 420 -236 -704 -333 271 575 137 -299 -492
$$ packed form
3794d93J33N25M49l8o18o81R6J017O36l33j076n39N48Q70L18n80o62k18N03N62
3814D19J89l67n76k76L34P46L58n20q82k13O61P61Q0o81p19M5O09O81p5n81o31
3835f38O9N35O68j58m31p34P5P45O55j62q76l66J27Q84M31l65o25l66L06O15K98
3856F87j34o44m50J08Q06M38k00q83m57N11R03J91n32r07j2N69N06L6l92n48n2
3877d56L82M91R6k94o48m22O59Q17J03p25q04J49P70O19k95n88m90J34O53L62
3897E13j10n02m42M6N72M60j14n69o80M30N91N28m54o52l08M37M92M75m28n18
3917b33j82K87M04M20k26q74k00L16Q42J78m94q06o8P62M80P8p16l29j2L40N02
3938D69q7l14m67j71M85O45R3o68o89J77P80M87l20o56m68L71O04L04m38m36j93
$$ plain form
3959 -492 -307 26 473 353 -203 -727 -495 221 616 269 -383 -692 -339 409 606 154 -483 -544 -92 336
3979 336 428 239 -433 -592 -137 452 686 143 -606 -659 -15 622 524 -101 -557 -440 85 460 398 26 -333
4000 -333 -455 -3 551 508 -19 -590 -469 141 623 461 -256 -700 -270 394 714 120 -351 -545 -185 325
4020 325 553 260 -246 -586 -364 289 557 246 -391 -677 -249 473 533 130 -521 -558 -38 432 426 -47 -425
4041 -425 -481 -142 476 402 -123 -573 -615 85 531 367 -262 -713 -370 159 545 263 -266 -530 -260 154 541
4062 541 301 -234 -636 -549 276 703 517 -255 -684 -226 336 575 38 -416 -405 -49 408 299 51 -310 -476
4083 -476 -239 335 533 162 -360 -546 -101 502 755 -11 -695 -633 191 536 369 -107 -591 -382 32 500
4103 500 428 -57 -458 -538 23 534 395 -145 -694 -341 363 612 251 -346 -584 -247 210 454 225 -207 -550
$$ packed form
3959d92J85L33M47j20n56n24K32P16L95l47o52l09L53P48J97m52o37o1M52M28
3979C36R2j89o72j59M55N89K34n43p49n3O44O37r8o25m56J17N25L75o2l72l59
4000c33j22M52N54m3n27n71J21O10M82j62p17m44M30O64L20n94m71j94L60N10
4020C25K28k93n06l40K22O53K68l11o37k86M28P22O0m03o51l7N20M70om73l78
4041d25n6L39O18p4n25m50m2P00M46j64o29m51L43N29L86k82n29k64K70M14L87
4062E41k40n35m02Q7Q25M27j86p72m29M58N62K39n37m54J1L56M57j09k48l61j66
4083d76K37N74J98l71n22j86M45O03K53p66o84O2Q24L45j67m76m84K09M14M68
4103E00p2m85m01q0N61N11j39n40n49L53P04K49l61n97k38L37M57K44k29m32l43
$$ plain form
4124 -550 -286 305 661 325 -398 -515 -282 457 787 44 -493 -537 38 532 429 -37 -361 -366 -48 308 427
4145 427 210 -398 -551 40 434 556 34 -541 -470 201 766 388 -212 -512 -339 178 449 187 -18 -379
4165 -379 -243 123 358 255 5 -624 -352 201 623 246 -216 -639 -75 431 464 110 -341 -374 -48 363 480
4186 480 176 -256 -583 -135 408 508 99 -453 -546 -15 542 487 -176 -573 -286 70 350 331 -41 -435 -408
4207 -408 -70 477 421 -132 -593 -508 65 717 458 -167 -670 -362 384 460 108 -298 -391 -338 162 450 204 -162
4229 -162 -431 -295 309 636 159 -342 -652 -263 541 552 -24 -383 -482 -27 224 373 -54 -270 -347 -131 360
4250 360 607 115 -422 -495 -1 585 554 104 -572 -306 267 528 406 -110 -408 -203 103 413 395 -130 -481
4271 -481 -280 80 541 478 -221 -656 -230 279 650 227 -411 -503 -179 133 413 199 -200 -360 -176 172 471
$$ packed form
4124e50K64N91L56l36p23j17K33P39L30p43n37m4N75M94j03m66l24nL18L56J19
4145D27k17o08j53N91L94J22n22n75P1O71N65l78o00l00J73N17K71k62k05l61
4165c79J36L66K35j03k50o29K72N53M22l77m62m23N64N06L3l54m51l3L26M11J17
4186D80l04m32l27M48N43J00m09n52r3N31N57n5o63l97K87L56K80j9l72l94K7
4207d08L38N47n6n53m61Q5N73O52k59o25n03L08P46P6l52m06r3N3N00K88k46l66
4229a62k69J36O04L27m77n01l10L89Q04J1n76l59r9M55K51J49m27k16p7K16M91
4250C60K47m92n37p3M94N86l1m50o76K66N73K61j22n16k98K05L06L10j8n25l51
4271d81K01L60M61o3o99m35M26N09L71m23o38r2L24L12K80k14l99j60J84L48K99
$$ plain form
4292 471 173 -383 -600 -156 582 585 99 -453 -518 6 441 386 -88 -377 -258 163 231 358 47 -355 -479 -26
4314 -26 489 461 -71 -490 -413 234 657 383 -176 -445 -190 204 524 228 -183 -375 -246 238 557 336 -259
4335 -259 -534 -257 350 526 296 -240 -483 -146 324 536 52 -499 -418 -141 400 406 109 -313 -400 -164 406
4356 406 479 62 -395 -382 137 447 309 -66 -526 -268 189 340 179 -10 -337 -350 63 386 393 -23 -439 -379
4378 -379 201 519 389 -239 -497 -159 343 464 85 -247 -395 -34 317 389 191 -207 -338 -208 344 572
4398 572 290 -187 -445 -147 294 553 83 -335 -347 -45 423 383 5 -304 -276 -38 324 350 11 -300 -493
4419 -493 52 543 236 -125 -416 -198 163 352 136 -100 -462 -158 169 360 226 -49 -416 -224 120 477
4439 477 122 -223 -472 -311 253 496 61 -330 -428 -5 242 272 39 -317 -370 -105 326 392 210 -244 -427
$$ packed form
4292D71k98n56k17M44P38Lm86n52o5N24M35n5m74k89J19M21O8J27l11m02j24M53
4314b6N15k8n32m19P7O47M23k74n59k69K55L94L20k96m11j92J29M84L19k21n95
4335b59k75K77O07J76k30n36k43L37M70K12m84n51Q1K77N41Ok97m22q7K36N70
4356D06P3m17m57J3N19L10j38l75m60K58M57J51j61j89l27j3M13L23Pm16m16O0
4378c79N80L18j30o28k58L38N02J21l79l32j48L61L51P2j98l98j31J30N52K28
4398E72k82m77k58K98M41K59m70m18j2L02M68m0l78l09K8K38L62K6l39l11j93
4419d93N45M91l07l61k91K18L61J89k16k36l62L04L27J91j34k75l67J92L44L57
4439D77l55l45k49J61N64K43m35l91r8M23K47L0k33l56n3K65M31O6j82m54j83
$$ plain form
4460 -427 -78 470 528 19 -471 -244 112 355 217 -86 -291 -338 86 463 230 46 -270 -343 118 510 390
4481 390 -182 -434 -199 269 422 162 -175 -291 -277 185 388 212 -190 -341 -230 191 415 195 -368 -513
4501 -513 -250 336 464 51 -311 -450 59 267 201 37 -232 -272 -56 300 219 56 -347 -339 -60 352 357 -142
4523 -142 -362 -296 171 378 317 -202 -284 -250 212 316 221 -64 -282 -222 147 393 212 -51 -402 -281 206 535
4545 535 210 -288 -337 -203 233 359 62 -357 -314 -95 175 313 12 -246 -438 -159 324 452 5 -468 -445
4566 -445 184 392 254 -66 -404 -262 103 240 194 5 -255 -185 2 339 356 58 -400 -347 187 472 205
4587 205 -297 -339 -175 208 327 159 -178 -393 -80 224 347 239 -258 -320 -169 244 393 134 -292 -398 -118
4608 -118 308 368 136 -416 -299 114 247 370 99 -186 -317 -130 429 438 107 -368 -366 15 444 393 -96 -286
$$ packed form
4460d27L49N48N8n09m90K27L56K43j38l03k05m7M24L77k33j84l16p3M61L92j20
4481C90n72k52K35M68J53k60l37j16J4M62K03j76m02j51J11M21K24k20n63j45
4501e13K63N86J28m13l62j39N09K08o6j64k69m0K16L56q1j63m03QK79M12Nm99
4523a42k20O6M67K07o1n19q2L4M62J04r5k85k18O0L69K46j81k63l51J21M87L29
4545E35l25m98m9J34M36J26k97m19M3K19K70J38l01k58j92K79M83J28m47m73K3
4566d45O29K08j38l20l38J42L65J37m6j89k60P0J87L37J7k98m58N3N34K85k67
4587B05n02m2J64L83J19j68l37k15L13L04J23j08m97o2J51M13J49k59m26j06K80
4608a18M26O0k32n52J17M13J33J23k71k85j31J87N59Rl31m75KL81M29n1m89j90
$$ plain form
4630 -286 -77 279 261 191 -154 -290 -178 132 351 228 25 -241 -373 60 476 263 -182 -433 -169 329 485
4651 485 32 -245 -316 -37 226 314 110 -149 -344 -172 241 289 101 -322 -400 -71 227 364 25 -513 -392
4672 -392 27 418 243 -93 -309 -214 8 328 260 -51 -266 -387 80 314 242 -196 -389 -163 14 350 216
4693 216 -292 -440 -158 130 289 311 -84 -289 -241 99 444 167 -223 -429 -274 337 408 -45 -283 -247 35
4714 35 261 331 -16 -158 -209 -179 187 220 109 -272 -363 -184 389 429 74 -324 -299 135 413 303 -117 -402 -75
4737 -75 212 201 156 -139 -185 -147 16 268 277 -72 -312 -374 63 403 200 -148 -411 -102 255 350 134 -200 -265
4760 -265 -33 216 149 168 -180 -361 -154 170 366 75 -340 -374 -44 304 344 -29 -324 -210 84 318 303 -105
4782 -105 -303 -329 -150 182 338 10 -383 -327 122 350 254 -24 -362 -133 361 229 71 -41 -234 -167 53
$$ packed form
4630b86K09L56j8p0l45j36J12L10K19j23k03k66j32M33M16k13m45k51K64M98J56
4651D85m53k77p1K79K63Q8k04k59j95J72M13M8j88m23p8L29K98J37l39n38J21
4672c92M19L91j75l36k16R5K22L20o8l11k15j21M67K34p2m38j93K26J77L36j34
4693B16n08j48K82K88J59K2l95k05M8L40L45k77l90k06J55O11P1m53k38L6K82
4714C5K26P0l47j42n1L0L66L3j11l81r1J79N73M0l55l98K5M34K78j10m20k85L27
4737g5K87j1m5k95m6L8J63K52Rl49k40o2M37L40k03l48k63L09L57R5k16l34o5
4760b65K32K49o7J9l48j81K07L24J96k91m15l4L30L48M0l73k95J14K94K34j5m08
4782a05j98k6J79L32J56l28l93N6M49K28r6k78l38K29M94j32j58j12j93O7K20
$$ plain form
4803 53 338 80 -25 -366 -275 47 387 155 -278 -365 -136 294 365 44 -273 -301 63 268 216 -53 -312 -149
4825 -149 -49 268 269 139 -240 -309 -27 292 369 -10 -300 -268 47 312 288 31 -299 -103 170 344 263 -85
4847 -85 -237 -148 153 430 183 -121 -327 -191 251 263 146 -149 -365 -54 19 230 213 -131 -271 -200 149 293
4869 293 168 -111 -316 -74 277 305 14 -285 -243 -17 352 197 13 -246 -115 -41 208 206 165 -219 -318 32
4891 32 307 354 -160 -311 -355 59 242 160 -129 -392 -109 86 292 167 -132 -182 -52 -17 254 226 -26 -301
4913 -301 -167 345 281 179 -233 -327 -87 168 230 22 -241 -280 -177 239 258 104 -263 -156 -51 304 283 41
4935 41 -168 -230 -14 345 160 -176 -227 -141 -31 118 330 -35 -417 -190 169 380 270 -152 -416 -224 190
4956 190 277 156 -186 -259 -138 153 363 183 -155 -366 -199 31 226 191 -197 -298 -121 208 343 92 -220
$$ packed form
4803E3K85k58j05l41R1L22L40k32m33q7K29M30P1l21l17k8L64K05n2k69k59J63
4825a49J00L17Jj30l79o9K82L19P7l79k90L2L15K65k4k57l30J96K73J74q1l48
4847h5j52Q9L01K77k47l04k06J36M42J2j17k95k16L11P3K11j7l44j40P1L49J44
4869B93j25k79k05K42L51K8k91k99M2K26L69j55j84k59J31P4K49km1l84r9L50
4891C2K75M7n14j51m4M14J83q2k89k63K83J95K06j25k99n0J30L5K71k8k52k75
4913c01J34N12o4j02m12r4K40K55O2k08k63l9J03M16J9j54l67J07J05L55k1k42
4935D1k09o2K16L59j85l36n1Q6J10J49K12l65l82K27L59K11j10m22k64J92M14
4956A90Q7j21l42p3J21K91K10j80l38k11J67K30J95l5l88j01J77L29J35k51l12
$$ plain form
4977 -220 -298 -77 257 271 -29 -230 -193 -103 255 163 -60 -151 -75 -50 159 263 75 -333 -219 25 343 325 -172
5000 -172 -265 -196 189 316 130 -24 -206 -181 118 280 255 -112 -323 -111 235 304 151 -181 -266 -110 187 286
5022 286 117 -70 -228 -53 219 253 105 -84 -241 -97 364 199 70 -228 -285 -1 397 205 -56 -203 -276
5043 -276 69 191 209 -14 -62 -190 87 316 370 44 -280 -167 48 354 178 -165 -258 -126 349 223 67
5064 67 -216 -278 -32 213 201 95 -8 -255 -191 149 386 188 -199 -227 -79 159 285 88 -251 -199 40 282
5086 282 292 108 -138 -267 -52 76 169 39 -87 -161 79 245 200 -54 -277 -91 93 344 127 -93 -135 -59
5108 -59 155 198 276 -22 -205 -87 138 340 188 -255 -347 -131 242 363 68 -195 -237 1 148 261 123 -77
5130 -77 -104 -76 91 405 182 -134 -393 -154 300 456 148 -255 -230 142 249 224 -109 -194 -60 -33 182 118 -99
$$ packed form
4977b20p8K21L34J4l00k01L7R0L58r2k23r1P6K5K09J04j88m08J14K44L18j8m97
5000a72r3O9L85J27j86j54j82K5K99J62k5l67k11K12L46O9j53l32q5J56K97R9
5022B86j69j87j58J75K72L4j48j89j57J44M61j65j29k98n7K84L98j92k61j47p3
5043b76L45J22J8k23m8j28K77K29N4l26l24J13K15L06j76l43r3J32M75j26j56
5064F7k83o2K46K45j2j06j03k47O4L40K37j98l87k8J48K38J26j97l39N2K39K42
5086B82J0j84k46j29K15J28R3j30j26p4K40J66m5k54k23J86J84K51k17k20m2P6
5108e9K14M3P8k98j83J18K25K02j52m43r2K16L73J21k95k63m2K38J47J13j38k00
5130g7k7K8J67L14k23l16k59K39M54J56l08m03K5L72J07k5l33q5J34K7K15o4k17
$$ plain form
5153 -99 -124 -231 91 310 277 108 -258 -225 121 434 186 -100 -305 -121 283 217 2 -99 -166 -91 146 291
5175 291 44 -113 -273 -190 76 448 41 -255 -281 -119 270 181 -38 -144 -146 -40 192 126 47 -199 -248 19 180
5198 180 270 41 -264 -255 107 283 170 -99 -260 -102 -34 110 101 -6 -164 -122 -1 143 139 -41 -256 -255 187 286
5222 286 277 -110 -363 -92 250 158 21 -220 -227 21 112 88 11 -146 -118 -185 210 235 139 -259 -198 -122 156 150 -70
5247 -70 -335 -174 58 169 230 -151 -191 -185 87 198 145 -84 -226 -145 120 213 193 -77 -301 -208 143 307 197
5270 197 -47 -85 -161 109 169 139 -43 -121 -165 51 158 84 -133 -324 -7 132 285 -17 -200 -56 -90 29 147
5293 147 77 -144 -150 -144 56 264 86 -176 -331 -16 231 298 -17 -178 -212 55 232 109 -68 -239 -18 55 64
5316 64 148 -50 -188 -162 74 253 207 -64 -215 -123 142 290 99 -148 -304 -132 135 218 54 -190 -292 -38
$$ packed form
5153i9k5j07L22K19l3j69l66L3L46L13k48k86k05J84M04o6k15j01o7P5K37J45
5175B91k47j57j60Q3K66L72m07k96k6J62L89q9k19j06kJ06K32o6p9k46m9K67J61
5198A80R0k29l05RL62J76j13k69j61J58O8J44rj07j58M2J21J44mj80k15JM42R9
5222B86rl87k53K71L42r2j37k41pK48R1k4p7j57K8o7L95K5r6l98O1P6K78ok20
5247g0k65J61K32J11O1l81m0OK72J11n3k29j42Q1K65R3k0k70k24R3L51J64j10
5270A97k44l8p6K70O0l0j82p8m4K16J07p4k17j91L17J39J53l02j83J44l4J19J18
5293A47p0k21oOK00K08j78k62j55L15K47O7l15j61l4K67J77j23j77j71K21P3R
5316F4Q4j98j38K6K36J79m6k71j51R2K65J48j91k47j56J72K67Q3j64k44j02K54
$$ plain form
5338 -38 25 187 42 0 -209 -48 100 197 -10 -159 -195 -39 168 236 -13 -221 -44 -126 176 220 88 -139 -157
5361 -157 -167 253 216 -12 -277 -158 134 217 167 -70 -168 -65 36 201 199 -6 -119 -252 -25 72 165 18 -202
5384 -202 -161 264 329 212 -249 -208 -14 113 199 -4 -182 -191 -48 315 197 143 -93 -202 -85 139 220 22 -254
5407 -254 -164 11 123 136 19 -214 -215 151 158 131 -94 -179 -221 23 212 138 -19 -206 -207 46 117 73 -167 -306 -1
5432 -1 144 145 88 -108 -170 -56 14 138 81 -121 -240 -100 183 343 50 -97 -207 -141 293 97 26 -242 -62
5455 -62 43 150 146 78 -163 -215 -86 56 136 -6 -247 -285 76 248 310 -78 -189 -120 66 108 39 -258 -224 -34
5479 -34 84 214 55 -20 -91 -99 -102 363 284 -40 -265 -45 117 270 35 -145 -207 -87 -15 139 101 -188 -65 -43
5503 -43 144 213 83 -174 -125 36 158 227 -226 -146 -175 -16 118 100 -57 -117 -142 -65 128 168 64 16 -324 -65
$$ packed form
5338c8O3J62j45m2k09J61J48R7k07j49l6J56K07O8k49k08J77q2L02M4j32k27j8
5361a57j0M20l7k28k65J19K92Q3n0k37r8J03J01J65kk05j13j33K27R7R3j47k20
5384b02M1M25O5j17m61M1J94J27Q6k03j78rJ43L63j18n4k36j09J17K24Q1j98k76
5407b54R0J75J12J3j17k33jL66Pk7k25q5m2K44J89p4j57j87jK53P1m4k40j39L05
5432aJ45Jn7j96o2J14P0J24n7k02j19J40K83J60k93j47j10O6M34j96p1k68J80
5455f2J05J07mo8k41n2J29J42Q0j42k41l8L61J72O2l88j11O9J86M2o9k97L4J90
5479c4J18J30j59p5p1qlM65p9l24k25K20J62J53k35j80o2J20P2J54l8k89J23K2
5503d3J87O9j30k57M9J61J22O9m53Q0k9J59J34j8j57o0k5P7J93M0j04m8l40K59
$$ plain form
5527 -65 256 158 -38 -190 -154 131 165 36 -267 -71 -109 117 154 14 -19 -84 -67 61 239 122 -10 -221 -102
5550 -102 114 219 0 -78 -49 69 222 64 -11 -104 -236 -11 177 155 172 -110 -123 -102 234 307 4 -181 -67
5573 -67 -11 226 51 -112 -122 -138 179 108 196 6 -20 -112 17 190 125 -81 -353 -53 29 260 68 -116 -190 15
5597 15 162 169 44 -7 -208 -118 178 156 59 -59 -162 -98 42 259 33 -124 -167 16 224 98 -28 -205 -168
5620 -168 -20 260 72 28 -33 -102 -11 161 176 9 -101 -99 62 200 112 -104 -208 -173 128 320 28 -205 -230
5643 -230 64 47 157 125 -33 -103 -173 79 158 142 -167 -210 40 166 219 76 -106 -80 47 134 122 87 -46 -60
5667 -60 -110 110 208 107 -206 -199 14 172 231 -72 -110 -40 -72 80 34 -51 -99 -129 66 84 79 -74 -86 -63 -20 108
5693 108 89 -79 -205 -47 115 37 66 -160 -244 -30 130 103 5 -71 -111 -41 68 164 55 -110 -169 -125 93 195
$$ packed form
5527f5L21r8j96j52L6K85L4j29l03J96l8K26L7j40l3o5J7J28J78j17j32k11J19
5550a02K16J05k19p8K9J18J53j58p5r3j32K25J88k2J7k82j3K1L36P3l03j85J14
5573f7N6K37j75j63j0j6L17p1Q8j90k6r2J29J73o5k06k72L00Q2K31j92j84p4K05
5597A5J47Pj25n1k01R0K96k2r7j18j03O4J40K17k26j57m3J83K08j26j26j77L7
5620a68J48K80j88m4o1o9R1J72J5j67j10KJ61J38q8k16j04L5L01J92k92k33k5
5643b30K94j7J10l2j58p0p0K52P9j6l09m3K50J26N3j43j82K6J27Q7j2l5j33j4
5667f0n0K20R8j01l13PK13J58N9l03l8P0l2J52m6q5m8l0J95J8nj53j2K3M3J28
5693A08j9j68j26J58J62p8K9k26q4K14J60k7r8p6m0P0J09R6j09j65n9M4K18J02
$$ plain form
5717 195 50 -196 -169 -16 160 76 -24 -101 -158 -26 58 105 7 -20 -101 25 157 134 7 -81 -138 147 260 44
5741 44 -158 -161 -34 57 96 71 -24 -82 -49 101 209 51 -99 -293 -164 146 257 131 -101 -151 -92 104 192 80
5765 80 -77 -272 19 32 146 51 -110 -123 60 154 141 88 -192 -171 61 161 218 97 -161 -88 43 61 93 11
5789 11 -296 -124 122 156 93 -103 -265 -211 31 124 89 -46 -314 -185 92 143 63 -157 -133 -165 40 163 101 -47
5813 -47 -58 -85 85 217 15 -86 -110 -167 128 230 75 -168 -146 14 165 31 22 -91 22 -32 114 139 32
5836 32 -210 -35 99 92 229 -71 -95 -48 9 217 194 -6 -6 -36 16 165 82 -123 -63 -174 128 92 94 -153 -185 -167
5862 -167 58 86 21 -126 -111 15 18 134 24 -76 -179 -93 33 150 48 -142 -192 -117 166 207 -65 -68 -124 67
5886 67 149 -55 55 -61 -173 113 31 21 -11 29 -37 113 178 143 18 -119 -44 82 191 20 -5 -203 -65 141
$$ packed form
5717A95j45k46K7J53J76q4j00p7n7J32Q4M7r8k7q1J26J32k3j27q8n7K85J13k16
5741D4k02lJ27R1L9k5r5n8L3J50J08j58j50j94J29L10J11j26k32n0N9J96Q8j12
5765H0j57j95K91J3J14r5j61j3J83R4j3n3k80K1K32J00N7j21k58P3J31J8L2q2
5789A1l07J72K46L4o3j96j62N4K42R3l5j35k68J29K77N1q0k20K4l2K05J23o2j48
5813d7j1k7J70J32k02j01k4n7K95J02j55k43K2J60J51j34rj13J13n4J46K5j07
5836C2k42J75J34pJ37l00k4M7N7K08k3k00%l0N2J49q3k05O0j11L02l6Kk47l2J8
5862a67K25K8o5j47J5J26LJ16j10j00j03Q6J26J17j02j90n0P5K83M1k72ln6J91
5886F7Q2k04J10j16j12K86q2j0l2M0o6J50O5l5j25j37P5J26J09j71k5j98J38K06
$$ plain form
5910 141 34 -27 1 -161 -61 55 88 -10 -110 -192 -138 169 176 -37 -196 -128 -20 30 -18 -118 -79 -236 75 86
5934 86 39 29 -101 -94 -23 210 140 -92 -237 -101 30 114 48 -4 -145 -127 37 120 34 -24 -114 76 -1 211 211 -36
5960 -36 -97 -140 105 166 87 -105 -232 -127 129 65 37 -179 -145 -37 61 105 23 -58 -122 -94 131 186 -39 -130 -98 -54
5986 -54 84 115 61 -126 -140 150 132 85 60 -147 -132 -78 215 44 22 6 -89 88 132 203 -165 -48 -179 19 138
6011 138 220 -45 -186 -87 -101 76 46 7 -53 -96 37 217 22 -156 -194 -31 66 176 -162 -128 -206 -65 7 70
6035 70 -158 -120 -101 -13 170 59 73 -129 -53 -33 212 145 -85 -124 -73 85 253 38 -19 -61 -4 58 141 21 -69
6060 -69 -59 -151 96 117 125 -98 -190 -100 245 235 23 -112 -144 46 -25 124 29 -96 -206 -53 -56 94 89 -131 3
6085 3 8 107 201 -56 -136 -26 -27 162 12 -70 -91 -50 76 74 8 -67 -52 -52 41 224 166 -59 -173 -100 64 86 21 -105
$$ packed form
5910A41j07o1K8j62J00J16L3r8j00q2N4L07Pk13j59O8J08N0m8j00L9j57L11J1
5934H6m7j0j30PP1K33p0k32j45J36J31Q4o6n2j41J8J64Q3q6n8r0J90p7K12%k47
5960c6o1m3K45O1p9j92j27J05K56o4k8k16L4J08R8M4q2q1o4K8K25N5k25r1L2M4
5986e4J38L1n4j87j4K90j8m7k5k07J5N4K93j71k2j6r5J77M4P1l68J17j31J98J19
6011A38Q2k65j41R9j4J77l0l9o0m3J33J80j95j78l8J63R7J10l38L4p8J41P2O3
6035G0k28L8J9Q8J83j11J4k02P6K0K45o7k30l9N1J58J68k15n7m2N7O2Q3j20r0
6060f9J0r2K47K1Qk23r2R0L45j0k12j35l2J90p1J49r5j25j10J53lJ50nk20J34
6085CNR9R4k57q0J10jJ89j50q2k1M1J26ko6p5J5%R3J83n8k25j14P3J64K2o5j26
$$ plain form
6113 -105 -48 -17 -30 183 30 -17 -167 -69 57 251 145 -89 -241 -166 4 153 3 -55 -92 -18 50 160 30
6136 30 -12 -63 -89 138 81 66 -122 -171 -46 93 68 -26 -114 -65 -42 140 21 -33 -79 -18 1 77 210 2 80 -33
6162 -33 24 39 72 111 -42 -66 20 101 134 -169 -147 -89 54 90 -25 34 -8 -12 -1 124 148 27 -44 -133 54 174 88
6189 88 -95 -75 -33 166 140 -14 -152 -61 -49 196 -24 -120 -123 -33 92 39 76 -63 -104 3 74 142 83 -36 -64 -38
6215 -38 -1 214 69 64 -145 -89 35 76 84 1 -170 -15 95 149 28 -132 -136 13 187 207 -16 -98 -127 45 203
6240 203 102 50 35 -56 -122 114 41 4 27 -201 -96 138 -7 3 -77 -89 -21 123 92 -56 -168 19 28 83 58
6265 58 -70 -133 -110 77 -7 141 40 -5 -15 102 116 78 0 -30 -99 -24 84 -10 83 -82 -17 88 109 35 -102 -87
6291 -87 -72 231 86 20 -109 -47 -27 23 78 -44 -73 -112 -58 18 232 -41 -33 -95 -9 183 26 -48 -92 -82 -32 169
$$ packed form
6113a05N7L1j3K13j53m7j50R8J26J94j06k34j52P5J70J49j50n8l7P4O8J10j30
6136C0m2n1k6K27n7j5j88m9J25J39k5r4q8M9K3J82j19n4m6O1J9P6J33k08P8j13
6162c3N7J5L3L9j53k4Q6Q1L3l03K2N8J43L6j15N9m2mJ1J25K4j21p1q9J87J20q6
6189H8j83K0M2J99k6j54j38R1J2K45k20r6lR0J25n3L7j39m1J07P1O8n9j19k8K6
6215c8L7K15j45nk09N6J24M1Qq3j71J55J10N4j21j60mJ49J74K0k23q2k9J72J58
6240B03j01n2j5r1o6K36p3l7K3k28J05K34j45J0q0j2O8J44l1j48j12J87RN5k5
6265E8j28o3K3J87q4J48j01m5j0J17J4l8p8l0o9P5J08r4R3j65O5J05K1p4j37J5
6291h7J5L03j45o6j29O2K0N0N5j22k9l9N4P6K14k73Qo2Q6J92j57p4m4J0N0K01
$$ plain form
6317 169 28 -104 -28 -155 -74 105 79 -3 -146 -137 169 34 72 30 -102 -106 -48 122 -79 -119 -95 -95 135 196 -16
6342 -16 -10 -171 57 26 55 19 -19 -146 -55 -14 198 13 -141 -58 69 42 80 -5 -100 -57 -20 70 66 47 -1 -44 -114 184
6370 184 8 -118 -170 -40 -66 173 24 -18 -31 -155 52 112 -40 -31 -109 -25 -63 90 15 -66 -62 -151 146 72 154 -75
6396 -75 -148 17 88 142 -5 -65 -154 37 -3 6 -64 -10 -59 50 41 179 25 -94 -56 94 -2 72 -32 -55 -8 24 19
6423 19 111 -23 -139 -91 43 168 85 -94 -67 -148 -1 197 74 -129 -126 -64 104 11 -82 -109 -160 -12 -23 108 27
6448 27 60 -86 -109 161 143 -8 -34 -99 3 227 80 -49 -88 -58 109 116 -9 122 -21 -120 -3 36 24 64 -6
6473 -6 -100 73 93 -36 -158 -152 53 21 113 43 2 -64 -170 -87 -21 -60 -169 -102 -45 62 134 158 -46 -136 23 151
6499 151 135 -135 -200 -129 12 56 -82 -33 58 11 88 97 116 32 -80 -98 -36 96 65 -37 -84 -52 0 205 8 -41
$$ packed form
6317A69j41j32P6j27Q1J79k6q2j43RL06j35L8m2j32mN8J70k01m0K4%K30O1k12
6342a6Oj61K28l1K9l6l8j27R1M1K12j85j54Q3J27k7L8q5r5M3L7R0mj9m8m3p0K98
6370A84j76j26n2J30k6K39j49m2j3j24K07O0j52Rp8Q4l8J53p5q1Mq9K97p4Q2k29
6396g5p3J65P1N4j47o0q9J91m0Rp0N4m9J09rJ38j54j19L8J50r6P4j04k3M7L2n
6423A9R2j34j16M8J34J25q3j79K7q1J47J98j23k03LO2J68r3r3k7n1J48j1J31q1
6448B7L3j46k3K70j8j51k6o5J02K24j47j29l9L0J67Pj25J31j43r9J17L9j2M0p0
6473fr4J73K0j29j22OK05l2R2p0m1o6j06Q3O6l9j09O7N7J07P2K4k04r0J59J28
6499A51j6k70o5P1J41M4j38M9R1m7P7RJ9q4j12j8O2J32l1j02m7L2N2K05j97m9
$$ plain form
6525 -41 -126 -22 119 -16 52 14 -13 -57 -29 127 30 -77 -40 -24 -6 19 6 -98 -127 75 43 79 10 -90 -82 -10 -31
6552 -31 74 24 -93 -112 -64 131 66 -138 -64 -29 86 35 86 19 -87 -126 -12 19 85 81 -31 -87 73 45 47 25 -79
6579 -79 -101 -6 15 -46 -36 -66 -79 62 -4 35 30 12 -152 55 24 163 -31 -147 -225 67 134 72 -79 -83 27 52 129
6606 129 -5 -113 -110 1 45 17 166 30 -199 -58 9 97 58 -109 -190 14 100 77 -98 -99 5 84 40 53 -100
6631 -100 -129 -21 -54 11 116 46 -156 -18 20 83 125 -64 -124 72 181 48 58 -82 -98 -2 -30 78 22 13 -44
6656 -44 -103 38 55 128 -47 -113 -24 58 109 48 -215 -135 46 84 92 -107 -133 -52 -30 -26 159 -42 -8 -159 -99 12 25
6683 25 -50 -177 -32 -145 102 38 -52 -8 -125 35 129 -28 -24 -60 54 -33 80 37 -11 -99 -57 156 126 102 -93
6708 -93 -19 -93 46 -17 49 -37 -54 -68 42 40 35 1 -78 88 116 58 12 -85 38 69 42 -34 -17 6 -148 -22 18 23 -101
$$ packed form
6525d1q5J04J41j35O8l8k7m4K8J56r7j07L7J6J8K5j3j04k9K02l2L6o9j00QP2k1
6552c1J05n0j17j9M8J95o5k04P4L5J15n1N1o7j06l9J14L1O6mj12n6J60k8Kk2j04
6579g9k2R5K1o1J0l0j3J41o6L9nj8j64K07l1J39j94j16p8K92O7o2j51mJ10K5P7
6606A29j34j08LJ11M4k8J49j36k29J41O7Q8l9j67q1K04Q6k3j75jJ04P9m4J3j53
6631a00k9J08l3O5J05p0k02J38L8O3M2j89o0J96J09j33J0j40j6R6k8J08n6rn7
6656d4n9J41J7P3j75o6Q9Q2N1o1k63Q0J81L8Qj99k6Q1K2MJ85k01L4j51O0J11J3
6683B5p5j27J45j13K47o4r0M4j17J60R4j57Ml6J14q7J13m3m8q8M2K13l0k4j95
6708i3P4p4J39o3O6q6j7j4J10knl4p9J66K8n8m6r7J23L1k7p6J7K3j54J26M0Nj24
$$ plain form
6737 -101 55 -112 -32 139 189 18 -200 -111 -21 100 137 -79 -124 -77 93 80 -8 12 -20 26 138 -35 71 -64
6761 -64 -80 16 -38 134 -9 -96 -126 2 141 64 -45 -91 3 -122 191 83 19 -117 -7 -43 96 175 -25 8
6785 8 24 -84 93 174 -25 -152 -43 18 -33 49 -61 -25 5 -158 103 107 -8 -32 39 50 171 -122 -66 18 -69 37
6811 37 107 -27 -52 66 -77 44 78 164 -16 -49 -33 56 57 67 -146 -44 70 28 32 38 -48 -61 -47 46 237 128 -12
6838 -12 -85 62 55 179 -43 -102 -111 -7 117 72 4 -145 -69 53 124 -27 -5 -31 -36 52 47 20 -120 -98 9 8 55 46
6866 46 -65 -130 61 109 132 79 -82 -69 36 69 -108 71 6 -127 -34 -10 5 40 10 27 -14 50 62 -53 -58 -85 -36
6893 -36 -3 -23 -67 11 -77 -26 -22 37 -53 -67 -19 -46 92 65 -54 -52 37 -14 112 38 -47 -99 2 65 95 59 -126 12
6921 12 63 46 180 40 45 13 -18 18 23 138 -40 -140 25 52 32 83 -52 5 -48 37 22 33 -137 -98 -125 116 5
$$ packed form
6737a01J56j67Q0J71N0j71k18Q9R0J21L7k16m5M7J70j3q8K0l2M6J12j73J06j35
6761f4j6R6n4J72j43q7l0J28J39p7j09m6R4j25L13j08o4j36J10l6J39P9k00L3
6785HJ6j08J77Q1j99j27J09O1n1Q2j10L6L0j63K61Mj15k4P1J1J21k93N6Q4q7J06
6811C7P0j34k5J18j43J21L4Q6j80l3J6Q9JJ0k13J02J14m2MOq6j3J4R3J91j09j40
6838a2p3J47pJ24k22n9rJ04J24m5o8j49P6J22P1j51K2k6nQ8nk7j40K2J07jM7r
6866D6j11o5J91M8K3n3j61J3J05L3j77J79o5j33R3K4J5L5l0J7m1O4J2j15nk7M9
6893c6L3k0m4P8q8N1MN9r0j4M8k7J38k7j19KQ9n1J26p4q5n2J01O3L0l6j85J38
6921A2N1j7J34j40Nl2l1L6NJ15j78j00J65K7k0N1j35N7n3Q5j5J1j70L9k7K41j11
$$ plain form
6948 5 31 -223 22 96 116 -45 -129 -73 12 110 -52 30 40 -130 88 -23 154 -10 -49 -29 -65 80 122 59 -163
6973 -163 -146 80 120 22 62 -58 44 -69 -35 125 5 49 -23 43 123 136 -54 -68 26 28 135 11 -65 3 6 -32
6999 -32 190 56 -133 -14 -17 -39 90 68 -97 -10 -154 154 55 -13 16 -38 145 112 102 -83 -130 -37 40 38 48 -49
7025 -49 41 -143 -6 119 93 71 -38 50 55 44 79 2 -106 -37 -75 99 75 24 -68 -14 74 135 141 -76 -15 -24 103 36
7053 36 123 61 -37 5 96 4 11 -38 31 6 -38 90 -24 -62 -105 -78 24 104 21 100 -52 1 -80 24 48 69 -135 64
7081 64 25 57 127 -133 -89 -40 -73 189 -15 13 -108 -21 111 68 -14 -36 -18 36 -13 -37 46 68 -41 66 75 108 -56
7108 -56 -154 -57 -37 143 35 -124 -20 16 31 94 20 -15 41 -83 8 24 14 -17 -18 -2 -105 61 3 -23 -182 -67
7134 -67 -25 12 -40 75 27 23 34 38 -18 54 -32 -40 74 122 -23 -116 -35 -102 -2 -24 -9 -144 3 59 -21 81 -51 -136
$$ packed form
6948EK6k54K45P4K0j61q4N6Q5R8j62Q2J0j70K18j11J77j64l9K0l6J45M2o3k22
6973a63J7K26M0r8M0j20J02j13L4J60j20M4p2O6Q0J3j90j4R4KJ07j24p6O8Ll8
6999c2K22j34j89J19lk2J29k2j65Q7j44L08r9o8K9n4J83l3j0j85m7R3P7kJ0r7
7025d9R0j84J37J25k6k2j09Q8Nj1L5p7j08O9l8J74k4n1r2N4Q8O1Ok17O1rJ27o7
7053C6Q7o2r8M2R1r2Pm9O9k5m4J28j14l8m3K7J02Q0q3P9j52N3q1J04K4K1k04J99
7081F4l9L2P0k60M4M9l3K62k04K8j21Q7J32m3q2k2J8N4m9k4Q3K2j09J07RL3j64
7108e6r8R7K0J80j08j59J04L6J5O3p4l5N6j24R1J6j0l1jJ6j03J66n8k6j59J15
7134f7M2L7n2J15m8mJ1Mn6P2q6qJ14M8j45r3Q1o7J00k2J5j35J47N6q0J02j32q5
$$ plain form
7162 -136 -11 -2 -40 -37 -25 -75 -137 -12 60 -105 -55 -64 -92 83 83 74 -163 10 36 -56 28 -180 -60 -15 34 139 4
7189 4 100 22 -27 -28 -50 46 112 -10 -93 43 47 63 -89 -23 -46 94 146 46 27 -85 -3 -5 -8 22 32 -191 -49 19 112
7218 112 100 61 -99 -53 61 66 -4 -81 30 -19 42 -31 96 -144 -155 -165 126 -48 -10 -47 -105 -13 -23 -116 84 -50
7244 -50 -72 95 48 9 -77 -49 -50 -45 -57 -43 -78 16 -12 -28 -23 64 -95 -28 -16 -97 66 39 -94 19 -3 22 -11 4 -121
7273 -121 -53 40 -15 -34 78 135 19 -103 -100 67 -5 -5 -87 89 -72 80 -14 -3 -83 -63 7 145 17 -9 64 31
7299 31 114 115 -41 -193 63 -45 -16 140 -57 63 8 130 37 -8 176 -7 43 -22 -73 95 -141 -101 74 106
7323 106 68 103 8 -70 58 82 131 33 85 23 -15 52 -7 39 -114 63 -39 27 -58 88 -83 -27 88 -26 8 -25
7349 -25 38 -26 26 82 67 -51 -246 -66 -49 96 77 16 -87 -57 82 -16 141 -133 -140 47 -122 184 204 -124 -11
$$ packed form
7162a36J25Rl8LJ2n0o2J25P2j65N0rk8J75%rk37J73K6r2Q4k08J20M5M9J05j35
7189DR6p8m9jk2R6O6j22q3J36MJ6j52O6k3J40N2j00j9j12Q2klL0J0k23J42O8R3
7218A12j2l9j60M6J14Np0p7J11m9O1p3J27k40j1j0K91j74L8l7n8R2j0r3K00j34
7244e0k2J67m7l9q6K8jNj2J4l5R4k8j6NQ7j59O7J2q1J63k7j33J13k2K5l3J5j25
7273a21O8R3n5j9J12N7j16j22LJ67p2%q2J76j61J52r4J1q0K0P0J38j28k6P3l3
7299C1Q3Jj56j52K56j08K9J56j97J20n5J22r3m5J84j83N0o5n1J68k36M0J75L2
7323A06l8L5r5p8J28K4M9r8N2o2l8O7n9M6j53J77j02O6q5J46j71N6J15j14L4l3
7349b5O3o4N2N6j5j18j95J80J7J45j9o1j03L0J39r8J57k74pJ87j69L06K0l28J13
$$ plain form
7374 -11 -97 -33 0 10 29 -44 -84 95 31 71 -160 -117 26 31 107 149 -10 -54 -13 -27 37 -38 -39 -56 -40 132 64 -18 -124
7403 -124 -46 16 57 26 -56 6 -77 14 26 25 19 40 -66 17 51 -55 13 30 -87 -112 -13 34 4 -93 -80 14 -39 -1 28
7432 28 40 11 -80 -17 75 -13 5 87 103 27 -31 87 -33 -52 48 71 -22 11 -2 41 20 15 1 -72 34 7 40 25 -86
7461 -86 -18 -57 -18 38 -11 -60 -96 -147 131 50 -39 50 -131 -75 65 122 -32 87 -23 -119 -102 74 74 -9 34 -30 192
7488 192 37 42 -38 1 63 69 21 -57 74 -70 67 74 161 -23 -69 -71 -12 152 90 51 -42 -6 67 -7 -22 12 -17 27 81
7517 81 15 32 28 -60 -53 37 22 -18 71 23 33 34 30 73 -84 3 56 39 86 55 3 -97 1 -34 148 38 -37 -61 -111 71
7547 71 60 -27 -66 -4 -57 82 36 -47 91 -38 -8 27 34 -126 -111 -35 -22 43 94 61 -99 88 88 16 50 -67 -27 -31
7575 -31 219 86 -34 31 21 144 -57 -39 53 -9 -152 9 -7 9 -140 -30 -80 -97 44 4 -44 -122 -14 -54 1
$$ packed form
7374a1q6O4L3J0J9p3m0J79o4M0k31M3J43NP6M2j59m4M1j4O4p5jj7J6J72o8q2j06
7403a24P8O2M1l1q2O2q3R1J2joK1j06Q3L4j06O8J7j17k5R9M7l0r7J3R4n3L8K9
7432B8J2k9r1O3R2q8J8Q2J6p6n8J18j20j9J00K3r3L3j3M3k1nj4p3J06k7L3j5j11
7461h6O8l9L9N6m9m9l6n1K78q1q9Q9j81N6J40N7j54J19j10r6J7J76%q3M3o4K22
7488A92j55Nq0L9O2Om8p8J31j44J37PQ7j84m6kN9J64o2l9r3L6P3p4j5L4k9M4N4
7517H1o6J7mq8PR0j5m0Q9m8J0JmM3j57Q7N3j7M7l1n2j00R8l5J82j10p5k4n0J82
7547G1j1q7l9O2n3J39m6q3J38j29L0L5Pj60J5P6J3O5N1l3j60J87%p2L4j17M0m
7575c1K50j33j20O5j0J23k01J8R2o2j43J61j6J6j49J10n0j7J41m0m8p8J08m0N5
$$ plain form
7600 1 115 1 57 -111 -132 49 -9 7 -2 -41 -1 47 108 -79 -190 -63 11 -69 51 22 26 -35 -56 57 51 -36 -21 -36
7628 -36 14 5 -3 14 -96 -73 88 93 -5 56 41 -68 -20 30 104 -33 -33 -139 56 92 -38 61 1 -81 87 70 81 -113
7656 -113 -38 194 -57 174 -73 8 3 40 -23 -43 96 -46 -72 67 28 31 29 -32 20 38 29 -36 4 20 -7 -95 31 -37
7684 -37 -30 -46 -182 48 51 49 -77 -13 -52 47 -12 -4 -180 -41 -20 -72 -61 -64 55 -106 4 -109 -73 -25 -2 -96 -9 3
7712 3 -95 15 -51 -49 -113 45 39 -107 -31 -2 26 59 -14 109 4 -131 -30 37 30 -34 -38 11 -19 38 37 -81 -72 -52 38 22
7742 22 -22 -130 79 61 83 29 40 -50 -94 -109 -23 193 70 -16 -44 -55 -62 -67 -30 -126 -38 -76 130 17 -21 -48 -130 -18
7770 -18 -93 -16 -23 -33 -91 29 -69 9 82 -35 -31 -16 50 -66 32 2 -33 26 100 -5 10 -86 47 56 -3 114 63 -48
7798 -48 -73 -42 -9 -43 12 118 85 -72 33 92 120 4 -27 79 61 38 -71 100 -5 9 -2 -70 5 68 -88 98
$$ packed form
7600AJ14j14N6j68k1J81n8J6rl9M0M8O1j87j11J27P4q0J20k9Mo1k1J13oq7J5j5
7628c6N0rqJ7j10K3J61Nr8O1j5j09M8N0P4j37%j06J95L6j30R9o0q2J68j7J1j94
7656a13P5K32k51K31k47Q1nL7o3k0J39j42k6J39l9Lko1N2J8ro5M0J6k7q8J26o8
7684c7Pj6j36K30Lkj26O4l9R9n9Qj76J39K1n2J1lJ19j61J10j13L6M8K3r4Q7J2
7712Cr8J10o6Ko4J58oj46P6K9K8L3p3J23j05j35J01O7po4mM9l0N7jj18RK0R0j6
7742B2m4j08K09j8K2n4J1r0m4j5Q6K16j23q6k8j1pnL7r6Q8l8K06j13l8k7q2J12
7770a8p5P7pj0n8J20r8P8P3j17MJ5O6j16R8l0l5N9P4j05J5r6J33Rn9J17n1j11
7798d8k5L1L3l4N5J06l3j57J05N9K8j16l1J06j8k3j09J71j05J4j1o8P5O3j56J86
$$ plain form
7824 98 23 30 -68 -47 4 -36 110 19 59 -36 -47 29 112 -55 -169 -26 -46 17 -3 5 -97 -16 -3 86 -17 51 -138 20
7852 20 -28 -9 18 30 -105 27 122 73 -42 -69 -105 66 94 -20 125 -16 -127 -73 -29 92 28 -116 14 93 114
7877 114 38 36 -77 -11 99 53 -75 41 42 8 -8 122 37 -10 21 -75 123 13 116 -49 87 -11 69 14 -63 73
7903 73 -36 97 -3 1 -57 -54 9 82 -6 48 -40 -104 -100 13 61 9 53 -22 2 12 -5 23 -74 -76 -41 -53 34 74 -55 -38
7933 -38 -62 -57 80 40 -87 -66 0 -35 92 -24 -23 -29 -12 4 92 -133 110 -53 43 -79 66 123 21 -135 -77 128
7959 128 31 -49 50 -100 -51 30 149 -11 -37 91 -22 -57 -41 137 -55 -62 96 -31 50 -9 27 7 37 15 68 -4
7985 -4 -132 -12 -117 -44 182 7 -44 29 -40 62 149 -51 -58 -57 16 -39 25 45 -10 -4 1 26 -77 65 11 -16 88 27
8013 27 33 82 8 -90 24 211 31 71 -51 -5 59 6 -98 -30 35 3 95 60 -22 48 59 13 -60 165 -88 28 -77
$$ packed form
7824I8p5Pr8K1N1m0J46r1M0r5j1P6Q3j67j14J43k0O3k0Qj02Q1J3Q9j03O8j89J58
7852B0m8J9K7J2j35J32R5m9j15k7l6J71K8j14J45j41j11N4M4J21o4j44J30P9K1
7877A14p6kj13O6J10m6j28J16Jl4j6J30q5m7L1r6J98j10J03j65J36r8Q0n5p7J36
7903G3j09J33j00Mn8LO3P3q8N4q8o4MJ13M8n2M4p5K4J0j7K8r7kL5j2Q7M0j29J7
7933c8k4NJ37m0j27K1O6l5J27j16JoJ7J6Q8k25K43j63R6j22J45N7j02j56N8K05
7959A28r7q0R9j50M9Q1J19j60k6J28j13l5J6J78j92pJ58j27Q1n9L6k0L0k2N3p2
7985dj28J20j05P3K26j75n1P3o9J02Q7k00pJP3n5O4K0n5ONK5j03J42n4k7J04o1
8013B7OM9p4r8J14J87j80M0j22M6O4n3j04O8O5l2R2l5q2P0J1m6p3K25k53J16j05
$$ plain form
8040 -77 62 23 -52 -125 -96 -2 118 -14 -12 -33 37 -69 -102 67 76 11 -24 -22 34 -49 -48 5 -3 -113 16 55 -6 47 -62
8069 -62 112 -20 -52 -72 68 -21 24 46 31 156 83 52 -13 42 28 -55 -80 38 74 39 -8 -73 -8 84 -22 3 128
8096 128 -84 -99 -178 145 124 -55 -43 21 -7 87 -54 130 46 100 60 -3 -4 9 -4 -49 10 34 -52 -96 -107 -57 106
8123 106 133 53 -31 -34 100 55 18 -40 -36 35 49 -2 -57 -21 -28 61 36 60 43 72 -50 91 -26 27 -79 128 -59 -6
8151 -6 35 -23 68 52 -49 25 -32 -62 33 14 64 -48 80 45 -149 -90 6 -57 23 19 -144 40 -34 -17 -112 -86 35 54
8179 54 -17 70 -21 4 -38 16 -65 -54 -93 20 62 -14
$$ packed form
8040g7J39l9p5p3K9R4J20j32Kk1P0j06l3J69Ro5l5KN6q3JN3qj10J29L9o1N3j09
8069f2J74j32l2k0J40q9M5K2j5J25p3l1o5N5j4q3k5J18L6l5m7o5O5R2j06K5J25
8096A28k12j5p9L23k1j79J2O4k8R4j41J84q4N4m0o3jJ3j3m5N9K4q6m4j1N0J63
8123A06K7q0q4lJ34m5l7n8MP1J4n1n5L6pQ9k5K4j7K9j22J41j17N3j06K07j87N3
8151fM1n8R1j6j01P4n7l0R5j9N0j12J28l5j94N9R6o3Q0mj63J84p4J7r5K6J21J9
8179E4p1Q7r1K5m2N4q1J1l9J13M2p6
8191a4
$$ Imaginary data points
##PAGE= N=2
##DATA TABLE= (X++(I..I)), XYDATA
$$ plain form
0 0 0 0 0 0 0 0 0 0 0 0 0 0 0 0 0 0 0 0 0 0 0 0 0 0 0 0 0 0 0 0 1 -2 2 -4 4 -4 4 -4 5 -6 6 -6 7 -8 9 -10 10 -13 16 -17 20 -27
52 -27 33 -43 58 -83 125 -211 420 -1141 7313 65378 55374 -15818 -62100 -39460 16289 40221
68 40221 14656 -26234 -43231 -28870 2065 27593 27879 -3817 -42789 -47269 -4629 43196 39759
81 39759 -14794 -56388 -34023 27662 59270 28107 -28511 -49979 -17604 30943 47147 20036
93 20036 -21162 -36388 -10815 30442 45226 16433 -28378 -42930 -11249 33327 43712 10575
105 10575 -28643 -35027 -5674 28899 35689 8283 -28113 -37865 -7584 36674 48972 11585 -37301
118 -37301 -41859 5736 51629 43232 -8507 -42219 -20807 27127 46538 22947 -12162 -25395
130 -25395 -12216 11069 27823 25822 2749 -26290 -30369 2963 40853 35449 -14146 -52425 -32025
$$ packed form
0@%%%%%%%%%%%%%%%%%%%%%%%%%%%%%%JlMoQqQqRj1J2j2J3j5J7j9K0k3K9l3L7m7
52b7O0p6J01j41K08l36O31j561Q454N8065j0004p1192m6282K2640N5749K3932
68D0221k5565m0890j6997J4361L0935K5528K86l1696l8972m480M2640M7825l437
81C9759n4553m1594K2365O1685L1608l1163n6618k1468L2375M8547J6204k7111
93B0036m1198j5226K5573M1257J4784k8793m4811j4552L1681M4576J0385l3137
105A0575l9218o384K9353L4573O790k7406l6396r752L0281M4258J2298l7387m8886
118c7301m558M7595M5893q397n1739l3712K1412M7934J9411k3591l5109j3233
130b5395J3179K3285J6754k001k3073k9039m079L3332L7890n404m9595l8279K0400
$$ plain form
143 -32025 24815 51087 16377 -36034 -45429 -7178 30826 30038 -890 -26221 -25007 -3472 19227
156 19227 27609 13769 -14611 -31089 -13724 24343 41916 16573 -25195 -34801 59 39706
168 39706 39027 243 -33555 -27909 8131 36370 29469 -3385 -28599 -22945 7216 31537 24010
181 24010 -8931 -33142 -22266 11995 34152 22085 -10067 -29001 -17256 11223 29057 19913
193 19913 -7457 -26714 -16560 16646 39846 26400 -12935 -35954 -15362 27215 42423 13469
205 13469 -24231 -28099 3438 32070 28047 -77 -21778 -20537 -2801 15914 22069 9407 -14579
218 -14579 -27493 -12315 19234 31039 4299 -34054 -38034 -532 35305 29088 -9923 -35541
230 -35541 -21288 12266 27500 12364 -12589 -23131 -12320 9323 24386 20170 -2050 -23124
$$ packed form
143c2025N6840K6272l4710n2411r395L8251L8004p88l0928k5331J214K1535K2699
156A9227Q382j3840k8380j6478J7365L8067J7573k5343m1768r606L4860L9647
168C9706o79l8784l3798N646L6040K8239o901l2854k5214N654L0161K4321p527
181B4010l2941k4211J0876L4261K2157j2067l2152j8934J1745K8479J7834r144
193A9913k7370j9257J0154L3206K3200j3446l9335k3019K0592M2577J5208k8954
205A3469l7700l868L1537K8632m023k8124k1701J241J7736J8715O155j2662k3986
218a4579j2914J5178L1549J1805k6740l8353l980L7502L5837o217l9011k5618
230c5541J4253L3554J5234j5136k4953j0542J0811K1643J5063m216k2220k1074
$$ plain form
242 -23124 -20580 6443 30316 22387 -9999 -30128 -14451 19664 34125 13358 -19235 -29744
254 -29744 -9554 18203 26253 8304 -17216 -24806 -6792 18925 25707 5262 -22004 -27507 -4426
267 -4426 22615 25342 2804 -20375 -21130 19 21032 21597 1479 -20013 -21924 -277 25032
280 25032 26922 822 -26446 -24128 5475 29521 20192 -11304 -29041 -14424 13420 24464 10118
293 10118 -12628 -22487 -12972 5829 18248 13472 -6894 -24385 -18608 8127 27184 15448 -16430
306 -16430 -32168 -12382 20889 29372 5337 -21797 -23124 -826 19726 19058 1514 -15015 -16842
319 -16842 -2965 15666 22209 7240 -16887 -24527 -5394 21541 25540 902 -24820 -22097 4877
332 4877 25158 17423 -8211 -24444 -16487 5746 20461 14777 -5102 -20522 -16160 4875 21755
$$ packed form
242b3124K544K7023K3873p929l2386k0129J5677L4115J4461k0767l2593j0509
254b9744K0190K7757Q050j7949k5520p590J8014K5717O782k0445k7266n503K3081
267d426K7041K727k2538k3179p55K1149K1013N65k0118k1492j911K1647K5309
280B5032J890k6100k7268K318K9603K4046r329l1496j7737J4617K7844J1044j4346
293A0118k2746r859R515J8801J2419m776k0366j7491N777K6735J9057j1736l1878
306a6430j5738J9786L3271Q483k4035k7134j327K2298K0552o68j7544j6529j827
319a6842J3877J8631O543j4969k4127p640J9133K6935L999k4638k5722K723K6974
332D877K0281p735k5634j6233P957K2233J4715n684j9879j5420M362K1035J6880
$$ plain form
345 21755 15560 -8832 -25034 -14670 11846 26167 13209 -11744 -22406 -9530 12435 21284
357 21284 9423 -11482 -20644 -8419 14454 24876 10532 -15715 -25400 -7508 18488 23467 2775
370 2775 -19643 -19521 1280 19102 16482 -1417 -17010 -17597 -3057 14292 18841 4289 -16526
383 -16526 -21314 -2075 21831 21888 -3933 -26776 -19699 8899 26637 15029 -10317 -21014 -8843
396 -8843 9777 16441 8034 -6734 -15984 -11492 4752 19348 16010 -5624 -24029 -16994 9569
409 9569 25078 11072 -16549 -25568 -6272 18437 21416 1689 -17747 -18650 -3275 12742 15841
422 15841 4163 -11758 -17200 -5195 14228 20429 4638 -17358 -21025 -1180 20473 20562 -6
435 -6 -18170 -15225 3975 19055 15414 -2476 -17343 -14786 3650 20041 17065 -3804 -21013 -15694
$$ packed form
345B1755o195k4392j6202J0364K6516J4321j2958k4953j0662J2876K1965Q849
357B1284j1861k0905r162J2225K2873J0422j4344k6247r685J7892K5996M979k0692
370B775k2418J22K0801J7822k620j7899j5593n87J4540J7349M549j4552k0815
383a6526m788J9239K3906N7k5821k2843P077K8598J7738j1608k5346j0697J2171
396h843J8620O664q407j4768r250M492J6244J4596l338k1634j8405P035K6563
409I569J5509j4006k7621r019J9296K4709K979j9727j9436r03J5375J6017L099
422A5841j1678j5921n442J2005J9423O201j5791k1996l667J9845K1653Q9k0568
435fj8164K945J9200J5080l641j7890j4867K557J8436J6391k976k0869j7209N319
$$ plain form
449 -15694 6960 21353 11473 -10937 -20998 -9580 9589 16656 6384 -9689 -17690 -11040 4377
462 4377 15674 10563 -8435 -22338 -14050 9804 22314 7858 -18385 -25614 -5118 18298 18683
475 18683 -1965 -18731 -15475 840 12337 10515 -222 -10942 -13987 -4988 10448 17277 5157
488 5157 -15778 -21911 -3428 19728 20267 -3173 -22658 -15804 7966 21162 10954 -9003 -17548
501 -17548 -8443 7106 15107 10116 -3366 -13815 -10945 4529 17537 12879 -6364 -19433 -10985
514 -10985 10671 20910 9076 -11175 -18596 -6629 10622 15910 4759 -11668 -17202 -6606 10761
527 10761 17241 4442 -15222 -20790 -5746 13403 15476 -1480 -17633 -15634 698 13076 10405
540 10405 -2848 -14029 -13855 -2563 10454 13756 2240 -14199 -17318 -1161 17751 16692 -4436
$$ packed form
449a5694K2654J4393r880k2410j0061J1418J9169P067j0272j6073q001O650J5417
462D377J1297n111j8998j3903Q288K3854J2510j4456k6243p229K0496K3416L85
475A8683k0648j6766L256J6315J1497j822j0737j0720l045Q999J5436O829j2120
488E157k0935o133J8483K3156N39k3440j9485O854K3770J3196j0208j9957q545
501a7548R105J5549Q001m991j3482j0449K870J5474J3008m658j9243j3069Q448
514a0985K1656J0239j1834k0251p421J1967J7251N288j1151j6427n534J0596J7367
527A0761O480j2799j9664n568J5044J9149K073j6956j6153J999J6332J2378k671
540A0405j3253j1181J74J1292J3017L302j1516j6439l119J6157J8912j059k1128
$$ plain form
553 -4436 -21875 -14529 8636 21208 9747 -10207 -16394 -5518 8436 12335 4727 -5751 -11597
566 -11597 -8034 3566 14374 11855 -4676 -18122 -11983 8606 20195 8872 -12859 -18980 -2792
579 -2792 16168 17280 1471 -12922 -12548 218 12242 13229 3449 -8416 -11484 -1516 12845 16056
593 16056 3143 -12943 -14422 911 16283 14640 -1439 -14464 -11464 3049 13588 10382 -3359
606 -3359 -14372 -11920 2092 14176 11336 -4977 -17789 -12413 5540 16058 7441 -10067 -16850
619 -16850 -6386 8807 12820 3682 -8115 -12360 -6028 5337 12513 7667 -5618 -14696 -8143 9166
633 9166 18078 7121 -12286 -17319 -2150 15696 16127 -15 -13565 -10643 3247 12657 10207 241
647 241 -8308 -8468 242 11122 13554 3428 -10353 -12585 1117 16352 15397 -1169 -14276 -9352
$$ packed form
553d436j7439P346K3165J2572j1461j9954o187J0876J3954L899p608j0478n846
566a1597L563J1600J0808k519j6531j3446O139K0589J1589j1323k1731o121J6188
579b792J8960J112j5809j4393L74J2766J2024R87r780j1865l068R968J4361L211
593A6056j2913j6086j479J5333J5372j643j6079j3025L000J4513J0539l206j3741
606c359j1013K452J4012J2084k840j6313j2812N376J7953J0518q617j7508o783
619a6850J0464J5193M013r138j1797m245O332J1365P176m846j3285r078O553J7309
633I166Q912j0957j9407n033J5169J7846M31j6142j3550K922J3890R410k450r966
647B41q549j60Q710J0880K432j0126j3781k232J3702J5235r55j6566j3107M924
$$ plain form
661 -9352 7359 17170 9884 -5225 -12445 -5977 6767 13742 8638 -3907 -12093 -7485 5647 13968
675 13968 7547 -7671 -15423 -6773 8530 13687 3711 -10255 -13951 -4711 7293 10484 2518 -9214
689 -9214 -13407 -5079 8437 13313 3289 -11745 -15023 -2295 12866 13610 -669 -13293 -10171 3710
703 3710 13300 9588 -2074 -9832 -7500 2244 10652 10880 1236 -9743 -10069 1928 14059 12161 -3193
718 -3193 -14877 -9362 7122 16080 7797 -7175 -12814 -4503 7723 11524 4642 -5875 -10411 -4848
732 -4848 6532 12705 6794 -6159 -12721 -5394 8918 14177 4203 -9623 -12095 -1052 11157 11637
746 11637 1235 -9593 -10638 -1180 9367 10761 1436 -10100 -11677 -707 11302 11041 -1798
759 -1798 -13348 -11142 2549 12279 7977 -4463 -11666 -7490 3013 9676 6699 -2796 -10498 -8465
$$ packed form
661i352J6711R811p286j5109p220O468J2744O975n104j2545q186M608J3132Q321
675A3968o421j5218p752Q650J5303N157r976j3966l696R240J2004L191p966j1732
689i214m193Q328J3516M876j0024j5034l278J2728J5161P44j4279j2624L122J3881
703C710R590l712j1662p758K332R744Q408K28r644j0979l26J1997J2131j898j5354
718c193j1684N515J6484Q958q283j4972n639Q311J2226L801o882j0517m536N563
732d848J1380O173n911j2953o562P327J4312N259r974j3826k472J1043J2209M80
746A1637j0402j0828j045R458J0547J394r325j1536j577J0970J2009k61j2839
759a798j1550K206J3691R730m302j2440p203M176J0503O663k977r495p702K033
$$ plain form
773 -8465 2475 12104 9342 -4063 -13487 -8133 6672 14504 6286 -8291 -12890 -3145 9248 11504
787 11504 2557 -7413 -9602 -2788 6744 10157 4114 -6464 -11146 -4210 8492 12455 2940 -10289
801 -10289 -12294 -783 11439 11027 -800 -10542 -8819 1451 9996 8854 -506 -9292 -8635 1221
815 1221 10822 10065 -1306 -11661 -9147 3606 12594 8027 -4829 -11670 -5866 5313 10311 4975
829 4975 -4736 -10089 -6295 3574 10084 6544 -4888 -12334 -7179 5953 12654 4635 -9222 -13153
843 -13153 -2931 9627 10845 588 -9300 -9052 -530 7336 8207 1663 -6626 -9102 -2315 7955
857 7955 11136 2442 -9513 -11557 -359 11614 10633 -1919 -11652 -8214 3669 10897 6669 -3447
871 -3447 -9544 -6600 2334 9098 7275 -2083 -10056 -7865 3155 11293 7234 -5100 -12022 -5743 6597
$$ packed form
773h465J0940R629k762j3405r424N354J4805P832q218j4577m599R745J2393K256
787A1504q947r970k189O814R532L413o043j0578m682O936J2702L963r515j3229
801a0289k005J1511J2222m12j1827r742J723J0270Q545j142r360q786O57R856
815A221R601p57j1371j0355K514J2753Q988m567j2856o841N804J1179M998n336
829D975r711n353L794R869O510l540j1432p446N155J3132O701q019j3857l931
843a3153J0222J2558J218j0257r888K48Q522P866Q71o544q289k476O787J0270
857G955L181q694j1955k044J1198J1973r81j2552r733L438J1883P228m228j0116
871c447o097K944Q934O764j823r358p973K191J1020Q138m059j2334o922O279J2340
$$ plain form
886 6597 11306 4187 -6371 -9743 -3240 5704 9175 4030 -5193 -9842 -4409 6511 11447 4413 -7899
901 -7899 -11766 -2296 9803 10938 -55 -9857 -8645 1262 8839 7198 -804 -7419 -7308 -924 6863
916 6863 8489 1369 -8738 -10126 -273 10630 9874 -2408 -12391 -8548 4716 11532 5566 -5411
930 -5411 -9921 -4316 4529 8155 4399 -3242 -8393 -5829 3000 9735 6517 -4332 -11195 -5890 6372
945 6372 11550 3812 -7914 -10437 -1968 7784 8868 1429 -6851 -8069 -1873 6388 8823 2528 -6926
960 -6926 -9697 -1775 8636 10076 526 -9757 -8850 1872 9961 7472 -2183 -8292 -5806 1965 7749
975 7749 6436 -596 -7505 -7381 831 9565 8634 -2027 -10948 -7421 4713 11690 5729 -6223 -10483
990 -10483 -3038 6314 8472 2356 -5055 -7256 -3151 3673 7475 4464 -4039 -9574 -5246 5374 10593
$$ packed form
886F597M709p119j0558l372O503Q944L471n145r223m649N433J0920M936p034j2312
901g899l867R470J2099J135j0993r802J212R907P577j641q002o615J11O384P787
916F863J626p120j0107j388R853J0903p56j2282r983L843J3264O816n966j0977
930e411m510N605Q845L626l756p641n151K564Q829O735l218j0849o863N305J2262
945F372N178p738j1726k523Q469R752J084p439q280j218O196Q261K435o295r454
960f926k771P922J0411J440r550j0283R07J0722Q089k489r655o109K486P771N784
975G749j313p032o909J24Q212Q734r31j0661q921L527J2134O977n961j1952m260
990a0483P445R352K158o116p411k201M105O824L802l011q503n535M328J0620N219
$$ plain form
1005 10593 3478 -8082 -11154 -1921 8638 8929 -662 -8977 -7734 349 6984 6244 -588 -6961 -7367
1020 -7367 -916 6684 7914 41 -8691 -8464 1028 9555 7431 -2850 -9547 -5708 3832 8802 5153
1035 5153 -2697 -7205 -4597 3063 8470 6222 -1996 -8350 -5421 4705 10916 5713 -5238 -9447
1049 -9447 -2532 7508 9686 2146 -6003 -6859 -711 5667 7099 2365 -4302 -7355 -3005 5132 8820
1064 8820 2890 -7221 -9951 -1668 8454 8720 -1203 -9787 -7976 1668 7777 4722 -2895 -7559 -5615
1079 -5615 407 5799 5056 -1264 -7666 -7477 312 7865 6459 -2971 -9977 -6211 3908 9167 4227
1094 4227 -4948 -8352 -3202 4799 7656 3574 -3634 -7072 -3184 4616 8624 4362 -4551 -8139 -2156
1109 -2156 7075 9314 2172 -6144 -6838 56 7183 7205 823 -5204 -5859 -511 6008 7440 1546 -6212
$$ packed form
1005A0593p115j1560l072R233J0559K91r591q315J243Q083O635p40o832o373m06
1020g367O451P600J230p873q732K27R492Q527k124j0281o697L839R540M970l649
1035E153p850m508K608P660N407k248q218o354K929J0126O211n203j0951m209
1049i447O915J0040K178p540q149q56O148O378J432m734o667l053M350Q137L688
1064H820n930j0111k730Q283J0122K66r923q584J811R644O109l055p617m664J944
1079e615O022N392p43o320o402J89P789P553j406r430p006L766J0119N259m940
1094D227r175l404N150Q001K857m082p208l438L888P800M008m262q913l588N983
1109b156R231K239p142q316o94O894P127K2o382o027o55N348O519J432n894p758
$$ plain form
1125 -6212 -7722 -664 7937 7910 -948 -9024 -6987 2603 8479 4893 -3553 -7890 -4151 2604 6079
1140 6079 3612 -2335 -6715 -5422 1131 6824 5234 -2861 -9049 -5801 3715 8775 3623 -5972 -9104
1155 -9104 -2797 5437 7104 1182 -5734 -6816 -1907 4310 6295 1733 -5118 -7451 -2454 5337 7508
1170 7508 1220 -6649 -7595 -213 6940 6513 -515 -6657 -5726 952 6482 5820 -198 -6151 -5795 713
1186 713 7447 6645 -1258 -7567 -5277 3213 8801 5053 -3328 -7173 -3108 4103 6858 3450 -2727
1201 -2727 -5606 -3106 2875 6719 4352 -2848 -7608 -4114 4318 8492 3270 -5817 -8451 -1857 6081
1216 6081 6791 -67 -6397 -6316 -575 4833 5010 42 -5253 -6303 -1830 4412 5927 168 -7038 -7482
1232 -7482 -478 6595 5640 -1996 -8056 -5796 1589 6367 4030 -2470 -6670 -4644 1709 6220 4600
$$ packed form
1125f212j510P058Q601k7q858q076K037R590N876l586q446m337L739O755L475
1140F079k467n947m380J293O553N693j590q095o188L248R516N060n152r595l132
1155i104O307Q234J667n922o916j082M909O217J985m562o851k333M997P791K171
1170G508o288p869r46P382P153m27p028o142R31O678N530o62o018n953L56O508
1186G13O734q02p903o309K290Q490N588l748q381l845M065P211K755l408o177
1201b727k879K500N981L844k367p200m760L494Q432M174n222r087k634O594P938
1216F081P10o858o330Q1N741N408J77m968n295j050M473O242J515n759p206m44
1232g482P004P073r55p636o060K260P385M778k337o500m200K026O353M511j620
$$ plain form
1247 4600 -2088 -6977 -4654 2985 7601 4263 -3503 -6933 -2597 4663 7136 2592 -3592 -5445 -1621
1262 -1621 4233 6628 3287 -2945 -6149 -2373 4946 7865 2673 -5394 -7190 -719 6843 6821 -256
1277 -256 -6460 -5487 835 5519 4391 -785 -5007 -4866 -486 4443 5080 -160 -6276 -6569 74 6451
1293 6451 5447 -2257 -8010 -5122 2595 6733 3213 -3627 -6578 -3023 2654 5439 2915 -2570 -6007
1308 -6007 -3678 2517 6478 3571 -3607 -7005 -2741 4638 6851 1711 -5037 -6094 -1006 4686 5513
1323 5513 1165 -4073 -5222 -1328 4524 6190 1467 -5040 -6333 -418 6470 6527 -247 -6550 -4969
1338 -4969 1800 6348 4173 -1644 -5152 -3297 1398 4930 4252 -526 -5221 -4891 725 6184 5052
1353 5052 -2021 -7211 -4414 3507 7354 2893 -4438 -6554 -1897 3905 5272 1565 -3367 -4761 -2018
$$ packed form
1247D600o688m889K323P639M616l338p766l430M336P260K473m544o184j853L824
1262a621N854K395l341o232l204L776P319K919n192q067j796O471P562k2p077
1277b56o204R73O322M684j128n176m222J41M380M929O37n240o116k93O643O377
1293F451j004p704n753K888P717M138l520o840k951L555N677K785k524n485l437
1308f007K329O195L961k907p178l398M264P379K213n140o748j057N088N692Q27
1323E513m348n238j149L894N852J666m723o507j293N915O888N7o774o303J581
1338d969O769M548k175n817l508J855M695L532o78m778m695L30N616N459j132
1353E052p073n190K797P921L847m461p331k116M657N802J367l707m932j394K743
$$ plain form
1368 -2018 2894 5401 2586 -3366 -6381 -2517 4530 6736 1699 -5317 -6281 -287 5493 5232 -470
1383 -470 -5209 -4522 356 4641 4503 234 -4528 -5210 -373 5341 5358 -722 -6228 -4962 1827 6446
1399 6446 3995 -2667 -6112 -3005 2516 5060 2729 -1850 -4562 -3119 1532 5284 4009 -2023 -6453
1414 -6453 -3816 3486 7144 3092 -4263 -6489 -1231 4919 5463 369 -4337 -4433 -487 3588 4398 1297
1430 1297 -3130 -4959 -1958 3740 5821 1311 -5058 -6076 -294 5929 5411 -881 -5933 -4170 1657
1445 1657 5257 3569 -1219 -4471 -3440 1047 4632 4067 -725 -5149 -4275 1509 6063 4064 -2455
1460 -2455 -6218 -3083 2995 5539 2008 -3261 -4911 -2020 2525 4542 2169 -2613 -5475 -3037 2676
1475 2676 5716 2157 -4322 -6380 -1389 4864 5612 128 -5145 -4669 387 4283 3745 30 -3348 -3643
$$ packed form
1368b018M912K507k815n952l015L864P047K206n037p016r64N994N780k61n702
1383d70m739O87M878M285j38m269m762o82M837N714J7o080n506J266O789M619
1399F446k451o662l445L107N521K544k331m579k712J443M651L752j275o032m430
1414f453K637P302L658m052p355k226N258O150N44n094m706r6L946M075Q10l101
1430A297m427j829L001N698K081m510o369j018N782O223n18o292n052J763N827
1445A657L600j688m788l252J031M487L585n65m792m424Q74N784M554j999o519
1460b455l763L135O078K544l531n269j650K891M545K017k373m782k862K438N713
1475B676L040l559o479k058M991O253P48n484n273M76N056L896n38l715l378k95
$$ plain form
1491 -3643 -427 3615 4793 1093 -4095 -5254 -104 5762 5561 -867 -5919 -4203 2243 6068 3170
1506 3170 -2520 -4935 -2228 2269 4561 2626 -1339 -4429 -3196 1391 4933 3427 -2025 -5702 -2877
1521 -2877 3287 5931 2111 -3838 -5529 -1451 3706 4589 919 -3175 -4366 -1276 3067 4604 1237
1536 1237 -3767 -5241 -1267 4264 5115 271 -4944 -4680 324 4415 3425 -1196 -4522 -3345 523 3769
1552 3769 3549 -73 -4053 -4410 78 4813 4322 -1136 -5641 -3750 2286 6077 3015 -2913 -5168 -1766
1568 -1766 3040 4407 1586 -2081 -3560 -1618 2009 4267 2764 -1853 -4862 -2613 3143 5851 2278
1583 2278 -3596 -5292 -843 4352 4832 285 -3992 -3775 178 3925 3924 537 -3207 -3766 -385 3890
1599 3890 4413 302 -4161 -3986 723 4997 3837 -1172 -4645 -3317 1331 4197 2802 -1316 -4291
$$ packed form
1491c643L216M042J178l700n188j159N150N866k01o428n052J716O446L825k898
1506C170n690k415K707M497K292j935l965l090J233M587L542j506n452l677K825
1521b877O164K644l820n949j691M078N157Q83l670m094j191L090M343J537l367
1536A237n004j474L974N531Q51m844n215K64N004M091r90m621l326J177L868L246
1552C769k20l622l980l57M488M735m91n458m505J891O036L791l062n928k255L402
1568a766M806J367k821l667j479J942L627K258j503m617l009K249N756K708l573
1583B278n874j696M449N195M80m547m277K17L953L747jl387l744n59L381M275
1599C890N23m111m463J75M709M274j160n009l473J328M648K866j395m118k975
$$ plain form
1614 -4291 -3056 900 4045 2905 -1729 -5247 -3479 1969 4868 2233 -3221 -5559 -1908 2862 4001
1629 4001 789 -3145 -4026 -1260 2299 3600 1364 -2424 -4225 -2007 2858 4940 1789 -3572 -4686
1644 -4686 -232 4794 4922 48 -4096 -3249 1246 4541 3517 -100 -2955 -2433 801 3832 3664 225
1660 225 -3606 -3394 991 4969 3915 -1114 -4539 -2847 2098 4756 2299 -2193 -4148 -2058 2016
1675 2016 4000 1977 -2243 -4496 -2599 1957 4171 1613 -3040 -4886 -1562 2879 3952 395 -3905
1690 -3905 -4332 -1025 2560 3003 231 -3057 -3973 -1287 2722 3765 472 -3902 -4591 -334 4396 4146
1706 4146 -589 -4462 -3170 1376 4264 2753 -1368 -3427 -2064 1402 3713 2948 -350 -3291 -2803
1721 -2803 1184 4501 3435 -1130 -4432 -2245 2683 4952 2200 -2604 -4272 -1144 2845 3924 1233
$$ packed form
1614d291J235L956L145j140m634l518J768N448K899k635n454k338L651M770J139
1629D001l212l934q81K766L559J301k236l788j801K218M865K082l151n361j114
1644d686M454N026J28m874m144Q47M495L295j024l617k855N22L234L031j68l439
1660B25l831K12M385L978j054n029l425J692M945K658k457m492j955K090M074
1675B016J984k023m220k253J897M556K214k558m653j846L324M441J073l557m300
1690c905m27L307L585M43k772l288r16K686M009J043l293m374o89M257M730k50
1706D146m735l873J292M546K888j511m121k059J363L466K311p65l298k941M88
1721b803L987L317j066m565l302K187M928K269k752m804j668L128L989J079k691
$$ plain form
1736 1233 -2302 -3475 -1195 2403 3736 1239 -2811 -4292 -1358 3110 4207 386 -3752 -3844 -157
1751 -157 3259 3077 -405 -3559 -3286 -37 2978 3157 -3 -3682 -3923 33 3744 3387 -1144 -4634
1767 -4634 -3286 1570 4145 2009 -2153 -4084 -1962 1480 3048 1735 -1402 -3290 -2372 1003 3743
1782 3743 2498 -1742 -4574 -2332 2608 4727 1601 -3197 -4300 -591 3416 3638 268 -2806 -2954
1797 -2954 -98 2894 3354 1051 -2259 -3359 -608 3277 4089 741 -3407 -3615 599 4263 3579 -704
1813 -704 -3705 -2626 1100 3554 2648 -666 -3111 -2709 752 3575 2767 -1201 -4217 -2702 1462 4298
1829 4298 2155 -2342 -4195 -1732 2085 3146 951 -2205 -3305 -1502 1586 3198 1514 -1853 -4122
1844 -4122 -2274 2146 4089 1205 -3498 -4322 -464 3778 3466 -430 -3767 -2894 532 2885 2628 16
$$ packed form
1736A233l535j173K280L598J333k497m050j481K934M468J097l821m138r2L687
1751a57L416j82l482l154K73L249L015J79l160l679k41L956L711l57m531l490
1767d634J348M856K575k136m162j931K122L442J568j313l137j888R18L375K740
1782C743j245m240k832K242M940K119l126m798j103L709M007K22l370l074j48
1797b954K856K992M60k303l310j100K751L885Q12l348m148k08M214L664o84m283
1813g04l001J079L726K454r06l314k445M02L461K823q08l968l016J515M164K836
1829D298k143m497j853K463L817J061k195l156j100J803L088J612j684l367k269
1844d122J848M420J943k884m703q24L858M242l12l896l337Q73L426K353k57k612
$$ plain form
1860 16 -2315 -2421 -219 2713 3288 511 -3265 -3519 468 4369 3616 -931 -3975 -2328 1974 4039
1876 4039 2063 -1602 -3098 -1464 1649 3332 2081 -1033 -3206 -2218 1562 3952 2242 -2049 -4074
1891 -4074 -1504 2869 3916 868 -2835 -3530 -806 2270 2931 585 -2300 -3207 -1049 2367 3495 774
1907 774 -3112 -4079 -519 3590 3512 -326 -3775 -2907 931 3424 2105 -885 -2783 -2071 624 2705
1923 2705 2568 -168 -2826 -2944 307 3605 3071 -1036 -4242 -2451 2041 4222 1894 -2360 -3655 -1008
1939 -1008 2284 2984 1025 -1541 -2755 -1309 1506 3216 1747 -1808 -3724 -1580 2503 3968 998
1954 998 -2947 -3536 -227 3093 3085 12 -2728 -2502 21 2504 2749 359 -2627 -3135 -356 3126 3188
1971 3188 -221 -3458 -3038 907 3604 2268 -1410 -3505 -1920 1368 2917 1812 -812 -2630 -2209
$$ packed form
1860A6k331j06K202K932N75k777l776k54L987L901p53m547l044J647M302K065
1876D039j976l665j496J634L113J683j251l114k173R88L780K390j710m291k025
1891d074K570M373J047l048l703o95K724L076O61k346k885r07K158L416J128k721
1907G74l886r67L560M109p8l838l449Q68L838K493j319k990j898P12K695K081
1923B705j37k736k658j18L251L298n34m107l206J791M492K181k328m254j295K647
1939a008L292P00j959k566j214J446K815J710j469l555j916K144M083J465k970
1954I98l945n89L309L320ql073k740K26K523K483K45k390k986n08K779L482O2
1971C188l409l237M20L945K697j336l678k095J585L288J549j105k624j818M21
$$ plain form
1986 -2209 687 3076 2347 -1144 -3806 -2278 1794 4045 1977 -2356 -3745 -927 2649 3033 370
2001 370 -2483 -2605 -403 1901 2532 989 -1839 -3125 -1245 2021 3374 924 -2895 -3536 -247 3297
2017 3297 3027 -494 -3503 -2770 655 2849 2132 -610 -2664 -2164 245 2607 2352 -551 -3309 -2568
2033 -2568 918 3461 2283 -1306 -3354 -1704 1608 3057 1382 -1594 -2835 -1176 1499 3003 1787
2048 1787 -1337 -3218 -1686 1821 3654 1371 -2281 -3415 -703 2968 3216 238 -2660 -2539 75
2063 75 2334 2340 273 -1865 -2368 -624 1983 2941 550 -2715 -3346 -223 3141 2987 -509 -3483 -2689
2080 -2689 944 3177 1746 -1533 -3107 -1744 965 2504 1456 -960 -2737 -2061 701 2867 1776
2095 1776 -1253 -3201 -1772 1742 3361 1466 -2014 -2929 -867 2067 2904 1024 -1611 -2636 -770
$$ packed form
1986b209K896K389p29l491k662J528M072K251k068m333j389K818L576L84k663
2001C70k853j22K202K304O31j543k828j286J880L266J353k450l819o41L289L544
2017C297k70l521l009P33L425K194p17k742k054N00K409K362k55k903k758P41
2033b568L486K543j178l589k048J650L312J449j675k976j241J659K675J504j216
2048A787l124j881J532L507J833k283l652j134K712L671K48k978k898J21K614
2063G5K259Ok067k138n03J744K607R58k391l265o31L123L364j54l496k974P94
2080b689L633K233j431l279j574J363K709J539j048k416j777O76K762K166j091
2095A776l029j948J429L514J619j895l480r15K062K934Q37j880k635j025J866
$$ plain form
2110 -770 2089 3065 947 -2195 -2882 -258 2848 2893 220 -2515 -2253 409 2519 2295 -122 -2124 -2006
2127 -2006 -35 2269 2581 171 -2681 -2624 171 3039 2637 -803 -3455 -2140 1456 3162 1302 -1748
2143 -1748 -2843 -1245 1316 2210 970 -1096 -2276 -1556 771 2461 1571 -1303 -3171 -1624 1700 3251
2159 3251 1066 -2326 -3261 -834 2372 2516 40 -2419 -2373 -103 2324 2252 191 -2120 -2425 -345 2259
2176 2259 2484 -10 -2413 -2253 389 2827 2170 -510 -2580 -1904 627 2621 2159 -403 -2417 -1834
$$ packed form
2110g70K859R76k118l142o87K624L106M5k673k735K62K662K110k24k417k002J18
2127b006J971K304L12k410k852N7K795K868m02l440k652J315L596J706j860l050
2143a748j095J598K561Q94j240k066j180P20K327J690q90k874j868J547L324J551
2159C251k185l392r35K427L206J44k476k459M6K270K427p2k061k311l05K080K604
2176B259K25k494k403J60K642K438o57k680k070O76K531J994m62k562k014N83
$$ [...]
8191b0
##END NTUPLES=NMR FID
##END=
