##TITLE=1H_CG-1119-a
 DMSO, 8 sc, 
 17.9.2019
##JCAMPDX= 6.0         $$ Bruker NMR JCAMP-DX V2.0
##DATA TYPE= NMR FID
##DATA CLASS= NTUPLES
##ORIGIN= UXNMR, Bruker Analytische Messtechnik GmbH
##OWNER= root
$$ XWIN-NMR		Version 3.5
$$ Tue Sep 17 15:26:57 2019 Russian Standard Time (UT+4h)  she@DPX200
##.OBSERVE FREQUENCY= 200.1315
##.OBSERVE NUCLEUS= ^1H
##.DELAY= (6, 6)
##.ACQUISITION MODE= SIMULTANEOUS
##.ACQUISITION SCHEME= undefined
##.AVERAGES= 8
##.DIGITISER RES= 18
##SPECTROMETER/DATA SYSTEM= spect
##.PULSE SEQUENCE= zg30
##.SOLVENT NAME= DMSO
##.SHIFT REFERENCE= (INTERNAL, DMSO, 0, 15.7039)
##AUDIT TRAIL= $$ (NUMBER, WHEN, WHO, WHERE, WHAT)
$$ ##TITLE= Audit trail, XWIN-NMR		Version 3.5
$$ ##JCAMPDX= 5.01
$$ ##ORIGIN= Bruker BioSpin GmbH
$$ ##OWNER= she
$$ F:/spectra/data/she/nmr/H-F/1/audita.txt
$$ ##AUDIT TRAIL=  $$ (NUMBER, WHEN, WHO, WHERE, WHAT)
(   1,<2019-09-17 14:53:10.18 +0400>,<she>,<DPX200>,
      <created by zg, POWCHK disabled, PULCHK disabled
       configuration hash MD5:
       00 E9 B6 7A A2 85 ED C7 34 08 36 98 17 FE 4E 26
       data hash MD5: 16K
       51 F4 1A 70 98 C9 C5 EF 4D 37 25 FB 46 AA 59 D9>)
$$ ##END=
$$ 
$$ hash MD5
$$ 24 5C 4F 91 71 F0 BB 8E DB 6D EE 1C 87 70 E7 B9
##$RELAX= 
##$RELAX= 
##$RELAX= 
##$RELAX= 
##$RELAX= 
##$RELAX= 
$$ Bruker specific parameters
$$ --------------------------
##$DU= <F:/spectra>
##$EXPNO= 1
##$NAME= <H-F>
##$PROCNO= 1
##$TYPE= <nmr>
##$USER= <she>
##$AMP= (0..31)
100 100 100 100 100 100 100 100 100 100 100 100 100 100 100 100 100 100 
100 100 100 100 100 100 100 100 100 100 100 100 100 100 
##$AQSEQ= 0
##$AQ_mod= 1
##$AUNM= <au_zg>
##$AUTOPOS= <>
##$BF1= 200.13
##$BF2= 200.13
##$BF3= 200.13
##$BF4= 200.13
##$BF5= 200.13
##$BF6= 200.13
##$BF7= 200.13
##$BF8= 200.13
##$BYTORDA= 1
##$CFDGTYP= 0
##$CFRGTYP= 5
##$CHEMSTR= <none>
##$CNST= (0..31)
1 1 145 1 1 1 1 1 1 1 1 1 1 1 1 1 1 1 1 1 1 1 1 1 1 1 1 1 1 1 1 1 
##$CPDPRG= <>
##$CPDPRG1= <>
##$CPDPRG2= <>
##$CPDPRG3= <>
##$CPDPRG4= <mlev>
##$CPDPRG5= <mlev>
##$CPDPRG6= <mlev>
##$CPDPRG7= <mlev>
##$CPDPRG8= <mlev>
##$CPDPRGB= <>
##$CPDPRGT= <>
##$D= (0..31)
0 1.2 0 0 0 0 0 0 0 0 0 0.03 0 0 0 0 0 0 0 0 0 0 0 0 0 0 0 0 0 0 0 0 
##$DATE= 1568717589
##$DBL= (0..7)
120 120 120 120 120 120 120 120 
##$DBP= (0..7)
150 150 150 150 150 150 150 150 
##$DBP07= 0
##$DBPNAM0= <>
##$DBPNAM1= <>
##$DBPNAM2= <>
##$DBPNAM3= <>
##$DBPNAM4= <>
##$DBPNAM5= <>
##$DBPNAM6= <>
##$DBPNAM7= <>
##$DBPOAL= (0..7)
0.5 0.5 0.5 0.5 0.5 0.5 0.5 0.5 
##$DBPOFFS= (0..7)
0 0 0 0 0 0 0 0 
##$DE= 6
##$DECBNUC= <off>
##$DECIM= 24
##$DECNUC= <off>
##$DECSTAT= 4
##$DIGMOD= 1
##$DIGTYP= 9
##$DL= (0..7)
0 120 120 120 120 120 120 120 
##$DP= (0..7)
150 150 150 150 150 150 150 150 
##$DP07= 0
##$DPNAME0= <>
##$DPNAME1= <>
##$DPNAME2= <>
##$DPNAME3= <>
##$DPNAME4= <>
##$DPNAME5= <>
##$DPNAME6= <>
##$DPNAME7= <>
##$DPOAL= (0..7)
0.5 0.5 0.5 0.5 0.5 0.5 0.5 0.5 
##$DPOFFS= (0..7)
0 0 0 0 0 0 0 0 
##$DQDMODE= 0
##$DR= 18
##$DS= 0
##$DSLIST= <SSSSSSSSSSSSSSS>
##$DSPFIRM= 0
$$ [...]
##$SUBNAM2= <"">
##$SUBNAM3= <"">
##$SUBNAM4= <"">
##$SUBNAM5= <"">
##$SUBNAM6= <"">
##$SUBNAM7= <"">
##$SUBNAM8= <"">
##$SUBNAM9= <"">
##$SW= 24.0689530833862
##$SWIBOX= (0..15)
0 0 2 0 0 0 0 0 0 0 0 0 0 0 0 0 
##$SW_h= 4816.95568400771
##$TD= 16384
##$TD0= 1
##$TE= 0
##$TE2= 300
##$TE3= 300
##$TEG= 300
##$TL= (0..7)
0 120 120 120 120 120 120 120 
##$TP= (0..7)
150 150 150 150 150 150 150 150 
##$TP07= 0
##$TPNAME0= <>
##$TPNAME1= <>
##$TPNAME2= <>
##$TPNAME3= <>
##$TPNAME4= <>
##$TPNAME5= <>
##$TPNAME6= <>
##$TPNAME7= <>
##$TPOAL= (0..7)
0.5 0.5 0.5 0.5 0.5 0.5 0.5 0.5 
##$TPOFFS= (0..7)
0 0 0 0 0 0 0 0 
##$TUNHIN= 0
##$TUNHOUT= 0
##$TUNXOUT= 0
##$USERA1= <user>
##$USERA2= <user>
##$USERA3= <user>
##$USERA4= <user>
##$USERA5= <user>
##$V9= 5
##$VALIST= <valist>
##$VCLIST= <CCCCCCCCCCCCCCC>
##$VD= 0
##$VDLIST= <DDDDDDDDDDDDDDD>
##$VPLIST= <PPPPPPPPPPPPPPP>
##$VTLIST= <TTTTTTTTTTTTTTT>
##$WBST= 1024
##$WBSW= 4
##$XGAIN= (0..3)
0 0 0 0 
##$XL= 0
##$YL= 0
##$YMAX_a= 170094
##$YMIN_a= -177074
##$ZGOPTNS= <>
##$ZL1= 120
##$ZL2= 120
##$ZL3= 120
##$ZL4= 120
##$ABSF1= 10
##$ABSF2= 0
##$ABSG= 5
##$ABSL= 3
##$ALPHA= 0
##$AQORDER= 0
##$ASSFAC= 0
##$ASSFACI= 0
##$ASSFACX= 0
##$ASSWID= 0
##$AUNMP= <proc_1d>
##$AZFE= 0.1
##$AZFW= 0.1
##$BCFW= 1
##$BC_mod= 2
##$BYTORDP= 1
##$COROFFS= 0
##$CY= 11.3945322036743
##$DATMOD= 1
##$DC= 2
##$DFILT= <>
##$DTYPP= 0
##$F1P= 20.1720416913024
##$F2P= 0.152960286110954
##$FCOR= 0.5
##$FTSIZE= 0
##$FT_mod= 4
##$GAMMA= 1
##$GB= 0.15
##$INTBC= 1
##$INTSCL= 1
##$ISEN= 128
##$LB= 0.24
##$LEV0= 0
##$LPBIN= 0
##$MAXI= 10000
##$MC2= 0
##$MEAN= 0
##$ME_mod= 0
##$MI= 1.114404
##$NCOEF= 0
##$NC_proc= 0
##$NLEV= 6
##$NOISF1= 3.799351
##$NOISF2= 2.8
##$NSP= 1
##$NTH_PI= 0
##$NZP= 0
##$OFFSET= 15.70392
##$PC= 1
##$PHC0= -9578.008
##$PHC1= 17.40096
##$PH_mod= 1
##$PKNL= yes
##$PPARMOD= 0
##$PSCAL= 0
##$PSIGN= 0
##$REVERSE= no
##$SF= 200.130013532006
##$SI= 16384
##$SIGF1= 3
##$SIGF2= 2
##$SINO= 400
##$SIOLD= 16384
##$SREGLST= <1H.CDCl3>
##$SSB= 0
##$STSI= 0
##$STSR= 0
##$SW_p= 3612.71676300578
##$SYMM= 0
##$S_DEV= 0
##$TDeff= 0
##$TDoff= 0
##$TI= <>
##$TILT= no
##$TM1= 0
##$TM2= 0
##$TOPLEV= 0
##$USERP1= <user>
##$USERP2= <user>
##$USERP3= <user>
##$USERP4= <user>
##$USERP5= <user>
##$WDW= 1
##$XDIM= 8192
##$YMAX_p= 0
##$YMIN_p= 0
$$ End of Bruker specific parameters
$$ ---------------------------------
##NTUPLES= NMR FID
##VAR_NAME=  TIME,          FID/REAL,        FID/IMAG
##SYMBOL=    X,             R,               I
##VAR_TYPE=  INDEPENDENT,   DEPENDENT,       DEPENDENT
##VAR_FORM=  AFFN,          ASDF,            ASDF
##VAR_DIM=   8192,          8192,            8192
##UNITS=     SECONDS,       ARBITRARY UNITS, ARBITRARY UNITS
##FACTOR=    0.0002076,     1,               1
##FIRST=     0,             0,               0
##LAST=      1.7004516,     0,               0
##MIN=       0,             -177074,         0
##MAX=       1.7004516,     170094,          0
$$ Real data points
##PAGE= N=1
##DATA TABLE= (X++(R..R)), XYDATA
$$ [...]
2724A97J653j042k513l24J885J899p30k081n45J685O78k34o80K1Q07p62m88N26
2742d8J752m11j356j376J113K010L56k227j214J085J586K86j005j159L3J005K88
2759G18q0k53l08p52L99N15R56o81j093q04J009J078j01r03p54M69O9Q19j36j23
2779D4o53o72L54Q89Q43j018j483k29J734J335r94j636k10J531O94n16q17Q3N60
2798a61l13k59P83Q00P9j721q96J717J885p48k020p51J157K102j32j945p08J051
2816h0J315j6j200l5J87P9k88L70O00K88o82j337M07J632L27j311j422O69J362
2835H65M93o81j522J75P20L55K18l62q28m3K48J68J162n89j454j67Q28J032q2
2854E36m44j004L4O00N43m80K83m59n78P6Q66R31n93j445k39J221J380m61j528
$$ plain form
2724 197 1850 808 -1705 -2029 -144 1755 1025 -1056 -1601 84 762 528 -152 -131 676 -86 -574 -48
2742 -48 1704 1293 -63 -1439 -326 1684 2040 -187 -1401 -316 1270 1556 551 -608 -575 430 718
2759 718 638 385 77 -675 -276 239 1195 514 -579 -1383 -374 704 603 -300 -1054 -585 -516 303 167 44
2779 44 -609 -1281 -927 -38 805 -213 -1696 -1925 -191 1144 150 -1486 -1696 -165 529 13 -804 -721 -161
2798 -161 -474 -733 50 850 929 -792 -1688 29 1914 1166 -854 -1605 -448 1654 1522 -423 -1131 -80
2816 -80 1235 1219 19 -16 171 250 -38 332 932 1220 538 -799 -392 1240 1567 256 -1166 -497 865
2835 865 1358 677 -845 -670 50 405 623 261 -567 -610 -362 -194 968 379 -1075 -1242 -414 618 536
2854 536 92 -912 -878 -278 265 -215 68 -391 -969 -893 -27 904 311 -1134 -1373 -152 1228 767 -761
2873g61o36J139J166j52p21o91K61N60RJM74o8m35j187P81J459K29j153j770R43
2893e52J905M64j385j579N19J451O11p94j458O39N78k28P9J98K62p18o89J26Q87
2912C16J084r72j620l02J536J235n81j544o90J188Q27K97r33l60J23k28M13M86
2930B75K8n14j153K42J278K51j56j286lP97P57N4n88n54J93J68L17O76j40j060
2950d18q09Q07J433K44j151j543M80J635O66j046j094K82Q21J02l22k45N34q5
2968B91j109M36J037Q08j263j387m8J856J134q84j871k54J532J008n93j136m87
2985i30R77k17K16K63R9n39n30k05O16J600p55j505p34J651J215l20j530o16P85
3004d59Q67K54n88n23j42J2L04R02J72q70q49J45J294K88k38q88p67O90J214q2
$$ plain form
2873 -761 -1397 -258 908 756 35 -656 -395 165 174 175 649 581 146 -1041 -260 1199 1428 275 -1495 -552
2893 -552 1353 1817 432 -1147 -628 823 1434 640 -818 -179 399 171 250 448 710 -8 -697 -571 316
2912 316 1400 428 -1192 -1494 42 1277 696 -848 -1538 -350 477 774 -159 -519 -396 -624 -211 275
2930 275 303 -211 -1364 -1122 156 407 251 -1035 -1038 -241 516 570 -18 -572 -379 -211 106 782 642 -418
2950 -418 -1227 -420 1013 1257 106 -1437 -957 678 1344 298 -796 -514 307 409 87 -158 376 291
2968 291 -818 -382 655 1463 200 -1187 -1235 621 1755 871 -1000 -1254 278 1286 693 -443 -930
2985 -930 47 -170 46 309 408 -131 -661 -866 -250 1350 595 -910 -1644 7 1222 902 -628 -1244 -459
3004 -459 408 662 74 -449 -591 -579 -275 627 799 -71 -920 -775 519 807 569 -319 -1086 -396 818 736
3024G36p36l95M8J27L48N37j12q32o77J24J388Q16q98j267k65J474R87l33j702
3043f32j36M60Q14N5k90j99n29o0J22P32O50l35j812j83J578J208k50j824p68
3062a399Q76J355Q21j473j000K86M50M37j2O2n34l7o53J098Q32k40j358p84R32
3081c41J380M17j152j670J49J375R66o01q71m13J42N16P20p8l80p49l47R05J067
3100A035J9j290j004N12R26P34l30j402J21O56M12L05n07m05m39j29R73R00j45
3119I42j512p00O51K029J42j350j229J18J177O33k80o65l71K15q5N13P92l52j314
3138f46o49R08J551N14j815j365N45J729M79n69j368m36J377L25K26p52n9k13
3156b18o95Q45R44L15j327j275M59J517Q35q98j534l93J278Q83Qr61m25J30P2
$$ plain form
3024 736 0 -395 -347 -220 128 665 553 -279 -956 -832 556 1372 474 -793 -1058 416 1403 1070 -632
3043 -632 -768 -308 506 561 271 72 -457 -517 -395 337 987 652 -1160 -1343 235 1443 1193 -631 -1399
3062 -1399 -523 832 1653 180 -820 -534 -84 353 341 403 -131 -168 -821 277 1109 869 -489 -1273 -341
3081 -341 1039 1456 304 -1366 -1217 158 1124 523 -348 -761 -619 -103 617 539 159 -590 -937 -32 1035
3100 1035 1054 -236 -1240 -728 198 932 602 -800 -679 -23 389 694 187 -218 -657 -786 187 1087 942
3119 942 -570 -1270 -619 1410 1552 202 -1027 -909 268 901 621 -44 -415 -200 -285 228 1020 668 -646
3138 -646 -1295 -387 1164 1678 -137 -1502 -957 772 1251 682 -686 -1122 255 580 806 54 -5 -218
3156 -218 -913 -68 876 1191 -136 -1411 -952 565 1400 502 -1032 -1425 -147 736 744 -217 -642 -512 -440
3175d40O04O09n85q85o35O07J361O94j443j068j37J582R73p43r94p02O07O27O24
3194F56k86n88k92l26P66J229j9j207j163O61J498P13j019j567J75J054O48Q4
3212A017p12l12k91LP83O22m19r90p49M34J493R18j271j700j79J388J452k33j618
3231c64p04N10Q53L56m52l96o39J81M89R32Q3p82j548K91J214J382n63j624j007
3250a788R88J339M07r62j017j68L10J046M56k03r83n44L89R03Q87m65j602l84
3268a391J083J502K36j573q29k8J041O62M44r92o45j39K78J479L21j222j056k65
3286a094J178J586m41j435j124O18J440M72o88r71l95N69N85O22l97n48q65PJ373
3305D92Q57n66j599j226J394J261O44j019j520M8J186P11k17n16o89j37K02J023
$$ plain form
3175 -440 164 773 188 -697 -1332 -725 636 1330 -113 -1181 -1318 264 1237 494 -500 -1202 -595 32 656
3194 656 370 -218 -510 -836 -70 1159 1140 -67 -1230 -569 929 1642 623 -944 -769 285 933 1017
3212 1017 305 -7 -298 -295 488 1110 691 -299 -1048 -614 879 1797 526 -1174 -1353 35 1487 1254 -364
3231 -364 -1068 -558 295 651 199 -197 -836 -655 -166 766 849 67 -1481 -1190 24 1406 843 -781 -1788
3250 -1788 -800 539 946 -16 -1033 -1201 -891 155 611 408 -575 -1119 -730 173 1060 595 -1007 -1391
3268 -1391 -308 1194 1430 -143 -972 -1000 41 703 1147 155 -490 -629 -351 1128 1449 227 -829 -1094
3286 -1094 84 1670 1229 -206 -1330 -712 728 1200 512 -459 -854 -285 300 922 525 -23 -888 -881 492
3305 492 1349 783 -816 -2042 -648 613 1257 238 -1282 -1234 -48 663 446 -70 -759 -896 -694 329
3323C29O43n25j680j81Q23J585M95j732j619O69J423R11j043q99m25L75R80M96
3341F25m4m98j111J2J189J064q8j661j072R43J906M21j002j754kJ275Q75j82l22
3360E74q38l40M2J221O19n10j347r58J290J583O6j241j314Q8J599M69l18q13n23
3379f51R4N48N85J84l55j478j18J141J015M6j576j122O17J523R81j024j150n56
3397a296Q28J050M60o68j039k98M58P82O02m48j240o46O86J512Q85j286j511k50
3415a419J683J181l09j202p68j81J049R13L09r38j164l41J214J410p8j275j560
3432a476N73J659P11j87j203j331Q07J207M18p46n08j005N57Q37O93q7r47j518
3450a546O42J408J165p70j789l74J073J344j26q17j395J82P86N83K84n04p74q57
$$ plain form
3323 329 972 447 -1233 -1414 -591 994 1489 -243 -1862 -1193 230 1141 98 -801 -1226 -851 129 625
3341 625 581 83 -1028 -1016 173 1237 1149 -512 -1584 -641 1265 1686 684 -1070 -1072 203 1078 896 574
3360 574 -264 -604 -562 659 1278 768 -579 -1537 -247 1336 1402 161 -1153 -1065 534 1003 685 -128 -651
3379 -651 -557 -9 576 760 405 -1073 -1191 -50 965 1011 -565 -1687 -1070 453 1434 410 -740 -1296
3397 -1296 -468 582 1042 374 -665 -963 -505 277 879 431 -809 -1455 -769 743 1628 342 -1169 -1419
3415 -1419 264 1445 1136 -66 -834 -1015 34 947 1256 318 -846 -1187 27 1437 1359 84 -1476
3432 -1476 -903 756 1467 1280 77 -1254 -447 760 1178 432 -76 -1081 -524 313 1006 919 -28 -1546
3450 -1546 -904 504 1669 899 -890 -1264 -191 1153 1027 210 -1185 -1003 -217 366 650 146 -628 -1485
3468a485R88J070N60p57j503m54J429J553m11j570j125O49J466R86r06q98m42
3485h50M9R57J008r1j182j254J46J516J457r40j435q41J233J467M59j195j163
3502f59l47R14P06M64o29j036m30N07J134P31o72j707j60J005J443K03j287j461
3520a281L78J184O19j39j165o15K16O08P59P01j556p62k64J513J172n66j267j258
3538a723O33J737Q57j025j253l75O77J060L62n83p42q09M04J555N70o07j708q04
3556a774J215J812J30j342j407K93J226R23l6j064o74n45J014J073L08q26j560
3573a234n7J112J514j75j470j102K18J609J241q75j272k94P4J224M66l8j200p57
3591a016L58Q22R74j24j518r87Q50J346Q98q78j794l65J277J191O0p71j114oN91
$$ plain form
3468 -1485 -497 573 1133 376 -1127 -1581 -152 1401 990 -580 -1705 -1056 410 1396 490 -408 -850
3485 -850 -801 156 1164 1073 -109 -1363 -1217 299 1756 816 -619 -1460 -227 1240 1699 504 -659
3502 -659 -1006 -92 614 1078 449 -587 -1017 -510 624 1355 683 -1024 -1184 -179 1264 1467 180 -1281
3520 -1281 -903 281 900 761 -404 -1019 -803 -195 564 1265 -291 -1053 -1317 196 1368 802 -465 -1723
3538 -1723 -1090 647 1504 479 -774 -1149 -472 588 950 367 -375 -1184 -780 775 1345 738 -970 -1774
3556 -1774 -559 1253 1383 41 -1366 -1073 153 1076 1040 -24 -698 -1243 -229 844 1152 326 -1234
3573 -1234 -1291 -179 1335 1160 -310 -1412 -1194 415 1656 781 -491 -785 -711 513 979 941 -259 -1016
3591 -1016 -658 164 1138 1014 -504 -1491 -641 705 1603 725 -1069 -1434 -157 1034 1094 323 -791 -797 -206
3610b06Q89K55l72j346n08Q58J573M82j427j579J40J533J102j65j397q95N20R20
3628C77M06Q8j072p36rP68J324p2j104j616P31J472J087j076j555o38J274J306
3646I55L3p60r58j6M8J139K28J03j531p28O76J464J187j222j810k29J275J578
3664A432l07j180j054q1J315P92M4q87q34l84Q97J186L21j411j281K55J258J689
3682A770o09j616j167Q01J476N39m15j637m14O19J067P63l11r87j268P22J307
3699F40J058r68j814m11J028J738J03j572r18l2J214O30J99q51r08m77R78J089
3717G26L33r64j164m61J517J401j15j590j153N72J447P65m80r80j012K65J204
3734C11P41j86r19j205K73J627J049p06j719n28P51J568N83r88j356j46M87J369
$$ plain form
3610 -206 683 938 566 -780 -1288 -430 1143 1625 198 -1381 -1241 292 1394 1229 -168 -1063 -543 377
3628 377 783 871 -201 -937 -946 -178 1146 1074 -30 -1646 -915 557 1644 568 -987 -1625 -351 955
3646 955 988 228 -730 -746 -698 441 669 772 -759 -1487 -811 653 1840 618 -1192 -1421 -146 1432
3664 1432 1125 -55 -1109 -1190 125 917 961 74 -760 -1144 -247 939 1260 -151 -1432 -1177 81 1770
3682 1770 1161 -455 -1622 -821 655 1194 779 -858 -1272 -653 414 1177 866 -121 -1389 -667 640
3699 640 1698 730 -1084 -1495 -467 1271 1374 -198 -1116 -1148 66 696 895 44 -864 -1341 -363 726
3717 726 1059 95 -1069 -1530 -13 1388 1273 -317 -1470 -898 549 1314 834 -146 -1158 -893 311
3734 311 1052 866 -53 -1258 -985 642 1691 985 -734 -1262 -511 1057 1640 652 -704 -850 -363 1006
3752A006K31q29j283k69Q79J140O62j019j235p78J534J162K99j366j094j15J306
3769B31R98k71q25j245J06J046J083l52j126q87J51J121J044L2j600j275O43J590
3787D64R56r24j647m29J185R37O18p69j136n26N10J147Q79n76j572p18J361J300
3805A060J79j308j030k92J382J708q42j092r55L37R66R71j0r41j148k14J040J591
3823A402P3j861j144M17J466J224n40j926l39O08J268M25l86j238o05L62J117
3840C23P11m20j198j147N64K027M42p38j710o88J432J382K11j180j116J13R18
3857g4N67N53p32j659j54M99J972M40j362j131p16J878J230n59j410n76K42J527
3875E35O51l46j053q42J83J076J025j53j419r92J51J702J236j014j511m12Q66
$$ plain form
3752 1006 1237 408 -875 -1144 -265 875 1537 518 -717 -1495 39 1201 1500 134 -960 -1075 231
3769 231 1229 958 133 -1112 -1006 40 1123 771 -355 -1242 -1091 30 1074 1106 -494 -1769 -1126 464
3787 464 1420 496 -1151 -1580 -395 542 1160 391 -745 -1271 -761 386 1265 689 -883 -1601 -240 1060
3805 1060 1239 -69 -1099 -1391 -9 1699 857 -235 -1190 -853 113 1084 1074 133 -1015 -1229 -189 1402
3823 1402 1475 -386 -1530 -1113 353 1577 1037 -889 -1228 -620 648 1073 687 -551 -1156 -794 323
3840 323 1034 614 -584 -1731 -1167 860 1302 564 -1146 -1834 -402 980 1191 11 -1105 -992 -74
3857 -74 493 1046 314 -1345 -1499 -1000 972 1412 50 -1081 -1797 81 1311 752 -658 -1234 -992 535
3875 535 1186 840 -213 -1055 -872 204 1229 1076 -343 -1335 -1184 518 1754 740 -771 -1183 -317
3892c17J350K08o97r70o81P16J272K62m04j287p69Q19J441M71j027j596j77J285
3910a01J462K0j449r15m01J518Q57Jj001j219K65R72J321J04j473j571O37J076
3928A03R56l28j407r42J054P95J030q05r87q61P68J110Q38p52j315o70N30J507
3946F24P96q58j702l07R94J650K7p92j491j10J337P82J64j054o43k47J059J154
3964A383K2j190j237J84J000J176p7j285j236N75J278J333j168j170r51O75J229
3981E41N26L9j379p51J21J077J208o31j519r12J023J859N33j408j258l93J019
3998c05Q77O63q84r21m57P14J267L07o75j804p7J092J395L20j522j434J23J654
4016C33J291n97j350q43L37J033R42l9j075j265J63R29J668n01j448q14O48J154
$$ plain form
3892 -317 1033 1241 544 -426 -1107 -391 881 1143 739 -548 -1317 -498 943 1414 387 -1209 -1386 -101
3910 -101 1361 1381 -68 -983 -1384 134 991 992 -9 -1228 -963 9 1330 1434 -39 -1610 -973 103
3928 103 1059 731 -676 -1618 -564 231 1261 456 -531 -1392 -624 486 1324 572 -743 -1413 -883 624
3946 624 1420 562 -1140 -1447 -453 1197 1224 432 -1059 -1169 168 950 1114 60 -583 -830 229 1383
3964 1383 1405 215 -1022 -838 162 1338 1261 -24 -1260 -685 593 1926 758 -412 -1363 -688 541
3981 541 1067 1106 -273 -1024 -903 174 1382 751 -768 -1680 -657 1202 1735 327 -931 -1324 -305
3998 -305 572 1235 351 -570 -1027 -313 954 1261 586 -1218 -1295 -203 1192 1512 -10 -1444 -1321 333
4016 333 1624 1027 -323 -1166 -829 204 1146 1107 32 -1233 -1070 -141 1527 1026 -422 -1236 -588 566
4034E66J051p73j587n77P51J462J68n43j000m70L98J643M10q09j094q98Q47J686
4052A231L34j239j569j95J337J278N3j355j147M51Q70O03L11p21j273k29J118
4069a42R74K77j236j119J29J510R87l24j526p25O62R49N89l41q91r10O08Q47Q74
4088A192j74j376r22N74J120J250q79j850j77J143P76K71r17r05j74Q41J083J63
4106A039n69j173o77J163J106K19j121j486K40J267R38L72j492p58L09P74P64
4123I15k99p15p60J27Q84J207k60j323j101M14J392P55m39j508n74N26J542L81
4141A164p62r13o34P30J235K83p35j096n32Q23J519J27p39j088p55J278J355L03
4159A563j591j107J9J448J026l48j008r26j74J203R79O0j654n43j91J453P07L30
$$ plain form
4034 566 1617 844 -743 -1320 -569 893 1061 518 -482 -952 -554 1089 1499 690 -404 -1302 -455 1231
4052 1231 1565 326 -1243 -1438 -101 1177 1230 -125 -1272 -821 49 652 963 242 -1031 -1260 -142
4069 -142 832 1109 -127 -1246 -1117 393 1380 1056 -470 -1195 -533 416 1005 664 -227 -1137 -529 318 1192
4088 1192 1018 -358 -1280 -706 414 1664 785 -1065 -1242 -99 677 948 31 -874 -1048 -207 876 1039
4106 1039 470 -703 -1380 -217 889 1108 -13 -1499 -1259 8 946 1318 -174 -932 -623 151 915
4123 915 616 -99 -859 -732 152 1359 1099 -224 -1325 -911 481 1236 797 -711 -1285 -759 783 1164
4141 1164 402 -511 -1145 -415 820 1103 368 -728 -1260 -437 1082 1209 470 -618 -1373 -95 1260 1563
4159 1563 -28 -1135 -1116 332 1358 1010 2 -924 -1098 105 1084 1144 -510 -1053 -1244 209 916 1246
4177A246j634j060L28J849P98r49j199l84N14J141N26q08q07n89L88J265P90o22
4195G93j696l90Q50J170P34r64j669P5R98J172P9r66r75j32Q73R24J38r27j122
4214a035q9J066J460p9j399j137K63J298Q39n59j020p96M45J176P03k87r40o30
4232g21q8J136R58n45j164j001P42J617M01m66j761l00Q20J439l4p84r55m84Q15
4251c75J000K60p84j289l53J196J429L07j412j536N63J136J085o27q22r08K63
4268h67J204P15K51j505r21J52J296J085m34j393r90L17J926N22l94j528p31J060
4286b35J102M78n78j192r31P44J191N47n42j144o94O48J307M59p93j469R5J005
4304bR37L64j291j062J5J162Q56K23j122j166k10J269Q33L59j259j223L60J247
$$ plain form
4177 1246 -388 -1448 -1120 729 1527 578 -621 -1005 -491 650 1176 368 -439 -1028 -640 625 1415 793
4195 793 -903 -1293 -443 727 1461 497 -1172 -1097 -99 1073 1152 186 -789 -921 -48 876 1014 87 -1035
4214 -1035 -1124 -58 1402 1323 -76 -1213 -950 348 1187 628 -392 -1188 -743 433 1136 849 -91 -721
4232 -721 -809 327 1285 740 -424 -1425 -683 934 1335 869 -892 -1192 -372 1067 1033 249 -706 -1190 -375
4251 -375 625 885 101 -1188 -1541 -345 1084 1391 -21 -1557 -994 142 1227 600 -222 -1130 -867
4268 -867 337 1052 1303 -202 -1123 -971 325 1410 976 -417 -1407 -1090 836 1358 964 -564 -1295 -235
4286 -235 867 1345 767 -425 -1356 -612 579 1126 584 -560 -1254 -606 701 1160 367 -1102 -1007 -2
4304 -2 935 1299 8 -1054 -1039 123 979 1202 80 -1086 -1296 -27 806 1165 -94 -1317 -957 290
4322B90J030n34r98j197Q51J029M86o19j125k18K83J080P58k80j389o28M35J244
4340D98O94p64j370n36Q75J594L92j121j204j27R86J271r7r56q60k96O95J118
4358G92K92r23j149R3R50Q58j08r75j184N43J121O48j89j200p20J16J257Q55k65
4377H12j133j012M73J128O56k01j374q98O61J510O48p74j469k36P43J033M67p25
4395C09j328J62J32J344O15r69j182l84J004J144K82j089j189L98O82R69L9q81
4413E8r75K9P00J198j56r21r37q8J430J012j28j317j157K67J384R66n47j486q4
4432g52N51R01M53q65n21o58K33J265Q63q22j430m82N83J539O36j054j550R3J038
4451B1P21P8q30j089M08L71J186J56p92j197l51J053J160L15j583j017L58J338
$$ plain form
4322 290 1320 786 -212 -1409 -558 471 957 338 -787 -1005 -722 358 1116 836 -553 -1181 -746 498
4340 498 1192 428 -942 -1478 -603 991 1383 262 -942 -1069 -83 1188 1091 135 -725 -1021 -326 792
4358 792 1084 161 -988 -895 55 913 805 -170 -1354 -811 310 958 769 -431 -1151 -1035 222 1077 812
4377 812 -321 -1333 -860 268 924 723 -651 -1549 -888 622 1270 496 -973 -1209 -466 567 1034 309
4395 309 -1019 -857 -725 619 1234 265 -917 -1301 -297 847 1129 40 -1149 -751 -69 900 939 58
4413 58 -917 -888 -188 1010 854 -67 -1004 -1092 338 1350 1222 -95 -1252 -985 399 1365 818 -668 -752
4432 -752 -201 700 1153 288 -233 -891 -658 607 1470 648 -782 -1264 -681 858 1494 440 -1110 -1017 21
4451 21 742 820 -10 -1099 -691 -320 866 1022 230 -967 -1318 -265 895 1210 -373 -1390 -1032 306
4469C06Q20k65j114o69J37J242M40k89j205l46K74J049O44k54j335o64O57J168
4487E96N50o91j328m64Q60J389J51n11j149m7K78R90N12r81r36m25R34J301R7
4506A126q15j608K89R09J225k43j129o32j46J234P87l75q00o88j14J394N76j96
4524G94j139p52L54J273N87j79j481l20O11P52P69j002n92p14P94Q24M51m68j238
4543f76m70Q03J181R3q75q36m41J072J257j00q39j146j15J201J194m49q66r65
4561i77L30R23Q34q9q70j155o8J285Q39m43q27o61l1J242R14p51j023m71O15P23
4581C39M99J61j385n70N17R04P47n73j354k97Q23J184K98j211j054l45J124P10
4599E17L07n86j110o6M80J270J91q97j069J43O86J204j17j175j075K28J458P49
$$ plain form
4469 306 1126 861 -253 -922 -785 457 897 608 -597 -943 -669 380 1024 770 -565 -1229 -572 596
4487 596 1146 455 -873 -1337 -477 912 1063 552 -597 -644 -366 624 1136 155 -781 -1206 -272 1029 1126
4506 1126 311 -1297 -1008 -99 1126 883 -246 -878 -1024 210 997 622 -178 -866 -980 414 990 794
4524 794 -345 -1097 -743 530 1117 938 -543 -863 -252 500 1269 267 -325 -1039 -245 579 1030 562 -676
4543 -676 -1146 -343 838 931 56 -780 -1221 -149 1108 1008 169 -977 -1092 109 1303 854 -12 -977
4561 -977 -647 276 1110 1021 151 -1004 -1072 213 1052 609 -218 -879 -910 332 1246 495 -528 -999 -384 339
4581 339 838 999 -386 -956 -439 465 1212 639 -715 -1012 -189 995 1293 82 -972 -1317 -193 517
4599 517 824 238 -872 -938 -458 812 1003 106 -963 -820 -134 1070 953 -222 -1297 -1069 389 1138
4617A138k54j040o85J14Q45R21l9j356o45K68J212O99k29j455o68P47J116K34
4635I23m70j296j16M66R39L77n83r35k07M31J134J23k54j165n48J119Q29O9p71
4654F5j382N20P61Q98J47j213p66K66P82R53l08r18p86k56J184J120j51r64j040
4673a088N45J090M76j36j604m74Q85J043M82o24j067n31N70O58Q65o65j124k63
4691i62N85J204L10p33j200k60P88J063J20q80j082KJ206J092k78j219p16oR01
4710f5J008J80j229q03MQ85J340m91j101p92O78N00J050m40j161m50K56R76O57
4729A002k65j100q23O93J024K94k46j344l45R05P40M12q05r90Q9P32O68N40j107
4748G4n92l09O47P79l8q2j331j99Q76J271l75r26q99M80R44Q17l24j071m13J27
$$ plain form
4617 1138 884 -156 -841 -727 118 1039 1000 -356 -1001 -733 479 1178 949 -506 -1174 -427 689 923
4635 923 453 -843 -959 -493 446 823 240 -695 -902 -471 663 786 532 -633 -1181 -62 767 836 65
4654 65 -1317 -797 -36 862 1009 -204 -970 -704 78 1031 723 -195 -981 -1237 -53 1067 916 -48 -1088
4673 -1088 -543 547 1023 887 -717 -1191 -306 737 1219 595 -472 -1003 -433 225 1090 425 -699 -962
4691 -962 -377 827 1137 404 -796 -1056 -268 795 915 35 -1047 -1045 161 1253 975 -244 -960 -966 -65
4710 -65 943 1123 -106 -909 -905 -20 1320 829 -272 -1064 -386 114 1164 724 -437 -887 -631 345 1002
4729 1002 737 -363 -1186 -493 531 825 579 -765 -1110 -205 535 947 142 -848 -759 -27 641 1181 74
4748 74 -518 -827 -180 599 561 479 -852 -1051 -175 1096 721 -205 -1104 -624 320 1137 813 -258 -671 -544
4768e44Q78N12K6j304p40J10J217J050n23j379n02Q44R52J48j49r77o28M56R23
4787C70O44p03j128k52O80Q80N27o08j099m43Q80J046J55j003j106L64Q43P23
4805G70r5n22r58j40P15J180l85l73j145n1J561P13l57j396m02K61Q33Q07n53
4824D63n82o68L41Q50L97k24r96o99M21R21R99j041q48l09M70J242M01p49j041
4843f52m76Q49J023qn72q75l56P04J308P6q75r33J0P50R92j98j063n28J52J090
4863D18N16l83q88q51Q68L81O49o8r03r45N25J102N07m70o13j208O82J092M85
4882H96l61r01p17P63R22K21p67p38O6N04J029K6q82p81k41R59P11K66q11r39
4902g75k51J184J019j27j070j050N2J445P35m33m80j016J17P90P19p7j027q07
$$ plain form
4768 -544 334 846 872 -432 -1172 -1062 155 1205 682 -697 -1199 -355 597 745 596 -381 -1009 -553 370
4787 370 1014 311 -817 -1069 -389 491 1018 410 -689 -1132 -252 794 949 -54 -1160 -796 47 770
4805 770 675 153 -805 -945 -230 950 565 192 -953 -1004 557 1270 913 -483 -885 -624 209 1016 463
4824 463 -119 -787 -446 404 801 577 -419 -1118 -697 224 1223 182 -666 -975 -505 737 1138 389 -652
4843 -652 -1128 -279 744 736 164 -711 -1067 -363 945 1021 146 -787 -777 -27 965 767 -296 -824 -672 418
4863 418 934 551 -337 -1188 -320 61 710 642 -261 -1206 -681 421 928 458 -155 -1363 -681 411 896
4882 896 535 -366 -1083 -320 602 823 56 -682 -616 -112 917 943 61 -720 -961 -2 709 975 164 -775
4902 -775 -1026 158 1177 1050 -20 -1070 -1018 427 1162 729 249 -767 -650 140 859 782 -245 -1052
4920a052J29R99P05p4j240n23O32Q90P15q60q52k21M09J125J63k84j185k64O30
4939a58R49Q8l80j438m49J217R11O8o70r82J27M68Q92j23o84m27j61P93M41L96
4959H78j162m94k45J216Q70l55j083p02N56P68L16J33p68o64K74O43O14k24r22
4978c51n37L24R97O55o36j136j94P84R30q1n58p18m78J128P02o8k71j070l39O96
4998b21Q03K48n80r41k30J058Q75k79o99p97k46Q27J057J1r67o43j15Q76Q78l51
5018E64p28n98J2J199L45m39p62m64J14J313O13o83q85q64O31J116N87o80j055
5037f64n80O80J268J60o07r77k18P41Q54L16j103q01J54P34O07J66r45q55M75
5056e95M93O99J6o52p66K91Q62N00J49j344m39J97Q88M33j58q49o73N08P30N61
$$ plain form
4920 -1052 -923 76 781 707 -533 -1056 -424 466 1181 321 -531 -752 -343 782 945 661 -524 -788 -158
4939 -158 791 879 499 -939 -1388 -171 740 808 138 -844 -717 -249 643 520 -164 -591 -752 41 482 878
4959 878 -284 -778 -1023 193 1063 708 -375 -1077 -521 247 563 696 -72 -736 -462 181 795 571 -351
4978 -351 -888 -564 433 1088 452 -684 -878 -94 836 755 197 -521 -999 129 831 763 492 -578 -917 -221
4998 -221 582 830 250 -691 -921 137 1012 733 34 -763 -1009 -182 875 886 -81 -724 -839 37 915 564
5018 564 -164 -762 -750 449 794 355 -407 -871 -757 556 1169 486 -399 -1263 -632 484 1071 391 -664
5037 -664 -1244 -564 704 864 257 -720 -938 -197 657 973 -130 -931 -777 -43 564 730 -215 -1070 -595
5056 -595 -102 597 613 -39 -805 -514 348 848 997 -347 -786 -589 299 732 574 -275 -948 -440 290 851
5076H51n05p32l44M66N88N02m01o45n69k8J364O11r41q46m04O70R38K28m60r65
5096f22j54N89N79M24p54p50l57J112O88J44p22j409M91O22J071m74p05p37K49
5115g15J041P07l28j117n24K41Q43Q16l70q46l60J48P69M27j66r75l43M71J006
5134G25j61k87p94Jk1J058L33o68o38l38L50R27N53p82r09J08K46J043J49r38
5154d3q85J27R76N15L16j074n53j93J249K98M2r56p45L52R05P68l66j160n06K84
5174f49P09Q56o51m88m86N04M30Q05n67q30m81N51Q50M25n47j170j37N29J003
5193F56J54o74n43j42L73O24K15n55r55J84P48R53k30q52o80J61Q38Q62o62p81
5213c06o55J74J043N20m41l91o57Q8R31L67Pj037m39M97J014P0k74q09o08M44
$$ plain form
5076 851 346 -386 -730 -264 324 826 425 -220 -789 -817 547 1158 217 -629 -1033 -363 575 803 343 -622
5096 -622 -776 -187 392 816 62 -688 -1045 67 755 899 177 -1232 -741 -119 952 478 -227 -964 -715
5115 -715 326 1033 705 -412 -936 -695 148 964 594 -252 -612 -464 305 732 566 -409 -752 -281 725
5134 725 564 277 -517 -516 -537 521 854 186 -452 -790 -440 487 1040 258 -651 -543 -297 746 895 -43
5154 -43 -928 -801 175 690 1006 -68 -621 -814 435 733 775 -181 -926 -574 331 1099 733 -427 -933 -649
5174 -649 60 916 265 -223 -709 -205 225 1030 463 -367 -848 -297 553 978 431 -739 -876 -347 656
5193 656 810 136 -407 -549 -176 448 663 108 -847 -663 85 1038 808 -44 -724 -563 275 1137 475 -306
5213 -306 -961 -787 256 776 335 -56 -713 -625 306 673 680 -357 -796 -299 715 785 511 -298 -906 -462
5233d62J140J93o93q76k32O76Q32M04j003n18K32M41L32K2j23j159k5P20O97J50
5253G48j068m42J17O57N92o2o43q13N27M90N38J06q05n52m9P33O38j45p19p65
5273i17M43R16L04j82q22o81N37Q87J09r4p36m40L59N61N01k32j110pK49J136
5293G81K9p62o49j45P32O49j2r52l74K90N55K08K25o71n46J12O22Q11l86n68o72
5314g23l6J261N62r77m22k62K34N45M11k53p02m59M82Q19J52j39r90k63M71M91
5334B02N49l95p48n81Q24Q99k65k00p89j95L95Q32J70o41n88k90P11Q20j01o89
5354h0o69R9P76P05k77n54o59K49P87O10l86p99o68L99P09N87o11m48l62K77N90
5375B75L24k18o60j60K28O19K90m34p45j27M12O64N8l30o58l14R59N57O2p39m58
$$ plain form
5233 -462 678 871 178 -698 -930 -254 578 982 -21 -539 -307 134 466 488 365 -794 -819 -99 598 748
5253 748 -320 -762 -645 12 604 542 -101 -914 -387 103 641 747 -58 -610 -659 74 712 567 -152 -917
5273 -917 -474 442 746 564 -258 -939 -402 485 594 500 -236 -676 -317 244 745 513 -597 -604 -355 781
5293 781 810 48 -601 -746 -14 635 623 -329 -703 -413 142 350 575 -96 -642 -530 92 903 517 -51 -723
5314 -723 -759 502 1064 87 -335 -597 -363 182 593 340 -362 -821 -339 480 632 493 -497 -760 -289 202
5334 202 751 356 -392 -973 -149 750 485 285 -504 -699 -304 528 698 57 -531 -821 -110 710 609 -80
5354 -80 -749 -650 126 831 554 0 -659 -410 377 987 601 -198 -866 -467 242 829 218 -230 -592 -315 275
5375 275 599 381 -279 -439 -211 408 698 264 -481 -608 -196 468 526 196 -462 -776 183 740 802 63 -395
5396c95k77O42O02J34p60l54j99Q07N25k62l52q63J70Q66N43l47q34k95J94O03
5416A48P04k61n80q71M95P17N85m72p04n09L58P13O87p94n62l35N82O54M8m54
5436A49q77J0N36Q21j00l22p97j20N81P85O8o79k72l48O56N30n6m91o91j52Q19
5457E0O27M9j007n23L65O85M20k16p26j19J48N82M67l02o93o34M16P57K59r3p63
5478b51p60R15N00L34m98p63j61O87O37J29q61q8q6Q2N39Q1k70j000J37P17J027
5499A047j90r96l60j48R12L48J25r22j44m36R19L72lr50j29M11L89M63k41q61
5519c94n41Q43K50Q32p66n34l49K74N43N35l23q84j47M34L23L07k86o94p7L21
5539c33J184l13m31o53j49N99O48L9p30l21j32O01L75P2o58l20N9M73N40n1n34
$$ plain form
5396 -395 -672 -30 572 706 -54 -408 -607 200 725 463 111 -752 -582 284 827 480 -354 -649 -455 148
5416 148 852 591 11 -860 -365 352 937 465 -239 -748 -390 323 1010 216 -346 -681 -99 555 603 149
5436 149 -728 -718 -182 639 539 217 -580 -700 -119 666 734 55 -217 -565 91 621 565 74 -617 -769 50
5457 50 677 726 -281 -804 -439 246 666 450 -276 -395 -247 335 802 500 -193 -827 -411 346 605 512 -251
5478 -251 -1011 -96 404 738 240 -523 -684 3 640 769 -92 -180 -266 -184 355 436 166 -834 -697 20 1047
5499 1047 857 -139 -499 -647 265 613 738 -184 -328 -764 155 527 524 -426 -555 -144 245 708 467 -394
5519 -394 -935 -92 158 990 224 -310 -659 -385 158 693 370 -514 -661 -227 96 403 117 -577 -654 -333
5539 -333 851 538 107 -546 -695 -96 552 591 -139 -460 -592 9 384 456 -202 -522 -463 10 550 499 -35
5560c5m15j31Q34L65J35r09n45L64N05M71m60m87k76K34P67L86o88n18l99N47
5580b55N33K15o82l43k68M85R46k8n73n60l3K46Q17j82k19m50j84O68K79j30n05
5601b23m98L57L87M76K2n20m20q7M66P33k83p64m71O06O49J57n08k88l28J99M62
5622A24N96n06m63m74L86Q11M0p74k53LM84M47J90o66m01n6J3Q52M74m44j055
5643f72L82J46N83N7o57o67K27P38L88l6n66o16P1O51N32j93o08l70K96J74O87
5664E47j07n96l55p5P63M68j46o50l29J25P06K65n64k68k90O3P44N33n45p50l43
5685h04M06Q64m2m36p48K82O18K88M22p76o66P5M83L82K36n23n35r6Q07K37k77
5706A97j17n94L5O94J95p7n41j13O2L57K20L8n79l55L43P25J28k16o65l18M99
$$ plain form
5560 -35 -450 -581 253 618 753 -156 -701 -337 168 639 179 -308 -584 -350 417 803 115 -403 -802 -255
5580 -255 278 493 -189 -532 -800 -315 631 603 30 -530 -563 -317 500 318 99 -351 -535 133 412 282 -223
5601 -223 -721 -364 23 499 521 1 -419 -506 -40 693 410 -354 -825 -219 430 587 79 -209 -537 -338 124
5622 124 720 214 -249 -723 -337 474 514 -260 -513 -510 -26 421 611 -55 -456 -512 -499 353 827 383 -672
5643 -672 -290 -144 439 496 -161 -828 -601 137 525 489 -77 -693 -622 29 561 368 -240 -610 -314 -140 547
5664 547 440 -156 -511 -586 177 645 499 -151 -480 -355 351 616 52 -216 -506 -443 301 834 289 -461 -804
5685 -804 -398 466 424 -12 -760 -478 140 428 850 74 -592 -517 -34 348 584 61 -474 -570 237 474 197
5706 197 80 -514 -479 215 410 333 -208 -321 -259 98 318 356 -223 -578 -235 490 618 402 -263 -581 -82
5727h2N73J74k61p09l85P24L87K91r97j29j79N77L99K49o13m52k62O93P15l61
5747C52n15l64j79O21O41k01l71o19L37J95P41l79m55m16K49O84K52j98m32m65
5767e22L71K04M79k90l68m37J46P71K01n87j18l20R9P07J49k00o91J4K79O55K71
5788H13p79p49L40M6P76j00m44j76k78Q56J48r7m83n06L12N67K61k08k28l91l7
5809c57K37O57k49o45k85M44M58L53l95n34P5j12R09J62n15n33l68K10R45K0j99
5830B78o44j48N61J65M90m71n21j82L43O21l47k07l25j16M34N22J49n92m17j05
5850e12M17O08k15m66m06L97L50O1J7n09j72oK77P30j79o98k12L13L08M9K48p22
5872c22j72L22N10K09k08q01R8K83L69L70n39n88j37K69P57j73o30J47j12N55
$$ plain form
5727 -82 491 665 404 -305 -690 34 421 712 -285 -414 -593 -16 383 632 19 -433 -695 -2 713 352
5747 352 -163 -527 -706 -85 556 355 -16 -635 -298 -103 638 259 -196 -612 -363 321 573 375 -57 -522
5767 -522 -151 53 532 242 -126 -563 -417 354 555 -32 -150 -470 -371 336 485 285 -406 -392 -113 542 813
5788 813 34 -715 -375 -329 447 347 -97 -273 -551 305 453 356 -127 -633 -321 246 507 299 71 -320 -357
5809 -357 -120 537 288 -357 -642 -198 260 613 218 -316 -241 -353 556 718 203 -330 -698 -488 457 477 278
5830 278 -366 -514 47 212 702 231 -290 -472 -129 492 145 -62 -387 -503 -69 453 602 10 -407 -512
5850 -512 -95 513 298 -168 -574 -177 173 234 251 -258 -430 -436 -159 571 392 -306 -518 -205 103 152 400 -322
5872 -322 -494 -172 338 547 339 -462 -364 -81 288 658 119 -469 -606 -337 420 247 -383 -236 -348 207
5892B07L68l31j58l67j8O82n1K4m05k73R2L89N21l83j71q16M35m4N79o9m83k67
5914e39K78M92L53m67p10m3Q7O28R7K5l46n00O89K04J63q5o34lK58O14j9l65n38
5937c61k38N38O66j85n53m55L84J38L91R5l36k62n3J75K95K05p58P0N3K85M70
5958E64k17n51j15L61K86J70n22k70k48N93K15K69k94n08l01O71r8L88k98n27
5978d32q3K96N15K67m82o25o1O75K69j29J0n37k74P15L14n4l88k68j37N20O53
5999G64j61o65m33J51O55K70l93l06m21L42M33J01k90k16k99K20M63K83j34o30
6019b66l23N40L02J80l81n34m3M25L92J22l47m51j2M69K94L8o53j75K13L08n5
6040D3L38o74k09rN04K31K68p99M4O0K46L71J8o25k86L70J54L21k55k63l12L85
$$ plain form
5892 207 575 244 86 -281 -299 383 332 356 -49 -322 -230 159 680 297 126 -690 -255 -299 280 211 -272 -539
5914 -539 -261 231 584 117 -593 -636 -549 79 176 201 -145 -645 44 248 411 326 -308 -311 -53 561 542 177 -361
5937 -361 -599 -61 605 420 -133 -588 -204 -66 325 420 84 -178 -231 -56 239 444 -314 -244 -191 94 564
5958 564 347 -204 -319 42 328 498 -24 -294 -542 51 266 535 241 -267 -568 103 5 393 95 -432
5978 -432 -515 -219 296 563 81 -544 -605 70 339 210 220 -317 -591 124 438 384 -4 -272 -409 111 764
5999 764 603 -62 -495 -344 311 581 188 -118 -539 -197 236 337 47 -169 -468 -248 215 498 364 -266
6019 -266 -589 -49 253 433 52 -482 -525 -100 292 414 67 -384 -396 73 367 405 -248 -423 -210 98 43
6040 43 381 -293 -502 -511 -7 224 492 -307 -263 -203 43 414 432 -193 -479 -109 45 366 111 -152 -464 -79
6062g9J84K59j82n83J9J97N52j6Pp19j38K04M26j20J31l10k28N4O67j52K2p06
6084e11J76N27J92m1m06k1j97L86K68k95j0o16J88N44J41j91j91k65q5M84L32
6105D09l83j81l01J24O18J30k36l24j37l3M24J34p5m33K0J73M70j03m05l2l34
6126d75N93M33R1o54m05N5L29K88N4k55k47k31O06J87k77m01k48O0L43N14k60
6147A00k62j81J34L29P9l26J24j00m9K76R3K23n16m41O16J88P9m11k81k47L71
6168b02M24J20m42o8l99M26N65j02k22l34l7K76R8K19m55l29K7K68L20K71n81
6189a57l58L87K73K19l1n75p2K57K34J17J11p15MK5J4N80l9k12o20J50J97P05
6211D94k54l13p8K0J34K01r0k13l87K11O79K0m19l73nJ73P02o9n22k19j42O41
$$ plain form
6062 -79 105 364 182 -401 -382 -185 367 351 358 -361 -499 -295 131 11 142 -168 -396 -342 325 173 195 -511
6084 -511 -335 192 384 343 -63 -84 -281 105 373 78 68 -548 -360 184 325 134 -57 -322 -407 77 409
6105 409 26 -155 -456 -332 286 416 180 -144 -281 -314 110 244 169 -264 -244 -71 399 296 -109 -141 -475
6126 -475 118 551 642 -12 -417 -362 -33 255 309 54 -193 -424 182 369 92 -309 -557 -497 -154 360 100
6147 100 -162 -343 -209 120 199 -127 -3 -103 -152 124 217 440 -76 -517 99 287 366 -45 -326 -573 -202
6168 -202 222 342 -100 -168 -567 -141 424 322 100 -234 -271 5 103 322 -133 -462 -435 -167 153 424 -157
6189 -157 -515 -128 145 364 333 -242 -314 -57 177 294 405 -310 -306 -281 -267 313 274 62 -558 -408 -211 494
6211 494 240 -73 -151 -131 3 204 114 -99 -486 -275 404 424 5 -368 -373 -200 502 433 -89 -308 -450 191
6233A91J42n2j02n15q7N27J90j31k10k88p5P48J21n7p94K1K31N2M65k70l41o4
6255b98Q1M46K90o17Q9l79j45N95J87j1o20j83O12K94q4j23l15l47N39K72J25
6276D08m16Ml73K63K80K76n13j99m6J86M98k47o5n00L13K36K98l46k59J18j51
6297b35L86L26k25m63O1J1M68J22j46k37o53M62M72P6j89m64p9M91L84j43m56
6318c1m96M53p8N74N1l83l96Q9n6O47k81n1l11r7L27N95l99l70OJ5K34L28Mn94
6342b20k37L91R2L22M0m99k61J32O57k35rm68q2K24L43O5j46n22J02l4O65m8j32
6365A40j20k6k92L42L77l39l00l50O16K72K8m31k80P7J94N21j37j68j67m59N35
6386C3M03l8k20m30Q6L94r2K45p92m7J98N39n5j07m43k6N68K1K5m61J38j32K61
$$ plain form
6233 191 333 281 179 -336 -423 104 294 163 -47 -335 -410 338 459 402 -392 -371 -140 -88 377 107 -234 -298
6255 -298 -217 229 519 -98 -9 -388 -533 62 249 238 -382 -565 47 341 257 134 -181 -528 11 283 408
6276 408 -8 -4 -377 -114 166 442 -71 -270 -316 -130 368 121 56 -444 -131 105 403 57 -202 -84 -235
6297 -235 151 477 252 -211 -150 -139 329 451 305 68 -585 -123 349 425 236 -228 -307 184 568 425 -31
6318 -31 -527 -74 -152 422 473 90 -306 -217 -273 374 93 42 -269 -366 -39 556 157 -213 -207 -192 42 370 374 -220
6342 -220 -457 -66 26 348 388 -111 -372 -240 417 182 173 -295 -377 -153 190 255 109 -413 -311 -345 320 272 140
6365 140 20 -6 -298 44 421 82 -218 -568 48 320 348 -83 -363 -286 -92 429 292 124 -43 -502 33
6386 33 436 398 178 -252 -166 228 136 381 -411 -458 -260 279 224 117 -326 -352 216 237 262 -199 -61 -193 68
6409F8r8M26p8o58l4L53K21J62l5l31m47L94L63q9k48o8j85O1O31j15k83k90L8
6432b42N80j06k98L4k61J64J74L81l72k14J85j68K58K79k00l48J50l62L41J66
6452A41l3k53k28L22M59Q4o59k1K30J40J31k42j06k97J51J38L78qm0m86k28Q41
6474D14j45K5l76k28J87R3K48j87m00K37k07L43K82l91K45o34M66K21M1m0j95
6495aj54l2L17K69l57j86N3J81K53j94j00j76o7K1O74q8k24k29j68J77J99L49
6517E17m96k97L31l67K76K85j85k73N7J17M01r3k55l53o4O78j98J17j25k63K2
6538a68L01J41m6k89l32K59J82J17j26m11qM01J79k04J6l4j23r9N18k10Lk91m6
6561b70M35L5k4Rk49k66N06J67k32k09j56K31m5L88l04O7n57J50L53M80m71k12
$$ plain form
6409 68 -30 396 318 -340 -374 -21 200 362 327 -4 -451 -57 306 217 -31 -99 -284 -223 408 293 10 -280 -242
6432 -242 338 232 -66 -32 -293 -129 45 426 54 -160 25 -143 115 394 194 -154 -4 -366 -25 141
6452 141 108 -145 -373 -51 408 492 -167 -188 42 182 313 71 -35 -332 -181 -43 335 327 287 -199 -427 414
6474 414 269 294 -82 -310 -123 -30 218 31 -369 -132 -339 4 286 -105 140 -494 -28 193 234 194 -1
6495 -1 -155 -187 130 399 42 -144 -91 90 343 149 49 -127 -194 -173 501 413 189 -40 -208 -31 168 517
6517 517 21 -276 55 -312 -36 249 64 -209 -152 -35 366 273 18 -335 -399 279 81 198 73 -190 -168
6538 -168 133 274 228 -61 -393 -134 48 165 39 -372 -380 21 200 -4 12 -22 -145 -244 274 64 67 -224 -270
6561 -270 165 200 176 185 -64 -330 176 343 111 -98 -254 -23 -68 320 16 83 -474 -324 29 509 38 -174
6583a74j59J93L41P5m28l5R6jJ01L42j53k68l81M29L15J0m27pj91L25l8L29m67
6606a73l2K40J6PK67k62l10O0M11K56q8l60m63L37J66O0N4j68oj38L39M2j19n17
6630c81nM89j95N70n09k10k15N00L36kk44Ln94N37m0J97j13m99K08l0K45M39m86
6653Aj86j14K78J96j18j78M3j76L17Q6J90n07J77p9Q5J35k29J3k56J76k06M80
6675A28J59m90q1K74R4L00j01l52l32L68K53k35m6L2r8l4M29p4k0m75j4J19K57
6698F1Jn6k20k9N2M02n6k90o1j68M72p2K05k7l71J29Q0J50j48k25n5K28M3M43
6722D88k76m14j09J13J97K85k60q5j78J57Q1K65j15k74N1K07l2qk2l44k32N73
6744F8Q7J35m45p6q6M07J15j29k44K19j30o0L89j87j01k21j01L77K84k74J81m96
$$ plain form
6583 -174 -333 -140 201 276 -152 -187 -91 -92 9 351 198 -70 -451 -22 293 303 -124 -131 -322 3 -35 294 -173
6606 -173 -205 35 51 58 325 63 -247 -187 224 480 392 32 -431 -94 72 132 186 18 12 -126 213 255 136 -381
6630 -381 -386 103 -92 478 -31 -241 -456 44 380 378 134 137 -457 80 40 237 124 -375 -167 -197 48 487 1
6653 1 -185 -299 -21 175 57 -121 -78 -254 63 149 339 -168 9 -70 15 150 -79 -66 -322 -146 -352 128
6675 128 287 -203 -284 -10 84 384 283 -69 -401 -33 220 -15 -61 -29 -127 -161 268 194 174 -301 -315 -196 61
6698 61 62 6 -214 -243 -191 211 155 -135 -196 -364 108 36 241 214 -157 -28 52 202 54 -171 -226 2 45 488
6722 488 212 -202 -311 -198 -1 284 24 -61 -239 -82 -1 264 149 -125 -74 133 101 93 71 -273 -505 68
6744 68 155 290 -155 -231 -317 90 205 76 -168 51 -79 -139 250 63 -38 -259 -360 17 301 27 208 -288
6766b88L11J86L43l63l27N1J59k00K84l9k26q5N5L78j7J31m54K9R4J43L66p07
6788a76M2j04N61J92o24N3k82K84pN42K1m21l33mj14O50M5l12k97Q2N30j07K5
6811B46k10l87L34J00J43J25n78j74J00J19L10j26j01k22M41M0q7J74n24K28R
6832d0K73K27o38J82l43l4N32N6k34j41k74K76L56j25N5l68j58K23K53J9l59J49
6854a13l67M24M16k10k55j1J8J26K78j41m57J24j08K60M39l51j71j05r1P46o6
6875C85m34n1PJ73k2K6q2j8m7r3L48k19K32k58k70L0N21j57j39l77m9L42K68L1
6899A47k67j41k33L44N10R4n61n5j00N09j65J3k19j62K0O42k88j2o0j35j12R1
6921a40L28Q4m00K02M6j68M00m03n5R5l07J66M01j69k87j58M18K27k99N7R5k70
$$ plain form
6766 -288 23 209 552 189 -138 -87 72 -128 156 117 -109 -194 -139 239 222 353 -101 -72 22 165 531 -176
6788 -176 -134 -238 323 515 -109 -56 -338 -54 -61 481 502 81 -252 -256 -370 280 325 13 -284 -202 328 221 246
6811 246 36 -351 -17 83 226 351 -227 -401 -301 -182 128 2 -99 -321 120 160 73 247 -277 -49 -40
6832 -40 233 460 -178 4 -339 -373 159 215 -19 -160 -434 -158 198 73 128 -240 -398 -175 78 97 -262 -113
6854 -113 -480 -56 360 150 -105 -116 -98 28 306 165 -292 -168 -276 -16 423 72 -99 -204 -295 451 385
6875 385 -49 -100 -93 80 58 84 2 -16 -63 -156 192 -27 205 -53 -323 -293 228 71 -68 -445 -494 -152 116 147
6899 147 -120 -261 -494 -150 360 454 -107 -162 -262 247 82 95 -124 -286 -266 376 88 76 16 -119 -231 -140
6921 -140 188 272 -128 74 120 -48 352 -51 -106 -11 -318 -152 249 80 -207 -365 53 280 -19 38 133 -137
6943a37l1O51l78n2j04m61M46K24K24k76l63J20L08K09k35l07j71J29N07j3j9
6964B71m37l43K97M10lj8l04j65K09K04J70k60j64k55M42K36Q7m09q3J2j38N05
6986B64k05l85J35k56P38r7J2l59J55k64J65L95l94j95j5J39P5L83l62J62k02
7007a11m2J37L9J79l93Q6o9N18N8j77m21J8K03L8q5K7j60k49K29M18J37j23m10
7030a53k90N54JJ0r1l28L10j32J38K30l32k59J28J95M54j36j72k09j67L53M5j12
7052C7r8j96l2M45J52p3n47K40L28j25l8k5j31l05N15l89M55k36J17k97o6J79
7074i0L91k50l39O7n6N00N2l76k34J11K59K98l2k12l25QK25J94l1j88l42K69J49
7097D8L64k44n66J95j14J14M1L22k64k61L94K39j15p4j03m91N38n6L35k34j43
$$ plain form
6943 -137 -168 483 105 53 -51 -512 -66 158 382 106 -257 -137 171 380 145 -162 -333 -204 303 290 271
6964 271 -166 -509 -212 198 195 177 -127 -292 -83 121 291 31 -133 -388 54 290 377 -32 -115 -103 -241 264
6986 264 59 -326 -191 -447 291 194 206 -153 2 -262 -97 298 -96 -291 -306 -167 -92 291 -71 91 -111
7007 -111 -153 -16 23 202 -191 -105 -174 344 402 225 -196 -178 25 63 -22 5 -155 -404 -175 243 380 257 -153
7030 -153 -443 111 112 122 31 -297 13 -119 19 249 -83 -342 -214 -19 435 299 127 -82 -249 104 149 37
7052 37 -61 -257 -289 156 308 235 -312 -72 256 131 93 68 -63 -368 147 -242 213 -23 94 -203 -269 -90
7074 -90 301 51 -288 -221 -277 223 275 -101 -335 -224 35 333 301 89 -236 -228 -3 191 160 -28 -370 -101 48
7097 48 412 168 -398 -203 -317 -203 -162 160 -104 -365 29 268 153 79 -24 -515 23 -33 302 68 -75
7118g5k19M59p3L35m63r9J59k44M93j45L2n22N4P1J69K90o8k71k15M09J37l42
7140a28O5j19n5K73R6j57P2l38J47J97J14O4l53K9j79O61k02P9r9n44J64M61q7
7163A61O8l16k31N00o4j8Q7m69k2N42PK20l44m2j04P3J01P1n9l20J24J64J91k15
7187A05j64pN1O8K29k52k00L8j72N06J34j36m4k88MK43K7P2m14l0L24J8k33J15
7211fO1l17J93K44J08j91J04m92J45L95l67K69m62J17M69L7k79J41m58O0P0L38
7233A79M4k02m08j02O09Q7q0j50l60N30j83R8K33l07k16j24M73L72n76P2j66o1
7255b38K58J40M1k62j91J95K43K36j33n40J24L81j2k12j97p4J87J7r4M19j69n01
7277c82L89r2K96q8j50k65K12J13K46k70K9q0j32Q7N9j5lj30j4J83J36j79K74
$$ plain form
7118 -75 -294 165 92 427 -36 -135 24 -220 273 128 160 -362 -308 -237 -68 222 154 -117 -332 77 214 -128
7140 -128 -63 -182 -237 36 132 -25 47 -291 -144 53 167 231 -122 -93 -272 389 187 266 167 -377 -213 248 161
7163 161 229 -87 -318 182 118 100 187 -282 -304 238 245 465 121 79 -25 48 149 220 161 -159 -35 129 320 105
7187 105 -59 -66 -15 53 282 30 -170 -132 -304 202 336 200 156 -132 -128 115 142 214 -200 -230 94 112 -121 -6
7211 -6 55 -262 -69 175 283 92 196 -296 -151 244 -123 146 -316 -199 270 307 28 169 -289 -229 -159 179
7233 179 223 21 -387 -489 120 207 127 -23 -383 147 -36 62 295 -12 -228 -352 121 493 -83 -11 -177 -238
7255 -238 20 160 201 -61 -252 -57 186 422 289 -251 -127 254 242 30 -167 -241 -54 -37 -131 288 119 -382
7277 -382 7 -85 211 123 -27 -292 -80 33 279 9 38 -42 -174 -87 -28 -43 -46 -176 -190 -7 129 -50 224
7300B24m68K18J86J24l22k28j7J62K66l4%n17J05M93K6j99Lp2j24L34l2jl08q0
7324b61j02L62L05J22m23k09M9Q3L06o2j04p5k65L21J82j24j95k41J87J63R9j4
7346A04l17RM33j78J95r7m16J36K66j89J29j44j19j15L97j46L21l02N5n63N77
7367C6L08j69k78k82L26R7K76k92K7l87J05J84N5K02l45l6M9J30J23O7k33l76
7389d13K41L51K09k35j41k33K17K40m00L53l21j96K7K30M95m75k79nK31K72j16
7410E2L5o29J71J57L87p1J56m52p8L46O1K49j35k60m13K75L97l39K41j9k33L22
7432B20J08j57j65k15K33J25j99k9k8j49M35q3P4q0m04p0J54L16P3J06k95m6j87
7455b63J95K91j09k83l1L04J75k48k59K92l14j05P51k67l0k23j69M97J84K1k51
$$ plain form
7300 224 -244 -26 160 284 -38 -266 -283 -121 145 111 111 -406 -301 192 218 19 22 -50 -174 160 128 127 -181 -261
7324 -261 -363 -1 304 426 3 -206 -157 -74 232 170 66 -9 -274 47 229 105 -90 -331 -144 19 118 104
7346 104 -213 -204 229 51 246 149 -267 -131 135 -54 75 -69 -188 -303 94 -52 269 -33 22 -541 36
7367 36 344 175 -103 -385 -59 38 314 22 49 -338 -233 -49 6 208 -137 -173 -124 6 129 196 -37 -413
7389 -413 -172 179 388 153 12 -221 -4 236 -164 189 -132 -328 -301 -71 424 -51 -330 -335 -104 168 52
7410 52 87 -542 -371 -214 173 102 258 -194 -272 74 135 384 249 -11 -424 -149 248 -91 150 131 -102 220
7432 220 328 171 6 -209 24 149 -50 -79 -107 -256 179 96 170 90 -314 -384 -230 86 159 265 -30 -76 -263
7455 -263 -68 223 114 -169 -200 104 279 31 -228 64 -250 -355 396 129 99 -124 -293 204 388 409 158
7476A58l28K52J42R2m61J16K8l38M38M8J99m92K3J8L41k2j93j68m16O08K78k72
7498E1j87P4PM8J81R6l70k8J31j49K85K29o56J57o2M40q1LJ5k15m3Q9K11k73K54
7523B07n95L28o2K62O9k1m82N5L48O9j73k34P6k05O49j71O4r6l11J55L34M4l46
7546c6n05L84J86K28Q1n61J69k96K65K26J83m47j66rL28J26O4j19k80K04j64L50
7568B11n5k34k21j87O75O6k67k1j67P0m0K74M1j88j2o4K93k09K33n72K2L29K37
7591B14o0L83n08k4j17K43J60j85j34k09k8L50R7Q2m57j8M59j32J85j55j88k22
7613b64J31M32j15k63k94O4J04L10M8m66m9Q3K06K33q9J50n44K22L98q0O0r5k68
7636h6q4J96L78m31m7nJ70K48j87km11J95M0J40L4j00Rj22j77L82J76m09qP3J1
$$ plain form
7476 158 -170 82 224 316 -145 -29 -1 -339 99 147 346 -146 -123 -105 236 214 21 -147 -563 45 323 51
7498 51 -136 -62 -55 -7 174 270 -100 -128 3 -146 139 368 -288 -131 -193 247 166 169 184 -31 -74 15 226 -47 207
7523 207 -388 -60 -122 140 209 188 -294 -239 109 178 5 -229 -153 -358 291 120 184 88 -223 -68 266 310 -36
7546 -36 -541 -157 29 257 338 -223 -54 -350 -85 141 324 -123 -289 -298 30 156 220 101 -179 25 -139 211
7568 211 156 -78 -299 -486 189 255 -12 -33 -200 -130 -170 104 145 -43 -55 -119 174 -35 198 -374 -352 -23 214
7591 214 154 537 29 5 -112 131 291 106 -28 -237 -265 85 182 264 -193 -211 248 116 301 146 -42 -264
7613 -264 -133 299 184 -79 -373 -309 -205 105 153 -313 -362 -279 -73 160 71 221 -323 -101 297 217 277 182 -86
7636 -86 -170 26 404 -27 -74 -79 91 339 152 150 -261 -66 -26 114 148 48 57 -65 -242 140 316 -93 -101 -28 -17
7661a7M37k42l58k29L79N36l83p7k8k46m4N81J01m58j70j8L9K88J30r5j90k01
7683b65M7K01R0J45m16K35j85L65l6j0m70N8j6N45J8m62r9R9J55K75Q4l76K3l39
7707c34J80J51J41l50L5J75k34L31P2j71j30K83J13j46j80R5k83O3k4N34j29Q7
7729B79p34N05M00k01j4k10l90J52K86M41m18j82j77J95K19n2r0j88J11N1K79
7750B62j43P6p18N14j53M40J74n07j23k02M59L00q8l43L1j99L21J1j18r0j25Q8
7772a33K02Q3r6j0l12J17K90j28Q2l62p0l8N75q9L01o24j61J30K87K47k43l32
7794b84k2M93P7K3k36J01m96M34J4J21k48m33K19K69J43j44j29o5J93j30N02m39
7816c7J16l30m1M62L02n05N6j46n1J49K40j23k38K00k13R9l0L67m51j05L12JK47
$$ plain form
7661 -17 420 178 -180 -409 -30 506 123 46 18 -228 -272 309 410 -48 -218 -236 -197 91 221 126 -64 -265
7683 -265 -218 -17 73 218 -198 37 -148 217 181 171 -299 -241 -257 288 306 -156 -255 -156 -1 274 358 -18 5 -334
7707 -334 -154 -3 138 -212 -177 -2 -236 95 167 -4 -134 149 262 116 -64 31 -252 -189 -213 321 192 279
7729 279 -455 50 450 249 235 25 -365 -213 73 514 96 -86 -263 -68 151 99 9 -179 -68 -17 262
7750 262 119 195 -523 -9 -162 278 452 -55 -178 -380 79 379 291 -52 -21 -220 101 112 -6 -96 -221 -133
7772 -133 69 152 56 46 -266 -149 141 13 95 -267 -337 -375 200 111 412 -212 -373 -243 44 291 48 -284
7794 -284 -306 187 264 287 51 152 -344 90 104 225 -23 -456 -237 32 175 31 -98 -163 30 -100 402 -37
7816 -37 79 -251 -292 170 472 -33 23 -123 -174 -25 215 92 -146 54 -159 -60 -90 277 -174 -279 33 34 281
7839B81k98l87R3L88O5mk16Q2l35M35J04m12J87l48K78N2N2L52n42L0M8l9N92
7862D58j70k32k77N1P8J15J38j89j90K02J31L25l22o03J73K88L02j52j5j69r9
7883a57Q6J77K04l53r3k63M08N6O9k07o9N8Q7M6M80n30j99l2R5J84j36k34K19
7906a04M0J71O1j22j1j01l62L32M59l94L7k14K05J78J4J24j69l59j32M75L41l37
7928A32k91j62J42K80k6K23o15J45P8m4Q01n08k73j65K54N1M39l36k98J20M0R5
7950H2n7J0k86K47P0J14o8j97J07j09L79m5j36J08m45j15L94K83k3m45l40J68
7972c04M36j3Q1k25l73J34K65J64k41R3N4j80K04Q5l64m3J65q8L68p6j77l94J86
7995b43N10l83J72K5j21k70p1P63o2o91K65j83J08M11k3m02j37K05J69K29l55
$$ plain form
7839 281 -17 -404 -311 77 142 138 -78 4 -331 104 208 -204 -17 -365 -87 -35 17 369 -173 -143 -95 -134 458
7862 458 288 56 -221 -170 -92 23 161 -28 -218 -16 115 440 118 -485 -312 -24 278 126 111 -58 -157
7883 -157 -71 106 310 -43 -136 -399 9 65 134 -73 -142 -84 3 49 529 -1 -200 -232 -137 47 -89 -323 -104
7906 -104 -64 107 168 46 35 -66 -428 -96 363 -31 6 -208 -3 175 189 313 144 -215 -347 128 469 132
7928 132 -159 -321 -179 101 75 298 -317 -172 -94 -138 663 155 -118 -283 -29 22 461 125 -173 -53 -13 82
7950 82 25 35 -251 -4 66 180 112 -85 22 -87 292 247 111 219 -226 -341 53 336 313 -132 -472 -304
7972 -304 132 119 200 -25 -398 -264 1 165 -76 17 71 -109 95 180 -184 -227 -62 -150 218 142 -35 -429 -243
7995 -243 267 -116 56 81 -40 -310 -381 382 320 -371 -106 -289 -181 230 207 -195 -332 -127 42 271 -84
8016h4J35k66M7K05K34k23j80O1k27O09j15J09l45r2k0M07k14kk12k99L83L14
8038B25j09j41m52N73j4R6j78j23Pk39R4N48K1l13k61k9M62o5n4j71p8j06L75
8061F8J33j37r2l51Q7K61J43J51m35j83L41M27k61K33k02j48r7Q1L34m28l08K69
8083a14L62N1m4q5j09M6k24M52k43k8l59K6J58L58J38n9o33J73P0L96j16r5n78
8106d57J29K64L12j2k07n5m25L97M70l39m46K69k12P16l91Pj7k24m4K87K09K60
8128D91o58lj07N34j94q2k12K7n1L81K46l95l39K42J0L85k24l43J34j63oO53j12
8151B14j66l41J96J43K45J1m05j00L35m8p0o1q1K50k03j4J12J87j73k15K19J88
8173B23n4J24n62P2ML02J88k42O4l26K29R6pj69j31L7O4M31
$$ plain form
8016 -84 51 -215 -168 37 271 48 -132 -71 -298 311 196 305 -40 -132 -152 255 41 39 -173 -472 -89 225
8038 225 116 -25 -477 96 82 178 0 -123 -116 -355 -261 287 308 -5 -266 -295 167 102 48 -123 -201 -307 68
8061 68 201 64 -28 -379 -292 -31 112 263 -172 -355 -14 413 152 385 183 35 -62 19 353 -75 -383 -114
8083 -114 248 299 255 170 61 107 -117 335 92 64 -295 -269 -111 247 385 326 -307 -134 -64 332 216 121 -457
8106 -457 -328 -64 248 236 29 -26 -451 -54 416 77 -369 -100 -312 404 13 20 3 -221 -265 22 231 491
8128 491 -167 -170 -277 257 63 -19 -231 -204 -255 126 372 -23 -362 -120 -110 275 51 -292 -158 -321 -327 326 214
8151 214 48 -293 -97 46 291 302 -103 -203 132 84 14 -47 -128 122 -81 -95 17 204 31 -184 35 223
8173 223 169 293 -269 -197 -193 109 297 55 119 -207 22 118 111 -58 -189 -152 -88 343
8191C43
$$ Imaginary data points
##PAGE= N=2
##DATA TABLE= (X++(I..I)), XYDATA
0@%%%%%%%%%%qJ6j6J6j6K3l1L2l9M7m9N7p1P9q8J04j20J36j54J73j95K20k47K78
34A47l10L43l82M25m70N22n79O39p09P88q71R63j070J192j333J497j688J919k201
53a178K554l018L655m576O050q791J5561n9243j28088J07274J50887M2935j04864
66A9158j04436p188Q0993P0429J5873l8761o0713m7291K1308Q7820P5621l6054
78G6759j25654p6853P5152J43553M1596j11943j29079k916J12500R3786j7446
89G9455r5180p1954J0083P2631O9734P162p0473q5887j0951Q5911R6818r97j03541
102a7189r0979K5203J10209P0251l8927r5638n3791L3131Q1996N4322k2676q3227
114b7315o9522J9463J00823P5568m2397j21706o3925O6914J20329L4591q7156
$$ plain form
0 0 0 0 0 0 0 0 0 0 0 0 -8 8 -8 8 -8 15 -16 16 -23 24 -25 32 -39 40 -48 56 -64 72 -82 91 -104 116 -131 147
34 147 -163 180 -202 223 -247 275 -304 335 -374 414 -457 506 -564 628 -705 792 -896 1023 -1178
53 -1178 1376 -1642 2013 -2563 3487 -5304 10257 -48986 -177074 -69800 81087 124022 19158
66 19158 -85278 -92466 -11473 58956 74829 36068 -24645 -71936 -50628 37192 112813 76759
78 76759 -48895 -125748 -50596 92957 134553 22610 -106469 -109385 3115 96901 79455
89 79455 -15725 -87679 -77596 -4965 64769 71931 1458 -84429 -95380 -9469 87349 86352 -17189
102 -17189 -108168 -82965 27244 97495 58568 -37070 -90861 -57730 24266 78588 55912 -27315
114 -27315 -96837 -77374 23449 99017 56620 -65086 -129011 -62097 58232 92823 5667
125E667j03004n745P9502P0555R1n3476n6178j8213L5157O9711M5475l7410r7813
138f5681m9312P1773J21279K9587j01730j13429R979J20353Q6794l9387j04832
149c4606m9419M2964P5463L5663k3584n5499m7255n50N8302P0212J862q4648q5181
162i6276J5671J04945P5216m4543j14192n2548O3262J00018K7589o2213q0712
173f3783k1374N1661P2852K8476m2593p7967l5516N1615R1307L0902o5917r0838
185g1175j4533P5783Q2211l66p3365o6307L025O0087O0043P701n6144p2366j6683
198h2089O5628Q7089R070r0821r1443J6739J06935P1782m3527j01605m2217N5420
210c9039P9370K1636m0125n1055k3255J6496M8786M9990o09o7329p0248J5152
$$ plain form
125 5667 -97337 -103082 -23580 46975 47066 -6410 -62588 -80801 -45644 24067 69542 32132 -65681
138 -65681 -114993 -43220 78059 107646 5916 -107513 -97534 22819 109613 70226 -34606
149 -34606 -84025 -41061 34402 70065 46481 -9018 -56273 -56823 1479 71691 73553 -11095 -96276
162 -96276 -80605 24340 99556 55013 -59179 -111727 -48465 51553 79142 16929 -63783
173 -63783 -85157 -33496 39356 67832 25239 -52728 -88244 -36629 54678 85580 19663 -71175
185 -71175 -85708 -9925 72286 71920 -1445 -67752 -64727 -4640 55403 63104 6960 -65406 -82089
198 -82089 -16461 70628 79698 -11123 -102566 -85827 21108 92890 49363 -52242 -94459 -39039
210 -39039 40331 61967 21842 -29213 -52468 -35972 12814 62804 62195 -5134 -75382 -60230
222f0230J01351P2579m8397j16569m4620P9203J05862R734q7727p7409J1974O9460
234A5211M7518q680m4553m5067j5102L1694N9786L0295m4345q3983k8951O8883
246a7294R1121O149q6810p9441J6118Q9228O0771k7748p6833m4480K4430O6296
258B1507M6702j6099o6489n1665J7911P5518N3964k8911q3062m3622M1180P6746
270D3680K9335m3204o6635k6365L4455N8864L1080k7884o7260m4112L3101Q3292
282C8347M3072n3754r5431k6070P6953Q9209k038q3413o2412K1378O8981M0917
294E5739j6901m4458l2159j534L1369M9263K2608l9995p3907k2440O7800Q7436
306H2821m71r4529p7753L2764R9754M6544n4158q3003k1565M9797N7103J1086
$$ plain form
222 -60230 41121 113700 65303 -51266 -95886 -16683 89179 98913 11186 -66223 -54249 15211
234 15211 62729 54049 9496 -35571 -50673 -18979 40807 71102 26757 -57226 -86177 -17294
246 -17294 73827 79976 -6834 -86275 -70157 19071 79842 52094 -24739 -69219 -44789 21507
258 21507 68209 52110 -14379 -66044 -48133 27385 81349 52438 -30624 -74246 -33066 43680
270 43680 73015 29811 -36824 -63189 -28734 30130 61210 33326 -33934 -78046 -44945 38347
282 38347 81419 27665 -67766 -93836 -16883 72326 70288 -13125 -75537 -54159 14822 55739
294 55739 38838 -5620 -37779 -39313 -7944 41319 63927 23932 -49975 -72415 -4615 82821
306 82821 82350 -12179 -89932 -57168 42586 89130 34972 -48031 -69596 -19799 37304 48390
318D8390l2365m1854k3211J2449M7255M2509j1453o6013n1706K7768Q4805M4772
330H1346n0054q6302k2133O3891P5021O906o0964n9595L30N3426N2219L837m6978
343A0950n4252r084N0263N8979N119n8716o0838L037O3014N1894j3319o0196m4604
356e7753J0762N3090M4625p069n5505n1195O451O5076N7641j7109p7695n1009
368g9690L6330Q3449L4317m9871p2117j2532N1502N1936N526l4241l7369j5094
380c7854J8329M2509L3466j5474o2652m5019L2761Q2079L5245o0089q7007j0602
392g4308P7083P0542j7379p5669m3250K6603N4110K5957j4893l4776k8598l529
404c8107L1136M6628J4825m4949o2730m912O6734O4884j4924p8758m9891L5693
$$ plain form
318 48390 16025 -25829 -49040 -36591 10664 53173 41720 -24293 -75999 -48231 36574 81346
330 81346 31292 -55010 -77143 -13252 61769 68675 7711 -51884 -51554 1872 54091 57928 10950
343 10950 -43302 -52386 -2123 56856 61975 3259 -57579 -54542 8472 60366 47047 -13149 -57753
356 -57753 -46991 6099 50724 43655 -11850 -63045 -56594 8482 66123 49014 -28681 -79690
368 -79690 -43360 40089 74406 24535 -47582 -60114 -8612 43324 48850 14609 -22760 -37854
380 -37854 -19525 22984 56450 40976 -21676 -66695 -33934 48145 83390 23301 -63706 -74308
392 -74308 2775 73317 55938 -19731 -62981 -36378 17732 43689 28796 -5980 -34578 -38107
404 -38107 -6971 39657 54482 9533 -53197 -58109 8625 73509 58585 -20173 -70064 -34371
416c4371P5283K8664m1056n9419j8789L2409M8221J9983k4774m8900k9162K2479
428b9432N5882L0821l3020o3879k4925M0933O1163J3659m5611n3828p958M1567
440a4628M7314J0990l6192n0886j4758M2023N9344J3560n2511o2109J212O4846
452H205N4421j5940o3017l7492K4018N2763K6236j8490l8730k5313M947L4669
464F277L9252K776m6941n2739M406O4930N3821k5018p7344l8174M4940P1497J6228
477F3911n0723n4190j704M2516L6478K781k4282l1805j7047J6652M4088K9783
489E6458k3387n9834k9366M1529O8428J3888n7431o1891L735N9759M6249j5222
501D2915n3341l3377J2973L9598K9875m831l7430l8598l72M2656M4471m771n3711
$$ plain form
416 -34371 40912 69576 28520 -30899 -49688 -17279 30942 50925 26151 -22749 -51911 -29432
428 -29432 26450 57271 24251 -39628 -64553 -23620 37543 51202 5591 -48237 -56195 -14628
440 -14628 32686 43676 7484 -43402 -58160 -16137 43207 56767 4256 -57853 -56641 8205
452 8205 62626 46686 -16331 -53823 -29805 22958 49194 30704 -8026 -33339 -28392 6277
464 6277 45529 48305 1364 -51375 -46969 17961 71782 46764 -30580 -68754 -23814 47683 63911
477 63911 13188 -41002 -42706 -190 36288 39069 14787 -17018 -34065 -17413 26675 56458
489 56458 33071 -26763 -56129 -14600 53828 67716 10285 -51606 -47871 11888 58137 42915
501 42915 -10426 -43803 -30830 8768 38643 33812 -3618 -42216 -42588 68 44539 39768 -13943
514a3943m4542J6119N8606L5377k4289n4309k5659K6520M8756K2236k1387m3560
526b0075k5152K0215M9575L0174k4679n5846k5777L5446N9461J5834m3856n2029
538c6709l629M2955M0525k00l5083l4779m776K7171L6819J3661k8942m8879j5997
551d7863M0953N6232N967n5314n3956J0831O1571L9041k4180n3740k3061K3597
563a9922M0114J7923j4280l1291k3727L172L4189L6531l630m8607m2583J5151
575c6960O0148L5338l2993o2631j9525M1092N0190N712l8073l8498m466K8171
587a2495L1993J0539k0971l7593j9678K5290M9047J8708l6716n3079p371M7653
599d673M8066m131m7952l4827J0679M0602K9732o083l3969k9853J738L4430L7088
$$ plain form
514 -13943 -58485 -42366 16240 51617 27328 -26981 -52640 -26120 22636 44872 23485 -20075
526 -20075 -45227 -25012 24563 54737 30058 -25788 -51565 -16119 43342 59176 15320 -36709
538 -36709 -40338 2617 43142 42942 7859 -26920 -31696 -4525 32294 45955 17013 -31866 -47863
551 -47863 -6910 49322 55289 -25 -53981 -43150 18421 57462 33282 -20458 -43519 -19922
563 -19922 20192 38115 23835 -7456 -31183 -28011 6178 42709 39079 -9528 -52111 -36960
575 -36960 23188 58526 25533 -37098 -56623 -15531 34659 40371 2298 -36200 -40666 -12495
587 -12495 19498 30037 9066 -28527 -48205 -22915 26132 44840 8124 -44955 -52326 -4673
599 -4673 43393 39262 -8690 -43517 -32838 7764 37496 31413 -2556 -32409 -30671 3759 40847
612D0847K41m2869m1517Q581N1726L6599k0390n3087k5906K7580M4762J5310k5148
625A6729l6273j4997J6229L3549K0980j3384l9415k8102J7766N0174K6150l0774
637A8632n4752j5106M1017M8844K007m2553l7146N000L4053K7615k28k5951k9941
650b8509p458K4823L7199J0692l2922m5638n469M4641M4468p929n0751l5224J8109
663c3968M6823K3107k0301l6838j7509J3719L1004K2470p278l3072k8490Q404
675c1929M2277L1910j6214m9062k5098K7772M9628J5359l2647m1257o751L0780
687e232L3107N715k3151l0503j1551K0629L5546J5386k5293m3167j3600L4325
699g789M5148L805m2503l9092N424M1399K9915j1259l5542k2453P482K7682K4093
$$ plain form
612 40847 41088 -1781 -43298 -34717 17009 53608 33218 -19869 -45775 -18195 26567 41877 16729
625 16729 -19544 -34541 -18312 15237 36217 22833 -16582 -44684 -26918 23256 49406 18632
637 18632 -36120 -51226 -10209 38635 40642 -1911 -39057 -34057 -4 27611 27383 1432 -28509
650 -28509 -35967 -11144 26055 36747 3825 -41813 -47282 -2641 41827 33898 -16853 -52077 -33968
663 -33968 12855 35962 15661 -21177 -38686 -24967 6037 28507 21229 -11843 -40333 -31929
675 -31929 10348 42258 26044 -23018 -48116 -20344 29284 44643 11996 -29261 -36012 -5232
687 -5232 27875 33590 10439 -20064 -31615 -10986 24560 39946 14653 -28514 -42114 -7789
699 -7789 37359 41164 -1339 -40431 -35007 6392 36307 25048 -10494 -32947 -25465 2217 26310
712B6310j036k8198l1528L26L5665L5546n894m3966l3558J6926M7696K3385k4380
725A7294m2458j3745K4719L3613J0342j9068k7906j4678J3140L2176K0318j5424
737A8323l9732k1148K3972M5115J4538l3646m2244l593L6386L4494k801l1638
749a974k6108K436K5335K5028M405k2085l1479p060K9247L7363L089l7666l6843
762c6312O977M3274K9405j6453l9770j9656J7757L2077J4349j3314k5962j8098
774b5726O067K8346K4695o974l7461k7984J5321M3965K2193k6515m3796j1210
786c9079L1213L5184K792k7372k7106k207K0584K3921Q221j5990k9413j4213K0807
799a2658L7507J2488l0722m0000l069L8266L4590p577l7896k4787J1701L0900
$$ plain form
712 26310 25274 -2924 -34452 -34126 1539 37085 31191 -12775 -46333 -29407 18289 41674 17294
725 17294 -25164 -38909 -14190 19423 29765 10697 -17209 -31887 -18747 13429 33747 18323
737 18323 -21409 -42557 -18585 26530 41068 7422 -34822 -38415 -2029 32465 29664 -1974
749 -1974 -28082 -25646 -311 24717 29122 7037 -24442 -31502 -2255 35108 38197 531 -36312
762 -36312 -29335 13939 43344 26891 -12879 -32535 -14778 17299 31648 18334 -7628 -25726
774 -25726 -19659 8687 33382 26408 -11053 -39037 -23716 20249 42442 15927 -27869 -39079
786 -39079 -7866 27318 30110 2738 -24368 -26575 -5991 17930 26151 10161 -19252 -33465 -12658
799 -12658 24849 37337 6615 -33385 -36454 1812 36402 28825 -9071 -33858 -22157 8743
811H743J8700q564k4802j9355K803K4327K4978l86l0990k9822O642L8370K7026
824C7670j5346m0503j9039K2165L6152J0801k1445k8061r047J6605K5711J2164
836B7827j3034k8626j6536J5327L5298J6120k2972l8785r330K9981L5215N68l1572
849e19k7318L682K6268K1497j828k1203k2226l029K0717K6557N511k6134l1820
862b9845j281L4051L1055p711l7686k4183J5654L4641J5507j6339k7371j1701
874b5209J1354K3283J4852p270k4241k0179P214L0690K2919j3627l7321j8469
886c6004K2372L7445R596k7092l1468k333K5003K3900J217j9194k1491n417J6219
899g247K4472Q862j7922l0122r116K5341L3225K434l1711k9163N814L2354K2082
$$ plain form
811 8743 27443 18879 -5923 -25278 -22475 1852 26830 26444 -4546 -34368 -27726 10644 37670
824 37670 22324 -18179 -37218 -15053 21099 31900 10455 -17606 -26653 -10048 15663 27827
836 27827 14793 -13833 -30369 -15042 20256 36376 13404 -25381 -34711 -4730 30485 31053 -519
849 -519 -27837 -24155 2113 23610 21782 579 -21647 -24676 -3959 22598 28109 1975 -29845
862 -29845 -31126 2925 33980 26269 -11417 -35600 -19946 14695 30202 13863 -13508 -25209
874 -25209 -13855 9428 24280 17010 -7231 -27410 -20196 10494 33413 19786 -17535 -36004
886 -36004 -13632 23813 33409 6317 -25151 -27484 -2481 21419 22636 3442 -18049 -23466 -7247
899 -7247 17225 26087 8165 -21957 -31073 -5732 27493 29927 -1784 -30947 -25133 7221 29303
912B9303r919k7868j6280Q654K2634J6058l853k1870k0063K425K5897K4180o067
925B3231l2408k2760J4018L4839J5520j9422l1030q718J9484K5026N968j5343
937H405k0811r745J1611K4049J3794j3730k9326j3777J9296L3642Q430k7092l0923
950b6177oK8743K3934n753k4210j7420L594J8483J6500J522j6965k2250l944K1671
964b278K6359J042k8817k7269O332L3655K0830j4491l1115j2585J5504K4442Q685
977B0294j1561j9523j0700O227K0828J6822o467k6899j8629J2448L1880J5367
989C0087j9824l2089p067K4260K6812R11k2274k0075O18J7201J7198L913j3744
1002E927k0613p834J7030K6043O712k3335k7052j037K8133K4379o562k8030j7389
$$ plain form
912 29303 19384 -8484 -24764 -16110 6524 22582 18729 -3141 -23204 -20779 5118 29298 23231
925 23231 -9177 -31937 -17919 16920 32440 13018 -18012 -26730 -7246 17780 23748 8405
937 8405 -12406 -22151 -10540 13509 27303 13573 -15753 -29530 -10234 23408 31838 4746 -26177
950 -26177 -26183 2560 26494 20741 -3469 -20889 -17295 1188 17688 19210 2245 -20005 -23949 -2278
964 -2278 24081 25123 -3694 -30963 -24631 9024 29854 15363 -15752 -28337 -12833 11609 20294
977 20294 8733 -10790 -21490 -15263 5565 22387 15920 -10979 -29608 -17160 14720 30087
989 30087 10263 -21826 -28893 -4633 22179 23090 816 -19259 -18641 -1440 15758 19671 5927
1002 5927 -14686 -22520 -5490 20553 27265 3930 -23122 -24159 3974 28353 21791 -6239 -23628
1015b3628R468K3665J3088p703j9065j4178L585J8972J7719k937k3759k0595O860
1028a8508K8249J8406j3271l0003j2579J7689K6279N953j7415k0745n039J3673
1040g311J8037P174j0577k0045j1610J2021K5720J0824j8193k7696o153K3303
1052d506K5933n68k4726k0257N277K1426J5135l626j7010j4353K16J5544J8167
1065A6652K501j8457k2078M43K4995K1755o279k7591j7243J2178K6795J1085j4070
1078A0686k1393p274J1534J7726Q199p370j7815j2063O538K1998J5020j1178k6455
1091a1847j2523J7106K6968N962k0578k3491o93J9966J7425j422j5749j5244j933
1104a6053J2582J6791M655j3855k1552n421J9753K3342j78k4431k0378N976K4278
$$ plain form
1015 -23628 -14160 9505 22593 14890 -4175 -18353 -14768 4204 21923 18986 -4773 -25368 -18508
1028 -18508 9741 28147 14876 -15127 -27706 -10017 16262 22215 4800 -15945 -20984 -7311
1040 -7311 10726 17900 7323 -12722 -24332 -12311 13409 24233 6040 -21656 -27809 -4506
1052 -4506 21427 20859 -3867 -24124 -18847 2579 17714 14088 -2922 -17275 -17059 -1515 16652
1065 16652 19153 696 -21382 -20939 4056 25811 19532 -8059 -25302 -13124 13671 24756 10686
1078 10686 -10707 -17981 -6447 11279 19478 12108 -5707 -17770 -11232 10766 25786 14608 -11847
1091 -11847 -24370 -7264 19704 25666 5088 -18403 -19096 870 18295 16873 1124 -14120 -16053
1104 -16053 -3471 13320 17975 4120 -17432 -22853 -3100 20242 20064 -4367 -24745 -18769 5509
1117E509J5393r694k0908j0255P637J6624J0797m176j5979j3961L081J9253J7503
1130B0824n626k4693j6084J2962K6542R812j6498k2810m557J6994J7687K414j2161
1143D806j4730m835R341J6609Q743j0271k0339r568J5090K4647N165k0817k2951
1156a9110J911K2338J7040n436j9604j1998N294J4312J1036j311j3148j4161j702
1169a4539J5736J8328o12k1554j9198O023K4861J4313j2279k3088q493J2731J8394
1182A0623M800j0517j4424o829O395J5449J0210o653j9390j1522J0120K2611R889
1195B0762j6165k2777l578J8806J8848r20j6491j4166J322J3657J2360J864j1690
1208A832j4403l708J3505J8391K733j7322j9108J119K1245J7095o938k0719j1696
$$ plain form
1117 5509 20902 11208 -9700 -19955 -12318 4306 15103 10927 -5052 -19013 -15932 3321 20824
1130 20824 15198 -9495 -25579 -12617 13925 23737 7239 -15571 -20128 -3134 14553 16967 4806
1143 4806 -9924 -14759 -5418 11191 19934 9663 -10676 -20244 -5154 19493 24658 3841 -19110
1156 -19110 -17199 5139 22179 16743 -2861 -14859 -9565 4747 15783 14472 1324 -12837 -14539
1169 -14539 1197 19525 18913 -2641 -21839 -15816 9045 23358 11079 -12009 -20502 -7771 10623
1182 10623 15423 4906 -9518 -16347 -9952 5497 15707 9054 -10336 -21858 -11738 10873 20762
1195 20762 4597 -18180 -21758 -2952 15896 14976 -1515 -15681 -14359 -702 11658 13522 1832
1208 1832 -12571 -16279 -2774 15617 18350 1028 -18080 -16961 4284 21379 14441 -6278 -17974
1221a7974Q673J7735Q482p191j4135q500M165J3762J1643l325j6864j3803O076
1234a1256K0707J2558j0996k2615q059J5060J9525L238j5192j5228j305J1700
1246a863J2438K712q910j3820o133R085J7391O527j3664j9642l748J7592J8712
1259A6677j513j9546j4986N500J7004J0236m607j3678q952K347J1647J1289K68
1272A1686j3893j4487J824J7993J5187n943k0030j2183J0321K0417P001j1909
1284E984j6078l601J0016J2642M522o489j2424p550N643J5814R772r264j9129
1297a0142p602J3667J9863K606j6430j6764J688J6126J1158l019j1588r594M40
1310i591R272J1269K684j0847j5002k762J5065J6849j458j8914j4516O438J9032
$$ plain form
1221 -17974 -9301 8434 16916 9725 -4410 -12910 -8745 5017 16660 13335 -3529 -17332 -11256
1234 -11256 9451 22009 11013 -11602 -19661 -4601 14924 18162 2970 -12258 -13563 -1863
1246 -1863 10575 13287 4377 -9443 -15576 -6491 10900 17427 3763 -15879 -19627 -2035 16677
1259 16677 15164 -4382 -19368 -13868 3136 13372 8765 -4913 -13865 -11518 129 11418 11686
1272 11686 -2207 -16694 -14870 3123 18310 12367 -7663 -19846 -9525 10892 17893 5984
1284 5984 -10094 -13695 -3679 8963 13485 6996 -5428 -12978 -7335 8479 18251 8987 -10142
1297 -10142 -17744 -4077 15786 18392 1962 -14802 -13114 3012 14170 11151 -437 -10031 -9591
1310 -9591 -319 10950 13634 2787 -12215 -14977 88 16937 15479 -3435 -17951 -11513 7519
1323G519R747r398j6192n354P124J1938N757m558j0867q950K616J3828J1642n239
1337I613j8119j0282R953J9257N857j3137j6460k202J3613J2831q8j0289r916
1350i369j908P819J1403M859p868j5057n046J2026J7166K285j6346j5384K765
1363a2655J6906J1345n348j4620p632M664J1107P109j904j0292r624LJ2197J2857
1377A4113j873j6239j2689O287J8502Q703r978j7030m511J0675J3334K036q547
1390B783j0072l180N966J0515N870n548j3622p071Q190J6695N669j2811j6684
1403a3300j147J4464J3212j862j3806r574K641J0564Q151p87q614r729j408R950
1417a245J1976J009j2692j3268J451J6137J1617o020j5758p922Q060J3375N117
$$ plain form
1323 7519 17266 7868 -8324 -13678 -6554 5384 11141 6583 -4284 -13234 -10618 3210 14852 9613
1337 9613 -8506 -18788 -8835 10422 16279 3142 -13318 -15520 -1907 10924 10836 547 -9369
1350 -9369 -11277 -3458 7945 12804 4936 -10121 -15167 -3141 14025 16310 -36 -15420 -12655
1363 -12655 4251 15596 10248 -4372 -12004 -7340 3767 10876 8972 -1320 -10944 -10941 1256 14113
1377 14113 12240 -3999 -16688 -10401 8101 16804 6826 -10204 -14715 -4040 9294 11330 2783
1390 2783 -7289 -10469 -4503 6012 11882 6334 -7288 -14359 -6169 10526 16195 3384 -13300
1403 -13300 -14447 17 13229 11367 -2439 -12013 -9372 1192 9343 8556 -58 -9787 -11195 -1245
1417 -1245 10731 11740 -952 -14220 -12769 3368 14985 8965 -6793 -14715 -6655 6720 11837
1430A1837o879j0774m708M788J0056P030l754j2280q259N313J4875P867q596j6518
1444a0002m812J1815J4442M51j1503j0927P92R386Q471N72p004r401l011P338
1458c393J2041L926j0359j3925j485J3744J3679k496j5509r858O111J3314O255
1471A2045n282j0491m878L447Q173O519o08r907r956K052J2664J0664n262j5719
1485f539q200Q863J5388L565j0259j2025j119Q594Q516J615n654q757l926M481
1499e457J1085O299p524j3562m639J0568J4082J457j3370j1579K825J2112P490
1512I787l212r211o126J279P304P677Q87q343j0642o67J2038J1213k564j4208
1526d788r213O143J4037N925q269j0749l298O509Q657L282l706q042n573L053
$$ plain form
1430 11837 4958 -5816 -10524 -5736 4320 11350 7596 -4684 -12943 -7630 7245 15112 6516 -10002
1444 -10002 -14814 -2999 11443 11894 391 -10536 -9744 -358 8113 8685 1681 -7720 -10731 -3393
1458 -3393 8648 12574 2215 -11710 -13195 549 14228 11732 -3777 -13635 -7524 5790 12045
1471 12045 6763 -3728 -8606 -5159 3014 9533 8925 -982 -10938 -8886 3778 14442 9180 -6539
1485 -6539 -14739 -5876 9512 13077 2818 -9207 -10326 -1732 6784 8399 2745 -6012 -9938 -5457
1499 -5457 5628 11927 4403 -9159 -13798 -3230 10852 12309 -1061 -12640 -9815 2297 9787
1512 9787 6575 -2636 -8762 -7483 -179 7498 8385 42 -10600 -11267 771 11984 9420 -4788
1526 -4788 -14001 -7858 6179 12104 3835 -6914 -10212 -3703 4954 8236 4530 -3512 -9085 -6032
1540f032J0234P558m491j3562o406Q685J4427K903j1020j2151Q15J0802Q252j798
1554H216p983o363n26N780P712K351o384j0187l496R075J2392m2j2116j0744K612
1569i703J3062P850n733j1558m937N551Q249M154l138p177n933J519Q612P808
1583H626k486j1082p988N148J3015N536p575j2305k614R051R593P71p362p376
1597g048j018N300P248L101m710r306m095O899J1655K765r725j1469P93J1053
1611A443R234k239j0562o726L338Q708M819j698o488o010j73P462Q280k5r817
1626d54q928K227J2190P250n271j2416m690P145R930K241o788p536j875M212O231
1641C468M038l346q179n904M310J0525N331p405j2035k476R475J0590r25r664
$$ plain form
1540 -6032 4202 11760 7269 -6293 -12699 -4014 10413 13316 2296 -9855 -9040 1762 10014 8216
1554 8216 233 -6130 -6656 -876 6836 9187 2803 -7384 -10880 -1805 10587 10545 -1571 -12315 -9703
1569 -9703 3359 11209 5476 -6082 -11019 -5468 2781 6935 3797 -3380 -9313 -7794 818 8626
1583 8626 6140 -4942 -12930 -7782 5233 10769 3194 -9111 -11725 -2674 6919 7690 328 -7048
1597 -7048 -8066 -2766 4482 7583 2873 -6433 -10528 -3629 8026 10791 1066 -10403 -9610 1443
1611 1443 10677 8438 -2124 -8850 -5512 3196 8015 6317 -171 -6181 -6354 1108 9388 9363 -454
1626 -454 -9382 -7155 5035 12285 7014 -5402 -10092 -2947 6983 9224 2436 -5100 -6975 -2763 3468
1641 3468 7506 4160 -4019 -9923 -5613 4912 10243 2838 -9197 -11673 -2198 8392 7467 -2197
1655b197p568K401P817N282j068n526n430j380N735P582K295p580r713K6J0288
1670I64R435k696j1511o411N326J0100L917n236p396k528L340N994M062j405o748
1685g93o401K023R946O747m682j1693m971Q067J0689J313q527p757N96O891N638
1700G086m5m611n457k423L795P495L890o295r894k264Q222J0052o23j1045p382
1715i499L657Q973M273l663o975l493J971N303M795q16n811o893K67Q717P439
1730H245k776j0256o197N542J1003K588p103p538q63N759N654J055l419n216k758
1745f280K953P198M245l927r186l638O602R887J446q544q508J378Q554N887k184
1760E883o728l918J208M624M990L15n324o106j096P034P893j034r041o857L267
$$ plain form
1655 -2197 -9765 -7364 453 5735 4667 -859 -6289 -7669 -1934 5648 7943 363 -9350 -9324 964
1670 964 10399 7703 -3808 -10219 -4893 5207 9124 3888 -3508 -6036 -2696 3298 7360 5955 -793
1685 -793 -7194 -5171 4775 11522 6840 -4853 -9824 -1757 8932 10245 1718 -6039 -5443 1448 7086
1700 7086 7041 2430 -3027 -5450 -1655 5840 9730 3435 -6459 -8723 -501 9551 8928 -2117 -9499
1715 -9499 -5842 3131 7404 3741 -3234 -6727 -4756 547 5342 4526 -1285 -8178 -7911 806 8245
1730 8245 5469 -4787 -10984 -5442 5561 8149 1046 -6492 -7355 -1596 4058 5113 1694 -3522 -6280
1745 -6280 -3327 3871 8116 4189 -4997 -8635 -2033 7854 9300 756 -7752 -6374 2180 8067 5883
1760 5883 -845 -4763 -3555 1069 6059 6374 1050 -5056 -6152 882 8775 7741 -1300 -8157 -4890
1775d890R164N029n353q312k284M548O370J566l206n173l417J971N972M614k592
1790D007p742n170M097R430L346o653q934r60P460O803j217n868m653N50L935
1805a569M584J505l960o059j942N319P747J268p356p717J204Q412O305k761q274
1820c294l761L874O129K835k652m656l137J157M920M861n49o904n768K012R211
1835D278M792n007q591k793O130P454N56n844m882o7L584L747K008k371n750l210
1851e966L233P467L362o080q218r93P361P141j600p507m837K634O006K963k118
1866B848m086l041m76L774N525O16n696o397M40P838O274l460q505l821N325P030
1882D188J352m660n003m45K607L998K177j322m799l880K006P013M104l898q356
$$ plain form
1775 -4890 4274 9303 3950 -4362 -6646 -2098 4272 5838 2632 -2541 -5958 -3987 1985 6599 4007
1790 4007 -3735 -8905 -4808 4622 7968 1315 -7619 -8579 -1119 5684 4467 -1401 -6054 -5504 -1569
1805 -1569 3015 4520 560 -5499 -7441 -2122 5625 6893 -463 -8180 -6976 1436 7741 4980 -3294
1820 -3294 -7055 -3181 2948 5783 3131 -1525 -4662 -3505 1415 6276 5727 -1177 -6945 -4933 4278
1835 4278 9070 4063 -4528 -7321 -1191 6263 6819 975 -3907 -3974 -390 3357 5365 2994 -2756 -5966
1851 -5966 -2733 4734 8096 2016 -6202 -7195 166 7307 5707 -1800 -6637 -4003 2003 4966 2848
1866 2848 -1238 -4279 -4755 -981 4544 5160 -536 -6933 -6493 1345 7619 4159 -4346 -8167 -2842 4188
1882 4188 5540 880 -4123 -4568 -1961 2037 4214 2892 -1907 -5787 -3781 3232 7336 3438 -4918
1897d918k075O378P449k65o761n096J283N426L444j169l013l519r42K974N001
1912D197J607m514o569o46O500O319j395q093m306L670O971K065l475m824k075
1927d568K795L612K197q69m214l863J001N654M667k613p461l471M706P021J699
1942F293n716n533NM756L984k06k991l601j542K670M618K173l193o016k178N354
1958a123O614n0o779n204K050O640L127k478m899k047J428L914K085k22l427l704
1974d075j87M695M914j013o257m901L149P312L118m810o301p99M702L991L12l140
1990G10l175j178K048L472K583k060m838l472L664O616J810n227o057l7O056M651
2006E566j751m944k599R27L638K485kk853l558o82L586M678P32n740m831J073
$$ plain form
1897 -4918 -6993 -615 6834 6569 -192 -5288 -4005 1421 4865 3696 683 -2836 -3778 -804 4197
1912 4197 5804 1290 -5279 -5925 575 6894 5499 -2594 -6900 -3230 3741 5806 2331 -2493 -4568
1927 -4568 -1773 1839 4036 3167 -1047 -4910 -3909 1745 6412 3799 -3662 -7133 -2427 4594 6293
1942 6293 577 -4956 -4951 -195 3789 3583 592 -3009 -4551 -1881 2737 4910 1717 -4299 -6477 -1123
1958 -1123 5491 5441 -1338 -6542 -4492 2148 5275 2797 -2102 -4149 -2721 1193 3278 3056 -371 -4075
1974 -4075 -4262 433 5347 4334 -1923 -6824 -3675 3637 6755 1945 -4356 -5155 -453 3538 3850 710
1990 710 -2465 -3643 -1595 1877 4460 2400 -2438 -5910 -2246 4370 6180 953 -5104 -5141 915 5566
2006 5566 3815 -1129 -3728 -2801 837 3322 3320 467 -3091 -3773 -187 4491 5223 -517 -5348 -4275
2022d275O912L769l571n952j681L509M192P06k152l306j440R34L261L248j206
2037B948m543l960K254O377L129m994o245n60N384M673r31m540l067J530K193
2052c52K276R38j829l574k059K708N373J640m549n716m4O351M675k456n988k521
2068e127L330M601N55k032k556j010J05K822K964J30l921m284P32N899L970k849
2084C329o200k134M187N195O9l722l571J38K757K538R29j844l511j952K227M592
2100C027J830l404n230p93M810M353j189m788l149J521M032J698q43l015j986
2115c126k05K709L306N58l921m093J75N311M126k658n498k241L435M593Q43l446
2131a32k952p2K246J714J085m48k580k298O70M444K929k404n138k206L818N553
$$ plain form
2022 -4275 2637 6406 2835 -3117 -4798 -1289 2903 3609 1457 -1849 -3289 -2355 906 4154 2948
2037 2948 -1595 -5555 -3301 3076 6205 1211 -5034 -5594 -210 4463 3532 -1008 -4075 -2545 -352
2052 -352 1924 2862 1033 -2541 -4600 -1892 3481 5121 572 -5144 -5188 1163 5838 3382 -2606 -5127
2068 -5127 -1797 2804 3359 1327 -1229 -2239 -2134 688 3652 3782 -139 -4423 -3691 2208 6178 3329
2084 3329 -2871 -5005 -818 4377 4446 724 -2847 -2709 48 2586 3515 1671 -1840 -3792 -1565 3027
2100 3027 4857 1453 -3777 -4570 240 4593 3404 -1384 -4533 -3012 1020 2718 1875 -1140 -3126
2115 -3126 -3331 -622 2684 3242 -679 -4772 -4597 714 4840 2182 -3316 -5557 -2122 2471 3314 -132
2131 -132 -3084 -3156 -910 804 1889 1441 -1139 -3437 -2767 1677 4606 2202 -2936 -5142 -1324 4229
2147D229M11m728l934J163M307K416j280l018j470M22J794K087J089j901l519
2162a932j331L540M257k0m793m094J701M865K621k833l911j266K128K811J040
2177B783j751k227j498L16L264K280j026l997k391J792M562J638l363m071n22
2192d211L354K972m89k057k089p55J846K447J722j929l511k133L484M619M14m518
2208h34l867J563M699K392k135l710n45J757J776R17k36j077k132q76K272L957
2224C921M08m466l639J614N371K331l554m784m2L654L000j160k619j156J97J278
2240C54Q45J243m70k430k253J078M180J891l141m751p8L945L407j175l940j891
2256c186J201K568J279o38j881j971j59K150K442P12l535l041J002L702K185j545
$$ plain form
2147 4229 4640 -88 -4022 -2859 1448 3864 2584 -434 -1904 -1482 312 2399 3488 1587 -1932
2162 -1932 -3263 277 4534 4514 -279 -4373 -2672 2193 4814 1981 -1930 -3196 -1068 1743 2783
2177 2783 1032 -1195 -2693 -2377 887 3167 2141 -1856 -4247 -2455 2107 3745 382 -3689 -4211
2192 -4211 -857 2115 1626 -431 -2520 -3275 -1429 1018 2740 811 -2700 -4833 -1349 3270 3684 -834
2208 -834 -4701 -3138 1561 3953 1818 -1892 -2437 -680 1096 2013 1777 700 -1432 -2308 -36 3921
2224 3921 4329 -137 -3776 -2162 3209 5540 1986 -2798 -2840 814 3814 2654 35 -1121 -924 354
2240 354 1199 2442 1972 -458 -2711 -1633 2547 4438 1297 -3454 -3532 413 3820 2645 -1295 -3186
2256 -3186 -1985 583 1862 1224 -657 -2628 -2787 -637 1805 2517 -1018 -4059 -3057 645 2830 1285
2272A285l521r51J985K681L00j374j666r45N15K015K404n39l305k413J628M361
2288B460J836l135m140O7M059K373j313k600j105R81J259O96M38k38k077j514
2304a953R37L602J646k565m578l5M029L472j637m201k006K351L507j44j899j958
2320a432JQ49R47Q18J86j733j745o11K707L018r90m094j812J879L746P84k678
2337a60k823J57K353J717r9j797j264l25J242J742R10j467k624m36K268L082l40
2354B136k867k021O27K809J356q88j636j004K10J537J710P7j878k410M15K900
2370A073K417j090m049j094K284L398j49k369k055M06K122K81n0o7n10j614q10
2387a876K083K606o53l504k125K437M154N81m262l031J720L521O19j619k275o6
$$ plain form
2272 1285 -2236 -3187 -1202 1479 1779 405 -1261 -2206 -1691 324 2728 2189 -1116 -3529 -1901 2460
2288 2460 4296 1161 -2979 -2912 1147 3520 2207 -393 -1498 -517 742 1438 1876 1638 -439 -1953
2304 -1953 -1016 2586 4232 1667 -2911 -2946 1083 4555 2918 -1283 -3289 -938 2569 2425 526 -1432
2320 -1432 -1431 -582 365 1183 1369 -364 -2109 -2720 -13 3005 2015 -2079 -3891 -2012 1734 2518 -160
2337 -160 -2983 -2826 -473 1244 1145 -652 -1916 -2241 -999 743 1653 186 -2438 -2874 -606 2476 2136
2354 2136 -731 -2752 -2125 684 2040 1152 -484 -1488 -1278 259 1969 2046 168 -2242 -1827 1073
2370 1073 3490 2400 -1649 -2743 -459 2939 2790 421 -1634 -1228 894 1175 1125 1058 548 -1066 -1876
2387 -1876 207 2813 2160 -1344 -3469 -1032 3122 3703 -559 -3590 -1870 1651 2270 651 -1624 -1690
2403a690J420L82o8M56K6j725j346J382K951L99k469k740J75L867J989k157l076
2420b224l37K311J968l97j294j220N4L45J234J288o40j975j046J143K397Q35j866
2437E76k249K43K185P44j18r27j169p1P35J006J250j315j899j258K203K911k59
2454B588l208k053J571L038P33k240j770M87J432N9k60L10J60j344j134R15K533
2471A817P85k905k689P96L768J478k431l307j68L441J871j631k044m69J134Q55
2487C01j61K3M25o63j578L49K131J266j223k668o53K263K298k83k787j423J317
2504a066K168P13j397j480j50Q65R77N89o31r74j163M46J619R78m21k019l99J065
2522b80R56M59q88q12n06N80J183Q48q01j679o65Q49K328P58k408k080O30K044
$$ plain form
2403 -1690 -270 112 44 500 526 -1199 -2545 -1163 1788 2187 -282 -3022 -2847 1020 3009 852 -2224
2420 -2224 -2561 -250 1718 1321 27 -1193 -1139 -794 440 1728 1088 -887 -1933 -790 1607 2442 576
2437 576 -1673 -1430 755 1499 1381 454 -715 -786 -51 955 2205 890 -1009 -2267 -64 2847 2588
2454 2588 -620 -2673 -1102 1936 2669 429 -1341 -854 578 637 377 687 847 -497 -1631 -716 1817
2471 1817 2602 -303 -2992 -2196 1572 3050 619 -2688 -2856 585 2456 825 -1219 -1688 -554 301
2487 301 140 163 588 -75 -1653 -1304 827 2093 870 -1798 -2451 -188 2110 1827 -960 -2383 -1066
2504 -1066 1102 1815 418 -1062 -1212 -347 630 1219 588 -386 -1549 -1103 516 1494 1073 -946 -1345 -280
2522 -280 676 1135 247 -565 -1071 -491 692 1540 739 -940 -1605 -756 1572 2330 -78 -2158 -1528 516
2540E16J515j432j416p46J483J134n99j25k70j39o42q7J711J186j082k480q90
2557b363K591K662j015l257j616K569K864n03k745r05J232J304m31m45j2N78r60
2574d52p05Q75J522M8k154j712J450K803N84k229k272P49K174Q32q84j502j09
2591i82O19M75M49k9m54j231jQ98J313K59j820j257R30J750J87p47r07M7J13M74
2611H6P85N24j276j210M2J976J136j195j838o84J983K049r57k200o15J384J159
2628A149l97o87L74k46q3q30N47J648j46k063j383J609K492K61k746k046J491
2645a056K654M52k201j735J034J529k77o74m39N91J26j274L29J263P03j311j722
2662b008K12K383J079j677j710k89J808J215m50j465l71O35R17K00m44M1q29j24
$$ plain form
2540 516 2031 599 -817 -1563 -80 1054 455 330 60 -79 -721 -808 903 2089 1007 -1473 -2363
2557 -2363 228 2890 1875 -1382 -2998 -429 2435 1932 -813 -1718 -486 818 387 -58 -70 508 -452
2574 -452 -1157 -282 1240 1288 -866 -2578 -1128 1675 2259 30 -2242 -1493 681 1513 629 -873 -982
2591 -982 -363 112 561 532 78 -1153 -1154 -256 1057 1316 -504 -1761 -831 919 1106 359 -548 -501 -388 86
2611 86 871 1395 119 -1091 -1049 927 2063 868 -970 -1654 329 2378 1421 -779 -1394 -10 1149
2628 1149 752 65 439 193 110 -720 -173 1475 1329 -734 -2117 -508 1984 2245 -501 -2547 -1056
2645 -1056 1598 2050 -151 -1886 -852 677 400 -274 -713 -122 4 -1270 -941 322 1025 -286 -2008
2662 -2008 -1796 587 1666 -11 -1721 -2010 -202 1013 563 -902 -1273 -638 279 479 35 76 -753 -877
2680h77Q98P92p1q98m22K00O07J258n13r35k87L4N58N32J21p59q73p3J240J223
2700A755n25j809q27J175J862j28j424j167O52J339J14r30l96M83r8l91m44J012
2718B53R20j250j627O78J851P91j776j934J03K613J158j725j818L4J710P80p01
2735F0j146J44Q46J46j129O30J103j51j520m30J110J494j90k029q60J638J783
2752A499m90j331q24N15J408J8k38p19O3N5J74P29N09p22j146K51O55J117n98
2771I25r45l44N58M76j77K16l50n67k22N20Q88L57j345j370O41J763O90j422j889
2790a597M94J579K58o03j399Q91O18k46o29M49P96j28j166q77J572J510r07k309
2808a694m71K246J802r31k428m85J816J340o57j359K07N13K73l54k1R90k41o38
$$ plain form
2680 -877 21 813 742 -156 -578 -378 229 1487 974 39 -248 -214 344 876 997 238 -635 -708 532 1755
2700 1755 1230 -579 -1406 -231 1631 1503 79 -1088 -436 903 1017 87 -309 174 76 -315 -759 253
2718 253 1173 -77 -1704 -1026 825 1616 -160 -2094 -1991 622 1780 55 -1763 -1729 -19 761 60
2735 60 -1086 -942 -96 50 -1079 -449 654 503 -1017 -1447 -337 1157 967 -1062 -1922 -284 1499
2752 1499 1009 -322 -1146 -631 777 795 557 -162 -99 -44 130 859 1368 646 -500 -249 406 1523 925
2771 925 -20 -364 194 670 493 709 359 -208 -430 90 978 1335 -10 -1380 -739 1024 1714 292 -1597
2790 -1597 -1103 476 734 131 -1268 -377 241 -5 -634 -185 611 483 -683 -1560 12 1522 615 -1694
2808 -1694 -2165 81 1883 952 -1476 -1961 -145 1195 538 -821 -614 -101 172 -182 -203 787 546 -92
2826i2q72Q64J475q3j572j088J195J534o2j334p18M42Q69M8j22j72l34L7J75J37
2846C27O48m59o73k49Q04P35k90j083m97L57P01J70j68l79m38l77P52M24L76j020
2866c39j218L97J318R29p04j605n38J564J095m21j033m47M63O12m29j28K23J50
2884a11m67l85Q93R87k05j422j027R64K050K50k075j350J284J696L02j299j062
2901i77M49J113k00l31J61Q1r8o14M21J110L31j282j103Q3J862N88j063j379k00
2920a048J543N70l29p82k87K66J52L67J38l30n40m06K69J004M52j033j162J62
2938i94J344K50l15q36k67K40N11K15M08n17p91l09O92J352j9j655p56O41J997
2957A191Jj632p29J37J607J04p96k83L32j72n33Q47P74M33j617q74P01J353Q24
$$ plain form
2826 -92 -964 -100 1375 1292 -280 -1368 -173 1361 1299 -35 -753 -311 558 606 484 312 -22 15 190 327
2846 327 975 516 -157 -406 398 1133 843 -240 -737 -380 321 491 323 -56 -494 -871 -119 305 681 -339
2866 -339 -1557 -1160 158 1087 383 -1222 -1760 -196 899 478 -555 -1002 -539 73 -356 -484 -261 -111
2884 -111 -578 -963 -70 917 712 -710 -1737 -773 1277 1527 -548 -1898 -614 1082 1384 85 -977
2901 -977 -528 585 385 54 215 296 198 -416 5 1115 1446 164 -939 -856 1006 1594 531 -848 -1048
2920 -1048 495 1065 736 -46 -333 -67 85 452 590 260 -280 -686 -417 587 1039 6 -1156 -994
2938 -994 350 600 285 -551 -818 -578 -67 148 556 39 -752 -1061 -369 983 964 -691 -1447 -806 1191
2957 1191 1192 -440 -1169 -1032 575 679 -117 -400 -68 -240 -773 74 848 1281 -336 -1210 -509 844 1668
2976A668j427j559K14K010O59r26j486L64M25J081o77j60L13o01m69K38J102M19
2994A188r29j297j35J600J128r32j631k75J392Q56m13n79o16J27K91K14Q14k01
3012F02j017n25M73R25N01p45j287P5J040P61m21n31o24K53O15N55j24n00n95
3031e69l58O53J244M75j464j264M05J622O26r23j488L04O76Q03j36q92k71N32
3049b5m82L37R67R4j003q38J56J444Q39r21j771l94J902R10n7j354j075P57J063
3068E49j60k70l16O1o26N80M02O08n35j056l88J164J541k49j564j363R47J343
3086F68K97n95j046k26R18N14j2j45k84r95MJ344P47o23j239n32Q07J457J16j189
3106a4r49M02M69O63n24n9m82q9Q6P77O82p17j262n70J720J092m54j348q64J017
$$ plain form
2976 1668 241 -1318 -1104 906 1565 639 -847 -483 -58 1023 346 186 499 -102 -571 -333 769 1188
2994 1188 259 -1038 -1173 427 1555 623 -1008 -1283 109 965 552 -27 -643 -516 -225 -11 803 602
3012 602 -415 -940 -467 458 959 214 -1073 -998 42 803 382 -149 -773 -520 95 650 526 26 -569
3031 -569 -927 -274 970 1445 -19 -1283 -878 744 1370 447 -1041 -737 -61 742 606 -286 -557 -25
3049 -25 -507 -170 797 891 -112 -950 -794 650 1489 568 -1203 -1597 305 1215 1158 -196 -1271 -514 549
3068 549 389 119 -197 -136 -762 -182 220 828 293 -763 -1151 13 1554 1305 -259 -1622 -675 668
3086 668 965 370 -676 -902 16 530 518 373 89 -906 -902 442 1189 566 -673 -1205 -398 1059 1175 -14
3106 -14 -963 -561 -92 571 47 -12 -494 -583 -497 280 962 245 -1017 -1587 133 1225 771 -577 -1441 -424
3126d24R60J61o23o58K29K62L30L03L71n93p60o86J483J085l93j716j161J248
3144e82K090M0j550j121M19J231N68m12p60l7r6J04O69K33J50j461p27J121J312
3163A191L96j601j402M44J476J071j158q19l27L92P70m2J41o69o18p7R66R07o5
3182I76j418j005M33J796M05j075j021k65J004N01J53l65m70m41J54P06Q91o56
3200C03j418l46R07J485J51j338j235N77J033Q69m27r60l07K56L65O36K55o15
3218A91q18j69Q91J136j2r24j759P80J576N07q35j198k65J027J005k16o51o86
3236d20O0L48P01M27k59j205o78P55Q27Q00r02j532k20J090J220M2j467o62J10
3255i65J207O18m37p62o49L2O71R67L38j159j047J25J069J222m56j661o16Q73
$$ plain form
3126 -424 536 697 74 -584 -355 -93 237 540 911 318 -442 -1128 355 1440 1047 -669 -1830 -582
3144 -582 1508 1548 -2 -1123 -704 527 1095 683 -77 -114 -210 -106 563 796 946 -515 -1242 -121 1191
3163 1191 1587 -14 -1416 -972 504 1575 417 -402 -729 -337 433 391 532 -137 -755 -832 134 1041 976
3182 976 -442 -1447 -1014 782 1187 112 -909 -1174 -170 331 484 119 -351 -792 -638 68 959 303
3200 303 -1115 -1461 -554 931 1082 -256 -1491 -914 119 988 561 -399 -706 -450 -85 551 806 191
3218 191 -627 -796 95 1231 1219 295 -1464 -684 892 1399 564 -634 -899 128 1133 917 266 -420
3236 -420 -360 -12 689 1116 857 -348 -1026 -271 556 1356 454 -1078 -1298 -208 1012 1054 -413 -1075 -965
3255 -965 242 860 423 -339 -988 -956 -285 682 1020 -139 -1186 -1061 8 1230 774 -887 -1503 -630
3273f30R33N82j071m73l01M30N49P11j73j065o26r3J862P60p62j512m33R98J465
3292A151P8j567m69K00J197R5P3n01n71o84O29J345Q86r41j903k60J316J777n42
3311A309j497p61L38J530K89p48o95N9k05M27Q53N0r21j108N1J479R54j96k225
3330a017p62J337J425n4j118j037L89O11O92k8l08q25o26N67J100Q24r05j506
3348a241n26J368J461P1j519r92M13J401M39q5j140j53L5N18Q97L15j089p87k85
3367h99J121J704p35j397j117Q25J564L75r94j126R9K39J200J71k02j169n85N29
3385c97J215O44n75j421q41J352J421K20j529r53k60J344J006n08r25q07J45J003
3403A34O61L50j545r59k4J282J480l72j473j128L64J430R78n71j435n18Q29P29
$$ plain form
3273 -630 303 885 -186 -659 -960 -530 19 730 557 -508 -1134 -1227 635 1395 633 -879 -1312 -314 1151
3292 1151 1229 -338 -807 -607 590 685 758 257 -314 -998 -369 976 1862 921 -982 -1242 74 1851 1309
3311 1309 -188 -949 -611 919 1208 460 -235 -176 -381 46 899 949 28 -1080 -1029 450 1404 1208 -1017
3330 -1017 -1779 -442 983 929 -189 -1226 -837 -226 466 438 130 -695 -1321 -754 346 1170 265 -1241
3348 -1241 -1767 -399 1062 1133 -386 -1378 -965 436 875 790 -350 -503 -468 50 947 1262 173 -614 -899
3367 -899 222 1926 1191 -206 -1323 -498 1066 1441 447 -679 -580 -341 859 1030 828 -341 -926 -397
3385 -397 818 1462 887 -534 -1375 -23 1398 1618 89 -864 -1124 220 1226 718 -207 -1014 -869 134
3403 134 795 1145 -400 -1359 -1383 -101 1379 1007 -466 -1594 -1230 200 1178 607 -828 -1346 -517 212
3421B12M60n00p27o18K98R48J084l35j701n14O21J550P52j400j260j2J148R38
3439I44K84j254q38R0P96P82J84m72j296k14P57J380M90j496j068q0J475Q38j00
3458A202j465q87P40J104K75l13j105p75J75J317Q58l3j530q70L02J642Q30o78
3476G89j887m61J310R93J32q65j004j63N83J097K17n36r68n62M12J846M44j202
3494A75j667P2J702Q80m2j620j053P43J172N95K8r88j059K68Q18R43J41j237j169
3513a298L1J726J149o31j752k07N82J491J08r12j015k45N01P11R89l55j350p96
3531a273N17J597O12j152j512n93J487J695j54j373j424Q01P43J170l56q49r20
3548i84j75J172R64K55j244j255j30J826J268o31j844o93L46J490Q96q13j202
$$ plain form
3421 212 672 172 -555 -1173 -875 73 1157 822 -879 -1393 -772 778 1530 130 -1130 -1142 6 944
3439 944 1228 -26 -864 -774 22 804 988 516 -780 -994 -237 1143 1633 137 -931 -1011 464 1302 1202
3458 1202 -263 -1150 -410 694 969 656 -449 -1224 -1049 268 1126 1093 -437 -1307 -1005 637 1467 789
3476 789 -1098 -1559 -249 744 876 11 -993 -1156 -573 524 741 205 -763 -1325 -913 933 1377 175
3494 175 -1492 -1420 282 1162 1120 -500 -1553 -810 362 957 985 -3 -1062 -794 24 967 1108 -129 -1298
3513 -1298 -1267 459 1608 977 -775 -982 -400 1091 1199 287 -728 -973 -472 239 1228 873 -477 -1273
3531 -1273 -756 841 1453 301 -1211 -1804 -317 1378 1224 -149 -1573 -772 -29 1141 785 -64 -984
3548 -984 -1159 13 977 1232 -12 -1267 -1397 429 1697 1066 -778 -1471 -1125 365 1261 448 -754
3565g54m30N22Q76N52R7j259p48K88J576Q23q55j421o77R15J620M68j564j264
3583a235mJ237J064k35o91q73l24P73J422K82q16j825j81J397J192J44j499j380
3601a552J16J905Q99p70q92o24M06R96O18o17p39j191K78J606Q99j66j928o79
3619a435L16J819P48j280p37q54R37J667L8q73r42l57O19J358N21j021j283o70
3637a429Q81J702M74j464j539K71J345J307n69j513q33O07P80R77k48o39j136
3654a026j73J073J435m10j085j152K06J862O38p23j464o04R01J341L53p35j077
3671f40o70O85J028R33n07j696p53P74J694N33r79j706k09J437J272k5j357o79
3689h65j82J094R25J97o59j554j80J010J422K97j456j330K12J629J185n57j755
$$ plain form
3565 -754 -1184 -662 214 766 863 -396 -1144 -856 720 1543 688 -733 -1410 -495 1125 1593 29 -1235
3583 -1235 -1239 -2 1062 827 136 -737 -1061 -288 1134 1416 600 -1225 -1406 -9 1183 1327 -172 -1552
3601 -1552 -1436 469 1368 598 -294 -918 -512 484 1102 485 -254 -1445 -1167 439 1338 1172 -756 -1435
3619 -1435 -1119 700 1448 168 -569 -1423 -486 1181 1219 346 -596 -953 -334 1024 1545 524 -759 -1429
3637 -1429 -548 1154 1628 164 -1375 -1104 241 1548 979 -534 -1367 -760 20 997 749 110 -1026
3654 -1026 -1199 -126 1309 899 -186 -1338 -1132 730 1368 645 -819 -1423 -522 819 1172 437 -640
3671 -640 -1310 -625 403 1336 829 -867 -1620 -846 848 1381 402 -1304 -1513 -76 1196 1171 -186 -865
3689 -865 -1047 47 972 1169 510 -1044 -1224 -214 1208 1505 49 -1281 -1069 560 1745 1188 -567
3706e67m45M19J148O34m92j033r15M20P53J276m53j221j068Q65J405P98p65j753
3724i94m93R36J734k18r03p74j64L02J203J30k66j294m49O58J446N89j010j708
3742a275n1J517J022o2j445j236L09J460P10m88n16j022J00J204Q94K1j641q24
3760a323K31J436R77l40j702o77P58J504L73r55j073l58P50J109M36o45j175n95
3778a269O62J732K55p83j710l34J083J784o5j364j327J05J471J004k59j047r03
3795i65%R05Q69K76j348j059j11J509J113q8j678j178O53J572P39n10j546m49
3813a296P31J279K30l83r92q47P12R81O22j89j589p09Q13J700M75j274j279j90
3831a205J152J241j19p53r88L1N42J143L9n70j195o04J293J431K09j570j291J85
$$ plain form
3706 -567 -1012 -593 555 1189 697 -336 -1251 -831 -78 1198 745 -476 -1544 -679 726 1524 759 -994
3724 -994 -1487 -551 1183 965 62 -712 -876 -574 629 759 493 -801 -1250 -592 854 1443 433 -1275
3742 -1275 -1326 191 1213 1151 -294 -1530 -1221 239 949 461 -55 -1077 -977 227 1121 1142 -499 -1323
3760 -1323 -1092 344 1321 981 -721 -1398 -640 864 1237 282 -791 -1149 -399 710 1146 501 -674 -1269
3778 -1269 -607 1125 1380 597 -1113 -1447 -364 1420 1355 -9 -1336 -1231 240 1244 985 -62 -965
3795 -965 -965 -60 809 1085 -263 -1322 -1433 76 1189 1101 -577 -1755 -1102 470 1209 699 -847 -1296
3813 -1296 -565 714 944 561 -431 -1278 -566 415 1037 848 -741 -1450 -637 1063 1538 264 -1015 -1205
3831 -1205 -53 1188 1069 316 -672 -641 -99 1044 1083 513 -682 -1286 7 1438 1647 77 -1214 -1029
3849a029J881P37n65j294p24M60J119M12q1j284o99K44J057J239k79j575j314
3866a695P24J971N51j018j567m47J106J187K13j110p15l57R09R11N09m03j579
3883h10o65J125J711J24j319j379j6J380Q51L39j676r15N15R07R58l44n96r37
3901g47k82J484R43Jj641j139P82J533P79l69k119n17P83J248L97n91q66o44O53
3920c12R74M23r6j496p54P99J508M89j085j606Q9J033J116q3r76j093N6J304N93
3939H83M31j103j144M2Q42J281K14j629j277J43J393J512p62j123r93O03R65J016
3957A294p50j020o99N05J238M45j42j467p92N84J374Q41o18j484p09J168J364
3974A132L69r31j527r0R32R61M39j119r68j93O25J286L85j155r93l52J518R93
$$ plain form
3849 -1029 852 1589 1024 -270 -994 -534 585 997 916 -368 -1067 -823 234 1473 1194 -381 -1695
3866 -1695 -971 1000 1551 533 -1034 -1481 -375 812 1025 -85 -800 -1157 -248 663 1172 769 -810
3883 -810 -1475 -350 1361 1485 166 -1213 -1229 151 1002 1341 -335 -1250 -735 172 1130 786 190 -747
3901 -747 -1029 455 1398 1399 -242 -1381 -599 934 1713 1344 -775 -1292 -509 739 1136 545 -321 -965 -312
3920 -312 662 1085 989 -507 -1261 -462 1046 1535 450 -1156 -1067 -34 1082 999 23 -1070 -1014 290 883
3939 883 1314 211 -933 -891 -49 1232 1446 -183 -1460 -1317 76 1588 826 -297 -1290 -687 278 1294
3957 1294 544 -476 -1175 -670 568 1013 871 -596 -1388 -804 570 1411 793 -691 -1400 -232 1132
3974 1132 1501 570 -957 -1047 -115 846 1285 166 -802 -995 -370 916 1301 146 -847 -1199 319 1312
3992A312j23j295j248M88J232Q40m00r38j104O45Q16R65k79j162r93J96J021J654
4010A627o30j733n90P53J397M86o65j412m30P05R07O24m81j229n57N09J248O07
4028A136n09j562p50J461J232N21j610j313K75J032J461p70p48j029J76J077J068
4045A148j60o40j575N4J310J458l28j527j194K52K245M86q07j251n74O36J074
4062F07M80n79j167o56O22J425M80k71j946n09R14J491N74j262j423J28R64J475
4080A347k77r42j114K76L28J218M05j121r88m06J090J259J08j201j246QJ865P49
4098A358o55j077p71L68J055P32m50p74j189O38J188P50n87j046p10L32J738M60
4116A360q67j177n10O80J235N85r74q37m15P74J121K16o37j238p61J170J737j52
$$ plain form
3992 1312 1189 -106 -1354 -866 366 1206 806 -132 -1236 -591 225 1190 911 -251 -1244 -1048 -27 1627
4010 1627 997 -736 -1326 -573 824 1310 645 -767 -1197 -492 415 1039 558 -671 -1228 -719 529 1136
4028 1136 627 -935 -1685 -224 1008 1529 -81 -1394 -1119 -87 1374 604 -144 -1173 -997 80 1148
4045 1148 988 348 -1227 -1173 137 1595 1267 -260 -1454 -1202 1043 1529 722 -529 -1103 -467 607
4062 607 1087 508 -659 -1315 -693 732 1212 941 -1005 -1514 -600 891 1465 203 -1220 -1092 -128 1347
4080 1347 1070 128 -986 -710 -382 836 1241 120 -868 -1274 -184 1075 1183 -18 -1264 -1256 609 1358
4098 1358 703 -374 -1145 -777 278 1010 560 -214 -1403 -765 423 1173 586 -460 -1170 -838 900 1360
4116 1360 493 -684 -1194 -514 721 1306 332 -505 -920 -146 975 1191 554 -684 -1445 -275 1462 1310
4134A310j240j167J36Q43J521l34j398p14P0J313O75o1j017r02Q6R51J125j17
4152A080j586r71L96J543R13n79j233q98Q43P96Q18n68j018r03J122J051L51p44
4170D13j013o44O00J595K14k28j787n04J225J252p8p26j355K89Q03J228l92r14
4188b2j057P0P77J253j48j085j111r1J419J231k58j416j163P55J157J237j247
4205C01r60o37O50J371O68o53p74j195K45J489Q58q73j109q07Q16J523N74j322
4223A65j129r8J023P01L47r50p08m97J108J006Pn35j476l22J531R98j60j207j238
4242a434N69J379M97l85r59p40K01J273M69K08j207j100K17J014J579o08j600
4259f27r46Q94J183P88j045j139m21O16J113P15r40r62m92P42J265N06r78j183
$$ plain form
4134 1310 70 -1097 -961 -118 1403 1069 -329 -1043 -973 340 1015 954 -63 -965 -879 72 1197 1080
4152 1080 -506 -1477 -1081 462 1375 796 -437 -1335 -492 304 1122 554 -464 -1367 -245 806 1157 413
4170 413 -600 -1244 -644 951 1165 937 -850 -1354 -129 1123 1045 319 -1036 -747 56 1284 892 -22
4188 -22 -1079 -1009 -232 1021 873 -212 -1323 -1414 5 1236 978 -438 -1601 -846 311 1548 301
4205 301 -659 -1296 -646 725 1393 740 -34 -1229 -984 505 1363 490 -619 -1426 -610 913 1487 165
4223 165 -964 -1062 -39 662 1009 59 -649 -1146 -38 968 975 440 -1036 -1358 173 1171 1011 -196 -1434
4242 -1434 -865 514 1011 626 -333 -1073 -872 401 870 1078 -129 -1229 -1012 2 1581 973 -627
4259 -627 -1573 -679 504 1292 247 -892 -1313 -697 416 1131 191 -771 -1263 -521 744 1250 272 -911
4277i11m59J052J376Q4j125j338K85J329O00k18p87r80L47J009M34J32p89j043
4295a002j44J126J026l4j262j049P40R75P23l97j242q10O20J424K87m08r47r29
4313a303P11J345N98p16j381n49P16J457N14r08j286l22Q80J288j84q46p77k99
4331a062J021O94K38q11j130j02R03J302k32r79j273M61J208Q16j41j151j098
4348a336K53J274P23j53j280o97L74R80R49l95j173p27L17J325P51o16j523j90
4366a144Q62J204q8l36j146m28Q43J249Q3q24q49l80Q79J005J35q50j307N9J275
4385B42R65k84q05j412P05R56O84j80r40p07j03J045J269k24j324j207L58J378
4403D16P65j75j796o08O52J539M18p87j441l7P35J071K94o75r17l54M00J095O00
$$ plain form
4277 -911 -1370 -318 1058 1142 17 -1321 -1036 293 893 675 -112 -1092 -745 264 698 830 41 -1002
4295 -1002 -1146 -20 1006 972 -290 -1339 -599 376 1099 702 -540 -1350 -730 694 981 573 -374 -1303
4313 -1303 -592 753 1351 635 -746 -1295 -579 878 1392 484 -802 -1124 -244 1044 860 14 -763 -1062
4331 -1062 -41 653 891 80 -1050 -1152 -249 1053 821 -158 -1431 -970 238 1054 913 -238 -1336
4348 -1336 -1083 191 914 761 -519 -1216 -842 138 1087 692 -481 -1208 -891 434 1185 569 -954 -1144
4366 -1144 -282 922 834 498 -648 -1076 -233 1016 1099 275 -574 -954 -75 930 1065 215 -1092 -1033 242
4385 242 1207 923 118 -1294 -589 367 1051 871 -69 -776 -879 166 1435 1211 -113 -1320 -962 416
4403 416 1181 1006 -790 -1398 -746 793 1211 424 -1017 -1054 -319 752 1046 371 -546 -900 -500 595 1195
4422A195q13j121p96J195J740r2j236j053l2R99R21k31o39p93M5P14J079J06j033
4441A55j289j72J426J075j82j143j066N70J331L66l88j146m68M12P58O90j99q78
4459a48r93L09J682K95n01j176r04J053J162M47p38r49n88O68J002J63m17j171
4477h04k06R66R25J97q62j065l53J226J197m9j439r55R8J240R27m00r67o84L26
4496f82J095N78l09j081p76K38J360P66k82j549m72N46J092P03o59j216l04O88
4514b64J033N92r22j037j94O11R40L09o53j087o8O45R96M56r94j522J22J162J163
4533A288k27j130j034J03J266N58K52j295r15J78J144Q53l80o84r57K93J012Q89
4551A214m83j172n14N91O48O80n28q88q43R16N01Q39k63j184p12O36J230M50p72
$$ plain form
4422 1195 382 -739 -1535 -340 1400 1308 72 -981 -1013 -14 907 676 37 -756 -711 3 1082 1188 155
4441 155 -1134 -1306 120 1195 1013 -130 -1196 -626 705 1071 683 -463 -931 -519 239 929 730 -148
4459 -148 -1141 -832 850 1145 644 -532 -1436 -383 779 1226 488 -461 -1049 -381 621 784 367 -804
4477 -804 -1010 -44 881 1078 216 -849 -1202 24 1221 1172 -267 -1222 -1124 116 1043 643 -324 -1008 -682
4496 -682 413 991 682 -399 -1175 -937 423 1189 907 -642 -1114 -568 524 1227 568 -648 -952 -264
4514 -264 769 1361 439 -598 -792 -181 759 1068 415 -672 -740 -95 901 1357 363 -1159 -1037 125 1288
4533 1288 1061 -69 -1103 -1000 266 824 1076 -219 -1134 -956 188 1041 661 -23 -980 -687 325 1214
4551 1214 731 -441 -955 -364 284 964 436 -452 -1295 -379 122 961 698 -486 -1198 -562 668 1118 346
4570C46j464j97J149J304k70j055p01o7R44R17R8p35j089q2Q13R47K27j055j072
4589a042j64J332R06m84p62q78M54R83P65q60m40n80MJ233J013p34r00j014L12
4608h56J346P00r30j116l85J172O92M15p25j146j23J079P43L0m60j307l3L09J460
4627H65K07p76j113l49J076J016k0j073r18N06P71M51k2o92r41K58R42P33j08
$$ plain form
4570 346 -1118 -1315 -166 1138 868 -187 -888 -955 -11 906 1004 269 -820 -902 -89 858 1085 30 -1042
4589 -1042 -1206 126 1032 548 -214 -1092 -638 345 1110 250 -190 -770 -766 467 1480 746 -154 -1168 -856
4608 -856 490 1190 260 -856 -1241 -69 623 1038 313 -833 -956 123 866 896 436 -871 -904 -595 865
4627 865 1072 296 -817 -1166 -90 926 906 -167 -1085 -579 192 643 621 -71 -1012 -754 188 921 813
$$ [...]
8191B43
##END NTUPLES=NMR FID
##END=
