##TITLE=1H_CG-1119-4
 DMSO, 8 sc, 
 18.9.2019
##JCAMPDX= 6.0         $$ Bruker NMR JCAMP-DX V2.0
##DATA TYPE= NMR FID
##DATA CLASS= NTUPLES
##ORIGIN= UXNMR, Bruker Analytische Messtechnik GmbH
##OWNER= root
$$ XWIN-NMR		Version 3.5
$$ Wed Sep 18 14:10:24 2019 Russian Standard Time (UT+4h)  she@DPX200
##.OBSERVE FREQUENCY= 200.1315
##.OBSERVE NUCLEUS= ^1H
##.DELAY= (6, 6)
##.ACQUISITION MODE= SIMULTANEOUS
##.ACQUISITION SCHEME= undefined
##.AVERAGES= 8
##.DIGITISER RES= 18
##SPECTROMETER/DATA SYSTEM= spect
##.PULSE SEQUENCE= zg30
##.SOLVENT NAME= DMSO
##.SHIFT REFERENCE= (INTERNAL, DMSO, 0, 15.7039)
##AUDIT TRAIL= $$ (NUMBER, WHEN, WHO, WHERE, WHAT)
$$ ##TITLE= Audit trail, XWIN-NMR		Version 3.5
$$ ##JCAMPDX= 5.01
$$ ##ORIGIN= Bruker BioSpin GmbH
$$ ##OWNER= she
$$ F:/spectra/data/she/nmr/H-F/1/audita.txt
$$ ##AUDIT TRAIL=  $$ (NUMBER, WHEN, WHO, WHERE, WHAT)
(   1,<2019-09-18 14:09:21.81 +0400>,<she>,<DPX200>,
      <created by zg, POWCHK disabled, PULCHK disabled
       configuration hash MD5:
       00 E9 B6 7A A2 85 ED C7 34 08 36 98 17 FE 4E 26
       data hash MD5: 16K
       9D 02 4D C5 76 06 96 1A EF 3A EA 63 B7 2D E5 85>)
$$ ##END=
$$ 
$$ hash MD5
$$ 15 27 ED 07 14 5E 2E 37 69 43 5C BC D9 B7 87 39
##$RELAX= 
##$RELAX= 
##$RELAX= 
##$RELAX= 
##$RELAX= 
##$RELAX= 
$$ Bruker specific parameters
$$ --------------------------
##$DU= <F:/spectra>
##$EXPNO= 1
##$NAME= <H-F>
##$PROCNO= 1
##$TYPE= <nmr>
##$USER= <she>
##$AMP= (0..31)
100 100 100 100 100 100 100 100 100 100 100 100 100 100 100 100 100 100 
100 100 100 100 100 100 100 100 100 100 100 100 100 100 
##$AQSEQ= 0
##$AQ_mod= 1
##$AUNM= <au_zg>
##$AUTOPOS= <>
##$BF1= 200.13
##$BF2= 200.13
##$BF3= 200.13
##$BF4= 200.13
##$BF5= 200.13
##$BF6= 200.13
##$BF7= 200.13
##$BF8= 200.13
##$BYTORDA= 1
##$CFDGTYP= 0
##$CFRGTYP= 5
##$CHEMSTR= <none>
##$CNST= (0..31)
1 1 145 1 1 1 1 1 1 1 1 1 1 1 1 1 1 1 1 1 1 1 1 1 1 1 1 1 1 1 1 1 
##$CPDPRG= <>
##$CPDPRG1= <>
##$CPDPRG2= <>
##$CPDPRG3= <>
##$CPDPRG4= <mlev>
##$CPDPRG5= <mlev>
##$CPDPRG6= <mlev>
##$CPDPRG7= <mlev>
##$CPDPRG8= <mlev>
##$CPDPRGB= <>
##$CPDPRGT= <>
##$D= (0..31)
0 1.2 0 0 0 0 0 0 0 0 0 0.03 0 0 0 0 0 0 0 0 0 0 0 0 0 0 0 0 0 0 0 0 
##$DATE= 1568801361
##$DBL= (0..7)
120 120 120 120 120 120 120 120 
##$DBP= (0..7)
150 150 150 150 150 150 150 150 
##$DBP07= 0
##$DBPNAM0= <>
##$DBPNAM1= <>
##$DBPNAM2= <>
##$DBPNAM3= <>
##$DBPNAM4= <>
##$DBPNAM5= <>
##$DBPNAM6= <>
##$DBPNAM7= <>
##$DBPOAL= (0..7)
0.5 0.5 0.5 0.5 0.5 0.5 0.5 0.5 
##$DBPOFFS= (0..7)
0 0 0 0 0 0 0 0 
##$DE= 6
##$DECBNUC= <off>
##$DECIM= 24
##$DECNUC= <off>
##$DECSTAT= 4
##$DIGMOD= 1
##$DIGTYP= 9
##$DL= (0..7)
0 120 120 120 120 120 120 120 
##$DP= (0..7)
150 150 150 150 150 150 150 150 
##$DP07= 0
##$DPNAME0= <>
##$DPNAME1= <>
##$DPNAME2= <>
##$DPNAME3= <>
##$DPNAME4= <>
##$DPNAME5= <>
##$DPNAME6= <>
##$DPNAME7= <>
##$DPOAL= (0..7)
0.5 0.5 0.5 0.5 0.5 0.5 0.5 0.5 
##$DPOFFS= (0..7)
0 0 0 0 0 0 0 0 
##$DQDMODE= 0
##$DR= 18
##$DS= 0
##$DSLIST= <SSSSSSSSSSSSSSS>
##$DSPFIRM= 0
$$ [...]
##$SUBNAM2= <"">
##$SUBNAM3= <"">
##$SUBNAM4= <"">
##$SUBNAM5= <"">
##$SUBNAM6= <"">
##$SUBNAM7= <"">
##$SUBNAM8= <"">
##$SUBNAM9= <"">
##$SW= 24.0689530833862
##$SWIBOX= (0..15)
0 0 2 0 0 0 0 0 0 0 0 0 0 0 0 0 
##$SW_h= 4816.95568400771
##$TD= 16384
##$TD0= 1
##$TE= 0
##$TE2= 300
##$TE3= 300
##$TEG= 300
##$TL= (0..7)
0 120 120 120 120 120 120 120 
##$TP= (0..7)
150 150 150 150 150 150 150 150 
##$TP07= 0
##$TPNAME0= <>
##$TPNAME1= <>
##$TPNAME2= <>
##$TPNAME3= <>
##$TPNAME4= <>
##$TPNAME5= <>
##$TPNAME6= <>
##$TPNAME7= <>
##$TPOAL= (0..7)
0.5 0.5 0.5 0.5 0.5 0.5 0.5 0.5 
##$TPOFFS= (0..7)
0 0 0 0 0 0 0 0 
##$TUNHIN= 0
##$TUNHOUT= 0
##$TUNXOUT= 0
##$USERA1= <user>
##$USERA2= <user>
##$USERA3= <user>
##$USERA4= <user>
##$USERA5= <user>
##$V9= 5
##$VALIST= <valist>
##$VCLIST= <CCCCCCCCCCCCCCC>
##$VD= 0
##$VDLIST= <DDDDDDDDDDDDDDD>
##$VPLIST= <PPPPPPPPPPPPPPP>
##$VTLIST= <TTTTTTTTTTTTTTT>
##$WBST= 1024
##$WBSW= 4
##$XGAIN= (0..3)
0 0 0 0 
##$XL= 0
##$YL= 0
##$YMAX_a= 131673
##$YMIN_a= -123763
##$ZGOPTNS= <>
##$ZL1= 120
##$ZL2= 120
##$ZL3= 120
##$ZL4= 120
##$ABSF1= 10
##$ABSF2= 0
##$ABSG= 5
##$ABSL= 3
##$ALPHA= 0
##$AQORDER= 0
##$ASSFAC= 0
##$ASSFACI= 0
##$ASSFACX= 0
##$ASSWID= 0
##$AUNMP= <proc_1d>
##$AZFE= 0.1
##$AZFW= 0.1
##$BCFW= 1
##$BC_mod= 2
##$BYTORDP= 1
##$COROFFS= 0
##$CY= 11.3945322036743
##$DATMOD= 1
##$DC= 2
##$DFILT= <>
##$DTYPP= 0
##$F1P= 20.1720416913024
##$F2P= 0.152960286110954
##$FCOR= 0.5
##$FTSIZE= 0
##$FT_mod= 4
##$GAMMA= 1
##$GB= 0.15
##$INTBC= 1
##$INTSCL= 1
##$ISEN= 128
##$LB= 0.24
##$LEV0= 0
##$LPBIN= 0
##$MAXI= 10000
##$MC2= 0
##$MEAN= 0
##$ME_mod= 0
##$MI= 1.114404
##$NCOEF= 0
##$NC_proc= 0
##$NLEV= 6
##$NOISF1= 3.799351
##$NOISF2= 2.8
##$NSP= 1
##$NTH_PI= 0
##$NZP= 0
##$OFFSET= 15.70392
##$PC= 1
##$PHC0= -9578.129
##$PHC1= 15.00096
##$PH_mod= 1
##$PKNL= yes
##$PPARMOD= 0
##$PSCAL= 0
##$PSIGN= 0
##$REVERSE= no
##$SF= 200.130013532006
##$SI= 16384
##$SIGF1= 3
##$SIGF2= 2
##$SINO= 400
##$SIOLD= 16384
##$SREGLST= <1H.CDCl3>
##$SSB= 0
##$STSI= 0
##$STSR= 0
##$SW_p= 3612.71676300578
##$SYMM= 0
##$S_DEV= 0
##$TDeff= 0
##$TDoff= 0
##$TI= <>
##$TILT= no
##$TM1= 0
##$TM2= 0
##$TOPLEV= 0
##$USERP1= <user>
##$USERP2= <user>
##$USERP3= <user>
##$USERP4= <user>
##$USERP5= <user>
##$WDW= 1
##$XDIM= 8192
##$YMAX_p= 0
##$YMIN_p= 0
$$ End of Bruker specific parameters
$$ ---------------------------------
##NTUPLES= NMR FID
##VAR_NAME=  TIME,          FID/REAL,        FID/IMAG
##SYMBOL=    X,             R,               I
##VAR_TYPE=  INDEPENDENT,   DEPENDENT,       DEPENDENT
##VAR_FORM=  AFFN,          ASDF,            ASDF
##VAR_DIM=   8192,          8192,            8192
##UNITS=     SECONDS,       ARBITRARY UNITS, ARBITRARY UNITS
##FACTOR=    0.0002076,     1,               1
##FIRST=     0,             0,               0
##LAST=      1.7004516,     0,               0
##MIN=       0,             -123763,         0
##MAX=       1.7004516,     131673,          0
$$ Real data points
##PAGE= N=1
##DATA TABLE= (X++(R..R)), XYDATA
0 0 0 0 0 0 0 0 0 0 8 -8 8 -8 8 -16 16 -17 24 -28 32 -40 48 -56 64 -72 81 -97 108 -121 140 -158 177 -199
32 -199 223 -250 280 -312 348 -387 428 -474 525 -581 643 -714 790 -875 974 -1084 1211 -1360
50 -1360 1532 -1742 1997 -2318 2738 -3311 4145 -5479 7959 -14185 65098 74105 -45210 -14926
64 -14926 69837 131673 86621 20551 -9232 21858 54695 73785 66647 43857 1840 -18614
76 -18614 9665 71661 87429 27948 -49706 -49142 25600 85350 57594 -19709 -62743 -32111 29283
89 29283 58392 29731 -24834 -56839 -37132 15788 50268 26742 -33471 -67639 -38868 20195
101 20195 45756 10741 -44764 -64012 -33686 11252 30413 7947 -39212 -69890 -50162 7211
113 7211 43591 12014 -59766 -89643 -38702 35506 45923 -16342 -75968 -66451 -5735 35891
125 35891 20162 -22398 -45625 -37228 -10983 16812 29479 11336 -30854 -54351 -21813 41370
137 41370 62166 8670 -59501 -59966 10208 68765 47182 -26359 -64955 -29829 29622 46039
149 46039 12218 -28120 -39954 -23654 2243 21053 18784 -11026 -48602 -52362 -8057 39315
161 39315 31447 -29894 -76534 -50746 18760 50949 9144 -53661 -66286 -21106 27431 31038
173 31038 -4559 -39937 -44339 -19267 14717 30016 9756 -31247 -51349 -24770 24365 42573
185 42573 7886 -42181 -52022 -11512 33914 37530 -435 -40001 -43200 -7287 33923 40705 4074
198 4074 -41007 -44384 3007 51126 44878 -6905 -43375 -24053 25655 50714 30957 -4154 -19051
211 -19051 -7398 16726 39246 43753 18840 -19626 -28313 13591 64221 59685 -2475 -49172 -22021
224 -22021 44702 67990 23673 -31491 -35142 4539 34955 29282 5903 -12146 -21102 -18320 3665
237 3665 31017 28179 -14993 -53207 -35827 23231 51996 12150 -47914 -56773 -8091 37257 30613
250 30613 -12620 -42051 -33795 -4369 18078 19168 -2028 -31314 -41826 -17629 20433 30023 -4524
263 -4524 -46987 -48305 -7394 28501 20640 -18712 -47127 -38723 -5082 21081 16904 -14344 -43978
276 -43978 -41446 -4795 30716 24707 -18562 -50424 -32689 14946 39431 16306 -23746 -35740
288 -35740 -11681 19642 30855 17573 -7148 -22893 -14815 14727 40802 33284 -5999 -35389
300 -35389 -17656 31016 54582 24600 -24535 -36406 987 41759 41277 6023 -22809 -19612 6028
313 6028 28239 29836 12153 -11444 -21485 -5537 25866 41512 19343 -20620 -33233 -447
325 -447 42479 45688 4863 -32645 -24713 15762 42530 29529 -5061 -25509 -15177 11490 29143
338 29143 23625 -775 -25089 -25231 1707 30096 26821 -8826 -39957 -30946 8489 32836 14738
351 14738 -23310 -40645 -22333 9325 23123 8180 -20614 -35999 -24023 6572 26807 13935
363 13935 -22143 -41667 -20815 19296 33077 6113 -29357 -33447 -5215 21218 22215 2503 -18130
376 -18130 -24907 -11807 12821 28020 13850 -20882 -38625 -14218 28014 37895 1274 -38521
388 -38521 -34403 6351 34338 20434 -12694 -27058 -14373 5673 17366 17435 4270 -15835 -24688
401 -24688 -5065 27644 35555 3692 -32884 -28629 13225 42744 25700 -14771 -31590 -9935
413 -9935 20557 28013 11696 -9257 -19772 -13980 6143 24647 19864 -8464 -32925 -22894 12698
426 12698 33009 13132 -23722 -35306 -11408 18778 24027 3162 -19953 -25047 -10181 12239
438 12239 24067 12106 -16142 -30661 -11481 23406 34694 8158 -25520 -26967 4151 31002
450 31002 25853 -418 -18413 -14023 5230 21586 23013 8110 -12902 -20495 -2449 26409 33240
463 33240 5850 -26248 -25191 8996 36680 26024 -8730 -27182 -12195 16343 28056 15141
475 15141 -6298 -17223 -9838 8458 23149 20727 -444 -21478 -18239 9315 31880 22212 -11115
488 -11115 -30744 -14776 18049 30000 8982 -20595 -28019 -8885 14445 18523 1613 -19168
500 -19168 -26452 -14313 6588 16347 2835 -22498 -34115 -17586 10557 18947 -2793 -30461 -33843
513 -33843 -10047 14169 14227 -7489 -27884 -26891 -7127 12527 14415 -3277 -24882 -27677 -6125
526 -6125 19167 20025 -5662 -29394 -24351 4241 23395 13723 -11164 -24071 -14809 4950 17218
539 17218 12340 -4087 -19461 -18702 1228 22993 21488 -5466 -28678 -18793 14558 32599 14686
552 14686 -16260 -23625 -2235 20828 22805 7775 -6857 -10392 -3071 11282 23632 19914 -1250
565 -1250 -19400 -10487 20014 36433 16762 -16408 -23433 2986 29767 26845 1493 -15659 -10500
578 -10500 5925 17784 17994 7221 -8353 -15607 -3772 18757 27517 8216 -18913 -21502 4627
591 4627 28529 23274 -3179 -19760 -10560 10674 21920 16308 559 -11823 -11467 4545 22850
604 22850 22899 1188 -20141 -15335 11427 29207 17309 -9862 -21211 -6693 14744 20828 8728
617 8728 -7676 -14887 -8546 6487 18845 14495 -6191 -22794 -14280 12306 26528 11298 -17122
630 -17122 -24940 -4298 19704 21017 1366 -15969 -15009 -148 13459 15646 5459 -9598 -16691
643 -16691 -6399 13684 22120 7170 -16551 -22424 -2420 20899 20839 -2002 -21503 -17138 3721
656 3721 18668 13235 -5135 -17673 -13920 1553 14352 13413 -2187 -17846 -17345 819 18178
669 18178 15953 -5337 -22178 -15912 7114 21269 11615 -10057 -20690 -10189 9370 17732 8065
682 8065 -8879 -17518 -10420 6247 17267 9789 -9648 -21722 -12246 9772 19588 6188 -15997
695 -15997 -22751 -7122 12077 14879 375 -15573 -17932 -6175 8232 13145 3718 -13426 -21127
708 -21127 -8823 12472 19086 2216 -20099 -21511 -336 18805 14738 -5414 -18282 -12331 3016
721 3016 12698 9982 -807 -11945 -14410 -3447 13492 17391 253 -20290 -19606 3505 21638
734 21638 13545 -11007 -22556 -10019 9579 14870 4504 -8585 -13765 -9162 1904 11872 10875
747 10875 -3933 -19440 -15947 5837 20968 10455 -14129 -23201 -7463 13825 16093 424 -14295
760 -14295 -14664 -4306 6851 10845 3724 -9440 -17973 -10989 7486 17344 4706 -17633 -23088 -4590
774 -4590 15169 14089 -4820 -18850 -14693 311 10157 8542 -1462 -12269 -14778 -4699 10735
787 10735 15046 1286 -16974 -18018 1413 19250 14848 -5724 -18104 -9527 8273 16339 9040
800 9040 -4223 -11200 -7207 4376 14676 13544 -707 -14023 -10965 7315 20808 13674 -6597
813 -6597 -17094 -6096 13277 19269 7439 -8278 -11984 -1945 10962 15427 8172 -4889 -11732
826 -11732 -4811 10647 18521 9140 -8092 -14651 -3195 14708 18842 5012 -11582 -12911 1042
839 1042 14828 14682 1628 -10523 -10782 196 11875 13606 2502 -11193 -13540 -952 13849
852 13849 14727 167 -15406 -13936 2817 16060 11521 -5097 -15478 -9507 4786 12850 8078
865 8078 -3990 -12019 -9731 1995 12587 10720 -3345 -15719 -12093 4844 16926 9163 -9361
878 -9361 -17585 -6996 9567 13867 3150 -9572 -12719 -5277 5252 10299 5490 -6733 -15286 -9428
892 -9428 6636 15265 5658 -12935 -18724 -4694 12625 13265 -1595 -14293 -12246 -172 8822 8375
906 8375 248 -8621 -12000 -5191 8286 14095 3078 -13826 -16364 -629 15578 13264 -4511 -15997
920 -15997 -9601 5208 12333 6664 -3554 -9561 -7802 673 9817 11339 696 -12912 -12679 3284
934 3284 17165 12023 -6514 -16278 -6540 10093 14849 4956 -7058 -9498 -2954 5888 10857 7929
948 7929 -2346 -11138 -8143 6484 16784 9387 -8302 -15379 -3547 13002 15235 2234 -10349
961 -10349 -10020 649 9684 10281 3088 -6066 -9545 -3239 8572 14088 5390 -9506 -13399 -841
975 -841 14024 14260 -337 -12460 -9263 4276 12756 9635 -867 -8789 -7175 2083 10861 11275 1172
990 1172 -10015 -9570 2756 14405 12117 -2261 -12880 -7587 7007 14546 7918 -4912 -10853 -4782
1004 -4782 6330 11523 6785 -3799 -10460 -6124 5107 12325 7410 -5553 -12969 -6531 7355 13274
1018 13274 4568 -9473 -13174 -3850 8285 10272 1089 -9571 -11306 -3519 6001 8718 1502 -9031
1032 -9031 -12842 -5465 6956 10472 874 -12323 -14393 -2443 9947 8916 -3674 -13552 -10725 443
1046 443 8068 5507 -3077 -10380 -9787 -1740 7197 8364 -1265 -12239 -12407 306 11923 8999 -5575
1061 -5575 -14518 -7982 5668 10827 4155 -6001 -9639 -4964 3099 8242 6216 -2614 -10563 -8512
1075 -8512 3453 12897 7860 -6925 -14306 -5476 9153 12117 1685 -9311 -9652 -1484 6280 7459
1089 7459 2157 -5266 -9690 -5640 4681 10906 4379 -9550 -14189 -3667 10011 10768 -2006 -12852
1103 -12852 -10270 1017 7710 4945 -2632 -8158 -8324 -2650 5180 7891 597 -10350 -12399 -1041
1117 -1041 10942 9199 -4114 -13400 -8209 4626 10320 4443 -5009 -8418 -4621 2445 7485 6514
1131 6514 -1260 -8899 -7998 2819 12286 8660 -4634 -11739 -4714 8280 12363 4076 -6500 -8149
1145 -8149 -966 7159 9075 4299 -3244 -7007 -2995 6008 11576 6289 -5163 -9996 -1967 9848
1159 9848 12235 2633 -7793 -8064 1260 9668 9012 994 -6344 -6493 504 7931 9042 1914 -6833
1174 -6833 -8040 33 9748 9866 -157 -9298 -7624 2762 10588 7556 -2149 -8536 -5324 3898 9460
1189 9460 6500 -1532 -7421 -4941 3348 9757 7674 -1339 -7973 -5121 5188 11959 7415 -3602
1203 -3602 -8509 -2740 7646 11347 5087 -4110 -6418 -886 6935 9651 5196 -2692 -6977 -2459 6801
1218 6801 11529 5689 -5257 -8878 -1058 9742 10767 1630 -7275 -6760 1529 8256 7078 658 -4958
1233 -4958 -6004 -1007 6362 8434 2319 -7266 -9543 -727 9388 8706 -2411 -10751 -7265 3040
1247 3040 8188 3720 -4163 -7900 -5252 570 4670 4482 -1701 -8536 -8968 -237 8252 6187 -4905
1262 -4905 -12389 -7091 4510 8473 1527 -7400 -8804 -3056 3112 5112 1949 -3792 -7769 -5881 2058
1277 2058 8209 4410 -6067 -11050 -4431 6877 9294 292 -8962 -7955 -36 5693 4844 -251 -5287
1292 -5287 -6571 -2722 3848 7009 2243 -6757 -10039 -2475 7628 8009 -1664 -10028 -7719 1915 7319
1307 7319 3908 -3482 -7041 -5234 -33 4809 5015 -634 -7321 -7852 -136 7712 6389 -3290 -10090
1322 -10090 -6335 3561 8221 3173 -5138 -7914 -3343 3300 5741 3069 -3060 -7090 -4600 2697 7455
1337 7455 4253 -3982 -8561 -3954 5233 8475 2802 -5726 -7521 -1369 5983 7312 1574 -4502 -5786
1352 -5786 -905 5542 7373 2622 -4461 -6604 -811 6949 8148 1576 -6045 -6367 722 7767 7202
1367 7202 -179 -6389 -5137 1783 7026 5619 -723 -5844 -4852 1042 6311 5990 -540 -6729 -5888 1488
1383 1488 7931 5824 -2487 -7889 -4566 3829 7727 3516 -3920 -6482 -2416 3335 5839 3355 -2153
1398 -2153 -5914 -4140 2626 7494 4787 -3977 -8517 -3299 5508 8124 1674 -6139 -6590 -277 5321
1413 5321 5176 379 -4050 -5226 -2127 3460 6361 2583 -4817 -7948 -2245 6537 7753 -49 -7618
1428 -7618 -6215 1563 6725 4446 -1736 -5237 -3633 380 3925 4801 679 -5301 -6579 -607 6783
1443 6783 6394 -1696 -8726 -5605 3366 7441 2878 -4056 -6266 -2679 2155 4254 2862 -1422 -5511
1458 -5511 -4811 1184 6570 4926 -3354 -8295 -4078 4952 8011 2081 -5773 -6111 -505 4688 4705 1106
1474 1106 -2933 -4304 -2193 2803 6158 3393 -3681 -7145 -2248 5701 7507 887 -6412 -6054 968
1489 968 5952 4582 -1054 -4561 -3938 -144 4079 4798 691 -4700 -5748 -504 6082 6037 -730 -6790
1505 -6790 -5230 2155 6696 4030 -2259 -5712 -3053 2228 5360 3445 -1550 -5143 -3759 1677 5896
1520 5896 4136 -2014 -6232 -3733 3080 6756 3114 -3516 -6127 -2040 3976 5906 1985 -3216 -4946
1535 -4946 -1613 3594 5732 2377 -3136 -5086 -1503 4274 6449 2459 -3806 -5598 -526 5680 6323
1550 6323 1015 -4635 -4670 1066 5554 4946 287 -3870 -3709 259 4738 5053 544 -4206 -4941 194
1566 194 5793 5634 -802 -6201 -4502 2051 6070 3297 -2747 -5153 -2732 1694 4129 2712 -1138
1581 -1138 -4654 -4063 893 5553 4193 -2078 -6772 -3940 3293 6447 2150 -4356 -5594 -1336 3470
1596 3470 4060 1022 -2552 -4246 -2314 1872 4819 2608 -3236 -6407 -2897 4387 6173 688 -5758
1611 -5758 -5525 401 4703 3896 -1038 -3904 -3289 -451 2727 3873 1384 -3914 -5916 -1406 4798 5584
1627 5584 -622 -6569 -5287 1486 5509 2829 -2773 -5205 -3001 766 2935 1919 -970 -4600 -4989
1642 -4989 -726 4201 3693 -2309 -7161 -4934 2035 5187 1379 -4682 -6139 -2262 2088 2980 339
1657 339 -2907 -4842 -3319 1060 3886 2263 -3153 -6263 -3162 3020 5303 900 -4846 -5420 -702
1672 -702 3746 3734 -4 -3455 -3623 -757 3043 3954 1087 -3377 -4561 -835 4155 5157 532 -4649
1688 -4649 -4392 930 4935 3906 -632 -4146 -2765 1388 4429 3543 -10 -3711 -3029 1206 4798 3972
1704 3972 -595 -4181 -2932 1948 5462 3515 -1737 -4729 -2185 2566 4812 2585 -2111 -4086 -1774
1719 -1774 2434 4377 2344 -1638 -3794 -1835 2283 4864 2569 -2305 -4609 -1506 3778 5167 1633
1734 1633 -3122 -3965 186 4221 4408 1009 -2380 -2808 483 3635 4625 2100 -2124 -3517 -209 4823
1750 4823 5641 1140 -3721 -3375 1826 5607 4114 -463 -2940 -1450 1924 3928 3469 765 -2216 -2568
1766 -2568 792 4736 4827 71 -4443 -3094 2505 5950 3097 -2263 -4063 -952 2658 3561 1633 -1258
1782 -1258 -2956 -2025 926 4062 2852 -1739 -5019 -3015 2595 5168 1098 -4186 -4615 -533 3406
1797 3406 2863 -326 -2909 -3121 -1066 1380 3003 1341 -2722 -4689 -1959 2943 4545 283 -4780
1812 -4780 -4599 548 3996 2706 -1289 -3652 -2376 352 2569 2361 214 -2743 -3546 -604 3703 4112
1828 4112 -512 -4646 -3433 1602 4582 2310 -2112 -4041 -1830 1762 2950 1485 -1546 -3382 -2474
1843 -2474 623 3282 2391 -1668 -4812 -2670 1981 4090 1199 -3227 -4455 -1461 2392 3007 310
1858 310 -2894 -3750 -1727 1601 2787 924 -2916 -4356 -1888 2169 3421 286 -3760 -4380 -829 2775
1874 2775 2876 -673 -3760 -3466 -288 2565 2397 -681 -3437 -3336 -192 2748 2800 -355 -3648 -3228 242
1891 242 3416 2886 -1020 -3488 -2732 1320 3803 2298 -1423 -3446 -1875 1595 3255 2033 -1173 -3069
1907 -3069 -1811 1305 3482 2591 -1350 -3706 -2083 2313 4266 1919 -2553 -3724 -678 2644 3275
1922 3275 766 -2026 -2665 -707 1872 3030 1450 -1800 -3493 -1394 2483 4271 868 -3374 -3526
1937 -3526 117 3773 2911 -472 -2767 -2144 426 2250 2362 445 -2113 -2916 -526 2747 3615 129
1953 129 -3872 -3432 1078 4017 2326 -1435 -3257 -1289 1628 2855 1258 -488 -2278 -2117 336 2932
1969 2932 2937 -453 -3707 -2653 1536 4411 1785 -2650 -3762 -667 2627 2692 793 -1611 -2274 -826
1985 -826 1026 2701 1908 -1233 -3540 -1904 2308 4025 1162 -3164 -3580 -210 3334 2777 -226 -2424
2001 -2424 -2259 -33 1899 2335 559 -1963 -2852 -688 2573 3185 194 -3258 -3072 583 3399 2320
2017 2320 -1189 -2979 -2054 740 2525 1654 -595 -2689 -2436 353 2732 2271 -1001 -3371 -2526 1195
2033 1195 3081 1596 -1750 -3211 -1550 1478 2464 908 -1808 -2944 -1494 1237 2611 1205 -1558
2048 -1558 -3120 -1502 1675 3012 1093 -2247 -3329 -992 2202 3089 570 -2400 -2800 -249 2339
2063 2339 2479 221 -2060 -2288 -211 2255 2777 519 -2163 -2377 -5 2588 2819 151 -2508 -2455 713
2080 713 3479 2672 -535 -2500 -1303 1510 2812 2063 -274 -1857 -1187 789 2820 2539 -136 -2651
2096 -2651 -1970 1455 3628 2150 -1396 -3064 -944 2239 2877 942 -1296 -2055 -725 1239 2397 1546
2112 1546 -916 -2606 -1492 1833 3382 1388 -2306 -3024 -551 2653 2477 22 -2168 -2040 70 1614
2128 1614 1980 710 -1409 -2639 -1006 2008 3193 500 -3022 -3011 476 3190 2223 -772 -2581 -1149
2144 -1149 1123 2273 1543 -25 -1405 -1424 82 2228 2790 380 -2601 -2352 894 3596 2157 -1533
2160 -1533 -2914 -1026 1998 2351 833 -1291 -1934 -1072 785 1802 1386 -760 -2746 -1814 1144 2821
2176 2821 1383 -2221 -3156 -902 1838 2123 -104 -2288 -2439 -872 871 1680 388 -2164 -2957 -1315
2192 -1315 1297 2194 68 -2876 -3119 -413 1793 1427 -696 -2714 -2481 -117 1283 1246 -502 -2202
2208 -2202 -2431 -496 1735 1908 -676 -2931 -2428 135 2449 1577 -1218 -2769 -1566 985 1999 892
2224 892 -1311 -2208 -1395 796 2189 1389 -701 -2183 -1368 981 2557 1403 -1201 -2342 -1367 1467
2240 1467 2790 1076 -2023 -2420 -621 1888 2231 194 -1771 -1975 -391 1341 1809 506 -1478 -2155
2256 -2155 -770 1353 2197 374 -2141 -2526 -375 2083 2054 -490 -2244 -1959 236 2012 1496 -566
2272 -566 -1727 -1572 -50 1759 1842 -84 -2055 -1848 719 2620 1982 -621 -2191 -1188 1363 2453
2288 2453 1247 -660 -1425 -641 750 2324 1846 -91 -1837 -1300 1643 3244 1604 -1283 -2113 -158
2304 -158 2416 2479 476 -1012 -876 223 1238 1831 1213 -363 -1472 -1066 1526 3205 1523 -1736 -2451
2321 -2451 115 2737 2498 -255 -1967 -1127 812 1856 1232 107 -1076 -1307 -281 1489 2079 453
2337 453 -1892 -2167 207 2519 2088 -462 -2387 -1356 918 2093 1022 -657 -1537 -973 405 1673
2353 1673 1396 -394 -1932 -1403 1074 2383 1424 -1157 -2215 -689 1359 1914 637 -1083 -1470 -706
2369 -706 795 1876 967 -740 -1949 -928 1438 2478 862 -1422 -2251 -131 1964 1871 36 -1614
2385 -1614 -1338 10 1263 1489 393 -1267 -1770 -382 1170 1768 258 -1863 -2122 -367 1611 1459
2401 1459 -458 -2321 -2065 233 1624 1160 -913 -2156 -1299 381 1464 678 -791 -1833 -1375 158
2417 158 1452 901 -560 -2116 -1689 267 1752 1191 -1372 -2376 -1090 1110 1830 347 -1597 -1732
2433 -1732 -522 1081 1263 199 -1063 -1661 -723 915 1791 683 -1400 -2084 -520 1582 1858 241
2449 241 -1580 -1480 -117 1552 1323 -22 -1423 -1574 -319 1337 1966 94 -1668 -1879 208 1863
2465 1863 1477 -769 -1977 -994 699 1632 892 -413 -1100 -1160 -16 1309 1607 260 -1777 -1706 366
2482 366 2287 1437 -1227 -2416 -828 1553 1983 238 -1266 -1159 33 815 1058 774 -273 -1355 -1062
2499 -1062 575 2135 1354 -1209 -2184 -559 1550 1913 90 -1536 -1386 122 1405 1206 284 -849
2515 -849 -1267 -254 1115 1729 320 -1369 -1682 33 1885 1559 -231 -1511 -1183 359 1418 1065 83
2532 83 -1191 -978 131 1563 1678 -211 -1708 -1377 655 1909 1223 -867 -1689 -743 877 1323 521
2549 521 -714 -1117 -551 504 1210 992 -394 -1466 -1143 523 1890 1136 -1007 -1913 -663 1356 1846
2566 1846 198 -1443 -1541 -128 1163 1296 70 -1106 -1339 -134 985 1128 200 -1153 -1608 -610 1063
2583 1063 1486 124 -1502 -1806 -445 1349 1238 -401 -1709 -1444 201 1599 726 -582 -1468 -1086 284
2600 284 981 932 -357 -1312 -1118 231 1348 1267 -347 -1618 -988 558 1672 806 -732 -1505 -614 627
2618 627 1427 735 -526 -1313 -594 705 1776 864 -879 -1586 -418 1309 1713 266 -1025 -986 -88 801
2636 801 1082 491 -372 -1026 -642 841 1806 628 -1374 -1836 -171 1866 1569 -332 -1604 -1053 697
2653 697 1340 595 -272 -751 -642 -65 759 1217 344 -1157 -1371 -18 1656 1470 -364 -1749 -1204 974
2671 974 1717 563 -755 -1298 -419 474 1170 719 -236 -947 -839 550 1829 1125 -663 -1474 -572 1165
2689 1165 1410 529 -719 -1196 -103 1006 1149 624 -528 -1150 -543 1103 1561 643 -1073 -1315 -94
2706 -94 1368 1307 40 -955 -747 308 1097 921 212 -677 -1176 -277 957 1392 219 -1269 -1547 23
2724 23 1457 926 -587 -1514 -807 795 1151 300 -735 -1197 -777 338 985 456 -476 -1177 -1145 -3 1078
2743 1078 718 -466 -1553 -906 480 1359 422 -1094 -1531 -583 790 1254 335 -1011 -1365 -361 852
2760 852 876 76 -774 -1257 -278 608 945 333 -736 -1257 -471 1058 1211 123 -1373 -1288 -12 1064 998
2779 998 -126 -1020 -942 -39 927 807 -150 -1205 -1193 2 1214 827 -398 -1465 -1045 367 913 476
2797 476 -460 -1168 -819 20 726 546 -262 -1387 -1204 256 1241 560 -921 -1640 -513 718 1208 15
2815 15 -1167 -1031 -248 437 389 299 -302 -792 -701 496 1213 936 -714 -1581 -399 1084 1472 -97 -1258
2834 -1258 -987 459 1427 768 -86 -624 -457 138 719 1169 237 -648 -1101 218 1415 1331 132 -1026
2852 -1026 -777 569 1200 665 -194 -699 -286 413 1029 987 72 -848 -827 449 1273 920 -457 -1016 -460
2871 -460 859 1175 479 -597 -854 -74 273 1017 661 -116 -972 -696 575 1372 682 -639 -1383 -318
2889 -318 1089 1197 188 -918 -715 161 833 726 140 -328 -487 -237 653 950 520 -569 -958 -43 1165
2908 1165 1125 128 -717 -807 321 1159 584 -143 -896 -511 248 1136 856 -266 -892 -669 473 1051 721
2927 721 -241 -934 -638 400 1152 755 -230 -936 -520 345 1104 625 -857 -988 -433 552 734 145 -719
2946 -719 -1014 -361 543 726 387 -713 -1042 -465 529 971 -81 -788 -1057 -243 786 808 79 -756 -723 -217
2966 -217 651 599 75 -910 -1133 -221 976 988 -305 -1195 -878 285 1017 495 -455 -727 -567 102 512 542
2986 542 69 -699 -880 -68 969 721 -464 -1437 -780 632 1180 352 -768 -977 -78 485 538 245 -251
3005 -251 -555 -709 282 831 526 -478 -1019 -622 650 1122 125 -999 -870 7 587 670 -62 -594 -737
3024 -737 -267 422 751 209 -729 -1035 48 901 953 -29 -969 -846 247 818 447 -189 -631 -517 79 483
3044 483 678 -10 -853 -720 -128 1022 870 -476 -1195 -545 461 853 250 -441 -545 -112 306 681 492
3063 492 -88 -636 -525 297 839 717 -321 -941 -398 724 1179 317 -584 -677 -59 637 713 407 -527 -593
3083 -593 -89 429 935 450 -573 -699 -29 612 829 130 -505 -782 45 804 866 -106 -614 -638 185 595
3103 595 856 -120 -767 -790 117 542 395 -138 -661 -502 20 724 576 -153 -750 -562 53 728 507 -476
3123 -476 -903 -374 407 731 260 -377 -714 -388 289 746 457 -359 -963 -413 445 787 377 -714 -815 -128
3143 -128 381 700 207 -565 -559 -233 262 552 226 -527 -914 -230 817 828 63 -925 -637 -88 749 621 -71
3164 -71 -717 -461 85 412 540 300 -530 -655 16 679 878 -71 -889 -668 560 976 502 -262 -677 -409
3184 -409 281 575 426 -215 -358 -472 53 895 527 -369 -887 -533 431 860 389 -620 -753 -50 434 461
3204 461 51 -398 -505 -466 279 776 526 -340 -952 -270 677 855 -23 -625 -728 245 710 429 132 -291
3224 -291 -412 -172 472 813 282 -410 -620 127 873 934 5 -757 -562 210 906 521 -198 -429 -200 176
3244 176 543 536 20 -592 -426 341 774 637 11 -739 -127 396 689 316 -316 -703 -164 155 655 345 -430
3265 -430 -679 -275 260 687 292 -305 -577 -259 485 649 181 -324 -661 -305 538 586 78 -517 -618 -111
3285 -111 323 512 98 -792 -675 -138 479 493 32 -607 -384 -85 517 573 -103 -616 -597 -15 710 553 -154
3306 -154 -781 -449 29 403 406 -106 -473 -367 78 654 597 -234 -710 -606 194 994 287 -554 -566 -208 217
3327 217 228 -149 -374 -421 -262 64 506 279 -302 -804 -559 278 571 -35 -693 -898 -126 347 256 -182 -526
3348 -526 -435 -179 70 203 86 -462 -621 -345 370 372 -201 -872 -649 98 755 359 -430 -606 -324 126 433
3369 433 243 34 -522 -552 4 323 485 -106 -574 -502 439 645 386 -187 -479 -39 325 402 196 -172 -415
3390 -415 -394 8 530 449 -310 -705 -272 457 865 129 -401 -530 -40 506 502 169 -286 -219 -222 362 568 231
3412 231 -368 -647 -11 769 576 51 -354 -330 204 536 295 -33 -478 -373 -164 379 489 -154 -488 -487 34
3433 34 716 492 -110 -384 -213 292 589 353 -267 -134 -214 78 480 241 -88 -476 -344 459 394 354 -284
3454 -284 -436 -138 331 542 516 -144 -422 -180 214 603 138 -606 -550 -88 437 623 170 -328 -172 -40 233
3475 233 572 29 -167 -463 9 628 690 382 -469 -436 159 559 454 6 -387 -403 190 289 244 64 -353 -397
3497 -397 -91 317 473 -35 -605 -507 121 537 322 -440 -709 -215 252 492 27 -113 -334 -209 -241 200 352
3518 352 -99 -328 -329 84 563 153 -450 -559 -108 367 365 -76 -357 -383 -181 34 525 340 -393 -492 -286 370
3540 370 489 116 -466 -393 109 667 278 -275 -421 -315 14 181 287 -105 -351 -510 5 302 472 -26
3560 -26 -449 -504 85 836 79 -452 -522 -227 -20 165 176 -78 -502 -422 -37 344 293 -77 -513 -389 330 759
3582 759 125 -251 -317 -107 174 338 -148 -231 -355 -124 67 646 113 -400 -307 -192 270 300 50 -452 -408 18
3604 18 286 452 100 -201 -103 -149 276 399 195 -332 -567 81 418 328 -135 -341 -318 117 390 228 65 -428
3626 -428 -242 15 426 64 -14 -347 -123 181 462 299 -171 -563 -205 253 421 314 -99 -348 -157 291
3646 291 360 304 -199 -318 -111 399 426 103 -268 -310 -227 254 524 173 -28 -381 -272 228 250 37 -427 -390
3668 -390 -74 412 330 -91 -328 -195 59 311 287 -91 -199 -364 16 271 509 -39 -345 -413 -73 549 290
3689 290 -209 -421 -158 201 131 101 29 -163 -157 -85 265 188 -67 -375 -408 186 420 335 -217 -403 -161 375 412
3712 412 0 -60 -134 -14 184 215 271 -138 -524 -195 363 476 28 -273 -421 -53 232 182 -32 -299 -191 69
3734 69 197 252 -51 -134 -353 -223 124 396 -188 -336 -469 -62 297 194 -257 -488 -144 87 236 126 50
3755 50 -207 -259 -155 469 190 -80 -324 -352 120 351 266 -31 -421 -195 206 259 152 -93 -189 -371 105 368
3777 368 206 -253 -297 -197 285 320 306 -84 -259 71 195 231 0 -300 -278 -9 259 312 233 -167 -202 -36 256
3800 256 333 157 -288 -222 -31 305 40 -144 -260 -450 -127 131 298 -208 -316 -394 138 153 115 -245 -341 -271
3822 -271 41 164 307 84 -295 -129 5 385 270 -226 -456 -79 344 204 184 -24 -242 -31 207 125 234
3843 234 -120 -401 -354 128 286 177 -294 -336 -36 330 341 118 -81 -52 -16 249 156 76 -187 -203 -122 177 365
3866 365 136 -271 -404 40 397 146 -46 -195 -70 98 165 212 -175 -206 -387 -43 468 292 71 -514 -520 128
3888 128 473 154 -116 -341 -98 251 228 20 -154 -314 -308 -31 108 168 -26 -453 -197 185 273 107 -229 -541
3910 -541 -134 309 151 -34 -256 -244 -164 111 378 83 -91 -335 -292 211 182 54 -343 -282 50 94 227 -141
3932 -141 -157 -20 -84 123 187 141 -124 -182 -173 337 299 -162 -55 -42 175 284 -27 -74 -177 -53 28 353 392 169
3956 169 -162 -376 -39 404 163 21 -363 -133 -53 281 40 -131 -269 -94 91 208 82 -23 -111 -12 128
3977 128 134 55 -230 -276 -103 131 238 -17 33 -128 -123 23 161 112 -169 -143 -45 295 237 -132 -326 69 201 319
4001 319 292 148 -131 -144 -24 228 86 205 16 -155 70 250 211 -2 -16 -16 47 62 168 -100 50 -54 -154
4024 -154 119 238 162 -133 -127 181 213 232 -24 -358 -94 270 196 117 -323 -121 142 73 130 108 -61 -177 -109 49
4048 49 347 152 -196 -275 -59 246 153 28 -277 -163 -12 76 24 -80 180 -172 -110 129 221 -108 -450 -247
4070 -247 40 128 34 -72 -284 -111 135 208 181 14 -99 -191 -202 316 85 -37 -94 -116 3 200 145 -174 -119
4093 -119 -271 22 257 -68 -234 28 -99 -127 130 -87 -118 -133 -123 377 257 64 -168 -68 145 226 36 114
4115 114 -324 -134 -120 85 199 80 10 -261 -89 44 196 32 -269 -8 89 181 321 100 -97 -180 158 105
4137 105 423 15 -151 -191 -4 459 217 -22 -68 -17 24 258 -33 -234 -148 -182 -24 54 -86 10 -170 -133 175
4160 175 238 162 -247 -171 -148 107 93 101 -235 -146 51 12 198 163 -44 -151 -225 167 156 -162 -101 -97 164 89 228
4185 228 40 31 92 -90 375 68 195 -243 -210 -82 260 83 -177 -144 -70 119 228 186 33 23 -21 -136 211
4208 211 189 63 -9 -33 -36 241 119 -15 -322 -163 228 219 18 -195 -34 -77 -79 -11 108 -12 -79 -348 193 166
4232 166 100 -31 -195 72 323 122 -8 -199 -74 39 89 53 89 44 -89 -1 218 40 -115 -153 -209 -46 131
4255 131 -50 126 -192 -101 220 76 -8 -159 11 -145 43 179 26 -4 -123 -372 -65 183 228 -77 -25 -119
4277 -119 -5 419 10 -130 -264 -104 142 -63 1 -72 -158 -84 35 238 120 79 -198 -92 269 178 163 -48
4299 -48 -8 91 -59 88 126 -175 -65 13 141 322 45 -147 -243 -271 184 9 4 -46 57 72 18 42 164 -48
4323 -48 -107 -26 184 244 -271 -165 -64 -50 75 -39 77 -64 -156 301 259 130 -115 -241 -77 -84 140 81 -201
4346 -201 -210 51 4 106 116 -146 -140 -216 270 292 286 21 -50 -198 52 70 -34 140 107 -101 57 157 -35 29 -142
4371 -142 -6 150 82 101 -96 -61 -132 201 274 -55 119 -299 191 47 6 -66 5 -136 63 8 263 108 -110
4394 -110 -255 50 82 128 115 -38 63 52 157 -41 -56 -147 105 -69 191 3 50 29 -265 -6 -67 -14 -145
4417 -145 -218 -92 317 359 57 31 34 -131 -63 173 -108 89 -407 -91 26 -38 -16 -220 -205 270 53 56 60 -251
4441 -251 -7 -61 16 -3 73 -128 16 -129 5 70 1 -40 -67 73 63 318 28 -112 -304 163 106 39 42 97 15
4466 15 31 85 139 -13 -39 113 2 110 -88 78 -133 -104 130 183 -146 -156 -11 -111 120 149 287 -161 -136
4489 -136 7 74 64 40 -73 -103 -3 23 31 -21 -24 -144 -65 76 16 114 -105 -146 10 101 123 -121 -139 -76 -18 53 138
4516 138 9 -129 -96 31 170 206 288 -192 -97 43 238 103 36 -92 -34 34 78 142 47 -149 -201 136 157 237
4540 237 -185 13 -164 69 335 72 -17 -103 64 40 263 123 74 -74 -42 52 181 273 -155 67 -52 45 118
4563 118 -123 -59 -35 -9 50 23 -108 -16 -158 134 108 248 -124 -168 66 -105 65 309 -107 -179 -17 -55 95
4586 95 10 -61 -88 9 5 12 187 15 -83 -212 99 167 182 -160 -44 -29 201 63 -146 -176 34 -6 69 98 -95 -88
4612 -88 -86 -170 99 45 173 -20 -166 -154 0 131 -117 -127 -256 -12 -26 -91 -54 -63 -74 -15 -2 11 6 -71 -148 29 244
4639 244 195 52 -108 -65 68 -56 -33 200 46 98 55 -45 221 91 -165 -161 115 95 142 28 -246 -227 -146 136
4663 136 1 284 -102 -144 124 -62 -29 -64 -171 -28 -28 160 166 3 -69 -36 23 260 146 -20 -1 -233 -21 37
4687 37 55 -23 207 3 -59 26 37 20 120 155 30 176 64 -260 -27 -51 -29 54 183 -4 178 48 172 176
4711 176 46 -193 22 -118 -6 -16 -51 -81 -51 -60 227 221 72 -139 -133 100 124 -9 -18 -326 -37 111 -71 -82 27
4736 27 -53 -169 60 163 8 -90 -51 98 50 137 -94 -48 -132 248 -108 132 75 -132 211 131 188 168 52 -59
4760 -59 -53 -97 22 40 113 -298 -3 -96 -48 -35 -70 123 372 105 91 -61 143 -113 -52 18 306 220 -84 -184 27
4785 27 99 59 71 -140 44 -51 11 102 12 -2 44 61 158 -52 -152 -109 -26 -116 -20 129 -155 -307 -197 -112 51 101
4811 101 -3 109 -11 -4 138 218 101 -72 -166 -124 14 22 41 -87 -130 13 41 -25 -81 -42 -135 14 166 89 142
4836 142 -94 -56 21 3 65 -29 -145 52 -108 46 -240 -33 -138 -153 66 -56 -107 -159 -142 -135 -54 16 73 77 -250
4861 -250 -79 130 -13 -1 -6 23 48 49 54 -80 -53 175 54 188 125 -40 68 -71 65 138 171 123 93 -158 7
4886 7 -11 -2 6 2 -99 240 122 59 222 -188 -140 -90 130 -85 -35 -148 74 40 77 131 75 69 -105 139 -41 86
4912 86 34 -50 117 -84 -44 40 94 105 -31 -145 -28 112 -60 -92 -65 245 -36 -165 -120 -24 19 -52 59 -83
4936 -83 54 107 27 118 -45 89 151 -65 -29 12 100 -56 -165 51 -2 158 -110 119 -170 23 137 32 -40
4959 -40 -44 -95 -177 103 254 109 -19 -150 -124 69 -67 49 2 -107 -99 198 -79 -89 -35 -126 -66 53 87 -72 -94
4984 -94 -171 -5 180 72 54 -37 104 -23 79 198 -200 -171 -34 -72 125 101 35 76 -144 185 153 -99 -43 15
5008 15 -45 -9 -50 -61 4 50 -192 62 32 -31 -221 -48 81 -77 -14 -119 23 -19 40 14 12 27 -132 -198 105 10
5034 10 54 47 30 -180 -30 -72 41 -70 -84 92 -79 169 113 65 10 -97 65 -31 221 -30 141 3 -21 -164
5058 -164 197 -138 -85 95 90 160 -47 139 33 235 -63 84 167 67 -130 -5 183 132 103 -21 -233 117
5080 117 65 86 -126 53 -28 -221 133 -109 96 -130 -140 63 27 15 -109 -99 90 -155 -53 -51 185 9 71
5103 71 -44 11 105 151 167 -39 -42 62 69 53 -18 -30 10 32 141 70 -94 77 20 30 9 82 -80 -2 -33 18 55 -35
5131 -35 -110 -43 11 102 60 -133 -26 14 -31 15 114 11 -120 -64 204 114 101 -98 49 -93 -3 77 88 18 58 -109
5157 -109 118 49 76 105 -86 -103 64 196 108 -154 70 30 29 20 165 22 -82 108 3 -5 -52 -217 61 -108
5181 -108 14 55 37 70 -256 -24 106 73 -157 -4 4 192 198 -104 -74 -123 -136 59 201 -11 -18 -75 -41 -7 43 155
5207 155 21 -52 -72 -72 25 113 -93 -58 -14 -6 -35 99 -127 97 -3 -110 5 15 -157 -65 -7 -217 130 170 120
5232 120 4 121 132 170 87 41 -41 -29 200 -33 -121 29 -121 -3 143 -38 41 -3 12 129 23 127 -35
5255 -35 -4 -170 -57 -49 132 -234 -51 102 -76 61 -147 -37 -12 -194 76 139 74 211 -83 -6 -11 146 34
5278 34 33 -188 208 112 55 -7 -99 63 16 -155 203 101 114 -9 -46 178 76 103 -144 157 -50 -10 15 114 -28
5303 -28 0 -49 30 48 17 -6 29 -12 51 -42 -18 -95 20 75 104 -31 -90 -27 -205 298 96 190 -89 -73 -137 -37 127
5330 127 -39 -98 -167 -3 -52 -28 -25 85 -7 48 49 136 16 -9 -39 -114 67 -17 119 41 122 -23 101 159 -93 -9
5356 -9 -35 46 -57 -71 112 17 24 89 174 151 56 -5 -36 -82 -22 -34 -90 -39 -145 -83 3 -80 89 -125 -164 -66 90 -122
5384 -122 27 -180 242 8 67 154 -156 -4 -85 126 126 57 -21 -124 -28 22 -61 50 -9 -2 5 67 17 -180 67 -157
5410 -157 -31 -62 84 -144 19 39 60 5 114 28 -23 -25 -96 -72 3 -127 -21 -21 -37 36 25 144 120 -77 -47 77
5436 77 -32 26 136 20 -41 -13 48 80 16 -1 -26 0 -59 -1 33 47 161 -5 50 -123 -79 147 101 -170 -12 -209
5462 -209 -78 62 7 18 -62 -75 -130 73 146 126 211 -108 -70 -21 120 -38 74 118 -130 157 44 -226 116 -40
5486 -40 -74 82 8 -69 -57 -144 3 -103 55 3 -85 -58 16 53 -4 15 46 56 36 -56 -119 6 84 92 63 8 61 48
5514 48 -92 -68 92 134 -103 -108 -65 -172 -39 63 30 -88 -67 -111 56 54 12 232 -25 135 126 -236 -21 82 -30
5539 -30 53 -100 -73 -9 18 -19 -26 -56 93 221 -42 -8 -185 -27 -81 190 55 -323 26 -55 206 -53 15 -129
5563 -129 7 266 167 -152 43 9 58 24 -69 -94 -163 -54 65 -164 -121 89 33 -45 -247 -112 -155 57 -7 15
5587 15 51 -27 -112 308 -75 143 92 -93 80 -4 -8 -27 -68 24 41 -16 -209 -109 138 -155 135 205 -40 -38 -145
5612 -145 -146 124 -21 190 -216 -110 -23 97 -16 63 -2 4 -17 130 -1 -154 -109 102 47 -29 -35 -61 137 204 -17
5637 -17 -56 -155 10 -122 50 -31 94 86 7 -11 -17 -273 25 44 -170 52 -66 132 92 -60 -127 -63 17 78 -100
5662 -100 31 -50 -23 -68 5 -96 42 -157 -83 135 28 29 39 -47 62 -78 -45 152 31 -63 106 85 36 -124
5686 -124 44 34 24 -7 17 16 -212 -61 -99 67 121 -20 -21 -57 150 -58 -36 59 -32 2 93 171 164 -241 101 -33
5712 -33 96 213 -183 -16 -82 -116 81 24 -128 -289 -156 -49 -37 174 54 -210 -214 99 86 121 -15 -2 -90 81
5736 81 -9 -64 -37 -13 19 46 189 173 -126 -33 -137 132 9 -72 10 25 48 97 102 -23 7 -113 -10 47 -79 60
5762 60 39 -49 -92 110 15 -90 46 43 36 10 30 45 -69 -120 -40 23 64 45 48 -9 89 -68 201 5 -51 196 66
5789 66 -40 206 -16 -214 -112 135 40 18 -48 58 -60 49 -44 -111 73 13 -47 31 14 -34 121 -149 136 -62
5813 -62 12 46 39 -258 -36 -112 95 -19 59 -175 31 132 -20 -26 -79 48 -184 67 -22 280 131 -118 42 20
5837 20 -13 36 5 -247 -144 116 -80 19 132 25 -59 -22 211 41 -36 142 29 228 238 -5 78 -208 79
5860 79 221 -79 88 -2 160 4 53 80 -156 -8 9 200 60 -111 -53 -186 57 22 -65 17 -24 4 -102 -105
5884 -105 -38 -52 101 -124 -112 179 15 50 -78 -186 -93 -14 58 11 103 -149 -79 -30 -69 -101 -112 -66 43 -29 74
5909 74 123 38 58 119 18 10 -109 -13 95 151 254 53 -3 -99 26 96 51 21 -24 27 125 15 42 44 17 -101 -60
5936 -60 -71 -120 -28 -51 75 -28 -56 69 138 52 -227 -57 30 156 -76 -93 133 -122 -112 31 28 145 52 -102 -2
5961 -2 -261 4 227 36 63 35 -123 160 -14 -72 148 -4 -104 117 -14 -56 -41 17 -50 125 131 -47 -204 38
5985 38 128 -28 -46 -49 55 42 33 34 26 105 -65 64 -119 -38 44 152 96 38 47 -85 -64 -68 -54 87 177 -80 -165 57
6013 57 111 59 43 -73 -14 69 -38 -85 -55 94 251 3 -17 72 85 -30 80 -83 -119 62 98 -99 117 45 89
6038 89 84 -203 -110 20 91 -54 140 4 -10 -46 -19 7 -68 12 98 -158 -66 5 -171 51 -54 -105 -93 -46 -60 21
6064 21 42 -50 -12 7 19 25 81 -13 -113 170 141 -6 78 72 -36 24 32 -162 -26 14 -61 -67 -4 -47 -10 36 -133 308
6092 308 -19 -126 -10 95 37 33 -220 -71 193 216 107 156 -193 70 -77 -33 50 75 -41 -50 8 25 -25 30 -34
6117 -34 -173 -83 -206 46 12 -64 36 -11 -75 -2 136 -13 -85 30 -109 76 217 -130 -59 169 -55 53 -27
6140 -27 -26 36 -134 137 147 98 -175 -99 101 55 51 121 -7 -31 28 -180 149 120 -4 -84 -154 44 268 33 -57 -30
6166 -30 37 -9 118 -74 -77 -12 22 58 88 15 -216 32 -36 95 -146 9 -76 70 -133 55 101 51 -130 -218 66
6191 66 127 -102 70 32 -135 34 112 15 -33 -48 -271 -103 -86 180 160 -128 -145 -15 28 76 -20 32 -52 -128 129
6216 129 21 -35 -91 151 -151 47 93 -75 -72 278 185 -67 -86 -11 54 74 103 -143 -208 158 -56 29 86 -27 -46
6241 -46 -247 65 126 -90 -177 -196 -117 13 43 81 16 -10 131 123 88 -5 92 11 -7 74 -116 -35 -87 -51 -90 5 134
6268 134 56 222 124 57 142 76 92 3 23 -64 -103 -1 64 56 -127 221 -133 -17 -24 6 -10 19 11 10 -140 -64 -123 55
6296 55 58 -94 74 -83 53 94 16 -26 17 -76 131 0 102 -103 114 -66 -156 -3 58 83 56 -13 -113 186
6320 186 266 54 -169 8 94 -2 25 149 68 260 -96 71 -4 36 -64 -93 168 -85 21 49 -74 78 -69
6343 -69 26 113 -23 59 61 141 42 70 11 1 -281 -79 54 -116 -54 58 -63 -31 -96 -109 7 -95 27 49 -4 37
6369 37 53 -40 -75 108 -7 -50 59 71 133 -3 -59 43 49 -148 127 -20 -37 -192 -44 -22 -47 -34 -50 21 -51 -16
6395 -16 -8 2 60 -170 95 131 -288 37 -87 62 -151 23 28 286 0 114 64 -37 -183 82 -68 -68 -21 46
6419 46 -106 -33 -4 -40 92 -164 -104 116 -9 94 1 -59 12 -7 126 -14 -2 -246 -111 -44 76 12 -54 28 -77
6444 -77 95 56 -126 -15 -9 292 19 28 -58 -225 -139 127 71 93 -31 54 -109 -106 -31 71 -149 -71 48 -3 44 -52
6470 -52 115 -98 -13 91 -141 184 -39 14 -82 -239 90 -77 3 67 100 26 39 -22 -56 -120 68 118 219 175 52
6495 52 -103 4 -25 51 -53 58 -157 -188 -57 180 -102 24 15 -114 -126 103 184 -46 124 38 4 -54 204 -79
6519 -79 -38 127 39 -62 -69 -8 -212 -73 -7 -32 154 -4 -39 -67 -24 -10 -38 162 -8 216 49 104 -85 -3 56
6544 56 85 -61 93 19 -6 35 -96 0 -16 29 -44 -70 -104 142 119 -54 54 -80 -239 66 -86 125 -74 -62
6568 -62 236 1 -43 -112 -139 -160 -21 -84 -54 -131 19 109 -227 87 36 17 -14 70 129 -35 -74 63 -55 103 95 9
6594 9 6 -82 -107 -12 12 109 131 124 58 90 -76 -101 29 21 67 41 24 -38 32 -28 -71 77 35 -208 164 58 45 -31 -195
6623 -195 83 -174 -51 26 53 -32 -108 87 -174 -154 -107 16 -13 -245 -19 -192 -148 -11 23 43 -165 82 181 -136
6647 -136 235 -193 85 9 62 -218 -87 -21 99 -88 -31 97 42 73 -62 10 -230 9 81 -37 -92 82 66
6670 66 -119 32 79 -79 -98 -137 66 -179 70 -198 25 -5 113 -45 11 23 4 168 -31 -56 -89 -43 -50 -18 32
6695 32 36 -293 -13 -29 -76 30 -35 11 79 96 -103 -270 -30 55 -73 160 -136 -123 -78 -173 187 39 22 161 23
6720 23 83 -34 139 -119 43 -82 -17 227 -84 -86 -93 -11 212 -41 147 -69 -100 117 -113 -79 -65 33 -74 -26
6744 -26 -43 4 -175 34 -10 -1 8 -41 110 -140 75 -4 -190 -123 -48 -1 41 -103 6 181 -26 23 -30 -78 34 131
6770 131 50 53 -18 -186 -70 57 -80 -179 -2 -5 -52 -46 -39 141 -18 10 -47 137 68 -233 -103 -124 -128 35 25 157
6796 157 32 -41 -102 -228 98 -152 101 -39 -46 1 4 -14 -27 -43 17 200 -139 -48 -20 -3 -59 59 23 45 -50 -4
6822 -4 38 130 -14 40 115 -46 141 43 22 64 16 -53 71 -188 -12 155 -153 -20 143 8 28 -296 -172 -18
6846 -18 43 -118 95 -108 -50 51 -33 54 35 141 -170 -19 -76 5 173 126 -134 -35 -170 -235 53 -142 -110 123
6870 123 16 34 -153 115 -238 -146 102 52 -18 -110 81 93 -27 102 -120 18 14 -134 93 -48 -35 -110 -87 107
6894 107 37 -46 74 70 39 -14 82 49 36 70 106 117 75 82 -103 39 11 79 117 87 138 31 80 40 41 44 60 42 3 3
6924 3 65 65 21 218 -87 74 -110 -23 23 30 -48 -28 43 75 -54 -93 -103 -75 -182 -74 -26 -88 -17 -55 -49 109 -66 -209
6952 -209 -27 -319 135 68 -70 -105 8 28 -59 -52 102 -34 79 -45 276 108 -61 92 74 5 -35 26 25 -4
6976 -4 119 -23 87 -117 -122 174 72 3 80 -107 49 76 -13 44 14 -78 -55 -230 83 -43 6 -98 232 70
7000 70 39 -132 -48 -180 -79 91 9 76 31 -79 32 -25 39 91 152 -92 14 -57 -35 27 48 75 -14 149 -198
7025 -198 -77 -53 -121 120 25 83 86 -40 85 53 62 43 65 99 185 -84 -246 -121 -69 -42 75 -73 -3 -28 -175 -59
7051 -59 -84 -258 -48 38 -7 -29 -27 -57 118 49 -28 -41 -28 13 9 103 10 -26 115 -132 -82 71 58 118 22 136 12
7078 12 -116 -5 -123 31 -32 32 40 121 -77 -27 -93 -15 70 -62 -13 -11 11 -237 -49 -19 -224 190 -172 -23 127
7103 127 157 164 -131 -270 -32 50 -68 -74 125 -158 -164 -34 -56 128 63 7 -104 -152 25 168 5 64 44 -105 -30
7128 -30 -29 134 -173 -69 -206 127 -68 126 -32 91 -56 -64 -171 -53 -49 -29 -2 -76 35 85 -50 52 -69 63
7152 63 50 49 156 33 -89 -111 91 -17 47 50 -17 -42 70 -55 -208 93 -58 -245 -132 -64 131 -143 -38 -180
7176 -180 -15 -140 -106 -47 -15 173 -10 45 5 38 135 53 -32 114 45 -39 -105 90 -15 -58 26 24 -35 202 -52 45
7202 45 -8 118 13 -73 60 34 -150 2 47 -23 54 -117 76 -10 30 -105 134 -101 183 -213 96 -41 -48 79
7226 79 -72 43 117 119 -94 97 -67 -30 52 -45 -24 30 13 67 -13 -16 32 40 16 7 152 97 112 -56 -8 156 82 56
7254 56 -15 -149 -94 -102 -125 -110 19 106 54 14 96 -30 -105 28 -9 -92 45 -9 13 122 88 -94 -86 127 -28 135
7280 135 78 -9 -9 -74 82 -43 -161 -2 -9 128 156 -34 47 74 -122 156 -15 -139 -209 -17 171 70 64 134 67
7305 67 0 157 -103 -119 70 19 -42 -214 -22 -92 -112 53 91 -133 42 -59 -28 -112 -135 53 21 95 45 -41 -38 38
7331 38 -88 -11 -30 -161 -25 23 95 -124 258 -133 -40 25 -24 88 108 -66 92 -34 104 -15 33 -53 81 -75
7355 -75 45 5 37 104 -78 272 -201 68 64 -25 105 46 71 -3 103 -118 66 18 -6 19 52 128 31 14 203 -108
7381 -108 42 47 -158 -3 80 48 -2 -17 161 -35 90 -87 -70 -48 200 -27 -83 111 -80 140 70 -56 -33 162
7405 162 42 -84 36 -215 -41 -9 4 150 31 -37 -171 100 -38 143 -120 -95 -61 9 19 -5 115 51 207
7428 207 -225 104 5 103 20 -31 23 -84 -92 -155 5 114 -210 101 -77 -18 83 -97 12 34 -43 66 -66 122
7452 122 127 15 -72 -26 42 48 -15 63 24 140 38 52 13 46 -36 -82 86 -81 -42 -336 159 -76 93 24 85 -30
7478 -30 165 132 14 17 -119 2 -47 -125 32 -31 33 97 32 -30 -126 -179 17 -215 -87 -55 -142 -219 10 78 -96 55
7504 55 -67 -15 -139 8 -29 63 142 26 -146 76 -101 -37 -68 -56 -4 -21 -21 -36 -151 -50 -29 38 -177 26 46
7529 46 38 22 -108 -179 104 -45 -24 -61 -28 34 97 12 1 -77 -54 -107 -91 60 -51 166 -15 -65 59 -86 57 107
7555 107 -15 12 86 34 -8 -16 -83 93 16 -55 -56 -68 -53 -7 -106 -142 -61 72 166 1 -55 -46 -17 89 47 125 53 157
7583 157 -96 25 113 -176 217 -66 -22 -50 38 84 6 96 59 -72 -117 150 -37 106 50 -48 -90 20 28 -40 131
7608 131 -81 -77 102 -106 -91 17 2 165 -244 32 113 -41 111 67 -148 110 -87 -67 66 -138 -232 -290 -8
7631 -8 -25 -105 66 -117 -156 -159 103 91 -73 -3 48 87 115 -120 -62 -181 -24 -11 -126 86 111 5 -185 54 -129
7656 -129 99 40 -118 -58 -66 88 -74 155 -6 -86 -47 -71 -52 -36 -58 35 -141 21 73 -66 34 38 -91 -200 95
7681 95 -134 -64 -25 131 96 -78 -15 -249 15 -81 -57 -18 -117 10 -52 92 66 -34 24 13 -39 -179 52 169 -58
7706 -58 117 -39 15 34 -25 -36 43 -132 174 40 136 -42 177 3 99 -56 48 -53 45 -82 -40 -38 3 -57 12
7731 12 -76 16 117 -67 68 11 -151 -2 -24 81 -85 148 -17 100 90 -107 -107 66 -70 -135 -2 -84 -101 92
7755 92 98 26 -54 16 86 -48 -80 -76 139 -57 -15 -64 -7 134 42 -65 35 -39 -65 68 -104 0 129 44 54 57 53
7782 53 -99 -71 -185 60 98 -31 88 -9 141 136 -32 164 -5 -68 108 92 -57 -12 251 63 -7 -148 15
7805 15 109 -138 61 -83 109 213 166 39 -30 -19 9 141 173 -65 81 -45 78 -141 -125 -133 156 52 239
7828 239 -13 -159 138 -91 24 81 61 -111 -23 28 -37 52 -58 83 -40 -38 131 31 -88 57 -241 -59 38
7851 38 -45 -55 -98 125 65 -149 206 37 -103 4 101 -24 55 -108 183 228 72 11 -186 73 -31 3 -80 -198
7875 -198 145 -47 -67 3 103 80 60 122 -68 68 -10 3 -77 29 -148 87 -75 17 129 3 -60 29 -92 -33
7899 -33 50 -42 39 50 52 -74 99 14 -122 -249 24 92 -24 65 -61 -52 -128 149 -106 39 -10 83 31 63 -22 24
7925 24 150 8 14 43 38 -114 -81 -161 -41 55 -34 96 -18 -8 -71 -6 107 3 121 88 -12 -115 27 113 -116
7950 -116 122 47 -107 2 -66 49 -13 38 43 -20 -47 54 -5 82 73 23 -65 35 58 24 -92 -60 3 81 63 96 -76
7977 -76 61 -111 165 9 59 189 67 -169 -35 -51 -88 99 -105 -46 -119 -56 52 83 16 -34 -59 -22 132 1
8001 1 130 9 23 67 -14 99 46 47 222 54 -99 120 -101 64 -73 -109 -59 81 32 -143 -47 -173 -105 -17 151
8026 151 183 3 21 94 -14 -40 -17 140 69 88 -6 -77 -141 73 -65 -24 76 -23 -27 40 18 2 76 -82 -44 7 13
8053 13 -38 -164 -264 -56 -215 -39 244 -66 -184 175 -21 107 25 98 43 -32 26 -15 -17 22 183 -95 -80 -3
8077 -3 -39 70 -49 14 75 -84 61 -47 -10 131 -30 -3 -243 -12 -101 -152 78 -35 9 -33 42 -51 -82 280 -27
8102 -27 -76 28 49 -144 35 -77 25 134 39 166 7 -73 -10 -169 -28 56 46 -43 -12 -43 123 14 37 141
8126 141 -137 22 -196 23 65 -34 220 19 -96 61 -194 41 44 115 -24 -110 -290 -50 -53 64 19 -27 -40 3
8150 3 99 7 -82 -66 2 -41 2 47 -35 -7 -5 -244 -13 -13 -50 -131 -132 18 -40 -35 146 17 63 43 87 118 -30 83 5
8179 5 113 54 100 56 3 -32 -108 13 -17 -35 58 -18
8191a8
$$ Imaginary data points
##PAGE= N=2
##DATA TABLE= (X++(I..I)), XYDATA
0 0 0 0 0 0 0 0 0 0 0 0 0 5 -8 8 -8 8 -8 16 -16 16 -24 24 -32 32 -40 46 -50 58 -66 74 -84 94 -105 117 -131
35 -131 144 -160 181 -199 222 -245 271 -301 334 -367 409 -455 508 -567 638 -722 823 -947 1107
54 1107 -1317 1610 -2046 2770 -4188 8022 -40557 -123763 -52714 36405 59084 -5816 -61474
67 -61474 -60091 -14211 20033 30017 15568 -13926 -46149 -40445 12952 65957 48590 -28848 -77543
80 -77543 -31380 56646 81285 15929 -55857 -55827 5473 54989 49985 5247 -33826 -38444 -5370
93 -5370 40479 57214 20936 -36551 -51872 -2184 60455 65032 5946 -49033 -39679 18782 60311
106 60311 47103 -584 -36297 -31240 8735 49252 50581 3619 -49288 -49749 8728 61406 44463
119 44463 -25432 -70336 -42221 22518 49364 11608 -43464 -59512 -30711 7315 22805 6435
131 6435 -29397 -57448 -49216 -4771 35238 22326 -37727 -77994 -48427 21262 51840 8493
143 8493 -58070 -70863 -18247 36957 36451 -10313 -48611 -44731 -10391 21491 26174 2179 -33442
156 -33442 -49863 -25498 21740 42204 6825 -49677 -63863 -16225 41085 41954 -14353 -62240
168 -62240 -49518 4296 39497 24190 -19187 -46702 -35050 2401 33071 30164 -6604 -43058
180 -43058 -38344 7841 47891 37370 -13069 -47084 -26939 23529 49457 27026 -15606 -36007
192 -36007 -19043 18571 43307 31345 -10764 -43728 -29442 23287 56770 28436 -31962 -53931
204 -53931 -12566 41439 46772 3553 -34485 -29843 2299 26466 29122 14739 -9105 -27453 -16714
217 -16714 24542 56092 34335 -23924 -48365 -2756 60961 64833 6481 -41185 -23939 30225
229 30225 56417 33584 -2271 -15402 -5473 13262 31632 38612 19649 -16561 -31233 1396
241 1396 49293 53180 2423 -44271 -30835 24695 56044 30583 -17803 -36052 -11558 24535
253 24535 38382 22747 -7722 -28209 -18201 17341 43510 29827 -13068 -38838 -16937 27862
265 27862 44522 16121 -23170 -33972 -10656 20748 31279 12151 -21155 -39342 -23299 15147
277 15147 35974 10665 -38008 -54923 -19235 27888 31102 -12141 -50806 -42737 -3989 20322
289 20322 10666 -15731 -33757 -33099 -14654 9423 19758 1552 -33152 -46783 -16145 29258 35790
302 35790 -7089 -50186 -41757 8732 41794 21455 -24053 -42343 -19021 15031 26434 9804
314 9804 -14525 -26578 -19480 2382 23363 22663 -5554 -34663 -30342 8743 40710 27495 -17978
327 -17978 -43175 -17466 28998 43565 14190 -22864 -28283 -293 30236 34818 13844 -11138
339 -11138 -18636 -2253 25681 39430 21838 -11684 -26047 -3070 33982 43225 13513 -22054
351 -22054 -25405 4055 33363 33434 5458 -22729 -24556 826 29007 31755 3413 -29110 -29775 3852
365 3852 35359 29080 -7837 -33321 -20120 13614 30434 17222 -7081 -20128 -14786 4627 24786
378 24786 26993 3662 -26267 -27751 7753 42221 32412 -13760 -41501 -17409 28235 40411 8533
391 8533 -25848 -25999 -368 18333 17621 6201 -8389 -19975 -17562 4568 28214 22195 -14201
404 -14201 -40292 -20183 24867 40572 7363 -33331 -34175 2191 30768 23025 -4937 -22415 -17728
417 -17728 -722 15981 20941 6218 -19078 -29389 -9167 22944 28802 -1434 -34088 -32021 645
430 645 25523 16605 -13730 -33003 -25030 -1559 15752 12176 -10116 -32462 -31471 -3774 22643
443 22643 16666 -16960 -39895 -25491 9481 25428 7246 -20741 -28899 -12954 9405 18915 10022
456 10022 -8880 -22961 -17332 7691 29135 21091 -11555 -32392 -14409 23216 37027 11331
468 11331 -22649 -26154 1479 27095 25608 3482 -14856 -14711 834 18128 23842 12310 -9453
481 -9453 -20116 -5373 23464 34677 12664 -19347 -24448 4685 34710 31555 675 -22628 -14294
494 -14294 13168 29868 21055 -1526 -16012 -10952 7047 22454 21051 1450 -19707 -19967 3514
507 3514 26186 21552 -7776 -29826 -20104 9792 25544 11098 -16296 -28248 -14668 8628 18563
520 18563 7692 -13531 -25626 -16563 6938 22593 11695 -15488 -29483 -13044 16648 26307
532 26307 6119 -19605 -22574 -2858 17453 20338 5457 -12334 -17973 -6036 14716 24961 11770
545 11770 -15157 -25609 -4779 25472 29066 1815 -24531 -19650 8115 25712 16825 -4155 -15297
558 -15297 -10205 3485 16093 18604 6571 -13144 -19675 -750 26129 28866 287 -26397 -18517
571 -18517 14151 32210 16341 -12101 -20412 -4835 13834 18677 9783 -3899 -14653 -12771 3654
584 3654 20864 17958 -6942 -27048 -17378 12710 27408 9119 -19515 -25913 -5776 16031 17161
597 17161 1756 -13738 -16877 -7489 8950 19192 10147 -11788 -23348 -8546 18567 27110 5939
610 5939 -19995 -20306 3396 23278 19023 -570 -14492 -11570 2724 15757 17857 5764 -12883
623 -12883 -18585 -1977 20818 23434 261 -23175 -19445 6676 24631 14695 -9535 -21499 -11301
636 -11301 7352 16006 8659 -6276 -16911 -14325 842 16103 13753 -6825 -24216 -18459 6004
649 6004 21126 9854 -15740 -26768 -12477 9767 16044 1693 -17520 -22893 -10897 5418 11123
662 11123 1524 -16007 -24844 -15071 4788 13952 1274 -20741 -28090 -12122 10108 14189 -4044
675 -4044 -23530 -23831 -5993 11059 10537 -4782 -19378 -19290 -5268 10261 13051 -858 -18516 -20701
689 -20701 -3226 16348 16469 -3866 -21825 -17284 4354 18794 11545 -7689 -18171 -11100 4533
702 4533 14263 10375 -3176 -15936 -14618 2098 18525 15295 -6031 -22525 -13602 10800 22688
715 22688 9086 -13368 -18790 -3991 12892 15631 5145 -7081 -11715 -6051 7141 17561 12930
728 12930 -5902 -19159 -8863 15079 24872 8059 -15499 -18261 1494 19460 16913 -36 -11638
741 -11638 -9494 1282 11876 14736 6323 -7901 -15121 -4034 16575 22323 4370 -17253 -16159
754 -16159 5926 22963 16085 -4055 -14207 -6371 7810 15800 12251 1332 -9260 -10012 2623
767 2623 18206 18734 473 -17250 -12545 9942 23555 12697 -9120 -16673 -4322 11614 15303
780 15303 6063 -5707 -11646 -7329 4970 14833 11132 -5900 -18671 -11047 10118 20422 7023
793 7023 -14752 -19381 -3202 14123 14236 9 -12335 -12669 -2463 8586 12021 4423 -9559 -15948
807 -15948 -6167 11571 17027 3236 -15716 -17831 -587 16292 14178 -3411 -16164 -12136 2783
820 2783 12869 9662 -2542 -12721 -11993 215 12639 12724 -1415 -15050 -13611 2724 16470 12479
834 12479 -5314 -17128 -10055 7210 16165 8549 -6771 -14015 -6855 6816 14097 8374 -5225
847 -5225 -13824 -8234 6782 16149 9007 -7526 -16499 -7391 10332 17040 5238 -11433 -14867 -2684
861 -2684 11365 12976 1997 -9684 -11945 -3458 8551 13129 4973 -9544 -14972 -4338 12318
874 12318 16433 2212 -14435 -14761 1758 15574 12057 -2799 -12730 -8820 2691 11093 9698 846
888 846 -9526 -11671 -781 13204 14518 -265 -15784 -13524 4752 17650 10367 -7609 -15585
901 -15585 -6303 7698 11803 4986 -4999 -10208 -7679 2168 11634 10348 -3385 -15813 -11054 7194
915 7194 17672 7638 -11192 -16504 -3599 11758 12795 1120 -9165 -9796 -2765 6222 10384 5588
929 5588 -5869 -13493 -7005 9355 16346 4643 -13164 -15669 -200 14434 12404 -2302 -12314
942 -12314 -8657 1978 9314 8759 1135 -7973 -10567 -2566 10800 14268 1749 -13512 -13489 3098
956 3098 16467 11132 -5208 -14091 -6696 6414 11816 6311 -3347 -9250 -7131 2071 10905 9915 -2330
971 -2330 -13589 -10471 4889 15293 8160 -8234 -15385 -5441 8568 12087 3096 -8398 -10932 -4201
985 -4201 5741 10089 4762 -6448 -12779 -6493 6786 13087 4632 -9982 -14545 -3555 10844 12168
999 12168 289 -11390 -11144 -211 9594 9312 -34 -9235 -9853 -1581 8939 10522 1058 -10230
1013 -10230 -11512 -816 11466 11323 -1450 -12885 -10316 2980 11999 8057 -4284 -11821 -7604
1026 -7604 3136 9887 6460 -3380 -10950 -8717 1575 10348 7654 -4550 -14008 -9767 4119 12224
1040 12224 5049 -9026 -14246 -6201 5850 8924 1401 -8376 -11448 -6010 2895 7776 3446 -7257
1054 -7257 -13828 -8004 5252 11274 2548 -11942 -15135 -3498 9186 9037 -2208 -11177 -9540 -945
1068 -945 6015 6880 897 -7363 -10433 -3781 7743 11592 1930 -11247 -12102 1331 13642 10446 -3244
1083 -3244 -11217 -5576 5509 10360 6675 -668 -5712 -4817 1998 10389 11334 1626 -9230 -7933 5561
1098 5561 15983 10405 -4129 -10679 -2516 10193 12691 4716 -3581 -5794 -1347 5503 10092 7883
1112 7883 -997 -8674 -5618 7186 14634 7378 -6849 -11326 -1259 11235 11884 1324 -7514 -6763
1126 -6763 900 7527 8395 3212 -4429 -8047 -2883 7754 12253 3827 -8511 -10688 760 12142
1140 12142 10646 -1360 -9476 -6278 3732 9736 6784 -451 -6224 -5509 1235 9006 9272 961 -8281
1155 -8281 -7812 3309 12711 9327 -2611 -10098 -4682 6488 11377 6150 -3504 -7520 -3009 5134
1169 5134 9597 6074 -2470 -7930 -4640 4942 11333 6402 -4991 -10159 -3678 7349 10798 2757
1183 2757 -7208 -9363 -2133 6647 7999 1124 -7043 -8825 -2939 5112 7500 1085 -7785 -10487 -3519
1198 -3519 6007 8202 -467 -10478 -10556 -1265 7467 6244 -3043 -10283 -8367 244 6093 4471 -2460
1213 -2460 -8660 -8150 -1282 6357 6390 -2051 -10564 -9489 1097 9268 5542 -5545 -11314 -5822 4086
1228 4086 7535 2513 -5079 -8034 -4772 1616 6159 4518 -3066 -9359 -7078 3246 10012 4900 -6948
1243 -6948 -11292 -3410 7256 8430 477 -7209 -7149 -1139 4712 5633 1874 -4306 -7890 -4212 4390
1258 4390 9020 2909 -8152 -10950 -1799 8624 8028 -2408 -9693 -6803 1239 6090 4130 -1500
1272 -1500 -6085 -6663 -1930 4985 7085 500 -8800 -9484 281 9385 6973 -4094 -10561 -5239 4281
1287 4281 7675 2969 -3665 -6123 -3805 1440 5851 5249 -1022 -7911 -6546 2706 10046 5858 -5114
1302 -5114 -10051 -3500 6497 8773 1529 -5898 -6439 -927 4364 5962 2938 -3065 -6725 -3711 4418
1317 4418 9232 4081 -5830 -8912 -1334 8000 8677 480 -7084 -6005 1392 6908 6178 250 -5078
1332 -5078 -5286 -316 6199 7259 1266 -6219 -6726 493 8137 7416 -874 -7791 -5478 2577 7896 5290
1348 5290 -2159 -6654 -4057 2747 7020 5216 -1414 -6322 -4346 2958 8029 5870 -2173 -7420 -3772
1363 -3772 4714 8728 4546 -3529 -6962 -2126 5397 7773 3007 -3706 -5872 -1945 4467 7145 3047
1378 3047 -3644 -6852 -2754 5032 8201 2380 -5728 -7742 -1044 6618 6916 -143 -6486 -5847 458
1393 458 5544 5026 131 -4836 -5564 -1109 4825 6510 960 -6640 -7514 49 7657 6283 -2324 -8258
1409 -8258 -5079 2724 6683 3183 -2777 -5572 -3732 1007 4652 4341 -916 -6905 -6381 1211 7805
1424 7805 5006 -4007 -8912 -3806 4679 7019 1584 -4908 -5885 -1426 3154 4594 2307 -2286 -5843
1439 -5843 -4095 2831 7587 3769 -4772 -8317 -2099 6412 7294 57 -6395 -5347 431 4796 4261
1454 4261 259 -3824 -4879 -2011 3642 6459 1777 -5778 -7564 -603 7174 6515 -1769 -7662 -4769
1469 -4769 2643 5903 3063 -1841 -4383 -3207 705 4549 4960 358 -5416 -5536 1240 7479 5731
1484 5731 -2386 -7176 -3404 4426 7418 2785 -3310 -5108 -1402 3193 5408 3350 -1635 -4997 -3300
1499 -3300 3108 7079 4010 -3489 -6777 -2137 5206 6984 1574 -4648 -5289 -27 4913 5102 1265
1514 1265 -3510 -4592 -940 4300 5901 1630 -4320 -5717 -556 5378 6122 146 -5655 -5071 692
1529 692 5742 4574 -778 -5361 -4074 974 4840 4005 -1049 -5285 -4622 616 5084 4476 -1394 -6045
1545 -6045 -4632 1643 6007 3991 -2734 -6274 -3344 2836 5691 2305 -2998 -5004 -2520 2392 4728
1560 4728 2502 -2619 -5408 -3402 2593 6014 2695 -4093 -7014 -2280 4282 5300 409 -5386 -5533
1575 -5533 -798 3405 3320 -143 -3915 -5183 -2268 2380 4199 855 -5147 -6867 -1910 4706 5055 -1462
1591 -1462 -6945 -5410 914 4505 2252 -2200 -4747 -3878 -549 2809 3429 -368 -5348 -5840 -208 5444
1607 5444 4609 -2427 -7119 -4095 2858 5401 1708 -3439 -4781 -1846 1887 3555 2337 -832 -4305
1622 -4305 -3587 1590 6133 4091 -2769 -6342 -2180 4814 6473 1261 -4033 -3996 180 3992 4179 1414
1638 1414 -1864 -3277 -1490 2876 5559 2666 -3434 -5798 -970 5420 5811 -25 -5234 -4173 1358
1653 1358 4597 3129 -716 -3437 -3210 83 3378 3937 753 -4151 -4921 -195 5321 4610 -1104 -5495
1669 -5495 -3552 2344 5277 2689 -1999 -4067 -2047 1932 4201 3195 -601 -3818 -2618 2061 5459
1684 5459 4161 -1673 -4767 -2043 3651 5879 2762 -2586 -3853 -405 3959 5197 2334 -1643 -3122
1699 -3122 -363 3800 5419 2700 -1743 -3553 -435 4515 5925 1884 -3056 -3464 494 5124 5008
1714 5008 1047 -3109 -3005 814 4391 4187 627 -3144 -3235 332 4029 4140 263 -3961 -3972 519 4497
1731 4497 3740 -1241 -5200 -3539 1724 4503 2257 -2316 -4335 -2725 966 3204 1973 -1491 -4095
1746 -4095 -3615 622 4302 2771 -2637 -5691 -2754 2686 4577 1017 -3682 -4308 -863 2603 3035 1013
1762 1013 -1947 -3423 -1572 1694 4132 2125 -2901 -5189 -1732 3913 4828 286 -4368 -3922 822
1777 822 3895 2839 -414 -3020 -2556 -637 2348 3551 1025 -3111 -4583 -917 4166 4136 -1156 -5478
1793 -5478 -3825 1549 4010 1557 -2433 -3943 -2488 441 2087 1459 -1077 -4141 -4311 -415 3484
1808 3484 2732 -2752 -6143 -3821 1853 3788 566 -3965 -4778 -1776 1349 2105 206 -2302 -3950 -3078
1824 -3078 594 3429 1869 -2946 -5440 -2315 2938 4220 213 -4104 -4140 -311 3138 2621 -185 -2724
1840 -2724 -3002 -611 2443 3505 840 -2780 -3950 -466 4045 4127 -183 -3805 -3078 1318 4081 2902
1856 2902 -642 -3034 -1888 878 3423 2715 57 -2808 -2416 972 4122 3463 -814 -3723 -2243 2105
1872 2105 4346 2373 -1414 -3603 -1602 1965 3602 1761 -1769 -3172 -1611 1877 3602 1613 -1922
1887 -1922 -3607 -1427 2202 3779 1547 -2411 -3740 -923 2816 3673 732 -2799 -3048 -231 3035
1902 3035 3146 284 -2215 -2619 -185 2584 3470 958 -2346 -3347 -65 3759 3788 -23 -3443 -2751
1918 -2751 1406 4020 2545 -687 -2834 -1696 1062 3004 2563 6 -2488 -2493 494 3785 3331 -909
1934 -909 -3897 -2245 2100 4255 1970 -2204 -3191 -758 1948 2840 1334 -1241 -2571 -1750 913 3266
1950 3266 2157 -1708 -4124 -2032 2652 4200 765 -3195 -3407 -59 2674 2409 -242 -2014 -2579 -1060
1966 -1060 1522 2758 1206 -2280 -3823 -1106 2754 3736 -192 -4122 -3143 699 3451 1858 -1345
1981 -1345 -2700 -1811 383 1933 2066 163 -2504 -3066 -314 3205 3186 -947 -4048 -2718 1371 3542
1997 3542 1509 -2165 -3252 -1180 1317 2308 1250 -915 -2612 -1885 842 3104 2272 -1415 -3537 -1694
2013 -1694 2271 3846 1168 -2302 -2844 -558 2431 2876 782 -2026 -2286 -628 1929 3199 1417 -1855
2029 -1855 -3207 -554 2868 3457 627 -2503 -2594 368 2984 2650 -184 -2369 -1958 341 2511 2470 147
2046 147 -2320 -2378 223 2877 2830 -213 -2747 -2316 737 3115 2147 -910 -3018 -1752 1140 2737 1593
2063 1593 -1353 -2630 -1432 1033 2813 1596 -970 -2918 -1790 1093 2987 1947 -1310 -3326 -1399
2078 -1399 2000 3233 1213 -2327 -2745 -332 2235 2686 545 -1674 -2060 -307 1554 2643 1085 -1548
2094 -1548 -2796 -805 2526 3293 776 -2515 -2613 322 3018 2485 -353 -2194 -1539 439 2018 2026 287
2111 287 -1955 -2257 -225 2625 2773 -199 -3111 -2518 935 2900 1580 -1642 -2883 -1245 891 1608
2127 1608 869 -990 -2422 -2273 -94 2243 1973 -1167 -3720 -2479 1286 2940 690 -2645 -3413 -913
2143 -913 1541 1483 -176 -1667 -2254 -1354 323 1807 1039 -1540 -3542 -1780 1720 3067 284 -3132
2159 -3132 -3111 -22 2354 1927 -546 -2163 -1655 -156 1345 1552 329 -1489 -2557 -675 2269 2691
2175 2691 60 -3005 -2226 733 2879 1546 -1119 -2463 -1237 815 1849 1568 -279 -2225 -2083 387
2191 387 2458 1892 -992 -2961 -1780 1104 2672 1066 -1601 -2779 -692 1166 1806 648 -1366 -2157
2207 -2157 -1407 990 2047 940 -1633 -2800 -1345 1663 2437 533 -2186 -2573 -533 1953 2090 -23
2223 -23 -1996 -1858 40 1884 1963 405 -1580 -1857 -54 2045 2461 527 -1875 -1922 247 2652 2834
2240 2834 181 -1882 -1574 1336 3063 1952 -511 -1702 -790 1434 2563 1672 116 -1345 -885 895
2256 895 2620 2341 -111 -2026 -1355 1340 3109 1960 -1103 -2184 -326 1791 2579 1031 -1010 -1751
2272 -1751 -541 1293 2126 1148 -893 -2106 -984 1617 2622 885 -1792 -2272 -265 2048 1841 172
2288 172 -1571 -1447 -210 1421 1847 645 -1414 -2078 -654 1864 2684 174 -2397 -2273 782 2795
2304 2795 1632 -862 -1947 -928 869 1547 1182 143 -1174 -1698 -85 2066 2482 -161 -2662 -1868
2320 -1868 1088 3009 1398 -1478 -2523 -587 1759 1947 298 -1021 -1322 -726 209 1723 1252 -530
2336 -530 -2266 -1519 974 2605 870 -2035 -2760 -608 1419 1481 -235 -2056 -2033 -700 932 1417 116
2353 116 -1532 -2356 -932 1277 1553 -180 -2506 -2333 -93 1628 964 -795 -2029 -1631 -281 1037
2369 1037 1259 -254 -1919 -2141 -353 1710 1582 -766 -2528 -1831 639 2108 986 -1277 -2130 -963
2385 -963 825 1499 643 -745 -1602 -1130 397 1693 1244 -683 -2302 -1346 979 2298 1009 -1206 -2237
2402 -2237 -757 1575 2006 323 -1750 -1898 -291 1540 1594 100 -1396 -1682 -302 1148 1549 456
2418 456 -1119 -1679 -721 1253 1971 282 -1816 -2169 -2 1895 1554 -389 -1889 -1675 454 1825 1043
2435 1043 -557 -1340 -1268 248 1513 1701 -87 -1584 -1489 525 2142 1564 -717 -1868 -935 935 1923
2452 1923 1009 -625 -1510 -853 615 1784 1326 -597 -1666 -980 1264 2443 756 -1364 -1831 -156
2468 -156 1735 1642 360 -801 -862 -88 797 1393 1071 -443 -1749 -971 1409 2366 673 -2015 -2015 450
2486 450 2143 1781 -498 -1691 -848 839 1091 857 281 -983 -1188 -371 1222 1693 350 -1717 -2036
2503 -2036 341 2204 1429 -907 -1852 -1097 1016 1531 536 -831 -1388 -850 403 1468 1161 -534 -1844
2520 -1844 -1272 886 1972 797 -1294 -1802 -697 954 1442 346 -677 -1311 -598 707 1492 918 -1036
2537 -1036 -1758 -814 1185 1843 232 -1635 -1671 -24 1680 1136 -194 -1247 -1100 -76 927 1072 71
2554 71 -971 -1376 -405 1411 1598 49 -1591 -1669 237 1809 1278 -704 -1717 -994 641 1594 847 -673
2572 -673 -1266 -830 451 1321 871 -241 -1400 -972 428 1601 1141 -642 -1713 -1020 664 1613 1099
2589 1099 -978 -1699 -421 1210 1670 354 -1128 -1293 -241 959 1074 346 -617 -1266 -670 750 1519
2606 1519 773 -1066 -1645 -362 1219 1445 113 -1273 -1367 220 1411 1215 -28 -1169 -1061 -48 1359
2623 1359 1536 59 -1350 -1231 351 1656 1143 -493 -1258 -771 625 1016 681 -10 -768 -873 238
2640 238 1440 1544 -106 -1445 -1299 986 2129 1177 -1058 -1591 -206 1468 1493 65 -927 -671 -144
2657 -144 512 1102 772 -306 -1405 -946 710 1809 912 -1279 -1964 -341 1571 1368 -396 -1438 -1084
2674 -1084 51 972 686 -269 -1128 -1341 -561 766 1112 168 -1522 -1595 -166 1243 841 -515 -1505 -1125
2692 -1125 184 1061 698 -441 -1313 -1315 -168 1032 1093 -323 -1806 -1233 452 1432 814 -951 -1296 -330
2710 -330 638 961 263 -733 -1022 -625 333 1131 829 -460 -1567 -980 841 1759 567 -1149 -1539 -477
2728 -477 1276 1057 95 -1021 -1159 -188 636 967 58 -859 -1090 -283 758 1204 116 -1062 -1586 -407
2746 -407 838 1027 -325 -1648 -1273 -23 1271 732 -423 -1500 -1021 257 824 557 -569 -1262 -819
2763 -819 129 996 612 -372 -1200 -957 182 1301 955 -461 -1297 -695 688 1452 677 -665 -1120 -461
2781 -461 687 1202 521 -409 -958 -476 735 1392 609 -752 -1173 143 1199 1440 552 -690 -751 90
2799 90 887 1222 598 -510 -875 -175 1122 1582 530 -1007 -1118 206 1619 1320 -296 -1258 -601 420
2817 420 1067 478 -145 -472 -549 -156 663 1090 241 -1089 -1264 259 1394 1120 -521 -1444 -495 886 1247
2836 1247 349 -667 -572 -280 453 1011 634 -153 -1023 -801 241 1498 957 -624 -1330 -232 1125 1502
2854 1502 206 -778 -633 81 697 1213 476 -416 -948 -222 787 1287 348 -1129 -1113 281 1272 1007 17
2873 17 -718 -815 224 792 674 259 -681 -947 -249 725 1076 30 -1227 -1119 208 1296 579 -551 -1032
2892 -1032 -479 453 849 347 -541 -863 -687 86 779 725 -354 -1145 -814 102 971 559 -732 -1186 -625
2911 -625 488 860 136 -821 -1174 -479 495 832 114 -817 -699 -403 528 776 -63 -841 -960 -213 576 816
2931 816 127 -741 -1168 -96 682 857 140 -967 -1114 -123 800 604 -64 -981 -902 125 657 738 -66 -874
2951 -874 -887 178 845 635 -363 -1038 -719 230 1018 486 -394 -1027 -512 81 755 424 -345 -1194 -654 273
2971 273 871 583 -728 -1292 -526 652 820 -3 -813 -658 16 277 597 276 -182 -843 -503 276 1046
2990 1046 503 -786 -1379 -286 1078 1084 -194 -920 -759 216 977 391 43 -446 -405 -135 657 837 413
3009 413 -734 -906 -18 1077 933 -259 -961 -497 589 1213 333 -393 -354 -324 199 739 724 -240 -764 -803
3029 -803 314 1195 566 -323 -1000 -320 752 939 241 -494 -545 -229 381 600 306 -174 -732 -653 254 975
3049 975 345 -764 -1225 -217 895 1020 79 -787 -552 116 545 541 33 -256 -728 -177 635 856 212 -773
3069 -773 -862 -105 787 835 -231 -709 -596 225 887 444 -299 -590 -463 -95 679 585 -88 -852 -651 335 776
3090 776 446 -367 -766 -487 372 877 419 -464 -744 -515 262 785 434 -411 -712 -260 357 851 211 -602
3110 -602 -593 -372 496 809 301 -728 -911 -225 656 994 29 -610 -965 -186 330 646 50 -674 -613 -15 674
3131 674 761 50 -520 -884 -125 795 831 -91 -858 -563 201 693 459 -407 -521 -273 279 363 514 -35 -668
3152 -668 -656 -44 930 551 -172 -762 -516 770 926 259 -703 -690 -212 514 622 294 -148 -578 -357 198
3172 198 614 596 -404 -843 -149 750 1088 258 -548 -594 279 620 413 158 -245 -298 -170 417 717 364 -409
3193 -409 -686 -129 788 965 -67 -826 -506 242 690 362 -91 -547 -537 8 492 472 131 -734 -800 260
3213 260 770 785 -294 -798 -272 390 794 166 -304 -528 -214 137 514 367 -275 -698 -681 277 779 398
3233 398 -426 -870 -230 552 668 -39 -614 -690 -169 321 422 149 -352 -516 -121 324 717 174 -398 -777
3253 -777 -155 758 709 102 -482 -597 10 529 544 45 -463 -680 69 471 513 -150 -683 -611 145 583 264
3274 264 -128 -777 -241 123 378 320 -105 -767 -759 114 579 196 -402 -738 -423 140 557 148 -597 -638 -466
3295 -466 121 518 159 -412 -813 -430 344 525 -11 -582 -651 -304 449 278 35 -450 -489 -184 123 478 147
3316 147 -256 -746 -186 419 510 167 -757 -716 106 604 399 -143 -507 -357 183 335 386 127 -267 -477 -200
3337 -200 680 605 -302 -825 -503 336 885 265 -421 -524 -302 341 534 397 53 -307 -489 -110 618 669 -353
3358 -353 -783 -229 635 729 79 -561 -484 -96 258 530 -106 -136 -409 -193 144 571 299 -175 -796 -323 530
3379 530 729 113 -547 -559 239 422 198 21 -221 -329 -3 321 441 285 -406 -544 151 708 615 -86 -489
3400 -489 -46 394 532 324 -68 -228 6 212 655 539 68 -405 -289 380 774 657 -248 -455 -92 431
3420 431 611 144 -319 -539 -186 233 436 343 -362 -419 -181 244 676 294 -505 -500 -163 551 493 -120 -528 -579
3442 -579 -240 211 333 72 -460 -447 -41 256 431 31 -528 -379 5 280 472 -141 -328 -401 36 186 419
3463 419 -132 -495 -361 44 666 250 -328 -394 -583 259 448 251 -18 -387 -273 182 417 447 -84 -612 -376
3484 -376 193 605 294 -282 -552 -133 366 280 29 -380 -622 -124 195 400 -5 -257 -608 -525 384 536 136
3505 136 -566 -478 -100 306 276 -272 -209 -418 -222 108 269 90 -558 -518 -250 344 612 76 -582 -447 19
3526 19 557 306 -223 -576 -241 40 237 241 14 -280 -482 -63 501 365 -150 -764 -425 219 561 125 -412
3547 -412 -407 -70 362 235 168 -79 -289 -166 139 621 385 -206 -522 -397 583 555 32 -344 -342 5 517 224
3569 224 121 -228 -324 -2 57 489 369 -207 -340 -56 243 480 -38 -368 -365 106 346 102 -32 -194 -160 16
3591 16 342 286 116 -206 -333 114 593 408 -197 -449 -319 207 580 274 -52 -340 -257 201 310 131 -201
3612 -201 -480 -345 143 267 146 -355 -442 -199 360 292 -22 -277 -302 -82 249 278 113 -396 -511 -33 218
3633 218 477 236 -414 -497 -145 417 373 200 -261 -127 -32 361 289 -55 -340 -408 134 259 418 -118 -254 -225
3655 -225 55 266 238 -62 -94 -311 52 224 345 -11 -600 -425 90 198 156 -66 -444 -30 62 458 -2
3676 -2 -200 -338 -337 117 339 291 -68 -505 -576 338 599 81 -220 -379 87 252 154 -8 -483 -283 -191 340 234
3699 234 115 -130 -465 -169 313 131 -145 -496 -415 256 318 137 -61 -125 -387 -111 351 138 29 -60 -162
3720 -162 -27 335 430 -22 -485 -358 373 191 218 -47 -262 -143 106 390 40 -161 -267 -178 43 364 256
3741 256 -140 -383 -390 488 583 179 -170 -371 -52 335 367 103 -166 -135 -313 141 371 205 -174 -338 69 348
3763 348 423 70 -294 -169 -18 83 295 164 -336 -350 -155 233 371 237 -204 -319 -34 426 303 54 -420
3784 -420 -349 91 163 102 -22 -256 -271 34 455 201 -166 -354 -220 62 92 125 -213 -334 -144 236 209 264 -260
3807 -260 -372 -94 109 470 -27 -164 -378 -186 71 409 79 -24 -272 -52 242 344 149 -61 -215 -147
3827 -147 207 270 299 -437 -595 -83 222 103 -109 -465 -316 106 162 62 -137 -414 -383 -153 42 420 -18
3848 -18 -459 -359 6 284 21 -30 -266 -114 134 178 134 -99 -127 -118 53 108 217 -145 -368 -198 119 343 33
3871 33 -135 -347 -167 229 25 63 0 -79 52 -5 349 284 -4 -420 -317 219 362 218 -76 -278 44 262
3893 262 210 -293 -239 -39 -89 21 254 246 -97 -283 -312 370 211 -11 -330 -135 224 308 166 -208 -164 -104 88
3916 88 20 106 80 -222 -245 225 318 321 -50 -298 -157 94 307 331 -54 -208 70 111 263 161 -40 -315 -84
3939 -84 48 290 334 -201 -207 -123 66 351 83 -335 -202 128 253 132 85 -309 -99 -78 242 398 29 -53 -179
3962 -179 42 214 266 46 -114 -297 -26 272 333 -25 -207 -193 -153 317 202 -157 -176 -315 -14 331 355 22
3984 22 -192 -265 105 78 269 79 -10 -219 103 483 376 -137 -207 -102 187 256 108 -188 -173 10 114 299
4006 299 128 27 -246 -43 178 218 257 -258 -317 -21 360 79 1 -53 -213 54 99 408 -86 -203 -38 -135
4028 -135 202 428 -11 -365 -188 -4 370 310 -157 -367 -269 55 62 33 157 -123 -41 -86 170 55 -193 -187 -154
4051 -154 8 82 107 -386 -400 -39 55 177 32 -41 -175 -167 14 62 45 -70 -57 -178 173 282 78 -429 -147
4074 -147 115 185 228 -19 -146 -91 -265 67 152 10 -286 -80 17 -11 238 101 -276 -338 111 160 99 -6 -375
4097 -375 -132 -10 122 28 -66 -199 -240 -108 50 319 81 -140 -198 236 334 -161 -12 -43 -61 159 260 28
4119 28 -70 -1 -22 171 202 148 -110 -358 0 322 153 138 -127 -183 -76 170 192 -45 86 -205 -182 207 179 240
4143 240 25 -28 189 206 342 -150 17 -76 -94 96 126 -83 -108 -192 -41 268 124 42 -74 -149 49 286 326
4166 326 41 -180 -194 220 24 -1 156 -382 -90 93 184 186 -106 -274 -187 -7 190 91 -94 -28 21 24 79 19
4190 19 117 -217 -248 -79 145 21 -286 -207 -25 311 17 -89 -78 -162 48 124 148 -4 -99 -123 -173 89 311 22
4214 22 -100 -135 56 377 293 -12 -96 -102 12 170 154 -42 -13 -173 36 216 360 111 -292 -112 149 300 16
4237 16 -212 -286 173 131 283 220 50 -237 -165 -44 156 364 -50 -352 -154 -28 200 79 -96 -204 -19 93
4259 93 163 125 -86 -64 -187 225 135 -34 -211 -56 0 91 423 -87 -117 -289 -138 215 128 -104 -154 -62 -6 15
4283 15 186 -5 -163 -85 48 -11 158 118 -252 -90 -48 35 152 -135 -155 -75 -122 69 17 -47 -64 -72 174 66 193
4308 193 -6 -155 -182 -22 307 -60 -50 -55 -119 36 99 253 -67 -137 -118 -42 278 4 -94 -70 -177 21 301 -97
4332 -97 -112 -222 -45 96 136 157 62 32 66 93 213 176 -99 -34 122 284 99 -124 47 48 143 201 168 16 -168
4357 -168 -10 52 -41 124 -120 18 -127 206 73 57 -235 -200 -101 -48 -16 213 64 -121 -29 -173 69 152 -128
4380 -128 -273 -26 -29 222 -66 -29 -194 57 -89 29 36 65 -149 -226 -64 176 -9 -302 -102 -87 189 -15 91
4403 91 11 33 146 58 9 -49 -44 -74 66 53 216 167 -108 -162 35 133 82 -160 -89 -22 201 4 102 89 -173 -76
4429 -76 77 158 4 -137 -161 -72 -13 193 95 -82 -11 -5 189 69 -103 -73 -8 -226 -163 295 128 -134 -193 70
4453 70 -15 61 -78 -248 -27 50 95 19 87 1 -3 -132 28 220 -25 -45 -125 98 177 51 78 10 -113 -29 125
4478 125 355 22 -86 -36 -90 65 158 -5 35 -32 128 -3 -25 -52 -37 -65 -24 -30 255 -94 23 12 -89 147
4502 147 47 15 -98 -165 178 85 27 16 -68 73 80 -69 -26 18 -165 -85 -66 326 128 76 -172 34 164 130 21
4527 21 -96 20 60 33 171 15 26 -70 -58 208 97 159 -206 -28 65 147 1 -51 -55 -60 132 246 289 -140 -247
4552 -247 -126 -13 -14 107 -12 -116 -169 66 319 126 -183 -14 -106 136 134 -13 27 -48 -176 117 67 -32 82
4575 82 -99 43 -131 -67 -67 -84 -173 -94 124 142 -35 -155 -32 -68 119 -192 -110 112 85 -279 103 79 133 8
4599 8 -128 92 254 -19 -142 19 -64 102 12 176 74 12 -193 -11 125 81 -6 -127 -182 -36 -89 51 71
4622 71 -9 44 28 155 -189 -13 51 -7 -8 -44 -83 -111 -130 6 -38 126 29 -163 -196 -5 49 144 -240 65 -17 -91
4648 -91 11 81 -13 49 -89 -260 -17 88 -43 -57 -30 -21 53 -93 71 -64 -112 -3 -31 106 118 -129 -39 -11 150
4673 150 17 -7 -158 40 146 162 124 -21 -149 -145 52 -2 212 -19 -226 88 42 132 5 -38 -155 -13 22
4696 22 -155 192 -1 -138 -62 93 -7 -50 -183 -180 -64 268 128 -146 -207 -135 -18 133 -3 -45 -189 -198 -91
4719 -91 85 134 207 137 -3 105 -1 51 -83 -165 -132 48 -19 -14 -109 9 -174 -165 320 215 117 -8 43 113 114 181
4745 181 -115 -136 101 208 56 3 24 36 93 71 149 -133 -24 -178 -51 -32 242 101 -204 -77 -24 57 43 -132
4769 -132 -214 -11 -22 -11 -51 83 -62 -69 -211 -142 81 9 -83 -258 -124 115 95 -80 -83 -43 -74 188 53 109 37
4794 37 7 3 23 159 100 -97 -16 -108 96 -2 133 -34 94 125 159 -50 -135 -15 101 12 77 206 45 -122 -21
4819 -21 112 153 145 64 -51 -106 -31 40 100 44 -159 107 53 51 -110 -16 -167 9 -31 -83 -56 12 184 -92 -109 12
4845 12 42 74 46 -110 172 121 13 38 73 -156 25 67 -44 9 -139 -55 43 -45 -112 -136 -111 -53 67 176 -2
4870 -2 17 23 177 -18 46 -188 -12 -7 64 -91 -74 48 -17 0 -35 57 -82 204 -178 -183 -57 80 35 -3 126 -36
4896 -36 126 -17 21 184 -65 -214 -54 71 -78 -185 -139 -56 -6 193 -141 126 33 3 95 129 -55 -18 -38 -269
4920 -269 -230 -18 140 -204 -65 220 124 82 -80 -132 -211 89 -40 -84 -183 -142 184 -41 204 190 123 -275 -252 40
4944 40 -113 180 -90 28 28 112 96 15 -72 -47 -182 4 94 -25 69 10 68 63 132 -23 38 80 40 116 110 -73 -187
4971 -187 -58 56 85 5 72 104 -264 -67 24 105 112 -164 -104 210 -54 -140 -121 54 73 79 123 223 2 54 -61
4996 -61 77 -133 -7 -147 -163 41 -155 80 -9 -103 -54 92 -13 87 -22 -109 -41 32 -20 -87 9 -48 -9 136
5020 136 162 -43 -111 -101 -154 38 -94 30 -113 -84 39 43 47 -97 -50 -85 -31 158 -80 88 -111 6 9 139 -118
5045 -118 -126 -32 -127 -147 44 131 83 0 -111 58 65 -74 -56 56 -187 -71 62 176 39 -4 -82 -200 122 -106
5069 -106 52 -82 -186 -84 -111 -27 -178 128 -84 -76 20 -45 37 -128 97 -121 60 207 195 -81 -140 102 101 116
5093 116 8 -33 -120 57 56 73 41 -3 -42 -97 -15 -2 -143 -86 -14 113 143 177 97 -32 -53 10 -190 38 -33 46 -22
5120 -22 -68 108 -18 24 -131 16 29 187 29 -44 7 -147 197 -5 3 85 -58 -25 -3 -155 -34 -25 13 -27 157
5145 157 206 -23 -81 -203 111 13 74 -1 91 -94 -21 -113 -28 -72 -75 44 -79 66 -123 -16 -106 33 110 11 -88
5170 -88 -110 -271 -179 180 29 35 146 18 118 -32 59 -15 -105 -44 -28 120 -53 62 -77 34 -69 -46 26 98
5194 98 20 40 -10 139 110 -111 -75 -151 -24 43 -130 143 -66 30 -165 102 -21 -3 -60 -14 -36 -34 21 97 8 -69
5220 -69 140 78 -1 201 -144 -80 -9 -99 -24 -47 -85 -76 81 2 -133 -24 -171 -203 48 72 -37 -159 -12 -160 -33
5245 -33 -52 -141 -195 -1 -5 -43 -29 95 144 -194 -71 -12 74 -35 -140 -134 16 123 -39 -13 117 112 20 231 181 -38
5271 -38 21 -16 205 -14 83 1 94 55 -35 85 0 -24 169 -89 61 36 234 -153 -68 75 -29 130 112 5
5295 5 108 -107 29 -68 74 -65 -75 -18 -78 43 130 78 -41 -93 -15 187 77 -249 -53 65 155 -91 171 -180
5319 -180 -52 45 -30 56 -78 -90 75 -122 110 15 -17 -74 -67 52 52 66 63 173 -135 -110 -54 -89 -117 9 -16 38 -115
5346 -115 166 -45 -41 64 193 38 -1 -69 -42 197 -149 96 40 -149 -197 -62 -23 -57 -136 -92 -52 80 -39 -29
5370 -29 70 -27 -58 -38 -57 65 -75 -8 -28 -13 -64 154 154 51 -60 168 34 143 155 138 21 103 1 71 55 105
5396 105 40 -25 0 0 -146 -259 -134 -207 -16 41 -9 -102 68 -56 186 156 111 162 113 -82 -50 131 -132 38 46
5421 46 -19 239 21 3 -64 -93 12 182 99 38 23 149 -104 30 -27 48 26 150 103 59 -146 -8 -118 69
5445 69 -110 34 -91 -2 146 -22 -138 8 32 -189 75 -222 108 222 146 71 -23 18 -102 -130 56 -99 -74
5468 -74 -53 14 47 5 134 -149 52 146 147 44 -30 -79 28 94 228 122 73 7 -117 -92 61 -57 -57 147 138 57
5494 57 117 120 -186 176 64 119 31 -97 33 29 185 116 42 32 42 -228 88 13 25 -241 63 144 103 15 2 42
5520 42 -214 1 -116 55 -152 -150 251 21 61 46 65 61 -188 103 126 50 94 -75 -26 30 -215 152 -63 55
5544 55 -13 160 124 -102 -50 -94 249 160 69 -63 -60 17 -6 39 -168 117 -425 138 166 -36 214 9 -88 146 22
5569 22 -30 27 73 -104 29 6 -65 -51 346 -29 -94 34 -20 199 -101 -34 58 19 40 -34 20 45 113 -215 71 -95
5595 -95 -134 146 24 -52 18 -120 44 -56 -72 77 109 -22 25 5 -52 175 110 17 13 -171 8 147 121 167 -60
5620 -60 -158 0 18 106 -113 -289 10 64 198 -47 -110 -121 -109 22 146 -63 31 26 22 9 -20 77 43 -219 64 -45
5646 -45 32 57 -6 30 -85 59 67 136 85 88 -119 -11 -93 108 -53 -58 70 43 -3 25 -50 110 -21 177 108 -72
5672 -72 -6 -41 59 129 104 -19 45 12 -46 67 196 -115 -50 17 63 53 -97 198 10 28 -88 25 72 92 58
5697 58 -86 -69 159 -104 -26 -140 -79 163 67 83 66 -9 -24 -192 6 -221 -12 69 -187 44 -34 82 111 15
5721 15 -186 -77 29 -239 103 -146 66 -208 140 236 18 -133 46 15 80 -134 -72 114 -41 7 96 -26
5743 -26 -106 -112 146 -49 277 60 -184 -46 -10 62 -37 -60 238 62 145 -61 80 -15 -48 98 -120 -6 67 33
5767 33 109 62 -36 -36 62 103 -2 -51 -196 -163 -86 -11 -32 -234 -68 28 55 66 26 32 -103 100 -39 31 -21 -43 5 -146
5795 -146 -3 -85 15 -24 -20 83 -38 160 -33 117 190 -126 -97 26 3 -188 -18 25 -112 -56 -174 107 67
5818 67 -70 149 -109 103 74 -85 139 -93 123 -75 -50 35 66 84 -1 110 -15 50 47 71 -35 12 -10 -15 153
5843 153 -193 113 69 116 -43 39 -31 -215 38 171 73 142 3 84 -97 -78 15 -59 -73 -4 -31 20 -102 42 -49
5868 -49 -162 126 128 31 -12 -90 -182 -4 65 88 239 119 17 -136 91 60 -121 -60 32 -22 106 52 52 -1 -125 -169
5894 -169 -82 -66 100 -84 12 84 190 -35 -22 -92 -33 -176 146 -44 -62 -51 -214 -119 -44 16 112 -68 -55 -89 106
5919 106 -35 175 -83 11 58 -82 21 -242 -18 -105 20 33 -122 -19 -95 157 54 -124 145 19 -28 -162
5941 -162 -137 32 -51 -50 -44 -77 131 -35 -138 -125 82 -14 30 18 20 -204 78 -75 3 29 136 -14 132 -89 1
5966 1 -13 -2 -30 -148 -82 8 126 -41 -55 240 -74 -81 128 -81 -87 214 -20 76 46 -43 16 189 -66 50 -52
5991 -52 -100 -16 -183 -37 55 -45 -76 25 -26 127 -85 32 -129 12 -122 45 112 -114 157 61 -82 67 -126
6014 -126 -19 107 90 21 156 7 76 -44 -122 -107 211 33 60 81 107 -201 -145 -70 -134 69 -94 50 -42 -72
6038 -72 -12 -34 66 44 61 203 -96 75 52 2 84 78 -9 177 -42 31 107 23 72 -6 -72 -67 -165 169 133 -20 -38
6065 -38 70 31 50 -114 80 26 57 175 -5 -126 27 -29 -28 -26 -47 34 43 38 86 104 -20 -135 -90 149 -19 171
6091 171 -72 85 -82 -85 -38 -208 -164 -177 -256 101 92 -40 114 -42 0 20 -9 311 55 -87 -42 99 275 119
6115 119 -25 45 18 37 -88 -19 13 17 -147 16 -58 -43 -33 -41 -105 178 -31 38 38 89 -23 36 63 59 232 -196 59
6142 59 -59 -70 -47 -83 -125 -180 312 -163 -19 -5 132 165 -20 172 77 28 60 -26 59 27 -33 79 7 146 -152
6167 -152 135 -2 315 114 86 86 -11 213 -89 2 -129 -27 -26 40 44 81 21 185 -23 91 -116 -32 66 13 -22
6192 -22 -216 -104 -70 64 56 77 -97 -11 10 31 -38 -44 -156 48 -26 -74 -24 -60 150 -142 128 -35 64 123 2 50
6218 50 67 30 29 -136 -84 -212 21 90 38 150 -99 -54 -48 168 97 -73 58 -94 -76 93 -20 33 -69 -237 -26
6243 -26 -57 68 154 154 91 41 86 11 126 70 -162 -146 76 -32 -78 -142 83 -31 95 -30 51 1 13 18 47 -202
6269 -202 81 -47 56 38 -107 52 89 -25 79 218 15 10 -177 -75 -96 13 -19 72 -124 -164 -138 38 29 22
6293 22 155 63 79 28 80 -51 -92 76 -140 -9 -50 115 56 103 29 34 117 -77 -102 -186 154 33 34 -44 27 -163
6319 -163 221 23 -75 -23 65 -3 274 288 -11 137 -195 50 173 140 120 27 171 77 42 -3 -199 50 38 65
6343 65 -91 145 -65 -1 -26 12 -65 91 -66 14 -101 -62 3 -2 135 -197 -17 29 106 48 -158 -54 -138 -4 111
6368 111 104 -88 -5 20 50 33 -15 -19 -66 -181 -44 117 -9 -54 -142 43 58 -8 64 60 -78 193 40 -183 -19 47
6394 47 -39 -49 32 191 -52 108 -121 -65 157 49 -15 -166 46 -32 -53 -65 129 -50 -135 -132 57 -24 -3 24 41
6419 41 -142 -115 110 99 -29 -55 146 109 -203 -140 -135 77 59 75 36 -151 -93 41 36 -33 74 -24 23 -73 118 -13
6445 -13 45 67 36 -101 114 -65 -129 -47 -12 168 -6 -79 -101 -89 -73 -109 105 13 36 -126 89 170 -149 40 -86
6470 -86 -82 33 72 125 109 84 23 -82 101 14 -111 92 5 -66 -217 -124 -25 -32 87 30 13 78 34 11 -107 -186 -96
6497 -96 31 32 -52 152 124 -65 -58 -124 -225 -33 -64 -36 15 40 165 -164 -58 -26 -55 20 -87 -81 -56 44 5 -51 21
6524 21 -16 45 -27 -19 -82 -116 -175 -99 -153 78 -111 28 -87 40 -119 -101 162 -3 179 -14 16 -35 -131 60 -73
6549 -73 -132 -166 22 189 -88 -71 62 90 -116 0 -96 29 -171 -17 -157 69 42 -114 84 84 -204 -102 -38
6572 -38 114 -111 85 -156 -29 152 -119 -43 -89 -66 41 205 -30 44 -5 74 8 58 -45 -17 -27 140 -139 3
6596 3 165 -19 56 105 14 119 50 -25 31 -31 119 -13 -1 5 -126 166 -6 -15 -120 -72 51 -20 -41 89 140 159
6622 159 -100 -10 -128 -56 21 102 52 -30 65 -93 -24 31 -72 -37 73 -144 -6 32 64 50 61 -189 54 -37 44
6647 44 21 -137 -3 -129 63 38 -122 -99 -57 100 69 -11 67 -56 -22 -24 -126 -153 -33 144 67 -72 184 28
6671 28 -9 98 -68 13 -4 -28 8 -2 -209 -128 -110 17 84 -104 107 16 -158 90 -9 27 65 65 -65 52 -47 45
6697 45 169 -128 -77 13 45 110 -69 -8 120 113 -186 -4 -53 -88 212 -143 -86 -171 212 27 -129 6 77 49 -148
6722 -148 -42 -50 -41 -58 -55 173 -97 110 -70 -60 -13 -24 138 -49 -92 16 -105 47 69 -132 86 -94 36 -40
6746 -40 -22 -135 -160 56 -75 69 24 -26 57 -96 -236 212 -25 -151 29 -6 -43 45 31 -64 -34 -156 -29 81
6770 81 143 73 148 39 139 215 35 -60 0 -126 133 161 42 125 -29 -128 15 -47 222 54 117 -34 31 27 -68
6795 -68 35 -57 116 -137 89 101 127 -47 253 -84 -49 -8 -93 -37 3 60 -34 26 -94 109 123 62 -13 237 -83
6820 -83 25 -75 -86 10 -220 114 140 -5 -13 -89 104 152 218 -6 89 31 74 -70 82 -73 -57 -26 -81 161 -173
6845 -173 -18 -57 -10 153 -33 98 56 121 30 3 -31 65 -6 45 56 -53 -30 -99 -42 49 9 33 199 39 -70 1
6871 1 78 -23 -21 170 12 33 -186 19 -55 31 -17 -15 54 -57 12 120 92 118 -5 -7 -53 15 52 -19 -89 124 167 179
6899 179 -41 -110 -5 115 -70 -54 83 32 98 10 14 41 -23 -31 -44 140 7 -53 -75 43 -178 -158 -17 -47 36 -50
6925 -50 -16 -62 -229 184 -54 -20 -18 -11 -56 111 68 60 -91 -193 -95 57 -85 -183 116 122 29 88 -51 -223 -151 55
6951 55 4 34 43 -17 -89 34 85 20 16 -46 128 75 -69 114 112 -125 104 60 97 141 57 -177 97 -86 130 7
6977 7 -72 -162 65 -212 -126 88 -81 -151 -112 -4 95 -6 -215 117 -161 -26 107 -5 86 -68 -2 102 62 125
7001 125 -76 29 170 -77 109 98 -51 15 122 23 -60 -57 -37 -17 4 7 -26 -13 -13 29 147 66 154 15 -16 26 26
7028 26 145 141 -166 -212 79 -94 45 30 -37 -132 206 73 76 -76 41 28 -37 -82 41 5 37 37 -122 25 -56 177
7054 177 82 47 156 -3 119 -25 -56 48 86 90 20 -4 -107 85 236 60 -7 -70 51 -46 125 33 -158 -17
7078 -17 -182 260 -32 15 -29 52 -34 -4 -236 -166 22 -11 163 -154 -22 -217 60 -11 -148 -37 114 130 157 -120
7102 -120 -103 -36 101 85 83 24 -140 93 16 25 89 -13 -113 -50 -7 -112 -212 -171 41 94 0 68 -3 -94 -4 50 -65
7129 -65 47 -20 40 -8 11 86 212 -83 155 121 43 72 161 -43 22 -56 -65 50 -38 76 -7 50 78 86 -96 -13 -65
7156 -65 -25 21 -12 -132 212 -37 63 -89 38 126 8 41 -125 -31 125 -158 -95 -40 -206 145 67 -153 -36
7179 -36 -29 60 20 -57 24 15 -144 -118 10 88 75 36 146 26 111 -96 -144 -24 80 -213 34 79 75 -106 50 165
7205 165 107 100 155 -119 41 176 75 -251 10 153 24 -5 -93 -57 131 -70 5 -16 30 46 41 -74 -28 55 -18
7230 -18 6 -66 -16 -128 143 41 95 38 -129 -113 -45 19 -39 206 -139 115 -14 177 185 -158 75 120 97 -55 -161
7255 -161 -125 -67 -83 105 195 63 -98 -29 189 126 15 -67 61 36 -114 93 107 73 -42 -90 125 218 135 54 114
7280 114 -10 -46 52 37 85 -8 -29 53 69 -55 134 -8 143 7 39 92 149 29 9 36 117 9 -32 -47 35 267
7306 267 64 -58 -18 -48 29 77 -215 -110 34 97 -5 -3 81 -56 22 -90 -55 -4 -48 40 -156 -17 16 133 44
7331 44 63 -60 -241 213 182 130 95 -77 -12 28 139 61 -356 109 -54 -260 -13 51 0 -68 63 -49 -57 -130 75
7356 75 373 88 110 71 67 67 23 -127 -42 46 -24 -12 -92 -22 -11 -104 123 -84 127 145 -156 56 35 -43 14 -41 -83
7383 -83 83 -35 43 -61 20 72 -3 27 -129 5 -61 -41 81 167 85 7 -173 -15 -33 99 82 -169 -73 8 -34
7408 -34 139 -78 -53 100 -176 121 212 -29 76 -16 -24 34 53 -135 -100 57 63 -43 -17 115 -87 -56 114 203 -21
7433 -21 -70 -126 -20 155 -19 -130 -32 70 84 -54 -103 -25 163 -120 -212 -49 -115 -72 -128 17 -72 -22 -76 -61 -143
7458 -143 -154 -162 171 -23 -51 78 -161 -85 -116 86 139 89 -92 -54 -144 -122 96 -142 -62 94 -31 -85 15 112 -16
7483 -16 91 -109 50 -2 -86 162 110 -62 189 58 70 186 -57 226 19 -159 -4 29 157 -80 177 -9
7505 -9 -152 5 119 178 23 9 231 17 57 76 -168 56 -82 -114 117 80 4 52 6 -82 -86 57 -9 79 -25
7530 -25 -79 -101 238 -37 222 105 125 2 -11 -113 21 -246 51 103 -81 163 -22 120 -68 -88 -146 -29 24
7553 24 -23 158 147 -41 7 -51 -35 -34 12 45 70 70 -35 131 -34 130 27 -1 -25 -13 -14 36 -17 -91 -3 12 -52 135
7581 135 -22 177 74 -96 18 53 37 78 -37 204 -17 64 -33 -196 65 -12 119 -2 64 -178 -132 100 136
7604 136 -33 109 -15 -33 -52 64 -140 43 -1 43 -10 41 -87 132 124 59 216 -58 -148 -152 -95 112 -40 -32 -79
7629 -79 29 27 -172 -2 50 -11 128 -152 41 -92 2 -43 126 -107 -42 18 1 50 16 193 41 10 -212 -176 100
7654 100 32 -121 146 -103 -126 -44 85 63 18 34 -32 -37 53 -57 29 101 47 4 145 225 -152 32 -31 -144 130
7679 130 40 167 -95 60 -73 -46 253 132 -155 43 114 -61 76 -91 -89 -89 52 -44 50 -58 143 47 -110
7702 -110 -77 -72 -160 58 107 -2 11 -19 108 -36 5 216 -49 0 -30 60 104 83 -74 -137 -30 -156 209 119 -1
7727 -1 43 -81 -219 -89 62 17 -26 -71 41 187 248 112 275 67 -32 2 127 91 -56 96 -28 45 -4 11
7751 11 -119 124 11 48 19 16 -107 -67 -18 160 60 -60 -248 189 116 66 -121 -32 26 -18 -146 -28 -110 -9
7775 -9 135 -88 241 61 -151 -82 8 106 164 105 59 -10 -20 -155 43 130 -6 59 -58 21 -109 90 -34 27 -16
7800 -16 78 65 79 115 46 80 -141 -15 130 54 35 -62 18 -25 -24 111 50 142 -155 -3 40 -9 -117 -93 90 52 -54
7827 -54 22 -174 161 -62 -47 24 47 46 29 -79 -108 34 -53 48 -66 -180 -106 173 -3 -175 210 -68 -8 38
7851 38 -14 -163 -101 261 25 0 -21 -142 -60 -70 128 -70 19 33 143 86 -96 54 21 -37 23 88 141 -109 70
7876 70 73 99 103 79 -179 -118 87 57 81 3 112 -61 -157 -123 48 95 32 -82 -165 142 23 45 241 -32 18 -71
7902 -71 104 -111 -37 -135 -19 -26 -34 98 -40 -63 151 26 160 22 -259 -102 149 30 -99 -9 -90 152 -11
7925 -11 -31 50 -45 25 203 67 -135 88 87 64 57 -44 -5 59 68 -22 -214 -113 2 137 0 -164 -48 9 -114
7950 -114 -35 -199 -122 -7 -25 28 -41 -164 -2 -40 -212 23 5 39 89 -149 88 21 88 6 -1 30 154 43 20
7975 20 -77 -113 139 -76 39 131 3 -124 -184 -102 -187 22 -63 20 -154 225 69 32 72 96 7 13 130 -76 6
8000 6 -40 -102 117 1 -7 46 64 74 183 30 -216 -113 -62 -33 -12 -34 -31 -63 -64 1 -199 -140 -194 43 55 21 186 -150
8028 -150 35 -102 -40 86 103 -124 144 54 -8 -4 -47 -45 -59 25 -123 155 -34 49 -36 -79 38 -114 35 -59 -22
8053 -22 106 -20 -82 -80 72 28 236 205 7 68 8 -85 -150 16 -10 -95 -92 84 -10 174 69 -216 45 -102 -195
8078 -195 121 -46 7 -77 -66 131 -53 184 132 -47 -73 98 14 -155 -115 91 64 17 83 -57 -87 24 -106 -25
8102 -25 77 -18 -47 98 -53 -84 -90 -77 -67 -76 37 -213 -206 -147 -19 -134 181 -53 -10 9 74 14 -61 175 -273 -126
8128 -126 136 -183 12 14 113 54 129 -63 -80 -13 81 -60 -2 -141 184 -48 -141 -17 -90 151 -15 -44 67 132
8152 132 -169 187 -138 38 -16 -181 55 -88 36 -55 -79 -64 -110 -71 116 129 -30 13 216 31 -24 75 113 48
8176 48 92 219 57 -36 117 64 -130 38 -49 -35 90 143 -147 -130 -74
8191g4
##END NTUPLES=NMR FID
##END=
