##TITLE=1H_CG-1119-3
 CDCl3, 8 sc, 
 16.9.2019
##JCAMPDX= 6.0         $$ Bruker NMR JCAMP-DX V2.0
##DATA TYPE= NMR FID
##DATA CLASS= NTUPLES
##ORIGIN= UXNMR, Bruker Analytische Messtechnik GmbH
##OWNER= root
$$ XWIN-NMR		Version 3.5
$$ Mon Sep 16 14:44:03 2019 Russian Standard Time (UT+4h)  she@DPX200
##.OBSERVE FREQUENCY= 200.13155
##.OBSERVE NUCLEUS= ^1H
##.DELAY= (6, 6)
##.ACQUISITION MODE= SIMULTANEOUS
##.ACQUISITION SCHEME= undefined
##.AVERAGES= 8
##.DIGITISER RES= 18
##SPECTROMETER/DATA SYSTEM= spect
##.PULSE SEQUENCE= zg30
##.SOLVENT NAME= CDCl3
##.SHIFT REFERENCE= (INTERNAL, CDCl3, 0, 15.7039)
##AUDIT TRAIL= $$ (NUMBER, WHEN, WHO, WHERE, WHAT)
$$ ##TITLE= Audit trail, XWIN-NMR		Version 3.5
$$ ##JCAMPDX= 5.01
$$ ##ORIGIN= Bruker BioSpin GmbH
$$ ##OWNER= she
$$ F:/spectra/data/she/nmr/H-F/1/audita.txt
$$ ##AUDIT TRAIL=  $$ (NUMBER, WHEN, WHO, WHERE, WHAT)
(   1,<2019-09-16 14:42:09.31 +0400>,<she>,<DPX200>,
      <created by zg, POWCHK disabled, PULCHK disabled
       configuration hash MD5:
       00 E9 B6 7A A2 85 ED C7 34 08 36 98 17 FE 4E 26
       data hash MD5: 16K
       08 69 CA 54 A5 E3 40 32 4A 73 B9 BE C9 6F 40 30>)
$$ ##END=
$$ 
$$ hash MD5
$$ FA C9 5A 7E DC 94 D8 E2 96 5B C9 D8 B2 C8 55 FF
##$RELAX= 
##$RELAX= 
##$RELAX= 
##$RELAX= 
##$RELAX= 
##$RELAX= 
$$ Bruker specific parameters
$$ --------------------------
##$DU= <F:/spectra>
##$EXPNO= 1
##$NAME= <H-F>
##$PROCNO= 1
##$TYPE= <nmr>
##$USER= <she>
##$AMP= (0..31)
100 100 100 100 100 100 100 100 100 100 100 100 100 100 100 100 100 100 
100 100 100 100 100 100 100 100 100 100 100 100 100 100 
##$AQSEQ= 0
##$AQ_mod= 1
##$AUNM= <au_zg>
##$AUTOPOS= <>
##$BF1= 200.13
##$BF2= 200.13
##$BF3= 200.13
##$BF4= 200.13
##$BF5= 200.13
##$BF6= 200.13
##$BF7= 200.13
##$BF8= 200.13
##$BYTORDA= 1
##$CFDGTYP= 0
##$CFRGTYP= 5
##$CHEMSTR= <none>
##$CNST= (0..31)
1 1 145 1 1 1 1 1 1 1 1 1 1 1 1 1 1 1 1 1 1 1 1 1 1 1 1 1 1 1 1 1 
##$CPDPRG= <>
##$CPDPRG1= <>
##$CPDPRG2= <>
##$CPDPRG3= <>
##$CPDPRG4= <mlev>
##$CPDPRG5= <mlev>
##$CPDPRG6= <mlev>
##$CPDPRG7= <mlev>
##$CPDPRG8= <mlev>
##$CPDPRGB= <>
##$CPDPRGT= <>
##$D= (0..31)
0 1.2 0 0 0 0 0 0 0 0 0 0.03 0 0 0 0 0 0 0 0 0 0 0 0 0 0 0 0 0 0 0 0 
##$DATE= 1568630528
##$DBL= (0..7)
120 120 120 120 120 120 120 120 
##$DBP= (0..7)
150 150 150 150 150 150 150 150 
##$DBP07= 0
##$DBPNAM0= <>
##$DBPNAM1= <>
##$DBPNAM2= <>
##$DBPNAM3= <>
##$DBPNAM4= <>
##$DBPNAM5= <>
##$DBPNAM6= <>
##$DBPNAM7= <>
##$DBPOAL= (0..7)
0.5 0.5 0.5 0.5 0.5 0.5 0.5 0.5 
##$DBPOFFS= (0..7)
0 0 0 0 0 0 0 0 
##$DE= 6
##$DECBNUC= <off>
##$DECIM= 24
##$DECNUC= <off>
##$DECSTAT= 4
##$DIGMOD= 1
##$DIGTYP= 9
##$DL= (0..7)
0 120 120 120 120 120 120 120 
##$DP= (0..7)
150 150 150 150 150 150 150 150 
##$DP07= 0
##$DPNAME0= <>
##$DPNAME1= <>
##$DPNAME2= <>
##$DPNAME3= <>
##$DPNAME4= <>
##$DPNAME5= <>
##$DPNAME6= <>
##$DPNAME7= <>
##$DPOAL= (0..7)
0.5 0.5 0.5 0.5 0.5 0.5 0.5 0.5 
##$DPOFFS= (0..7)
0 0 0 0 0 0 0 0 
##$DQDMODE= 0
##$DR= 18
##$DS= 0
##$DSLIST= <SSSSSSSSSSSSSSS>
##$DSPFIRM= 0
$$ [...]
##$SUBNAM2= <"">
##$SUBNAM3= <"">
##$SUBNAM4= <"">
##$SUBNAM5= <"">
##$SUBNAM6= <"">
##$SUBNAM7= <"">
##$SUBNAM8= <"">
##$SUBNAM9= <"">
##$SW= 24.9336996594482
##$SWIBOX= (0..15)
0 0 2 0 0 0 0 0 0 0 0 0 0 0 0 0 
##$SW_h= 4990.01996007984
##$TD= 16384
##$TD0= 1
##$TE= 0
##$TE2= 300
##$TE3= 300
##$TEG= 300
##$TL= (0..7)
0 120 120 120 120 120 120 120 
##$TP= (0..7)
150 150 150 150 150 150 150 150 
##$TP07= 0
##$TPNAME0= <>
##$TPNAME1= <>
##$TPNAME2= <>
##$TPNAME3= <>
##$TPNAME4= <>
##$TPNAME5= <>
##$TPNAME6= <>
##$TPNAME7= <>
##$TPOAL= (0..7)
0.5 0.5 0.5 0.5 0.5 0.5 0.5 0.5 
##$TPOFFS= (0..7)
0 0 0 0 0 0 0 0 
##$TUNHIN= 0
##$TUNHOUT= 0
##$TUNXOUT= 0
##$USERA1= <user>
##$USERA2= <user>
##$USERA3= <user>
##$USERA4= <user>
##$USERA5= <user>
##$V9= 5
##$VALIST= <valist>
##$VCLIST= <CCCCCCCCCCCCCCC>
##$VD= 0
##$VDLIST= <DDDDDDDDDDDDDDD>
##$VPLIST= <PPPPPPPPPPPPPPP>
##$VTLIST= <TTTTTTTTTTTTTTT>
##$WBST= 1024
##$WBSW= 4
##$XGAIN= (0..3)
0 0 0 0 
##$XL= 0
##$YL= 0
##$YMAX_a= 28534
##$YMIN_a= -39356
##$ZGOPTNS= <>
##$ZL1= 120
##$ZL2= 120
##$ZL3= 120
##$ZL4= 120
##$ABSF1= 10
##$ABSF2= 0
##$ABSG= 5
##$ABSL= 3
##$ALPHA= 0
##$AQORDER= 0
##$ASSFAC= 0
##$ASSFACI= 0
##$ASSFACX= 0
##$ASSWID= 0
##$AUNMP= <proc_1d>
##$AZFE= 0.1
##$AZFW= 0.1
##$BCFW= 1
##$BC_mod= 2
##$BYTORDP= 1
##$COROFFS= 0
##$CY= 11.3945322036743
##$DATMOD= 1
##$DC= 2
##$DFILT= <>
##$DTYPP= 0
##$F1P= 20.1720416913024
##$F2P= 0.152960286110954
##$FCOR= 0.5
##$FTSIZE= 0
##$FT_mod= 4
##$GAMMA= 1
##$GB= 0.15
##$INTBC= 1
##$INTSCL= 1
##$ISEN= 128
##$LB= 0.24
##$LEV0= 0
##$LPBIN= 0
##$MAXI= 10000
##$MC2= 0
##$MEAN= 0
##$ME_mod= 0
##$MI= 1.114404
##$NCOEF= 0
##$NC_proc= 0
##$NLEV= 6
##$NOISF1= 3.799351
##$NOISF2= 2.8
##$NSP= 1
##$NTH_PI= 0
##$NZP= 0
##$OFFSET= 15.70392
##$PC= 1
##$PHC0= -9579.9
##$PHC1= 24.60096
##$PH_mod= 1
##$PKNL= yes
##$PPARMOD= 0
##$PSCAL= 0
##$PSIGN= 0
##$REVERSE= no
##$SF= 200.130013532006
##$SI= 16384
##$SIGF1= 3
##$SIGF2= 2
##$SINO= 400
##$SIOLD= 16384
##$SREGLST= <1H.CDCl3>
##$SSB= 0
##$STSI= 0
##$STSR= 0
##$SW_p= 3612.71676300578
##$SYMM= 0
##$S_DEV= 0
##$TDeff= 0
##$TDoff= 0
##$TI= <>
##$TILT= no
##$TM1= 0
##$TM2= 0
##$TOPLEV= 0
##$USERP1= <user>
##$USERP2= <user>
##$USERP3= <user>
##$USERP4= <user>
##$USERP5= <user>
##$WDW= 1
##$XDIM= 8192
##$YMAX_p= 0
##$YMIN_p= 0
$$ End of Bruker specific parameters
$$ ---------------------------------
##NTUPLES= NMR FID
##VAR_NAME=  TIME,          FID/REAL,        FID/IMAG
##SYMBOL=    X,             R,               I
##VAR_TYPE=  INDEPENDENT,   DEPENDENT,       DEPENDENT
##VAR_FORM=  AFFN,          ASDF,            ASDF
##VAR_DIM=   8192,          8192,            8192
##UNITS=     SECONDS,       ARBITRARY UNITS, ARBITRARY UNITS
##FACTOR=    0.0002004,     1,               1
##FIRST=     0,             0,               0
##LAST=      1.6414764,     0,               0
##MIN=       0,             -39356,          0
##MAX=       1.6414764,     28534,           0
$$ Real data points
##PAGE= N=1
##DATA TABLE= (X++(R..R)), XYDATA
0 0 0 0 0 0 0 0 0 0 0 0 0 -1 8 -8 8 -8 8 -10 16 -16 18 -24 25 -31 34 -40 46 -51 59 -66 74 -82 94 -107 116
35 116 -131 146 -162 180 -198 221 -244 270 -299 332 -368 408 -456 508 -569 643 -731 837 -970
54 -970 1147 -1384 1728 -2275 3292 -5832 28223 28534 481 21424 16060 9452 9041 5924 3268
69 3268 22450 17961 -1629 5091 19438 5119 -1516 1595 -5073 -3565 8064 -6437 -17300 2164
83 2164 8253 -10161 -9052 -1185 -6123 -3156 552 -14042 -11215 7091 -643 -14792 -2873 3522
97 3522 -3351 987 354 -9487 1647 12568 -4677 -9834 7226 7009 -2043 2212 324 -2706 9223
112 9223 6740 -10314 -2210 11727 185 -6590 1620 -1519 -2492 6128 -3480 -13425 2381 7685
126 7685 -9428 -9398 1097 -2699 -2614 71 -9915 -7580 8234 286 -13469 -1470 6516 -2628 -533
141 -533 1881 -4891 3443 12517 -2016 -6306 11264 10963 245 5095 7141 4134 13194 12203 -1980
156 -1980 6017 20249 9063 1153 11354 11535 8046 14031 7997 468 14137 18215 1977 2724
170 2724 14216 9576 6547 10192 2795 3480 16629 9274 -4549 6451 14918 3801 2470 7083
184 7083 2343 6254 12765 199 -3932 11342 10409 -2029 2345 5966 1728 6827 6640 -5549 590
199 590 13471 1988 -7131 3662 5288 -789 2899 -378 -6646 4322 7450 -7854 -7266 5364
213 5364 558 -5302 -1017 -4862 -5408 5063 -952 -13797 -2804 6293 -5478 -7908 -1315 -4024
227 -4024 -2404 3042 -6965 -9750 4967 4051 -9164 -3785 3176 -1958 739 2204 -6744 -1335 10487
242 10487 245 -8383 3450 6845 -559 1817 1751 -2599 6130 8960 -4750 -3412 9944 5142
256 5142 -2369 2895 2425 400 8039 3994 -6630 3217 11836 211 -3256 5075 3509 2534 6671
271 6671 -434 -3086 9914 8574 -4416 635 9155 3583 2931 5626 -391 2933 12443 3347 -4755
286 -4755 6909 10648 1371 2718 4885 1109 6898 9293 -2974 -1829 11330 5762 -3571 2417
300 2417 4284 526 5153 2420 -6465 1574 9218 -2686 -6619 2865 1655 -1945 1195 -3615 -6259
315 -6259 4560 3439 -10056 -4608 4892 -1787 -4700 -492 -4598 -2961 4929 -2914 -9968 1512
329 1512 5141 -4836 -3852 962 -2455 1160 3639 -6086 -4836 7682 2754 -6741 -208 4019 -517
344 -517 2124 1437 -5002 1995 8698 -2113 -5559 4972 4437 -1219 2129 159 -2352 6408 5587 -6414
360 -6414 -1334 8799 2012 -2637 2397 1038 866 6785 507 -5613 5097 8343 -2206 -1471 5068
375 5068 1889 2542 5325 -2015 -1394 9790 5226 -4942 2325 7562 2016 2793 3769 -1207 4148 10024
391 10024 -193 -3204 7814 7293 -274 3033 3686 834 6986 6353 -4002 709 10226 3026 -2630
406 -2630 3427 3102 1433 5369 498 -4838 4514 7274 -4285 -3726 4063 546 -1553 1144 -4230
421 -4230 -4190 4779 -6 -9384 -2582 2852 -3995 -4621 -2380 -6026 -2376 2054 -7123 -9492 1373 520
437 520 -7745 -4502 -1707 -4552 -726 -355 -8295 -3833 5452 -1700 -7090 319 1524 -1429 1818 -647
453 -647 -4375 4138 6963 -3369 -2693 6546 3796 261 3735 1060 933 8227 4443 -3491 3328 9225
469 9225 1712 238 4442 1702 3321 7136 -459 -2748 7417 6462 -2918 429 4982 1408 2785
484 2785 3507 -3018 703 8553 1200 -4281 3552 5196 415 2654 2207 -1057 5452 7859 -2064 -893
500 -893 8604 5191 442 4410 3947 2769 8115 5128 -1905 5012 10730 2516 696 6134 4262 3990
516 3990 6879 1218 -1154 7952 6706 -3015 419 5709 1437 686 1533 -3049 -478 5512 -1530 -7254
532 -7254 684 2785 -3945 -2553 -1732 -4840 -266 1224 -7425 -6268 2690 -803 -6889 -2737 -1504
547 -1504 -3216 514 -1704 -7300 -791 4473 -3791 -5424 1598 494 -1498 1545 -1902 -3476 4498
562 4498 3427 -5173 -1459 4974 299 -1048 1537 -1515 231 5615 -572 -5452 2864 4976 -2555
577 -2555 -1026 1782 -1037 1779 3268 -3736 -2547 5802 2165 -4245 657 2931 225 2595 1353
592 1353 -2918 2881 7152 -598 -2343 5452 4742 1284 3825 2349 965 7395 6298 -1439 2725
607 2725 8964 3974 1677 5014 3498 4219 8018 3122 -1122 6915 8651 740 1357 5794 3166 3684
623 3684 5007 -533 399 7514 3551 -3029 2134 4841 750 1586 1516 -2423 2012 5551 -2072 -3958
639 -3958 4120 2908 -2174 327 201 -1460 2941 1906 -4793 -778 5309 -263 -3457 1142 484 -453
655 -453 2890 -1050 -4588 2927 4394 -3449 -2693 2664 235 -678 1160 -2790 -1872 4468 283 -5621
671 -5621 -97 3177 -1659 -1448 79 -2686 179 3287 -3464 -4727 2968 2180 -3706 -1227 411 -1322
687 -1322 1591 958 -4758 -881 4828 -900 -4179 1293 1549 -682 1595 -437 -3168 3026 4131 -2983
703 -2983 -2269 3986 1422 -586 1347 -968 -330 4700 1269 -4337 1628 5163 -497 -789 2257 96
719 96 1654 4193 -1147 -2356 4944 3982 -1984 560 3139 941 2398 2762 -1620 1609 6947 1062
735 1062 -2578 3578 4096 733 2599 1921 -496 4264 5363 -1847 -501 5582 2679 -384 2154 1089
751 1089 523 4296 1383 -3737 1956 5120 -964 -2000 1897 427 220 1972 -2267 -3302 3241 1865
767 1865 -4519 -1551 1936 -953 -691 -16 -3501 -946 3713 -1511 -4847 1127 2194 -2051 -593 75
783 75 -1907 1734 2545 -3306 -2085 4124 1159 -2516 804 973 -209 2881 720 -3464 1602 4821
799 4821 -1170 -2271 2359 1179 -73 1865 -1051 -2117 3459 2276 -4043 -827 3053 -584 -1299
814 -1299 310 -2176 -677 3142 -1728 -4882 1040 2366 -2757 -1801 129 -1908 477 1300 -4045 -2486
830 -2486 3513 369 -3824 65 1250 -929 965 396 -2992 1125 4308 -1630 -2549 2886 2222 -327
846 -327 1631 163 -748 4104 2611 -2945 271 4732 703 -734 1753 246 619 3637 -405 -2944
862 -2944 2554 3480 -2037 -1234 1792 -251 771 1351 -2859 -1754 3754 144 -4082 -270 1612 -1515
878 -1515 -338 -322 -2916 77 2951 -2804 -3648 2076 1029 -2381 -416 -617 -1621 2038 1146 -3696
894 -3696 -569 3808 -441 -2472 1110 287 -4 2481 -483 -2575 2797 3429 -2182 -971 2695 843
910 843 423 1929 -1131 -445 4290 1186 -3050 1191 3018 -343 -47 751 -1394 1044 2794 -1917
926 -1917 -2442 2764 1545 -2336 -193 292 -1072 1510 736 -3493 -661 3399 -912 -2963 847 778
942 778 -865 1071 -678 -2568 2160 2589 -2680 -1386 2561 373 -472 1068 -879 -149 3409 834
958 834 -2925 1217 3839 -287 -332 1581 -253 1321 3075 -1299 -1674 3578 2254 -2225 151 1714
974 1714 -542 1220 819 -2711 -298 3474 -884 -3231 999 1044 -1294 64 -763 -2587 1238 1627
990 1627 -3667 -2363 2310 -396 -2621 -250 -1428 -1415 1595 -532 -3971 45 2430 -2005 -1964 661
1006 661 -442 -185 1394 -2051 -1933 2914 1532 -2867 -30 2231 -93 597 1127 -1434 575 3741
1022 3741 -208 -2230 2276 2507 -373 673 737 -812 2249 2605 -2162 -755 3511 1041 -1662 879
1038 879 766 -315 2068 450 -2491 1358 3320 -1361 -1769 1789 713 54 1550 -964 -1379 3112
1054 3112 1895 -2659 248 3230 250 51 1382 -523 996 3528 159 -1898 2854 3118 -535
1069 -535 914 1961 460 2575 2945 -1215 271 4473 1692 -1280 1723 2103 717 2195 1037 -1174
1085 -1174 2018 3859 -826 -1238 2590 1241 -147 1236 -236 -1201 2427 1137 -3057 -441 2645
1100 2645 -816 -1525 219 -1188 -600 1662 -1608 -3406 1205 1275 -2670 -1569 412 -1234 -350 435
1116 435 -2807 -1626 2442 -341 -3337 -52 1068 -887 -94 -30 -2106 695 2347 -1979 -1938 1855
1132 1855 927 -1326 493 -253 -687 2040 908 -2736 -97 2983 -430 -1403 950 186 17 1669
1148 1669 -628 -2210 1988 1979 -2152 -720 1510 -98 125 1122 -1455 -656 3002 272 -2504 893
1164 893 2185 -520 399 802 -945 1356 2891 -995 -1212 3289 1930 -672 921 1385 407 2756
1180 2756 2111 -773 1380 4374 923 -198 2617 1970 1331 2890 1042 -346 3505 3301 -651 481
1196 481 3319 1472 705 1890 82 582 3302 746 -1912 1497 2730 -457 -87 1064 -438 748
1212 748 1807 -1758 -1571 2192 888 -1988 -145 680 -795 328 56 -2523 -247 2174 -1265 -2427
1228 -2427 756 412 -1030 166 -743 -1977 1043 1230 -2604 -1367 2004 -234 -1538 310 -751 -777
1244 -777 1686 -465 -2828 690 2058 -1639 -1429 500 -803 -280 1073 -1813 -2254 1839 642 -2599
1260 -2599 -522 837 -1003 -285 147 -2065 -242 1946 -1288 -2572 958 863 -1392 -40 -30 -1290
1276 -1290 1068 1229 -2341 -1030 2348 215 -1471 729 184 -156 1632 327 -1739 1561 2938 -663
1292 -663 -693 2163 827 670 1828 -166 -122 3017 1732 -1363 987 2957 708 722 1709 -140 1077
1309 1077 3119 -139 -975 2611 2095 -583 706 1171 -210 1646 1734 -1530 -116 2705 229 -1390
1325 -1390 791 785 -200 1126 -66 -2121 786 1704 -1794 -1627 1333 -48 -915 320 -1023 -1278 1485
1342 1485 260 -2531 -363 1653 -754 -1008 274 -959 -307 1590 -1286 -1991 1277 1066 -1867 -461
1358 -461 800 -476 206 683 -1867 -693 2394 -419 -2075 537 873 -634 232 -243 -1735 657
1374 657 1513 -1914 -1731 1314 32 -1255 -257 -896 -1100 1105 -129 -2774 -146 1644 -1123 -1563 242
1391 242 -651 -448 984 -1336 -1895 1537 968 -2133 -530 1281 -404 -1 692 -1185 -84 2348 -139
1408 -139 -1565 1384 1702 -317 518 767 -516 1410 2215 -905 -507 2189 1188 -600 984 990 -53
1425 -53 1686 698 -1511 877 2506 -657 -1118 1249 322 -313 1119 -651 -1272 1474 1007 -2300 -495
1442 -495 1134 -488 -567 349 -1299 -670 1557 -868 -2444 496 1067 -1422 -669 42 -1131 133 1009
1459 1009 -1754 -1287 1845 379 -1708 289 741 -380 808 327 -1740 544 2209 -940 -1328 1261
1475 1261 754 -527 725 -33 -938 1671 1359 -1670 -174 1770 111 -492 565 -456 -163 1558
1491 1558 -438 -2150 1080 1410 -1249 -628 462 -468 169 884 -1421 -861 1927 312 -1555 245
1507 245 942 -681 248 434 -1265 755 2053 -1013 -1209 1672 1094 -461 796 345 -474 1593 1041
1524 1041 -1296 174 2376 105 -568 1133 476 290 1829 97 -1143 1363 1644 -957 -277 1255
1540 1255 53 25 822 -839 -663 1989 -90 -1757 166 929 -820 -539 -37 -1481 0 1119 -1502
1557 -1502 -1779 974 141 -1779 -509 -452 -1287 275 345 -2083 -794 1458 -690 -1506 336 -75 -475
1574 -475 888 -407 -1495 1144 1280 -1263 -427 1421 47 -215 958 -175 -52 2091 641 -1520
1590 -1520 782 1765 -404 36 913 -59 643 1569 -569 -922 1879 947 -1002 -13 593 -395 963 791
1608 791 -1192 225 1950 -368 -1208 962 641 -321 616 57 -832 1214 1491 -1097 -248 1785 278
1625 278 -50 823 207 279 2059 581 -1072 1254 2388 -27 295 1447 644 919 1905 51 -167 2324
1643 2324 1456 -886 837 1599 377 852 974 -778 557 2094 -360 -1349 1068 751 -764 226 -64
1660 -64 -896 699 703 -1773 -910 1195 -317 -1460 -208 -586 -1022 471 -438 -2137 167 1082 -1512 -1200
1678 -1200 229 -319 -572 437 -1003 -1262 1229 271 -2019 -171 1091 -520 -226 435 -773 132 1606
1695 1606 -504 -1223 1306 1110 -870 -9 466 -364 1140 944 -1234 -165 1841 364 -885 701
1711 701 421 -102 1074 376 -1105 808 1786 -923 -582 1289 423 -205 799 -225 -259 1802 736
1728 736 -1186 513 1973 -130 -5 888 -68 575 1448 -40 -736 1609 1438 -356 585 1246 201
1745 201 1050 1454 -471 178 2471 729 -539 1364 1237 291 1044 1017 -231 1419 2170 -635 -372 1757
1763 1757 915 -115 901 269 -108 1673 796 -1176 569 1661 -467 -658 531 -217 -68 833 -680
1780 -680 -1330 897 462 -1450 -582 271 -660 -390 -103 -1349 -631 1109 -535 -1939 80 389 -1208
1797 -1208 -364 -212 -1140 246 730 -1375 -1128 1152 222 -1043 124 18 -696 795 88 -1420 261
1814 261 1413 -762 -822 667 -119 -49 899 -369 -776 1062 1050 -1271 -194 1294 -153 -123 225 -733
1832 -733 -147 1534 -405 -1539 651 963 -573 -126 576 -531 204 930 -1137 -825 1477 408 -738
1849 -738 350 658 -215 603 434 -798 671 1905 -356 -601 1108 740 -150 885 192 -243 1484
1866 1484 1271 -755 332 1839 530 46 1123 256 407 1824 229 -856 1150 1546 -504 92
1882 92 799 -154 544 814 -981 -614 1495 76 -1239 129 554 -602 165 27 -1160 6 854 -1015
1900 -1015 -1564 653 237 -1079 -237 -395 -898 669 379 -1786 -340 1055 -431 -1070 401 -164 -371
1917 -371 1120 -434 -1167 879 962 -1146 -397 745 -46 -198 610 -681 -398 1573 258 -1411 181
1934 181 964 -408 91 200 -830 45 987 -881 -873 694 448 -827 -46 -156 -596 413 344 -1442 -322
1953 -322 1131 -662 -955 168 -200 -395 401 -447 -1199 713 908 -878 -489 795 -26 -173 600 -407
1971 -407 -253 1212 350 -1017 381 1482 -50 156 590 -320 737 1433 -368 -491 1480 912 -842
1988 -842 239 699 -141 488 586 -970 225 1666 -320 -1020 610 307 -463 259 -300 -958 797 758
2006 758 -1215 -963 832 -223 -579 -167 -556 -506 788 -147 -1391 10 1013 -675 -595 338 -445 49
2024 49 616 -629 -795 1143 423 -999 56 659 -174 497 410 -728 146 1542 -159 -840 737 746 -221
2043 -221 394 186 -351 813 1141 -1026 -486 1181 266 -469 464 -86 -143 824 -46 -1097 349 999 -722
2062 -722 -755 548 20 -368 419 -784 -758 1081 227 -1267 7 625 -364 -257 263 -674 -79 1026 -310
2081 -310 -790 1019 672 -361 58 444 -238 726 829 -941 -353 1441 273 -650 671 484 -133 691
2099 691 137 -706 710 1097 -646 -451 850 57 -162 447 -529 -713 879 360 -1298 -206 810 -460
2117 -460 -516 222 -584 -223 693 -817 -1095 512 265 -887 -330 157 -580 47 114 -1088 -443 986 -286
2136 -286 -955 252 426 -333 318 29 -893 654 1017 -649 -301 1069 485 -276 563 73 -64 1246
2154 1246 605 -691 316 1265 -14 -192 738 124 278 1084 -291 -619 989 728 -827 171 582 -141
2172 -141 460 458 -549 71 1255 -53 -965 714 643 -324 332 432 -534 643 856 -792 -477 1089 310
2191 310 -454 395 253 -210 1071 513 -881 601 1473 -117 -106 696 253 90 1080 -36 -508 1190
2209 1190 952 -740 96 1014 89 -90 484 -408 -72 1063 -186 -1052 478 674 -709 -182 253 -687
2227 -687 191 331 -1159 -830 778 -14 -1205 61 -160 -537 89 -385 -1406 19 781 -830 -1053 333
2245 333 -141 -651 242 -581 -662 558 288 -1142 -403 763 -216 -154 504 -445 -97 1076 -48 -736 754
2264 754 689 -250 17 458 -50 463 666 -499 -132 1367 370 -644 378 549 53 580 623 -782 350
2283 350 1133 -325 -619 1099 208 -291 319 210 -263 736 560 -866 36 1083 119 -87 636 167 113
2302 113 863 151 -365 1041 1097 -343 -21 881 149 373 828 -246 66 1384 484 -350 759 1051 224
2321 224 455 514 -231 577 1189 -241 -364 1157 476 -352 428 206 -356 610 437 -1102 40 1074 -398
2340 -398 -763 196 -200 -464 381 -547 -1123 302 436 -1043 -708 188 -440 -231 67 -703 -772 616 -149
2359 -149 -1209 -86 382 -787 -489 131 -672 63 598 -784 -895 872 365 -901 -207 280 -207 531
2377 531 184 -912 130 1029 -321 -677 510 301 -131 418 -104 -609 753 735 -1043 -416 927 -23
2395 -23 -288 248 -195 -347 943 -242 -1066 277 922 -416 -391 393 -404 78 561 -464 -590 834 240
2414 240 -746 165 609 -115 399 390 -700 482 1373 133 -482 1075 726 31 606 347 -156 836 907 -551
2434 -551 198 1248 178 -184 514 257 222 1013 392 -747 443 1047 -614 -318 600 -111 156 463 -655
2453 -655 -661 821 296 -1059 -210 289 -421 -164 48 -858 -230 792 -801 -1178 460 181 -792 -186 -2
2472 -2 -572 271 300 -1039 -480 930 -99 -683 326 32 -404 492 -142 -918 433 828 -730 -509 610
2491 610 -44 -249 449 -384 -680 959 185 -988 219 543 -244 -196 243 -490 -140 684 -766 -934 492
2510 492 437 -871 -107 137 -651 147 333 -911 -524 783 -142 -971 128 173 -341 182 -40 -924 438
2529 438 958 -589 -325 917 149 -131 560 28 -338 912 442 -631 484 1138 -27 -69 717 79
2547 79 342 797 -179 -351 972 746 -524 78 434 -253 391 525 -595 0 886 -123 -895 327 227
2566 227 -576 133 -11 -754 472 573 -843 -673 575 -183 -685 59 -246 -505 438 -65 -1076 -22
2584 -22 792 -686 -478 420 -160 -99 659 -327 -562 978 523 -833 29 1004 -105 97 356 -473 110
2603 110 1243 -136 -1009 713 675 -442 184 331 -138 434 746 -707 -371 782 32 -694 14 74 -219
2622 -219 431 52 -976 260 836 -536 -743 578 -74 -439 315 -590 -724 687 228 -1048 -109 629
2640 629 -296 -358 268 -392 -157 752 -99 -848 748 815 -340 35 542 -244 333 758 -474 -282 1202
2659 1202 301 -592 434 456 -108 392 335 -685 234 834 -614 -788 750 125 -407 142 -299 -497 479
2678 479 247 -1085 -313 494 -297 -669 60 -534 -533 321 -454 -1029 347 318 -775 -309 318 -425 -38 311
2698 311 -513 -240 739 -29 -918 391 501 -428 159 191 -472 343 1006 -381 -332 1030 457 -426 569 431
2718 431 -223 732 658 -704 389 1194 9 -581 820 109 -32 843 183 -545 724 737 -758 -122 731
2737 731 -132 -110 416 -572 -107 924 43 -995 399 740 -392 -47 388 -445 189 851 -585 -576 972
2756 972 322 -522 364 510 -102 626 375 -635 109 1386 -136 -319 666 340 -111 569 84 -747 869
2775 869 763 -561 18 848 168 -239 367 -335 -295 695 -125 -1007 451 734 -719 -564 274 -618 -75
2794 -75 316 -713 -790 547 124 -1114 -220 151 -505 -169 152 -1183 -74 745 -587 -797 275 152
2812 152 -553 79 144 -591 437 616 -828 -248 925 6 -262 456 54 -166 759 162 -741 630 1086
2831 1086 -253 67 777 -1 154 698 -171 -355 1200 542 -557 413 854 29 136 416 -379 178 1081
2850 1081 -263 -621 730 564 -242 233 204 -373 472 584 -636 -108 1019 70 -378 541 199 4 754
2869 754 124 -495 550 976 -578 -186 697 233 224 788 -37 -178 1233 507 -736 249 997 -230 75
2888 75 506 -180 92 1044 -101 -623 870 659 -651 82 220 -413 357 499 -931 -337 644 -3 -945
2907 -945 211 160 -727 30 -323 -1030 205 311 -1013 -642 431 -161 -694 150 -529 -663 610 -102 -1249
2926 -1249 -66 652 -503 -436 374 -449 -177 742 -282 -821 530 456 -669 129 501 -19 479 603 -597
2945 -597 -146 1162 -45 -754 730 527 -335 339 117 -600 484 504 -740 -296 750 -93 -332 525
2963 525 -217 -195 497 189 -720 -100 789 -318 -339 443 -3 -97 424 -382 -590 781 663 -700 119 882
2983 882 -93 126 614 -157 58 1077 104 -656 850 741 -22 234 532 -417 466 1071 -385 -247 1130
3002 1130 476 -371 576 274 -111 439 311 -715 245 881 -487 -517 353 -83 -275 418 -309 -780 406
3021 406 267 -1104 -352 697 -432 -335 249 -620 -473 726 -327 -1095 232 299 -775 -131 265 -549
3039 -549 191 377 -653 -463 629 67 -864 43 385 -402 172 122 -591 229 988 -203 -527 616 81
3058 81 -189 310 -118 -370 730 399 -983 -306 926 -203 -443 521 -403 -174 587 -148 -887 581 614
3077 614 -642 -109 471 -382 -54 451 -788 -462 741 -44 -997 241 437 -323 102 309 -699 182
3095 182 942 -524 -319 740 375 -372 409 317 -272 433 357 -588 70 1066 -44 -178 592 92 -26 435
3115 435 141 -493 594 841 -424 -110 711 -100 -84 389 -483 -263 753 58 -1015 235 489 -335 40
3134 40 -19 -564 -99 283 -794 -909 623 25 -654 65 -95 -510 379 168 -688 33 762 -198 -474 486
3154 486 -79 -235 451 -44 -473 712 508 -641 -118 870 -103 -125 266 50 -146 624 130 -717 667
3173 667 718 -288 6 386 -106 -20 600 -259 -505 666 263 -611 73 259 -334 204 271 -716 -100 760
3193 760 -346 -701 239 67 -416 171 -207 -659 396 560 -847 -324 732 8 -492 165 -134 -223 510
3212 510 167 -1002 385 784 -389 -118 497 -32 -21 768 -127 -275 885 292 -652 114 686 -247 96
3231 96 410 -396 -84 775 -302 -726 550 307 -457 112 123 -519 334 297 -897 -389 756 -350 -639
3250 -639 131 -35 -210 421 -98 -958 152 424 -691 -698 601 -190 -317 435 -150 -375 702 157 -785
3269 -785 234 614 -145 53 294 -194 113 860 -238 -419 752 542 -397 243 587 -36 531 676 -520
3288 -520 76 957 9 -439 547 282 -183 406 296 -501 426 663 -493 -398 603 126 -217 320 -169 -448
3308 -448 644 351 -803 -3 342 -434 -162 316 -203 23 612 -338 -493 685 495 -538 126 495 -328
3327 -328 418 439 -472 -111 750 46 -747 583 538 -108 236 208 -532 339 993 -414 -412 766 231 -300 313
3348 313 28 -332 459 87 -991 -5 559 -651 -348 335 -385 -467 133 -569 -954 469 262 -916 -271
3367 -271 266 -492 -244 12 -602 -261 552 -168 -856 348 278 -542 -79 216 -473 120 703 -517 -334 802
3387 802 131 -384 326 276 -117 526 408 -398 365 1069 -333 -100 514 220 -128 577 19 -388 730 487
3407 487 -379 65 701 -71 -39 473 -171 -178 801 60 -504 457 554 -410 -69 170 -272 34 502 -445 -379 614
3429 614 76 -665 348 180 -169 258 328 -507 232 877 -272 -238 567 88 -106 336 94 -231 722 517
3449 517 -816 43 907 -24 -209 329 -218 -168 656 -58 -620 313 591 -365 -88 202 -202 53 321 -599
3469 -599 -322 668 -43 -892 -144 142 -523 -136 -63 -746 2 627 -647 -730 261 -117 -755 -127 -265 -568
3489 -568 145 335 -722 -153 439 -142 -444 249 81 -267 469 -125 -413 616 557 -289 35 471 -98 76
3509 76 502 -354 -220 689 167 -449 440 545 -181 252 527 -504 127 784 -511 -433 610 297 -456 110
3529 110 175 -99 281 82 -754 -61 667 -154 -644 289 29 -210 313 39 -401 497 505 -367 -84 459 -9
3550 -9 -59 538 -91 -2 826 251 -643 366 552 -20 86 307 -153 132 665 -87 -349 704 374 -403 223
3571 223 206 -215 219 306 -446 6 668 -153 -551 321 168 -263 156 -241 -677 166 271 -856 -335 318
3591 318 -297 -510 221 -327 -637 299 -94 -1026 -132 422 -498 -460 272 -425 -150 211 -399 -353 675 224
3611 224 -547 87 451 -275 283 326 -482 83 942 -244 -526 534 233 -323 240 165 -339 512 573 -439
3631 -439 -293 714 2 -456 457 74 -238 193 5 -681 211 629 -607 -351 397 -93 -254 401 -195
3650 -195 -451 524 314 -746 49 356 -347 112 -106 -272 70 632 -108 -456 624 311 -131 212 205 -182
3670 -182 384 573 -305 -164 981 147 -378 572 292 -42 365 85 -555 201 683 -432 -316 582 -239
3689 -239 -339 205 -67 -411 539 30 -898 -50 350 -360 -336 295 -256 -149 314 -286 -701 451 5 -556
3709 -556 -285 65 -482 4 244 -651 -271 702 -84 -784 57 260 -389 181 -81 -568 92 536 -429 -506
3729 -506 616 168 -356 262 85 -26 522 210 -561 23 621 -240 -291 426 73 8 602 -294 -584 589
3749 589 457 -542 -188 343 -164 77 91 -594 -173 492 -146 -664 31 169 -592 -98 -37 -370 18 381 -365
3770 -365 -330 521 -187 -397 369 115 -244 471 197 -454 221 905 -205 -333 519 120 76 373 -12 -420
3790 -420 685 362 -359 6 487 -231 -78 421 -268 -135 575 -209 -671 299 391 -206 -12 -8 -411 24 296
3811 296 -541 -366 525 191 -677 -113 35 -349 38 -59 -500 111 520 -451 -411 308 90 -332 331 -105 -378
3832 -378 644 329 -488 225 515 -174 -31 396 55 -74 627 201 -474 663 569 -219 64 582 -200 23
3852 23 441 -343 -62 625 268 -609 188 267 -364 223 111 -406 18 529 -274 -616 600 228 -218 134
3872 134 -48 -343 469 167 -631 -51 497 -171 -475 325 -15 -269 329 -142 -669 463 529 -573 -295 438
3892 438 -137 -51 361 -97 -210 619 245 -528 197 447 -142 67 215 -227 63 480 -286 -370 465 160 -498
3913 -498 222 33 -441 263 136 -680 66 397 -444 -618 214 -157 -276 251 -248 -653 211 74 -581 -520
3933 -520 200 -169 -372 130 -349 -332 383 -167 -778 12 357 -359 -143 205 -273 5 546 -252 -424 497
3953 497 203 -408 161 379 -190 331 542 -331 230 854 -110 -279 474 378 28 499 178 -175 628 583 -339
3974 -339 -97 388 -21 -237 265 -76 -155 444 154 -657 149 480 -334 -194 322 -281 53 402 -284 -429
3994 -429 387 110 -465 143 261 -267 91 337 -415 -104 751 -212 -412 517 210 -386 265 43 -304 485
4014 485 481 -311 -304 580 77 -286 106 37 -46 334 -23 -753 64 668 -311 -389 549 -83 -201 138 -402 -300
4036 -300 312 -19 -629 -278 -11 -333 -180 -111 -544 -351 246 -525 -752 97 50 -484 -182 29 -434 205 391
4057 391 -557 -222 521 -184 -321 128 -39 -233 392 129 -284 362 682 -237 -189 443 68 22 536 150 -205
4078 -205 691 356 -365 233 635 -155 -72 251 -223 -42 632 -116 -515 425 383 -386 73 151 -173 -32 125
4099 125 -506 -158 425 -126 -485 170 179 -378 199 153 -334 178 587 -410 -101 617 192 -297 369 46 -155
4120 -155 568 446 -462 128 561 -34 -93 505 39 -227 577 -97 -343 278 386 -580 -81 350 -314 126
4140 126 61 -406 -243 657 -229 -573 0 51 -579 -50 -81 -536 -155 260 -447 -597 433 -175 -581 -49 -78
4161 -78 -467 207 -16 -650 -19 547 -331 -330 307 -10 -281 233 -87 -511 443 369 -540 155 552 -251 0
4182 0 161 -257 -224 439 35 -534 308 542 -347 234 162 -387 87 422 -469 -260 542 113 -416 250 106
4203 106 -381 198 203 -510 56 520 -311 -562 186 50 -103 239 -150 -411 390 320 -565 64 366 -37 -189
4224 -189 253 -84 -204 472 19 -478 233 325 -370 137 372 -6 14 431 -209 -182 711 207 -422 215 3
4245 3 -161 80 456 -440 211 625 -381 -423 415 188 -402 302 -72 -524 350 52 -777 -232 483 -256 -449
4266 -449 96 -231 -508 191 -75 -671 109 347 -507 -290 104 -254 -185 191 -466 -483 511 35 -630 83 230
4287 230 -347 75 173 -260 116 654 -317 -245 667 358 -130 306 348 -340 333 521 -326 -90 960 14 -354
4308 -354 352 214 -94 459 111 -449 340 656 -386 -168 410 -218 -176 347 -338 -421 424 146 -659 104
4328 104 199 -506 -171 247 -347 -97 511 -450 -459 422 231 -358 100 292 -314 305 489 -467 -86 483 -98
4349 -98 -332 346 201 -179 437 16 -402 225 664 -479 -239 478 3 -322 283 -151 -414 445 81 -574
4369 -574 235 459 -512 78 127 -364 -295 366 -245 -620 386 170 -531 -39 230 -497 -2 391 -545 -315
4389 -315 687 -236 -587 351 160 -470 128 261 -301 312 292 -310 -450 648 -28 -312 467 108 -176 560
4409 560 239 -442 200 746 -92 -16 520 134 -116 647 98 -224 627 427 -441 205 450 -98 -18 165 -555
4430 -555 -124 385 -170 -658 117 366 -313 117 51 -460 19 113 -588 -366 633 -267 -452 141 -133 -324 139
4451 139 185 -691 -185 336 -378 -183 415 -182 -218 381 -118 -201 375 277 -487 -3 406 -190 23 266 -178
4472 -178 -19 539 -146 -703 275 442 -291 1 356 -437 83 441 -625 -400 530 -128 -493 -58 -65 -445
4492 -445 -58 105 -344 7 479 -574 -478 470 -107 -432 228 14 -413 371 264 -428 12 594 -295 -144
4512 -144 390 -70 57 669 253 -439 504 706 -362 352 627 -58 104 507 -229 224 807 235 -269 373
4532 373 268 -64 18 270 -276 270 694 -404 -488 376 7 -349 258 37 -363 137 324 -807 62 357
4552 357 -163 -538 157 -110 -266 196 -108 -663 280 379 -343 -200 368 -68 -67 395 -106 -139 630 274 -453
4573 -453 334 328 -192 181 332 -126 178 592 -190 -111 640 354 -338 276 190 -303 248 237 -494 16 651 -167
4595 -167 -502 187 48 -517 187 -279 -667 286 280 -771 -170 147 -247 -278 274 -458 -463 325 -164 -613 90
4616 90 243 -330 -18 61 -267 -104 380 -374 -111 431 241 -421 55 495 -291 210 305 -289 94 701 -162
4637 -162 -277 513 172 -184 369 200 -196 469 338 -528 -34 541 -36 -183 405 -152 -198 358 -187 -537
4657 -537 230 400 -340 -209 366 -137 -9 398 -411 -437 147 -16 -512 80 146 -284 -122 269 -372 -222 615
4678 615 -130 -540 478 85 -318 10 385 -452 144 442 -361 -168 436 44 -269 204 92 -398 341 154
4698 154 -453 372 397 -353 -432 97 -14 -220 183 -206 -270 532 153 -464 67 370 -226 -220 -134 -430 -220 349
4720 349 -339 -461 213 231 -342 -154 -83 -324 -76 236 -559 -275 408 -164 -490 14 175 -538 156 44 -512
4741 -512 67 423 -488 -286 605 -68 -250 360 254 -385 514 146 -286 304 693 55 41 534 -44 6 435
4762 435 -77 -215 378 407 -355 138 351 -444 87 405 -275 -177 332 -82 -533 186 117 -365 -53 -210 -383
4783 -383 289 471 -265 -338 254 -116 -370 102 -206 -353 224 197 -501 126 434 -91 -250 319 -67 -342 366
4804 366 -124 -460 511 297 -394 47 495 -99 127 347 -111 2 433 66 -473 215 287 -271 116 131 -315
4825 -315 41 361 -356 -442 310 -79 -238 80 -10 -431 239 3 -564 3 307 -191 -271 291 -72 -342 264
4846 264 -19 -256 308 295 -434 -63 330 -170 -95 216 -63 19 625 252 -349 313 573 -108 43 405 -159
4867 -159 -68 356 -6 -169 442 254 -317 175 98 -204 41 115 -175 22 307 -413 -209 228 -107 -462 82
4888 82 42 -429 280 154 -606 -143 449 -379 -263 109 -118 -411 281 11 -542 154 141 -450 -101 366 -194
4909 -194 71 257 -304 -252 348 96 -359 409 268 -115 135 169 -319 216 485 -17 -418 503 233 -127 144
4930 144 -2 -253 149 130 -506 -33 361 -125 -310 54 -73 -459 412 -72 -516 150 174 -478 -183 202 -365
4951 -365 -77 36 -404 -554 286 170 -360 -46 232 -411 -4 347 -168 -69 436 -253 -403 404 261 -342
4971 -342 350 135 -165 285 498 -345 -160 675 -61 -67 318 197 -63 428 222 -191 223 398 -455 -332 347
4992 347 -87 -308 262 -104 -213 285 44 -401 260 364 -342 31 103 -160 -176 91 -180 -537 171 42 -569
5013 -569 120 170 -163 -137 294 -285 -206 551 -220 -512 138 220 -208 163 58 -191 178 376 -318 6 398
5034 398 89 -238 205 -31 -126 250 305 -435 35 267 -184 -218 357 88 72 312 -83 -268 340 3 -583
5055 -583 80 139 -259 -237 112 -458 -260 345 -220 -426 18 212 -145 -205 167 -236 -164 311 -351 -241 373
5076 373 -24 -217 411 141 -171 413 -42 -51 95 567 -94 -226 364 189 -13 363 9 -147 436 446 -264
5097 -264 360 437 -196 80 250 -396 25 475 1 -276 194 247 -252 134 149 -376 -33 185 -255 -308 308
5118 308 -84 -295 92 64 -246 -1 -27 -436 35 163 -209 -287 331 -22 -326 180 -47 -331 199 159 -270
5139 -270 143 466 -103 -306 149 28 23 395 -12 -212 340 416 -174 97 199 -57 -62 372 -217 -97 294 -55
5161 -55 -347 -20 64 -33 203 84 -352 47 291 -251 -285 146 117 -350 -105 -143 -152 202 -70 -286 98 475 -321
5184 -321 -55 187 -127 -136 104 148 -311 398 319 -369 40 168 -139 -66 312 -40 21 387 -64 -265 149 325
5206 325 -118 67 202 -82 135 354 -20 -302 324 143 -220 -42 86 -231 93 112 -284 -101 342 -265
5226 -265 -360 69 -85 -246 257 256 -303 223 346 -311 -131 260 -31 -183 129 -134 -148 304 135 -431 175
5247 175 104 -316 -187 79 -73 -39 343 -175 -243 468 164 -278 157 293 -226 181 333 11 68 513 134
5268 134 -33 311 190 -83 246 78 -258 135 224 -279 -85 418 -114 -139 182 -110 -563 270 136 -380 56
5289 56 242 -258 -111 113 -118 -316 162 -248 -399 298 151 -352 123 -14 -235 -117 268 -150 16 651
5309 651 -228 -412 352 199 -184 94 57 -157 137 278 -352 -111 272 -59 -164 278 28 -123 278 188 -328
5330 -328 63 373 -199 -115 396 66 -13 37 -84 -195 367 57 -420 -42 174 -231 85 171 -64 -176 262
5351 262 -108 -241 352 123 -265 112 36 -90 96 126 -398 -200 357 -89 -285 146 135 -139 177 191 -263
5372 -263 272 417 -135 -10 264 202 -69 419 -49 -261 301 228 -309 88 66 -162 -143 76 -215 -175 249 -53
5394 -53 -484 154 103 -345 -166 109 -290 -74 206 -124 -286 343 133 -448 -30 93 -238 247 95 -398 -8
5415 -8 198 63 -206 289 123 -42 182 71 -219 256 322 -103 183 402 -12 134 349 -43 210 466 298
5436 298 -216 353 236 -312 -27 395 -60 131 305 -190 -174 398 -130 -464 172 90 -161 86 145 -279 18
5457 18 287 -254 -267 164 -111 -206 45 41 -176 163 68 -336 -45 315 -189 11 100 -90 -241 118 -15 -178
5479 -178 361 100 -391 8 227 -39 2 207 -38 -76 368 119 -145 209 220 -219 119 63 -64 -39 168 -260
5501 -260 -267 137 173 -280 18 -92 -95 186 61 -296 -80 317 -218 -203 224 130 -289 51 -165 -422 133 69 -362
5524 -362 11 348 -275 -234 74 -193 83 252 62 -264 26 280 3 70 293 -171 25 550 -207 -107 330
5545 330 284 -216 180 311 -64 217 197 80 60 437 -240 -76 250 48 -172 209 101 -465 193 160 -290
5566 -290 -263 226 -227 -209 167 -234 -274 277 -79 -473 -56 68 -343 -208 202 -162 -174 160 -204 -11 347
5587 347 78 -268 140 242 47 37 86 -89 102 347 -117 -258 254 262 -188 280 -6 -229 349 258 -391 18
5609 18 368 33 -148 168 -70 -252 146 80 -404 81 313 -518 -224 183 -105 -183 350 -184 -319 235 -159
5630 -159 -411 32 112 -150 8 217 -244 -87 252 -171 -186 183 152 -160 137 256 -91 204 241 -322 -14
5651 -14 624 -18 -197 335 122 -179 275 52 -309 205 268 -230 -85 320 44 -21 75 -183 -180 121 -50 -225
5673 -225 98 243 -273 -71 159 -173 -262 255 -108 -290 125 125 -241 -14 165 -141 -49 355 -82 49 334
5694 334 -150 -298 383 44 -64 51 42 -235 116 138 -56 -39 312 -101 -104 278 44 -127 200 -97 -312 -28
5716 -28 248 -205 59 211 -153 -243 76 -137 -357 147 182 -473 -146 142 -116 -90 90 -83 -223 273 -53
5737 -53 -342 78 155 -257 164 87 -224 37 333 -65 -38 323 205 -256 218 171 -193 67 182 -302 136 349
5759 349 -7 -11 163 113 -82 155 101 -184 350 158 -356 -146 200 -98 -21 275 47 -57 321 -54 -277 278
5781 278 269 -179 31 115 -237 -126 225 -292 -36 326 26 -397 134 178 -44 -38 -53 -263 77 404 -381 -319 169
5804 169 -60 -221 65 -104 -85 42 -99 -143 -119 387 -84 -230 143 -210 -42 278 -109 -188 212 174 -119 -99
5826 -99 269 -62 -140 376 -44 -120 390 76 -300 169 398 25 32 122 7 -43 276 -63 -261 265 -74 -259
5848 -259 148 -4 -254 196 65 -419 -36 172 -114 -320 79 -5 -52 -4 -103 -189 133 197 -287 -24 311 169
5870 169 15 250 -331 -228 390 134 -286 202 293 -87 20 269 -41 78 235 31 -104 335 299 -60 277
5891 277 65 -73 187 63 -183 149 75 -189 -125 50 109 -109 172 -4 -266 44 64 -226 -205 116 -228 -247
5913 -247 34 -231 -166 164 -129 -351 122 154 -221 72 97 -212 66 71 -203 -262 194 118 -185 210 89 -109
5935 -109 303 368 -41 66 370 -69 -244 331 -163 -7 34 68 -343 81 275 -304 -129 167 -246 -217 106
5956 106 -10 -291 107 -77 -308 217 -34 -181 -309 54 -64 -97 140 -258 -203 141 165 -341 390 252 -144
5977 -144 32 218 -38 107 198 -38 -193 199 282 -51 27 238 9 96 462 -223 72 369 -13 77 212 321
5999 321 -45 465 75 -211 142 103 -2 -109 108 32 -29 212 -65 -172 316 198 -259 72 171 -211 -33
6020 -33 42 -144 -102 211 -241 -282 170 115 -156 -187 202 -272 33 300 -344 -114 263 -137 -150 175 138 -102 106
6043 106 64 -308 134 222 -375 -74 368 146 -104 195 8 -76 240 213 -50 145 359 -144 180 125 -31 -117
6065 -117 356 174 -196 65 233 -158 -100 223 -57 -6 285 -126 -91 130 -48 -152 -65 123 -143 -93 -33 -340
6087 -340 89 218 -196 -175 291 250 -87 209 -87 -314 190 225 -124 -167 140 -63 -193 246 -115 -203 224 -99
6109 -99 -324 201 231 -184 176 159 -80 -153 43 -299 -39 266 79 -90 109 261 -432 40 176 -98 50
6130 50 48 -231 -280 205 -117 -148 71 57 -209 37 163 -306 35 145 -242 -148 145 16 -168 204 85 -291
6152 -291 143 338 -169 101 222 -113 1 231 -176 -18 341 17 -200 43 145 -144 -54 159 -60 165
6172 165 359 -171 -34 273 251 -268 366 89 -262 150 -260 -116 -38 175 76 -22 68 75 -318 65 97 -207 187
6195 187 90 -157 -28 300 -96 -270 236 -247 -183 248 5 -178 114 181 -217 -233 271 -79 130 230 -170
6216 -170 -233 317 80 -239 91 205 -13 133 220 -73 -63 219 -141 0 357 226 -179 93 69 -85 155
6237 155 269 -67 76 222 -176 -153 218 30 -206 22 -89 -206 136 126 -255 51 202 -138 -100 19 -199
6258 -199 -311 121 61 -221 -167 298 -219 -178 104 48 -153 173 -113 -80 222 150 -209 -88 162 -244 107 166
6280 166 -22 56 237 -38 -52 157 -1 -7 135 217 -184 287 428 -91 -18 340 -43 -120 188 -139 -214 210 168
6303 168 -175 84 182 -259 -132 107 -111 -68 99 -174 -183 182 -96 -204 42 -55 -287 92 174 -177 -64 84
6325 84 -336 -106 202 195 -191 236 188 -121 31 186 -47 18 176 100 2 157 30 -21 260 43 -368 143 185
6348 185 -139 -101 124 -127 -216 -2 30 -151 122 -69 -460 -54 190 -28 7 -129 -295 -168 171 101 -204 143
6370 143 56 -211 -263 36 -252 82 336 -80 -152 75 -82 -181 264 165 -167 314 202 -55 311 339 -202 -2
6392 -2 377 52 87 118 8 -42 279 152 -309 30 224 13 54 258 -74 16 105 3 -299 -19 111 -263 28
6415 28 155 -145 -82 105 -348 -29 124 -16 -173 79 99 -8 62 29 -259 227 16 -229 -88 99 190 -115
6437 -115 194 -28 -95 139 -4 37 97 247 -124 -137 83 -55 -57 258 -155 -240 215 78 -217 0 70 -138 107
6460 107 202 -222 -63 212 26 -219 215 -86 -298 60 10 -61 48 224 -134 -193 263 -30 -266 81 -56
6481 -56 -76 232 52 -292 22 207 -295 -190 103 -265 -49 193 63 -67 80 5 -209 16 319 143 -73
6502 -73 -10 83 110 349 7 -353 88 208 -168 115 -46 -24 62 367 -7 -21 296 0 -114 81 -21 -226
6524 -226 -41 98 -292 86 162 5 -287 145 -61 -118 92 -40 -153 155 118 -209 -62 116 -12 -88 305
6545 305 -72 68 228 -7 -13 46 251 -316 46 125 30 -77 147 -200 -311 172 115 -142 54 253 -32 -101
6567 -101 51 -135 17 249 -9 -2 85 146 -87 22 231 -381 128 2 -232 -151 274 -148 -227 198 -72 -114
6589 -114 106 -108 -66 266 6 -226 -13 153 -185 55 16 89 67 69 -111 -181 279 167 -86 136 99 -164 -103
6612 -103 128 -93 -122 123 46 -82 27 4 0 16 225 -186 -132 147 -38 -194 111 -161 -51 -10 -50 -186 80
6635 80 -26 -262 -74 81 77 -185 -89 -68 -15 43 66 -163 4 122 -148 -104 222 -197 -103 253 -196 -137 129 42
6659 42 -280 46 170 34 -57 103 -48 8 291 75 -159 130 0 -10 50 -21 -260 -42 148 -120 38 254
6681 254 -71 -222 -33 -75 -30 218 32 -92 221 249 -49 -44 60 -178 -101 86 -319 -196 97 115 -418 -102
6703 -102 75 -142 -68 -30 -54 -70 276 -333 -465 174 4 -121 218 -73 -122 -16 32 -209 -42 31 -79 -100 141
6726 141 -131 -55 175 6 -128 -31 15 102 135 183 -68 -11 94 -137 24 74 73 -170 162 148 -8 101 69 -89
6750 -89 -123 178 -8 -105 290 -85 -193 105 40 69 -35 328 -192 -211 328 -63 -179 144 13 -128 194 171
6772 171 -260 -24 93 -243 -24 253 130 16 45 -1 109 198 111 -59 -103 183 -79 -35 202 -141 145 231
6794 231 -274 -129 103 41 -124 -92 91 -178 -13 162 -279 -63 70 -122 -213 113 -176 -312 44 -26 -84 -75
6816 -75 56 -112 -184 226 -7 -237 -57 8 -390 2 43 -158 -71 142 2 -45 45 56 -38 327 87 -173 24
6839 24 263 -189 99 165 207 -36 -22 -165 -8 230 241 -334 102 173 -100 4 49 -112 -28 195 -78 -2 233
6862 233 17 -110 -5 22 -146 74 -7 -384 -58 112 76 -112 245 -16 14 94 42 -88 138 62 -45 -80 218
6885 218 -163 139 106 -261 13 163 -15 -247 113 158 -132 110 190 -92 56 -74 -32 -21 278 149 87 63
6907 63 141 -1 133 200 -280 -160 82 -131 -128 59 -114 -68 -19 -213 -139 -39 82 -97 -160 -86 -123 -19 44 -209
6931 -209 -177 71 13 -188 258 80 -85 3 141 -169 -152 121 -129 -114 126 114 -142 -7 164 84 218 232 -49
6954 -49 162 329 -17 -31 -10 -76 51 270 -49 -122 234 162 -286 115 303 -214 -138 236 17 -24 112 -147 76
6977 76 227 3 -196 -54 10 -48 161 -74 -109 29 -1 62 -196 72 -132 3 42 -73 -35 -66 264 -51 -89
7000 -89 201 -28 193 187 5 122 253 157 -61 -10 177 -129 -235 181 105 99 312 42 11 169 218 -133 -27
7023 -27 257 -120 -69 24 -55 -116 238 -53 -359 -80 70 -189 5 59 -203 -32 -16 -105 -224 259 265 -60 -91 187
7047 187 -169 125 213 -21 -46 212 -128 -29 186 -85 -224 44 -48 -135 103 67 -211 -106 162 56 -46 -166
7069 -166 -167 -181 161 -31 107 56 245 -164 -100 59 47 92 444 -67 -162 75 -128 -96 -35 85 -63 -68 204 -297
7093 -297 -83 262 -165 -86 63 67 -11 -110 -297 -192 -163 292 -197 -115 -206 62 -84 53 23 -169 29 88 -188
7116 -188 49 166 -141 -132 -14 -124 -23 257 -75 10 140 88 3 -4 226 -8 -41 108 57 69 73 130 55 -16 48
7141 48 -130 12 -136 -171 107 151 -328 -67 114 -99 2 98 50 -153 68 -164 -174 -56 65 -168 -178 92
7163 92 -119 -260 63 -87 -82 -22 148 -85 -36 -16 207 -49 160 24 -31 86 -147 -4 236 122 -177 142
7185 142 7 -59 76 273 13 7 13 134 90 160 -63 -74 103 97 -35 39 12 -123 -116 292 -74 -127 -38 -153 -217 294
7211 294 -4 -24 6 -43 -92 -52 35 -116 -5 3 -119 11 91 62 -102 285 156 -118 139 146 71 -57 118 28 -174
7236 -174 -80 260 -173 116 289 128 185 209 -152 -81 39 -28 -43 119 -95 -36 231 -146 -88 72 68 -70 -207
7259 -207 -56 124 -96 218 246 -139 284 -80 -69 39 119 -81 -189 40 -13 85 28 -142 -75 -25 1 62 154 142
7283 142 -218 59 -57 -110 82 115 -115 -123 210 224 -9 123 -3 -18 40 149 142 -74 358 69 -77 309 65
7306 65 -21 206 -1 -187 108 147 2 -266 199 -113 -116 159 -155 -206 62 89 -156 -41 20 -166 16 130 -156
7329 -156 -77 44 68 -42 -57 96 -8 -87 33 -296 -55 80 63 -134 -42 106 -92 220 81 -89 84 29
7351 29 65 85 235 -65 -193 276 109 86 222 -52 -14 291 125 -123 15 21 -179 -154 13 -45 -28 88 -179
7374 -179 56 23 -17 22 70 28 -138 -285 123 16 -219 95 -65 -25 184 -60 -119 -91 329 -13 -38 196 -96
7397 -96 -139 -4 234 -159 248 132 -42 70 80 -7 36 386 82 6 133 -30 -283 255 -68 -236 123 20
7419 20 -1 52 33 -56 -6 24 -21 -211 67 -46 -34 -104 -4 -116 186 49 -29 12 -89 -57 -218 140 32 -376
7443 -376 -21 -155 -110 -175 -74 -188 189 124 -1 -105 9 112 -33 47 -100 -306 158 279 82 148 292 -134
7465 -134 37 105 -43 -41 104 -71 107 -65 24 -187 20 21 -144 -279 77 -155 -180 170 -17 119 -6 99
7487 99 -83 -7 181 -145 -148 213 26 -131 115 91 123 -64 -82 -242 -137 52 -120 -32 108 -22 -144 -29 106
7510 106 -184 112 300 -139 60 177 -48 63 23 77 -30 -13 232 -53 53 25 -109 5 295 -114 -6
7531 -6 -12 -32 -42 -1 43 16 14 60 -77 19 27 -155 -55 124 -20 5 154 55 44 30 21 -55 119 -52 73 -44 101
7558 101 -256 -90 2 -137 -189 55 112 -27 125 69 -93 -133 93 21 145 0 27 -19 174 -60 -51 55 60 69 43
7583 43 -69 -90 -49 121 -137 -89 111 3 -130 15 59 -234 7 141 -131 165 64 -213 131 115 22 -113
7605 -113 -51 59 -286 38 174 -211 -13 90 -164 -11 190 -233 -93 177 -83 -263 48 78 -21 81 -66
7626 -66 -56 -60 71 -133 108 234 -160 89 101 -63 -78 -50 20 -196 306 223 -11 -178 104 -90 -83 264 152 -217
7650 -217 -20 36 -268 1 -13 -63 -1 23 -274 -185 13 -80 -181 44 35 -28 49 64 -85 -11 104 24 82 154 178 2
7676 2 -85 -65 -50 -121 85 -10 136 83 -50 21 40 121 -175 -21 -112 8 116 67 -126 -43 1 -90 -65 -7 -87 -93 164
7703 164 -35 -262 20 200 -104 -107 -124 -156 -26 23 -33 -166 55 90 -139 44 -173 -179 39 36 -194 -153 -28 -211
7727 -211 -13 206 54 -63 79 211 11 -112 23 -207 -156 -30 -128 -66 121 22 18 226 -48 28 187 -46
7749 -46 13 245 100 -194 -73 134 8 10 359 136 -58 52 4 -102 223 92 -91 -127 51 30 -364 39
7771 39 31 -137 79 192 -166 159 54 -68 -64 80 -90 -48 98 -218 -68 174 28 -62 216 9 -75 -114 196
7794 196 -125 -96 23 -17 -41 185 4 -114 109 267 79 73 61 60 -62 76 -133 15 168 -123 -67 152 78
7817 78 30 155 -32 -21 -134 46 -183 -217 17 20 -212 -5 39 -6 43 -9 -167 14 115 -173 152 -118 -117 -82
7841 -82 -5 150 -123 -18 57 -193 157 110 149 86 168 74 -18 24 66 -218 62 77 37 64 118 -63 66 62 -160 -146
7867 -146 32 -37 -294 34 15 -82 157 -36 -12 -34 -157 57 -29 -57 -146 -121 105 145 -87 -74 86 6 -23 139
7891 139 -35 -116 -150 -29 -6 181 80 -93 114 -28 -106 183 33 -25 78 155 31 -120 -3 -187 -181 -30 88
7914 88 123 151 -8 -75 22 32 -130 -25 39 93 -94 -76 -11 -135 -27 -46 -65 38 228 -60 -49 7 56 69 -14 -63
7940 -63 -194 56 41 68 64 130 -88 -98 135 81 -22 308 -128 -151 -30 89 -2 -3 54 36 -69 147 24 -167 99
7965 99 -137 -30 -14 -13 -20 243 218 -13 -28 65 74 -110 131 81 -28 48 57 -180 98 26 47 131 258 37 90 165 60
7992 60 5 -186 69 -148 -110 71 45 45 188 -403 118 86 -14 -100 111 -41 101 -27 -41 108 119 -75 -69 -79
8016 -79 82 -13 -38 44 67 61 -73 165 -244 72 73 -33 190 305 -86 -93 27 33 -65 194 236 -46 217 22 -160
8041 -160 64 38 -65 80 268 59 -89 -98 128 -146 -136 88 -119 -3 107 -19 -199 21 -64 33 1 -10 -28
8064 -28 -138 -67 -139 -27 35 0 53 -26 -79 -17 100 -37 -85 -63 -51 -210 40 -6 -12 -31 39 12 145 157 -109 -18 206
8091 206 62 2 51 109 -185 102 159 -99 -32 71 27 -51 182 87 126 89 30 -113 20 144 28 -110 148 55
8115 55 -91 75 75 -74 202 43 -181 161 -73 -91 -27 -6 -72 -216 -64 16 -53 46 95 -33 -100 -115 -65 -2 123
8140 123 -47 -66 108 83 -13 -86 294 -91 44 -68 104 -29 180 -80 30 18 -147 -173 73 -102 41 32 17
8163 17 -44 -166 225 -189 29 169 -126 -50 13 -39 -84 100 81 -203 79 148 -117 75 195 -181 -128 -16 -93
8186 -93 -108 44 80 44 138
8191A38
$$ Imaginary data points
##PAGE= N=2
##DATA TABLE= (X++(I..I)), XYDATA
0 0 0 0 0 0 0 0 0 0 0 0 0 0 0 0 0 0 -2 8 -8 8 -8 8 -8 10 -16 16 -16 19 -24 24 -29 32 -35 39 -44 50 -56 61 -67
39 -67 74 -82 92 -101 113 -125 138 -154 172 -193 218 -244 280 -324 378 -451 554 -705 958 -1453
59 -1453 2775 -12464 -39356 -11882 -6832 -19395 -18529 -15018 -17308 -3438 -4925 -25468 -20969 -3979
73 -3979 -16326 -26970 -17893 -17153 -17543 -6168 -13706 -24488 -5893 3849 -15481 -16915 -2720 -5688
87 -5688 -7553 -1806 -10424 -10344 8043 3555 -13224 -2060 8955 -967 -1634 2249 -5376 594 11482
102 11482 -3148 -11532 6351 8793 -5398 -2613 736 -3913 3369 4064 -11733 -6449 9859 -762
116 -762 -11790 -880 962 -4284 2468 -1685 -11598 2036 10651 -6493 -8595 6550 4377 -678
130 -678 4195 -810 -951 13108 8546 -6662 4348 15922 5028 2669 9091 4447 7597 16545
144 16545 4329 -2613 14244 16204 1045 4026 10310 5505 8988 10129 -2559 1703 16168 5499
158 5499 -6557 4694 8050 121 3276 1516 -6327 3534 9427 -6861 -8881 5375 2075 -5603
172 -5603 -1467 -3799 -5958 4526 470 -13797 -4274 7302 -4653 -9567 -1290 -3725 -3925 2108
186 2108 -6920 -12448 2144 3757 -11011 -8246 234 -4599 -3676 -1587 -10813 -7611 5365 -3863 -15526
201 -15526 -3609 1786 -7050 -5644 -3990 -9581 -1950 3361 -10648 -11691 3192 464 -9039 -3768
215 -3768 -2360 -5301 2828 598 -11284 -2387 9380 -2227 -7867 2407 2250 -173 4802 -975
229 -975 -5112 7881 9373 -5317 -1464 9038 3558 1602 5370 -662 900 11998 4105 -6795
243 -6795 4751 11015 426 276 4102 164 4622 8655 -3220 -4122 9710 6365 -4930 1012
257 1012 4360 55 4521 3577 -6283 1023 11052 -194 -6483 4084 4881 -292 2950 -17 -4014
272 -4014 6457 7229 -6441 -3173 8057 2179 -2698 1639 -1269 -1501 6908 251 -9539 1285 7028
287 7028 -3899 -5368 529 -2553 -803 2342 -7479 -8391 4583 1136 -10905 -4665 1001 -4593 -3105
302 -3105 -2131 -9864 -3990 4621 -5791 -11647 -381 786 -6012 -3028 -3454 -6782 1735 2867 -9778
317 -9778 -5907 6182 -139 -6241 -207 -583 -1883 4629 118 -7910 2398 8345 -2858 -4242 3996
332 3996 1377 768 4158 -2649 -3417 8282 4976 -6492 -180 6868 633 121 2425 -2667 1279
347 1279 8136 -1048 -6597 4581 5911 -2650 -327 1676 -1891 4035 4761 -5949 -3151 8362 2133
362 2133 -5437 931 2411 -343 3548 457 -5969 2571 7883 -3549 -4948 4285 2090 -936 2270
377 2270 -1903 -3461 6287 3488 -7502 -1545 6381 -581 -2838 808 -2985 -687 5084 -3290 -8209
392 -8209 2930 3990 -5914 -3743 227 -3374 -753 666 -8107 -6020 4393 -1952 -10277 -3135 -358
407 -358 -5086 -2889 -4166 -9325 -2112 2000 -9019 -10036 -35 -2117 -7252 -3561 -5475 -7064 423
422 423 -1615 -11217 -4890 3318 -3988 -6990 -1623 -3210 -2220 2418 -3851 -7235 3461 4736 -5138
437 -5138 -2374 3833 507 1412 3450 -2641 -199 9018 3208 -4314 3354 7065 1549 2732 3289 -591
453 -591 5088 8773 -1488 -2341 7852 5564 -1441 2245 2210 87 5210 3212 -5413 222 7535 -600
469 -600 -4294 1635 584 -935 2743 -2203 -5883 3461 4302 -6262 -3652 3557 -372 -1900 831
484 831 -3459 -1909 5439 -98 -7060 1149 4963 -1943 -1249 1228 -1930 1823 5039 -3697 -4506 5466
500 5466 3336 -4624 -903 1451 -1571 1485 256 -6659 -1600 4899 -3619 -7754 -592 -856 -4346
515 -4346 -2056 -4952 -8055 -534 0 -10124 -7773 -124 -4303 -7411 -4377 -6677 -6291 -184 -4999
530 -4999 -11228 -2979 743 -6695 -6579 -2282 -4378 -2342 560 -5998 -6206 3600 1459 -6374 -1743 2193
546 2193 -1081 691 861 -3994 1031 6956 -809 -4391 3735 3865 -793 1581 1062 -1640 4403 4723
562 4723 -4261 -1392 6280 1856 -2472 1352 448 -78 4281 276 -5203 2613 6167 -2264 -2470 3153
578 3153 1158 918 3098 -1850 -2005 6284 3731 -3971 854 5409 1383 1466 2672 -975 2715 7576
594 7576 302 -3079 5534 5915 -335 1533 2681 301 4291 4485 -3179 -830 6634 1551 -3410 927
610 927 1238 -783 2133 -1078 -5543 1308 4085 -4610 -5133 1112 -1044 -2970 -962 -4277 -4846 1955
626 1955 -592 -7992 -3104 1752 -3300 -4084 -1674 -4414 -2163 1965 -4318 -6966 1357 1662 -5091 -2979
642 -2979 -283 -2616 -3 498 -5353 -2739 4102 -882 -5772 -248 976 -1901 468 -995 -4664
657 -4664 1094 3914 -4283 -4320 2701 686 -2746 -206 -1609 -2222 3170 884 -5762 -629 4428 -1414
673 -1414 -2622 721 -750 -54 3150 -1746 -4059 3822 3951 -3275 -903 2870 536 1280 2398 -2386
689 -2386 -45 6162 1157 -3703 2324 4179 -53 1272 1601 -1235 2952 5023 -1821 -1855 5097 3101
705 3101 -1204 1410 1120 75 4175 2184 -3471 1229 6094 98 -1938 2509 1683 646 3378 -254
721 -254 -2263 4203 4438 -2747 -678 4079 1309 648 1842 -1421 39 5191 336 -4328 1906 4078
737 4078 -1207 -553 871 -1899 1016 3035 -3156 -3598 3366 1086 -3898 -1117 11 -1837 881 -509
753 -509 -5342 -1059 3566 -2742 -5122 427 98 -1986 -101 -2121 -3879 1900 1665 -4876 -2645 2634
769 2634 -328 -1694 157 -1610 -750 3624 -287 -4334 1779 4080 -1331 -1049 1778 -13 1364 3064
785 3064 -1762 -1822 4599 2578 -3067 484 2378 -93 1192 908 -2921 577 4388 -1466 -3606 1877
801 1877 1611 -1523 133 -819 -2515 2197 1921 -4334 -2186 3355 -260 -2737 181 -718 -973 2443
817 2443 -558 -4291 1498 3834 -2058 -1729 2060 278 594 2047 -1543 -1121 4716 2334 -3031 918
833 918 3628 425 965 1878 -1087 1493 4953 -615 -2632 3289 3219 -974 516 914 -491 2441 2134
850 2134 -3228 -959 4012 371 -2883 479 275 -962 1336 -804 -3965 905 2902 -3317 -3033 1270
866 1270 -294 -1282 148 -2343 -2508 2730 507 -4622 -587 2484 -1153 -1140 524 -1724 48 3274
882 3274 -1511 -3180 2449 2476 -2034 -392 1468 -194 1787 2047 -2529 -356 4609 728 -2763 1588
898 1588 1906 -183 1640 354 -1986 2119 3422 -2164 -2006 2777 936 -1131 587 -1108 -1442 2774
914 2774 465 -4115 -350 2860 -1198 -2068 157 -1187 -497 1723 -2007 -3474 2109 1621 -3178 -1401
930 -1401 935 -782 149 686 -2923 -847 3348 -392 -3569 888 1791 -825 269 104 -1755 1346
946 1346 2902 -2472 -1875 2966 1026 -1477 588 56 -776 2203 651 -3494 119 3369 -1187 -2232
962 -2232 679 -424 -681 1008 -1880 -3348 1927 1371 -3792 -1856 1009 -1280 -1154 -155 -3031 -1668
978 -1668 2306 -1407 -4620 -123 1129 -2147 -1423 -625 -2388 290 1561 -3159 -2804 2632 596 -2822
994 -2822 -5 542 -871 1555 605 -2823 757 3844 -761 -1820 1967 1308 -79 1665 -202 -1498
1010 -1498 3092 2615 -2367 -190 3186 552 -346 1381 -577 145 3328 -116 -3013 1735 2698 -1266
1026 -1266 -697 900 -585 590 1903 -2327 -1752 3058 948 -2787 -122 1137 -641 767 240 -2652
1042 -2652 240 3325 -1305 -2526 1708 1176 -721 789 -235 -1165 2287 2042 -2758 -539 3501 557
1058 557 -1187 1004 -49 87 2591 -140 -2623 1747 2746 -1399 -1214 1389 -228 220 1314 -1919
1074 -1919 -1539 2777 353 -3432 -486 1242 -1339 -806 -422 -2759 -389 1729 -2588 -3681 796 149
1090 149 -2732 -1109 -1243 -2505 196 108 -4161 -2054 1715 -1249 -2954 -375 -826 -1497 699 -1147
1106 -1147 -3047 907 1848 -2377 -1642 1449 -77 -395 974 -1198 -1031 2760 742 -2656 414 2788
1122 2788 -298 -46 1016 -599 929 2841 -618 -1591 2682 2232 -1089 322 1417 -17 1671 1735
1138 1735 -1865 -99 3533 419 -1888 1200 1321 -216 1464 187 -1675 1922 2579 -1573 -1122 2707
1154 2707 1076 -253 1282 -227 -206 3110 1313 -2040 1446 3489 410 21 1934 366 1216 2981
1170 2981 -321 -1020 3191 2879 -822 709 2433 636 1715 1811 -1026 576 3412 322 -1915 1362
1186 1362 1523 -395 637 89 -1359 1163 1804 -2500 -1845 1908 3 -1773 -115 -754 -1494 1000
1202 1000 -360 -3368 -417 1802 -1767 -2344 -11 -923 -847 406 -2062 -2723 1348 713 -3124 -1116
1218 -1116 1068 -1093 -515 233 -1815 -619 2298 -808 -2656 893 1460 -982 49 259 -1201 924
1234 924 1756 -1790 -1092 2616 635 -1516 539 696 -614 1333 410 -1981 836 2955 -730 -1292
1250 -1292 1496 658 -204 1270 -548 -1273 2434 1769 -2026 -176 2518 343 -153 1269 -330 497
1266 497 2858 253 -1572 2012 2643 -495 606 1798 410 1828 2519 -623 -56 3617 1691 -941
1282 -941 1373 2221 704 1862 1283 -881 1709 3677 -202 -714 2693 1751 237 1460 508 -118 2412
1299 2412 1671 -1739 263 2611 257 -645 910 3 200 1884 -351 -2080 1162 1762 -1756 -961
1315 -961 784 -578 -58 637 -2130 -1641 2051 -38 -2672 -212 690 -941 -183 -319 -1908 166 1629
1332 1629 -1917 -2107 1458 427 -1510 -63 -271 -1095 1220 830 -2290 -463 2355 -363 -1441 838
1348 838 106 -160 1386 -497 -1646 1531 1912 -1575 -816 1479 132 42 904 -940 -637 2357 265
1365 265 -2196 695 1678 -613 -218 325 -778 562 1955 -1377 -1671 1815 990 -1409 119 703 -549
1382 -549 1041 771 -1850 211 2552 -318 -1128 1243 901 -61 1530 134 -1022 2030 2332 -1005
1398 -1005 -519 2378 757 400 1357 61 317 2749 1006 -1402 1406 2467 -245 180 1254 -156
1414 -156 648 1952 -727 -1158 2248 1027 -1648 -58 714 -598 516 517 -1945 -423 1863 -936 -2257
1431 -2257 546 286 -1148 113 -542 -1588 655 832 -2363 -1219 1530 -271 -1334 106 -518 -555
1447 -555 1289 29 -2030 750 2077 -756 -728 1105 -52 63 1101 -790 -932 2065 1126 -1730
1463 -1730 116 1483 -51 436 767 -764 350 2199 -506 -1552 1291 1180 -908 291 214 -897
1479 -897 860 1202 -1798 -589 2110 122 -1344 521 31 -675 1191 -259 -2060 543 1428 -1262
1495 -1262 -917 1114 126 -280 684 -691 -821 1861 785 -1674 354 1764 -224 -39 697 -592 326
1512 326 2078 -455 -1423 1722 1186 -863 247 513 -370 894 1003 -1617 -396 2107 -40 -1549
1528 -1549 373 470 -427 504 -450 -1775 450 1161 -1749 -1507 781 -309 -1139 -69 -1180 -1321 1041
1545 1041 -158 -2707 -501 1070 -876 -1118 153 -1031 -371 879 -1346 -1816 1198 1052 -1661 -376
1561 -376 749 -233 632 795 -1039 -137 2304 271 -1324 966 1417 -144 808 554 -696 1398 2092
1578 2092 -885 -667 1886 719 -329 798 202 -298 1588 609 -1580 686 1891 -437 -538 871
1594 871 -183 77 1142 -526 -1454 1443 1110 -1413 -310 1172 -205 63 829 -1148 -271 1905 -112
1611 -112 -1715 755 1198 -565 187 671 -425 922 1525 -1087 -474 1884 524 -755 564 454 -328
1628 -328 1245 357 -1548 438 1989 -425 -927 701 81 -645 524 -600 -1163 924 657 -2195 -870
1645 -870 805 -691 -1086 -160 -1419 -1004 798 -1204 -2509 47 564 -1552 -1001 -344 -1251 -239 484
1662 484 -1777 -1205 1043 -216 -1988 53 173 -848 410 -5 -1348 197 1582 -755 -1075 1137
1678 1137 680 -158 734 90 -495 1581 1354 -1387 80 2002 332 -74 910 266 334 1705 137 -986
1696 -986 1400 1616 -704 -210 1238 70 696 1172 -772 -142 1966 517 -1401 822 1276 -202 540
1713 540 606 -796 553 1745 -606 -775 1406 994 -342 623 321 -316 1425 1138 -1095 257 2039
1730 2039 206 -492 1010 379 241 1368 213 -967 1268 1538 -749 -329 1242 31 101 756 -664
1747 -664 -259 1661 248 -1223 312 1110 -618 -353 312 -936 305 1111 -1136 -1573 914 245 -1288
1764 -1288 -189 -306 -1092 502 89 -1952 -538 925 -886 -1677 295 -309 -857 46 -775 -1686 428
1781 428 680 -1522 -880 796 -193 -648 320 -754 -639 1248 113 -1636 201 1417 -475 -335 613
1798 613 -128 497 1304 -571 -820 1653 1097 -818 470 1062 136 789 804 -777 321 1999 96 -672
1816 -672 1148 889 -15 1038 283 -613 1288 1495 -1064 -217 1647 463 -274 609 -26 -313 1203 181
1834 181 -1243 813 1510 -317 -237 1049 235 344 1330 -425 -327 1785 971 -926 631 1206 167 899
1852 899 856 -504 529 1950 -14 -775 1266 1079 -115 625 418 -274 1131 1142 -889 -322 1520 -127
1870 -127 -728 453 163 -329 549 -108 -1302 494 911 -1230 -1133 267 -417 -502 205 -899 -989 836 -4
1889 -4 -1732 -630 673 -506 -540 96 -931 -142 1184 -635 -1466 830 729 -885 17 285 -320 640
1907 640 696 -1125 -435 1667 137 -944 856 441 -152 901 247 -798 714 1314 -778 -423 1093
1924 1093 259 -267 606 -134 -471 1189 442 -1152 85 1150 -367 -342 246 -512 30 1150 -623 -1164
1942 -1164 832 788 -888 -9 560 -222 347 855 -932 -77 1713 151 -781 675 770 -100 700 498
1960 498 -392 704 1397 -359 -334 1641 748 -149 712 333 -58 1415 662 -1057 123 1664 -292 -531
1978 -531 495 -43 30 836 -349 -911 1037 701 -1099 -528 552 -313 -188 167 -989 -435 1114 -472
1996 -472 -1590 157 463 -737 -254 -180 -730 175 812 -1212 -813 957 179 -885 100 -55 -440 833
2014 833 372 -1217 172 1404 -440 -817 815 21 73 884 -238 -662 1129 785 -854 -1 1016
2031 1016 67 -7 467 -341 2 1187 81 -1154 517 858 -802 -106 277 -528 361 713 -1040 -975
2049 -975 973 -19 -1134 75 148 -558 343 -9 -1135 87 1079 -781 -1018 512 77 -531 229 -278
2067 -278 -770 854 618 -1034 -218 1249 -22 -346 574 -259 98 1053 -121 -1042 778 1089 -626 -281
2085 -281 736 -264 211 616 -986 -420 1219 -85 -964 141 516 -393 224 -223 -1038 101 959 -1083
2103 -1083 -1227 542 -2 -708 -88 -342 -771 494 38 -1376 -403 1026 -550 -634 231 -176 -422 749
2121 749 -204 -1215 803 731 -857 -166 761 -103 229 700 -355 -133 1352 406 -717 438 1029 -65
2139 -65 316 513 -311 608 1157 -363 -541 1123 605 -359 437 210 -193 661 460 -1069 95 1287 -213
2158 -213 -670 508 302 -515 455 -439 -1084 764 656 -834 -383 699 -333 -192 343 -540 -341 872
2176 872 56 -1300 271 883 -379 -129 280 -384 248 764 -714 -725 1235 468 -681 180 309 -234
2194 -234 415 346 -956 95 1152 -470 -767 482 229 -326 248 -189 -811 645 519 -1189 -594 693
2212 693 -403 -716 -88 -594 -690 496 -367 -1463 67 454 -904 -635 78 -565 -81 275 -1077 -992 848
2231 848 187 -1086 -113 577 -347 107 225 -758 24 1127 -251 -530 971 697 -243 378 428 -83 775
2250 775 946 -561 77 1408 405 -307 734 242 21 1124 296 -558 767 1182 -131 -114 869 208
2268 208 131 704 -185 -267 1149 607 -935 83 811 -171 -26 373 -432 189 966 -309 -623 630 825
2287 825 -431 140 275 -216 690 676 -772 -59 1128 194 -579 512 432 42 668 119 -634 745 1099
2306 1099 -422 -308 877 208 -248 357 -292 -217 1080 389 -952 -117 780 -359 -485 431 -767 -161
2324 -161 636 -751 -1085 411 188 -1071 -237 0 -570 -167 -11 -1174 -362 878 -368 -1291 -43 19
2342 19 -672 -34 -241 -968 275 531 -877 -693 871 3 -367 227 2 -229 720 258 -854 214 1141
2361 1141 -51 -255 708 70 180 978 -109 -540 1044 925 -441 106 877 27 301 595 -492 261
2379 261 1383 42 -729 692 783 -76 180 208 -349 691 988 -834 -417 852 244 -555 119 265 -133
2398 -133 776 278 -699 590 1265 -216 -341 903 316 187 688 -37 -286 1195 868 -535 343 980
2416 980 118 498 712 -382 216 1182 108 -580 743 863 -376 86 323 -259 249 552 -737 -424
2434 -424 968 45 -949 175 89 -439 188 -73 -1069 -93 605 -854 -1002 254 32 -658 -239 -607 -881
2453 -881 433 306 -1268 -466 771 -499 -543 219 -501 -240 584 -314 -1041 703 827 -710 -159 284
2471 284 -131 289 535 -351 -435 1305 291 -639 472 569 -244 314 313 -652 369 1312 -303 -694 740
2490 740 335 -383 257 106 -197 843 527 -814 -36 1100 -233 -430 325 -161 -263 640 -127 -526 647
2509 647 842 -644 -169 541 -257 160 599 -543 -223 968 281 -726 377 786 -197 272 313 -324 453
2528 453 1094 -346 -308 1008 518 -229 408 178 -160 753 531 -674 280 1122 -260 -424 577 113 -121
2547 -121 434 -122 -837 527 504 -851 -554 453 -346 -266 157 -772 -313 780 -166 -1135 110 528 -509
2566 -509 -253 162 -624 78 494 -707 -940 896 208 -884 79 188 -272 413 376 -756 198 1077 -156
2585 -156 -551 764 551 5 321 -29 -387 716 565 -633 -295 872 68 -184 250 -101 -180 922 18
2604 18 -994 316 674 -720 -342 393 -440 -130 380 -699 -491 751 203 -1023 -141 202 -149 115
2622 115 -216 -892 -66 924 -580 -716 591 382 -603 23 50 -462 557 671 -690 -60 1136 -24
2640 -24 -220 532 -12 -101 706 65 -872 575 811 -511 -133 428 52 64 374 -440 -424 959 73 -1041
2660 -1041 -117 470 -484 -246 54 -689 -179 701 -556 -958 417 196 -750 -310 145 -664 302 450 -932
2679 -932 -408 862 -110 -826 200 -14 -367 464 -34 -751 376 806 -538 -351 791 303 -39 717
2697 717 -148 -156 1009 410 -852 337 962 -87 161 609 -330 180 1022 -283 -572 891 602 -563
2715 -563 195 447 -232 171 365 -777 -162 876 -146 -860 288 249 -456 207 -162 -862 321 544 -768
2734 -768 -573 509 -36 -530 214 -302 -517 587 253 -1001 245 833 -537 -327 490 -141 119 726
2752 726 -321 -572 860 492 -803 109 524 -245 -33 399 -726 -213 874 -347 -937 517 222 -668
2770 -668 208 -57 -835 256 648 -960 -622 506 -213 -838 -90 -180 -564 297 -21 -1223 -129 540 -547
2789 -547 -343 256 -384 -387 332 -510 -833 836 369 -1030 -195 783 -216 -13 412 -67 13 1147 -40 -697
2809 -697 876 792 -115 368 732 7 592 1007 -343 -74 1093 476 -295 700 391 -94 802 492 -515
2828 -515 392 1102 -298 -360 639 185 -196 519 -138 -268 654 681 -818 -66 790 -133 -223 369 -231 -142 748
2849 748 -226 -731 639 713 -525 11 337 -489 190 592 -331 -341 921 223 -778 291 477 -153 387
2868 387 276 -704 324 847 -538 -399 784 355 -381 231 -98 -365 653 345 -997 -145 632 -249
2886 -249 -557 215 -357 -367 416 -583 -1243 235 454 -857 -266 292 -361 -199 167 -773 -584 834 -287
2905 -287 -1094 55 339 -552 -162 86 -572 239 746 -600 -603 795 402 -467 192 270 -151 832 630 -684
2925 -684 232 1319 22 -200 656 373 96 800 157 -509 974 827 -514 202 845 139 62 614 -211
2944 -211 -145 1134 245 -851 275 594 -317 132 364 -356 327 661 -308 -552 932 446 -679 103 145
2963 145 -167 408 614 -567 282 964 16 -525 797 523 -47 544 23 -421 754 775 -436 -155 914
2982 914 2 -121 665 33 -156 976 99 -800 560 867 -303 -241 427 -438 294 696 -415 -654 742
3001 742 130 -914 2 103 -728 -189 160 -1039 -299 715 -396 -879 303 9 -735 -35 -148 -627
3019 -627 308 615 -1082 -421 746 -165 -556 238 -151 -281 570 -191 -728 437 710 -331 -207 687 138
3038 138 99 738 -131 -276 987 355 -545 364 773 40 284 588 -389 61 1056 -216 -614 611 419
3057 419 -548 326 143 -359 384 460 -785 -403 716 -140 -654 421 126 -348 536 27 -920 270 859
3076 859 -557 -294 632 164 -35 385 -26 53 919 465 -612 268 845 -244 264 646 -168 257 898
3095 898 -202 -371 1009 600 -297 132 422 -154 443 676 -533 0 930 5 -651 353 131 -405 175
3114 175 -103 -759 189 490 -732 -620 484 -13 -658 177 -412 -553 590 49 -1068 61 584 -630
3132 -630 -409 261 -375 -232 559 -455 -742 595 490 -752 -65 486 -217 139 395 -317 -48 1078 216
3151 216 -633 607 623 -43 247 247 -474 407 788 -456 -369 888 124 -357 188 44 -243 603 268 -779
3171 -779 118 680 -317 -531 446 -218 -331 460 -528 -893 404 244 -1100 -324 310 -378 -115 337 -595
3190 -595 -116 596 -158 -876 420 420 -625 208 310 -342 363 501 -375 -349 824 361 -453 88 158 -113
3210 -113 431 77 -822 60 1001 -400 -481 626 61 -168 363 -162 -481 637 415 -854 -63 540 -347
3229 -347 -258 279 -611 -440 735 -135 -973 158 338 -840 -217 66 -397 -50 410 -767 -552 721 -66
3248 -66 -790 71 278 -366 400 301 -668 349 992 -142 -566 669 346 -162 612 252 -242 637 468 -641
3268 -641 305 893 -29 -109 525 209 2 784 197 -543 586 670 -376 -309 544 -413 364 418 -601 -374
3288 -374 667 -44 -813 -49 201 -503 -134 237 -656 61 284 -536 -731 407 197 -703 258 22 -393
3307 -393 302 503 -666 -115 779 -208 -542 332 -80 -25 556 58 -544 756 647 -384 -253 540 -49
3326 -49 -152 419 -255 -305 726 178 -861 260 385 -414 -33 195 -410 -3 545 -494 -692 424 141
3345 141 -745 -7 -41 -495 262 3 -964 -224 492 -309 -603 334 -138 -397 430 -48 -618 478 493 -715
3365 -715 -176 590 74 -94 344 -126 -177 973 405 -589 479 808 -138 34 440 25 296 622 -2 -230
3385 -230 908 667 -476 157 490 156 337 395 -426 -28 973 -228 -508 558 129 -316 414 50 -382
3404 -382 344 455 -619 -387 613 -190 -565 183 -184 -342 598 31 -755 111 635 -518 -375 418 -206
3423 -206 23 519 -363 -334 634 315 -687 119 358 -130 235 263 -339 -2 739 -172 -541 614 169 -391
3443 -391 190 150 -553 183 434 -717 -206 618 -138 -434 143 -45 -580 205 -220 -599 -51 411 -579 -634
3463 -634 49 -125 -297 64 -459 -683 610 49 -756 -155 479 -285 -167 218 -245 -60 728 -86 -441 636
3483 636 348 -418 91 328 -104 293 559 -260 89 1035 158 -428 571 492 174 647 339 -438 446 784
3503 784 -173 -159 602 84 -195 455 -56 -74 735 172 -850 332 711 -121 -168 279 -35 34 719 -233 -478
3524 -478 434 397 -533 34 429 -230 106 268 -245 -194 713 -82 -540 388 326 -93 166 121 -438 201 537
3545 537 -483 -106 734 74 -302 429 57 -58 524 67 -566 148 727 -246 -204 280 -285 13 338 -278
3565 -278 -692 384 289 -759 -60 364 -427 -334 120 -793 -405 393 -279 -867 -52 262 -638 -139 27 -557
3585 -557 -99 264 -626 -391 704 33 -570 337 225 -201 381 276 -592 222 953 -203 -305 568 250
3604 250 66 453 -59 -295 782 572 -670 29 807 68 28 408 -220 -155 802 3 -714 535 582 -528
3624 -528 90 296 -453 74 331 -569 -443 704 117 -737 133 201 -400 52 260 -823 -69 498 -479 -338
3644 -338 337 44 -205 284 123 -352 484 349 -538 87 580 -82 -40 521 21 -1 656 -21 -436 546 633
3665 633 -425 -45 538 -232 113 447 -535 -423 735 131 -529 91 261 -229 -44 -5 -507 -25 493 -450
3685 -450 -632 466 8 -586 -22 -73 -635 175 230 -782 -94 597 -321 -473 -7 -169 -218 294 -38 -588
3705 -588 333 508 -519 -170 574 -217 -104 595 -330 -199 785 145 -428 496 375 -128 23 198 -248 229
3725 229 699 -362 -215 491 366 -184 -10 290 -208 428 203 -645 -19 707 -198 -699 386 45 -236
3744 -236 234 -72 -702 200 474 -829 -367 322 -9 -308 208 -369 -165 594 9 -810 117 436 -374 -94
3764 -94 90 -338 83 675 -311 -432 586 474 -345 271 307 -167 260 308 -436 22 639 -317 -373 161 296
3785 296 -257 219 230 -522 312 306 -603 -190 368 -218 -496 84 -190 -297 367 -108 -799 53 467 -472 -333
3806 -333 250 -139 -38 336 -457 -495 542 335 -471 70 533 -248 35 341 -309 32 899 -12 -645 581
3826 581 519 -200 440 419 -78 680 484 -400 -63 721 -51 -153 330 171 -128 593 248 -547 375 698 -416
3847 -416 -172 557 114 -260 138 -443 -553 331 -9 -701 -44 306 -468 -244 70 -523 -231 528 -84 -615
3867 -615 270 -11 -486 83 61 -379 169 484 -403 -260 591 -94 -248 219 125 -201 264 95 -527 232 437
3888 437 -453 -329 355 -13 -257 100 -181 -290 543 270 -723 -211 721 -362 -390 325 -95 -234 362 -313
3908 -313 -457 319 329 -602 -31 241 -637 0 173 -488 -340 372 74 -517 269 246 -374 190 214 -361 137
3929 137 544 -351 -102 477 -22 -303 331 93 -133 485 321 -295 355 802 -278 66 428 27 106 568
3949 568 4 -127 649 626 -363 6 433 -241 187 669 26 95 741 -87 -486 457 325 -345 78 27 -140
3970 -140 162 400 -235 -313 404 -130 -482 155 -25 -338 184 71 -676 50 595 -509 -447 366 -211 -404
3990 -404 244 -120 -443 571 311 -563 -114 499 70 -220 289 -156 -67 594 97 -458 395 398 -243 -50 295
4011 295 -143 -82 402 -534 -378 557 80 -507 246 128 -364 96 44 -643 -111 535 -433 -542 174 -20 -227
4032 -227 47 -118 -567 299 34 -668 -171 295 -180 -387 88 -196 -40 579 74 -458 379 620 -191 193
4052 193 496 -136 187 634 -180 100 674 437 -383 517 413 -136 284 481 -210 186 644 -467 -453 484
4072 484 281 -366 241 126 -244 299 333 -402 -62 505 -281 -437 268 -87 -267 283 -152 -667 -39 294
4092 294 -372 -170 340 -166 -117 455 -158 -132 633 345 -290 355 483 -69 287 297 -49 277 627 -76 -298
4113 -298 533 156 -235 127 257 -224 73 248 -549 -101 470 -140 -527 292 64 -215 175 -42 -705 302
4133 302 265 -651 -409 270 -310 -425 109 -302 -483 491 106 -701 39 386 -310 -152 407 -419 -81 570
4153 570 -202 -471 622 258 -255 292 481 -116 274 415 -164 118 649 -64 -350 582 323 -175 359 166
4173 166 -538 344 349 -171 -61 478 86 -260 310 -28 -351 588 195 -375 303 595 -200 -70 330 -153 -309
4194 -309 470 -460 -439 337 225 -687 -163 127 -140 108 332 -304 -91 464 -139 -465 307 268 -284 216 106
4215 106 -283 183 412 -585 -403 600 130 -285 180 136 -196 560 138 -554 73 509 -379 -186 389 -70
4235 -70 -149 298 -235 -492 515 341 -643 -72 130 -295 21 338 -357 -281 440 -82 -597 401 220 -617 -23
4256 -23 -20 -425 3 323 -450 -183 438 -123 -341 148 278 -163 253 182 -361 190 531 -328 -300 515 101 -95
4278 -95 474 96 -162 487 359 -518 273 774 -178 -27 274 -104 -3 656 6 -526 483 617 -365 -43
4298 -43 363 -340 186 376 -345 -280 685 257 -600 214 100 -468 26 94 -495 -119 570 -293 -433 300 -29
4319 -29 -372 211 -18 -330 2 178 -631 -127 488 -191 -244 256 -175 -60 605 -120 -635 436 347 -420 -44
4340 -44 373 -2 10 454 -447 -231 719 -2 -538 281 363 -314 126 86 -338 272 460 -386 -290 570 142 -621
4362 -621 242 100 -339 253 219 -540 -66 607 -254 -368 473 15 -7 262 -49 -582 251 330 -503 -32 440
4383 440 -101 -22 383 -195 -353 619 243 -432 395 549 -279 196 281 -182 29 704 -305 -178 632 273
4403 273 -198 360 272 -165 226 375 -416 101 472 -319 -273 274 -94 -365 26 -181 -437 257 210 -584 -326
4424 -326 373 -176 -308 197 -246 -312 295 28 -924 89 363 -540 -122 252 -258 -154 351 -260 -412 115
4444 115 193 -365 234 270 -213 153 316 -423 -13 552 -176 -353 464 107 -414 345 203 -44 320 445 -501
4465 -501 -153 559 -168 -251 345 41 -237 302 38 -733 131 248 -500 -142 327 -313 -284 243 -431 -561 415
4486 415 2 -620 31 437 -289 -44 185 -314 -55 769 -51 -440 618 510 -77 435 200 -186 472 659
4506 659 4 136 703 274 -116 490 358 -159 478 383 -368 281 814 -430 -147 358 -92 -72 335 -116
4526 -116 -334 439 120 -725 45 136 -406 -411 159 -340 -59 183 -454 -504 141 146 -550 44 96 -416 98 33 -558
4549 -558 -190 520 -260 -500 282 234 -272 376 421 -164 260 458 -299 -312 559 103 -170 410 -46 -333 516
4570 516 160 -617 91 435 -183 -58 272 -26 -289 515 -95 -521 242 168 -632 -276 294 -384 -9 116
4590 116 -365 -233 556 -313 -572 109 198 -262 90 139 -275 225 381 -470 -209 644 266 -274 372 217 -86
4611 -86 544 285 -275 302 729 -128 -120 456 75 -56 675 105 -494 503 356 -344 342 551 -276 -36 404
4632 404 -49 -256 404 34 -413 390 199 -192 94 47 -359 188 453 -495 -442 391 42 -439 105 98 -341
4653 -341 330 256 -843 22 492 -562 -238 316 -160 -314 312 -112 -464 277 250 -577 -22 353 -160 -32
4673 -32 469 -271 -97 411 -75 -509 422 393 -262 -24 152 -237 60 407 -408 -39 445 -141 -487 215 133
4694 133 -155 187 158 -346 97 560 -108 -316 319 104 -323 121 94 -341 236 203 -479 -231 286 -203 -312
4715 -312 97 -342 -283 266 -153 -564 227 362 -530 -228 339 -168 70 156 -131 -177 470 88 -227 253 223
4736 223 -185 249 141 -167 230 653 -275 -410 532 277 -226 310 363 -254 434 390 -423 17 417 -172 -319
4757 -319 408 184 -207 350 -154 -436 226 316 -545 -150 171 -394 -181 264 -37 -252 387 -151 -478 31
4777 31 199 -200 -105 198 -335 118 235 -158 -136 515 305 -411 154 225 -75 217 222 -303 -28 607 73 -217
4799 -217 492 17 -152 228 58 -337 203 338 -471 -221 337 -125 -361 303 -10 -306 215 64 -525 58
4819 58 397 -284 -186 338 -92 -204 260 -264 -287 381 167 -476 -40 210 -518 77 194 -571 -218 532 23
4840 23 -327 149 461 -327 250 124 -289 101 436 -288 -83 609 69 -137 313 106 -162 521 127 -516
4860 -516 22 420 -77 -108 329 -72 21 313 -175 -244 234 131 -648 -40 164 -480 -45 151 -472 -234 543
4881 543 -135 -520 261 253 -305 60 228 -351 53 342 -313 -357 434 35 -482 253 65 -98 304 89 -238
4902 -238 188 630 -262 -23 483 151 -118 414 199 -325 286 352 -375 -3 534 -152 -7 191 -162 -113 191
4923 191 -224 -574 271 185 -551 -105 179 -309 51 133 -391 -230 439 -134 -576 30 211 -430 27 36 -401
4944 -401 -43 322 -339 -196 515 255 -216 250 207 -224 340 265 -490 180 488 35 54 413 -38 -13 361
4965 361 54 -218 292 336 -349 -9 378 -86 141 345 -377 -96 344 34 -565 120 282 -227 -47 -119 -358
4986 -358 -41 253 -276 -430 168 31 -397 -39 -92 -375 67 73 -522 -162 366 -212 -237 162 -174 -92 324 44
5008 44 -559 556 245 -243 43 295 -166 -86 278 -121 -80 416 71 -280 405 456 -69 77 354 -108 136
5029 136 331 -361 -421 394 127 -288 98 134 -261 63 173 -357 -173 225 -199 -335 197 144 -337 225 166
5050 166 -288 161 213 -365 -172 235 -22 -160 222 85 -12 501 -48 -386 240 275 -186 -61 394 -113 290
5071 290 265 -198 -80 512 156 -331 279 239 -301 124 308 -269 -49 704 -152 -321 202 134 -347 229 -70
5092 -70 -232 321 435 -354 -163 135 -143 -285 29 -97 -309 101 -88 -426 273 359 -381 -205 163 -211 -117
5113 -117 108 -219 -230 272 19 -392 36 285 -72 -88 195 -74 -72 656 -71 -411 390 92 -124 265 325 -170
5135 -170 186 255 -282 66 511 -182 -250 240 113 -229 155 6 -236 -110 299 -362 -110 308 4 -338 157
5156 157 -220 -495 237 -9 -288 45 266 -379 -206 144 -247 -156 173 -281 -250 185 263 -431 168 183 -151
5177 -151 106 173 -30 -11 388 103 -352 217 139 -336 190 242 -148 249 409 -12 99 514 14 -241 227
5198 227 -29 -151 339 282 -501 53 181 -181 -84 231 -35 -71 315 -103 -254 304 42 -333 270 140 -185
5219 -185 139 165 -203 -222 235 -106 -491 185 95 -272 299 171 -416 138 381 -395 -193 376 107 -235 182
5240 182 -74 -184 415 -10 -264 1 484 -184 -80 265 -87 187 286 -33 -160 310 335 -355 -10 217 -146
5261 -146 67 165 -187 -97 488 104 -444 185 73 -310 15 182 -250 107 184 -440 -196 319 -67 -241 69
5282 69 219 -1 116 136 -269 -73 428 -142 -302 231 -34 -118 214 -67 -262 209 413 -475 -174 282 -46
5303 -46 37 264 -157 -207 358 -98 -240 131 256 -214 38 167 -176 14 478 -127 -109 265 89 -244 200
5324 200 133 -224 142 31 -435 209 463 -286 -345 308 -86 -179 -45 -49 -270 279 39 -319 -294 479 33 -222
5346 -222 108 -156 -126 404 77 -357 187 69 6 46 230 -208 140 112 -241 -194 250 110 -386 6 283 -39
5368 -39 153 82 -261 114 238 -166 -171 190 221 -75 120 -81 -147 55 87 -310 -187 397 -10 -324 115 -81
5390 -81 -213 158 -328 -365 219 310 -348 -79 258 -114 -171 76 -70 -328 292 91 -234 87 307 -178 115
5411 115 139 -29 223 367 -199 -408 161 211 -213 99 164 -125 290 295 -131 22 428 -80 -391 234 -51 -217
5433 -217 161 -124 -278 2 137 -326 -97 211 -136 -182 54 -58 -35 217 12 -415 21 227 -154 247 132
5454 132 -159 -61 377 -41 -369 197 203 -170 173 198 -183 103 206 -113 70 500 -83 -178 163 208 -164 181
5476 181 112 -100 170 265 -344 -62 253 -205 -221 214 -110 -126 301 74 -325 -25 225 -266 -176 13 -184 -122
5498 -122 87 -306 -395 227 86 -506 -98 164 -161 -36 130 -350 -29 395 -112 -407 137 109 -307 85 73
5519 73 47 280 145 -245 120 341 84 -73 419 -67 -55 320 11 -211 -30 64 -55 117 305 15 -90
5540 -90 122 -52 -284 260 -46 -255 -107 43 -196 -61 72 -200 -183 259 -22 -398 211 1 -260 -154 33
5561 33 -194 221 96 -203 -203 350 9 -194 236 113 -339 134 78 -356 56 331 -154 -185 480 -28 43 224
5583 224 103 -51 393 226 -280 95 277 -3 -101 338 -213 111 326 -80 -150 115 88 -214 -213 -45 -141 155
5605 155 200 -373 -134 308 -117 -458 41 86 -215 41 105 -229 -83 120 -244 -188 268 -107 -367 153 58 -174
5627 -174 -36 373 -328 123 640 -249 -134 129 -16 -102 286 102 -181 320 158 -278 -106 275 -283 90
5647 90 158 -133 -116 378 -101 -374 190 22 -160 73 60 -315 -57 246 -265 -390 152 21 -470 164 37
5668 37 -216 37 197 -396 95 222 -186 -286 279 -12 -160 129 93 -82 335 175 -253 25 238 -177 39
5689 39 60 -34 -113 310 106 -391 17 227 -147 1 121 -247 63 203 -182 -257 352 -49 -305 130 107 -307
5711 -307 44 126 -435 -145 421 -121 -337 267 -8 -116 31 19 -313 69 130 -344 29 439 -90 -177 368
5732 368 -131 -50 157 10 -273 150 284 -300 -109 146 58 -46 264 -40 -223 452 167 -549 83 312 -145
5753 -145 90 285 -206 -4 308 -79 -229 131 114 -230 22 50 -108 109 174 -325 -84 140 -130 -269 242
5774 242 0 -158 144 150 -241 113 266 -307 -146 142 -37 9 -88 -183 -245 325 -116 -236 36 40 -52 176 56
5797 56 -5 228 395 -168 -226 297 293 -301 169 236 -332 220 194 -111 -36 347 -102 -135 304 27 56 51 165 -357
5821 -357 389 102 -155 -58 358 50 -70 196 -111 -322 198 100 -398 99 102 81 51 318 -336 -129 232 -311
5843 -311 -280 148 -96 -347 39 6 -579 -117 108 -163 -300 192 -116 -194 292 -27 9 5 66 -172 377 497
5865 497 42 16 500 -79 -154 256 -11 -35 506 125 -312 228 255 -175 -16 292 -221 -101 184 104 -211 -76
5887 -76 -69 -280 -65 125 -242 -164 142 -306 -85 111 -159 -347 148 -14 -401 -74 -19 -339 87 88 -223 -108
5909 -108 125 67 -249 91 128 119 197 153 -160 76 266 -29 131 320 63 -179 385 110 -116 209 300 103
5931 103 94 278 86 -152 169 -130 47 297 -200 -408 202 264 -157 -59 211 -238 -20 160 -259 -87 92
5952 92 -18 -297 57 152 -160 223 143 -433 -43 237 -172 -278 425 8 -244 273 70 -350 288 208 -72
5973 -72 186 369 37 -235 131 84 69 411 -25 -388 187 16 8 -112 183 20 -45 270 -107 -140 359 -44
5995 -44 -245 157 126 -274 6 36 -179 -143 190 -216 -373 342 -62 -363 71 -28 -265 262 86 -389 -122 409
6017 409 -280 -231 163 -116 -177 165 -12 -264 190 252 -423 219 269 63 -11 372 48 -143 196 -82 -264 70
6039 70 148 -45 7 116 -106 98 445 -249 -160 366 228 -92 -5 -125 -47 85 124 -132 10 208 -301 -112
6061 -112 151 27 -143 336 -18 -172 198 386 -77 -192 259 -178 -94 31 -39 -170 179 -69 -191 266 199
6082 199 -160 5 192 -233 14 156 35 -141 325 91 -24 132 238 -109 41 176 65 142 320 5
6102 5 -278 220 -107 -121 -89 -5 -172 -121 72 -173 -198 144 52 -204 -47 -289 -93 125 -100 -276 101 142 -219
6125 -219 -272 284 -4 -230 332 -145 -342 367 26 -207 196 154 -107 30 162 -131 7 484 -179 -4 158
6146 158 23 -225 224 66 -223 -5 26 -189 -274 350 -14 -203 -30 -18 -167 269 -115 -215 -8 165 -234
6167 -234 -146 250 -32 -132 125 -176 -254 124 71 -108 -9 151 -159 -77 -11 -128 8 221 -120 -91 -39 85 -20
6190 -20 80 163 -113 -38 186 -83 -313 299 104 -64 131 69 -58 19 56 -72 65 292 -163 -340 118 -65
6212 -65 -58 260 -191 -183 294 231 -273 61 227 -127 -93 278 -97 -69 329 -238 -562 219 105 -433 68 199 -172
6235 -172 -135 108 -190 -100 273 85 -266 -59 123 -357 70 -16 -436 18 219 -338 -242 311 132 -241 86
6256 86 -141 -287 293 -44 -308 -180 290 -73 -2 415 17 -1 290 271 49 68 180 -243 129 255 -46 -30
6278 -30 160 -82 1 170 122 -95 318 243 -130 69 95 -360 78 133 -125 -338 155 127 -337 5 -104 -36 -81
6301 -81 18 -206 30 291 -111 -186 173 -53 -234 182 -88 -205 70 162 -238 -112 244 31 -78 -10 -147 66
6323 66 426 178 -175 99 252 -225 93 265 -93 135 213 -237 21 246 -29 -212 33 158 -259 25 -59
6344 -59 -283 -77 208 -281 -143 83 -127 -165 92 -38 -463 49 141 -344 -254 218 -158 -108 -16 10 -49 188 -3
6367 -3 -272 260 107 -177 -16 65 -62 32 279 -90 72 290 -76 -197 -98 16 -140 67 212 -61 2 241
6389 241 -172 -116 199 139 -175 -56 -71 -91 158 85 -110 40 252 -82 -100 115 28 -213 25 -23 -121 33 4
6412 4 -298 -87 200 60 -146 -18 7 31 290 -106 -98 264 95 -157 5 270 -25 76 195 -49 -243 280
6434 280 289 -232 248 98 -25 -215 137 -69 43 218 -19 -278 1 -37 -72 178 4 -51 64 19 -164 -108
6456 -108 175 -115 -138 155 -61 4 55 -134 -243 46 61 26 43 93 -30 19 106 -163 -255 226 -63 -213 198
6479 198 60 12 128 91 -25 53 187 -3 -158 118 123 56 32 -69 -240 119 170 -69 -31 96 -5 -59 130
6502 130 97 -83 169 -39 -164 148 60 -73 -79 50 -5 -159 254 87 -83 137 185 -175 -99 -48 -91 246 -5
6525 -5 -182 -74 154 -156 -100 60 13 -169 -67 -12 -67 -25 193 -115 36 125 34 -30 210 21 -66 232 110 -237
6549 -237 -31 300 -149 -79 238 9 69 257 -153 -306 223 146 -12 -1 76 -56 17 297 -32 -143 344 -89
6571 -89 -33 -42 125 -263 -16 -3 -91 47 86 -194 -340 260 86 -12 -130 -162 -153 173 -26 -177 -72 267 -130 -101
6595 -101 35 146 -77 117 -83 -170 443 167 -136 99 200 -99 -53 188 -120 -103 204 182 -221 67 111 -244
6617 -244 29 45 -99 -106 183 -281 -214 171 -76 -159 107 77 -91 216 142 -104 -68 280 -139 -217 142 -36 -135
6640 -135 41 -128 -179 45 57 -207 77 52 56 -57 27 8 6 28 95 -203 130 132 -242 114 328 39 112 270 -87
6665 -87 34 380 27 -27 221 167 -7 -34 113 -124 -61 299 -245 -151 169 7 -120 182 64 -195 -13 75
6687 75 -267 146 179 -29 -278 120 -167 -164 249 -26 -233 53 83 -146 -30 59 -271 -134 309 -62 72 112
6709 112 -33 -56 37 294 -199 70 271 9 95 134 -217 -68 132 -76 -161 -28 168 -39 121 210 -92 -111
6731 -111 119 -161 -161 -21 -27 -235 40 -77 -347 -35 182 -125 -107 172 -122 -120 12 -275 -79 143 30 -391
6753 -391 167 348 -218 -93 -47 -19 60 135 -56 24 165 -11 -320 116 -148 -131 -14 74 -25 -113 88 82 -211 135
6777 135 -83 -55 3 -45 -136 96 75 -162 127 130 -32 -143 190 -36 35 -48 -94 -48 -3 96 -194 -190 130 -159 -90
6802 -90 236 -68 -337 18 -16 -124 -68 121 -151 -105 135 -225 0 109 -336 -163 90 30 -170 109 107 -39
6824 -39 200 134 -88 131 152 54 31 134 205 91 245 328 -103 110 70 -10 21 319 6 48 118 -134 -231 43
6848 43 29 -165 96 145 -119 -24 155 -206 131 229 -128 -247 73 -16 -242 1 26 -81 -251 -134 -177 57 121
6871 121 -131 -71 10 35 -206 -168 -84 -30 -50 412 -324 -47 175 42 5 153 214 -31 78 45 -212 39 157
6894 157 156 202 220 -190 15 163 9 -80 248 -205 -190 1 -68 -41 29 -14 -209 -104 8 -319 -146 59 -68
6917 -68 -115 53 97 -238 91 85 -52 -28 6 85 -1 106 -27 -145 111 19 -169 -8 224 28 -32 172 75 -47
6941 -47 108 -115 -124 67 311 1 166 157 -129 -102 115 -24 38 109 216 -250 179 -84 -97 126 -192 -198 2 68
6965 68 -268 -53 150 -110 -111 98 -54 -119 18 41 -120 -109 129 -210 17 92 -103 93 80 -30 -285 112 130
6988 130 -23 22 250 163 96 -114 -90 155 25 4 -139 195 195 -220 153 -58 -376 103 165 -144 -27 88 31
7011 31 -244 211 -6 1 -62 152 -245 -16 107 -248 -243 210 38 -33 -5 -26 -137 124 65 -148 -48 86 -115
7034 -115 -150 60 -184 -98 152 -141 -279 51 138 -80 78 243 172 136 126 23 62 183 89 92 270 132 -3
7057 -3 132 193 -100 -96 -19 -69 99 114 -102 -67 173 84 -92 228 50 -288 10 101 -187 -91 -139 -9 -195 66
7081 66 -235 -99 89 175 -142 -47 375 -158 -73 5 -197 0 108 -67 -127 208 137 -111 177 -14 -196 -79
7103 -79 193 102 -70 167 -4 -160 71 -28 -61 132 145 -180 26 315 -18 -241 134 64 -175 144 -41 -135
7125 -135 -44 185 -181 67 132 -62 -158 123 -65 7 28 -99 -150 145 8 -170 -27 13 -52 95 236 -251 -72
7148 -72 299 -101 -123 55 48 -274 4 11 -54 -130 -56 -145 80 161 44 50 -37 1 -64 107 149 -166 219 58 -190 49
7174 49 77 -53 -66 85 69 -121 123 78 -281 -39 -125 -192 -21 53 3 -277 64 111 -66 -43 -44 -187 -26 20 -54
7199 -54 -76 89 -84 -96 -77 170 -65 -89 -3 -135 -53 235 -157 -8 -65 -153 -68 281 220 -11 140 37 -73 191
7223 191 -41 -114 79 217 7 -4 120 -31 -152 285 74 -68 -38 123 -216 0 220 130 -158 145 -106
7244 -106 -124 -25 -44 -97 51 150 -131 -36 111 -16 9 177 -189 -208 147 -131 -207 -101 17 10 54 27 -104 -169 193
7269 193 33 -221 128 50 -13 198 100 -129 182 -35 -111 -13 68 -6 58 187 -243 -94 123 -43 102 81 16
7292 16 -48 103 270 -154 44 118 -108 -120 11 -22 71 110 183 -125 17 -8 -14 -229 256 -35 -129 -4 -29 -114 -45
7317 -45 120 -390 75 270 -54 -67 -126 -143 -9 98 79 -89 68 76 36 138 104 -157 103 326 127 -17 110
7340 110 -95 -304 40 311 -135 16 204 -1 -53 375 59 -25 144 31 -70 -7 -5 -93 113 27 -183 85
7362 85 177 6 -198 136 -297 -16 31 -340 -232 26 79 -85 47 20 -45 -134 74 -25 -214 60 -35 -34 143 134
7386 134 54 166 154 -281 205 56 -70 35 69 -24 -112 217 206 25 50 115 73 30 178 -242 44 209 -189
7409 -189 -38 217 -67 -32 169 123 -106 -234 0 -191 -35 72 -134 15 145 -134 -104 106 85 -153 88
7430 88 64 -96 -144 198 -100 -225 193 -146 -149 8 78 -253 85 108 -52 128 -43 -155 -66 150 123 37 176
7453 176 -74 -159 112 128 -197 -76 119 -34 -158 185 -83 61 -85 -60 71 -14 7 -255 -127 88 -46 -2
7475 -2 104 -71 -136 29 91 -99 -28 -101 -63 80 79 -263 -23 133 -323 32 193 103 -138 68 92 -141 116 -5
7499 -5 137 180 142 -181 -42 299 167 -92 51 59 14 114 157 -53 99 56 -159 -52 -94 50 -5 217 -169 39
7523 39 -87 49 -91 158 -119 -34 -55 -5 15 -271 64 -120 -118 103 63 -200 -54 82 -230 -54 89 -105 -101
7546 -101 -49 -56 -156 140 136 -170 -143 109 -56 18 78 77 64 89 15 -93 130 -12 -41 199 97 -161 41 129 46
7571 46 -64 249 -54 -191 156 -133 -260 134 237 -54 -36 -61 -317 69 -78 -34 266 205 59 -138 44 36
7593 36 -190 36 1 -122 -146 191 7 -106 244 -28 -58 152 180 -109 139 -111 -222 79 -34 -99 -39 94
7615 94 -48 -194 158 -18 -13 175 257 18 115 251 -134 -1 18 14 -264 167 -68 -251 58 256 -69 -45 -17
7638 -17 -63 -62 40 -312 -355 -112 -27 -207 135 -23 -38 19 76 -222 -3 30 -144 13 22 -109 -152 230 42 -255
7662 -255 89 155 -47 150 111 -63 -287 192 74 -51 75 69 -160 53 47 -183 8 14 -56 -115 109 -247 -30
7685 -30 115 139 -116 88 12 -107 -104 -16 -71 -44 113 -251 58 96 -86 -67 266 69 -143 116 171 -168 -33 31
7709 31 -52 153 68 14 -257 63 -8 -167 126 158 -141 116 3 108 -20 113 -83 -44 -14 -163 -188 83 61
7732 61 -156 181 -36 196 125 70 41 133 121 48 -91 71 26 -278 51 90 -199 -153 -100 -153 -19 112 -102 -72
7756 -72 24 -49 -109 -173 3 -103 -159 192 -70 64 239 -44 -60 44 -128 -38 98 -28 -63 77 31 -145 33
7779 33 -15 -91 -282 -48 52 -71 -16 -51 -136 43 249 127 -87 243 222 -40 118 74 -140 160 33 31 105 184
7803 184 -121 -122 88 -110 -40 143 21 -73 144 -12 -199 183 50 -112 89 222 -59 -237 103 52 46 -86
7825 -86 55 -175 228 -98 -32 55 45 -161 70 85 -44 -81 -21 68 -33 170 37 -49 124 196 88 -97 -1 42
7849 42 -56 114 -20 -185 -59 178 -59 241 98 10 10 120 -137 -141 122 39 -175 20 109 -221 -102 98 -121
7872 -121 68 165 -6 -135 -99 0 -217 24 -99 -225 48 -57 64 52 101 -98 -157 62 56 -35 -17 157 -68
7895 -68 24 155 -34 -59 29 -48 -267 28 22 -148 228 0 -13 62 -5 -82 55 265 -188 -38 -27 26 -101 164
7919 164 133 -189 26 141 -101 105 29 -111 19 153 -166 -210 13 -151 67 69 -120 -43 -84 13 49 -189 209
7942 209 -166 -42 92 15 125 141 6 -7 153 -90 -55 -108 43 -260 -96 197 -47 112 280 103 -160 -120
7964 -120 76 -173 50 -14 -185 -36 154 -10 -63 122 -204 -158 116 -33 -168 35 -2 -122 -99 119 -99 14
7986 14 20 -50 -16 156 21 -184 134 66 -186 156 278 60 5 -118 -261 -114 95 39 -110 19 -127 153 -32
8009 -32 -46 -138 -78 -22 -180 -154 -9 -14 -26 83 24 -14 26 145 -62 -160 44 63 -17 -60 -180 -241 98 -12 -163 -1
8035 -1 8 -49 43 210 -124 10 21 34 -171 30 45 -173 -44 112 60 -6 44 11 169 119 -16 -232 -103 -55 -35
8060 -35 -129 123 -80 -81 -42 1 114 71 -58 -28 50 -21 -47 -58 -83 -195 -52 230 -158 188 111 -92 -74 40 -6
8085 -6 -115 117 95 -212 107 9 -133 53 -28 -43 -80 54 51 -16 288 162 -45 -38 49 2 -19 22 -284 139 96 -138
8111 -138 -118 -28 -61 -90 -63 -41 -205 -126 104 86 -119 111 -25 -136 110 64 -314 4 -3 -125 155 222 -91 86
8135 86 97 -104 23 -34 23 -247 121 56 -79 -111 42 -83 -76 89 -5 36 35 -165 -130 3 -46 -141 26 -53 -120 -171
8161 -171 -7 -29 32 157 4 240 39 59 -128 77 -130 -163 76 112 -70 -93 128 100 -37 211 -11 -127
8183 -127 24 15 -33 123 -39 64 -29 95
8191I5
##END NTUPLES=NMR FID
##END=
