##TITLE=1H_CG-1119-0
 DMSO, 8 sc, 
 20.9.2019
##JCAMPDX= 6.0         $$ Bruker NMR JCAMP-DX V2.0
##DATA TYPE= NMR FID
##DATA CLASS= NTUPLES
##ORIGIN= UXNMR, Bruker Analytische Messtechnik GmbH
##OWNER= root
$$ XWIN-NMR		Version 3.5
$$ Fri Sep 20 14:02:10 2019 Russian Standard Time (UT+4h)  she@DPX200
##.OBSERVE FREQUENCY= 200.1315
##.OBSERVE NUCLEUS= ^1H
##.DELAY= (6, 6)
##.ACQUISITION MODE= SIMULTANEOUS
##.ACQUISITION SCHEME= undefined
##.AVERAGES= 8
##.DIGITISER RES= 18
##SPECTROMETER/DATA SYSTEM= spect
##.PULSE SEQUENCE= zg30
##.SOLVENT NAME= CDCl3
##.SHIFT REFERENCE= (INTERNAL, CDCl3, 0, 15.7039)
##AUDIT TRAIL= $$ (NUMBER, WHEN, WHO, WHERE, WHAT)
$$ ##TITLE= Audit trail, XWIN-NMR		Version 3.5
$$ ##JCAMPDX= 5.01
$$ ##ORIGIN= Bruker BioSpin GmbH
$$ ##OWNER= she
$$ F:/spectra/data/she/nmr/H-F/1/audita.txt
$$ ##AUDIT TRAIL=  $$ (NUMBER, WHEN, WHO, WHERE, WHAT)
(   1,<2019-09-20 14:01:09.75 +0400>,<she>,<DPX200>,
      <created by zg, POWCHK disabled, PULCHK disabled
       configuration hash MD5:
       00 E9 B6 7A A2 85 ED C7 34 08 36 98 17 FE 4E 26
       data hash MD5: 16K
       E1 31 2F C2 0F E4 5B 0C C9 E1 8C 4C D3 79 84 A4>)
$$ ##END=
$$ 
$$ hash MD5
$$ EB E1 FD 21 50 0B EB 96 83 28 48 EB 0E 13 06 82
##$RELAX= 
##$RELAX= 
##$RELAX= 
##$RELAX= 
##$RELAX= 
##$RELAX= 
$$ Bruker specific parameters
$$ --------------------------
##$DU= <F:/spectra>
##$EXPNO= 1
##$NAME= <H-F>
##$PROCNO= 1
##$TYPE= <nmr>
##$USER= <she>
##$AMP= (0..31)
100 100 100 100 100 100 100 100 100 100 100 100 100 100 100 100 100 100 
100 100 100 100 100 100 100 100 100 100 100 100 100 100 
##$AQSEQ= 0
##$AQ_mod= 1
##$AUNM= <au_zg>
##$AUTOPOS= <>
##$BF1= 200.13
##$BF2= 200.13
##$BF3= 200.13
##$BF4= 200.13
##$BF5= 200.13
##$BF6= 200.13
##$BF7= 200.13
##$BF8= 200.13
##$BYTORDA= 1
##$CFDGTYP= 0
##$CFRGTYP= 5
##$CHEMSTR= <none>
##$CNST= (0..31)
1 1 145 1 1 1 1 1 1 1 1 1 1 1 1 1 1 1 1 1 1 1 1 1 1 1 1 1 1 1 1 1 
##$CPDPRG= <>
##$CPDPRG1= <>
##$CPDPRG2= <>
##$CPDPRG3= <>
##$CPDPRG4= <mlev>
##$CPDPRG5= <mlev>
##$CPDPRG6= <mlev>
##$CPDPRG7= <mlev>
##$CPDPRG8= <mlev>
##$CPDPRGB= <>
##$CPDPRGT= <>
##$D= (0..31)
0 1.2 0 0 0 0 0 0 0 0.06 0 0.03 0 0 0 0 0.0002 0 0 0 0 0 0 0 0 0 0 0 0 
0 0 0 
##$DATE= 1568973669
##$DBL= (0..7)
120 120 120 120 120 120 120 120 
##$DBP= (0..7)
150 150 150 150 150 150 150 150 
##$DBP07= 0
##$DBPNAM0= <>
##$DBPNAM1= <>
##$DBPNAM2= <>
##$DBPNAM3= <>
##$DBPNAM4= <>
##$DBPNAM5= <>
##$DBPNAM6= <>
##$DBPNAM7= <>
##$DBPOAL= (0..7)
0.5 0.5 0.5 0.5 0.5 0.5 0.5 0.5 
##$DBPOFFS= (0..7)
0 0 0 0 0 0 0 0 
##$DE= 6
##$DECBNUC= <off>
##$DECIM= 24
##$DECNUC= <off>
##$DECSTAT= 4
##$DIGMOD= 1
##$DIGTYP= 9
##$DL= (0..7)
0 120 120 120 120 120 120 120 
##$DP= (0..7)
150 150 150 150 150 150 150 150 
##$DP07= 0
##$DPNAME0= <>
##$DPNAME1= <>
##$DPNAME2= <>
##$DPNAME3= <>
##$DPNAME4= <>
##$DPNAME5= <>
##$DPNAME6= <>
##$DPNAME7= <>
##$DPOAL= (0..7)
0.5 0.5 0.5 0.5 0.5 0.5 0.5 0.5 
##$DPOFFS= (0..7)
0 0 0 0 0 0 0 0 
##$DQDMODE= 0
##$DR= 18
##$DS= 0
##$DSLIST= <SSSSSSSSSSSSSSS>
$$ [...]
##$SUBNAM2= <"">
##$SUBNAM3= <"">
##$SUBNAM4= <"">
##$SUBNAM5= <"">
##$SUBNAM6= <"">
##$SUBNAM7= <"">
##$SUBNAM8= <"">
##$SUBNAM9= <"">
##$SW= 24.0689530833862
##$SWIBOX= (0..15)
0 0 2 0 0 0 0 0 0 0 0 0 0 0 0 0 
##$SW_h= 4816.95568400771
##$TD= 16384
##$TD0= 1
##$TE= 0
##$TE2= 300
##$TE3= 300
##$TEG= 300
##$TL= (0..7)
0 120 120 120 120 120 120 120 
##$TP= (0..7)
150 150 150 150 150 150 150 150 
##$TP07= 0
##$TPNAME0= <>
##$TPNAME1= <>
##$TPNAME2= <>
##$TPNAME3= <>
##$TPNAME4= <>
##$TPNAME5= <>
##$TPNAME6= <>
##$TPNAME7= <>
##$TPOAL= (0..7)
0.5 0.5 0.5 0.5 0.5 0.5 0.5 0.5 
##$TPOFFS= (0..7)
0 0 0 0 0 0 0 0 
##$TUNHIN= 0
##$TUNHOUT= 0
##$TUNXOUT= 0
##$USERA1= <user>
##$USERA2= <user>
##$USERA3= <user>
##$USERA4= <user>
##$USERA5= <user>
##$V9= 5
##$VALIST= <valist>
##$VCLIST= <CCCCCCCCCCCCCCC>
##$VD= 0
##$VDLIST= <DDDDDDDDDDDDDDD>
##$VPLIST= <PPPPPPPPPPPPPPP>
##$VTLIST= <TTTTTTTTTTTTTTT>
##$WBST= 1024
##$WBSW= 4
##$XGAIN= (0..3)
0 0 0 0 
##$XL= 0
##$YL= 0
##$YMAX_a= 92872
##$YMIN_a= -102552
##$ZGOPTNS= <>
##$ZL1= 120
##$ZL2= 120
##$ZL3= 120
##$ZL4= 120
##$ABSF1= 10
##$ABSF2= 0
##$ABSG= 5
##$ABSL= 3
##$ALPHA= 0
##$AQORDER= 0
##$ASSFAC= 0
##$ASSFACI= 0
##$ASSFACX= 0
##$ASSWID= 0
##$AUNMP= <proc_1d>
##$AZFE= 0.1
##$AZFW= 0.1
##$BCFW= 1
##$BC_mod= 2
##$BYTORDP= 1
##$COROFFS= 0
##$CY= 11.3945322036743
##$DATMOD= 1
##$DC= 2
##$DFILT= <>
##$DTYPP= 0
##$F1P= 20.1720416913024
##$F2P= 0.152960286110954
##$FCOR= 0.5
##$FTSIZE= 0
##$FT_mod= 4
##$GAMMA= 1
##$GB= 0.15
##$INTBC= 1
##$INTSCL= 1
##$ISEN= 128
##$LB= 0.24
##$LEV0= 0
##$LPBIN= 0
##$MAXI= 10000
##$MC2= 0
##$MEAN= 0
##$ME_mod= 0
##$MI= 1.114404
##$NCOEF= 0
##$NC_proc= 0
##$NLEV= 6
##$NOISF1= 3.799351
##$NOISF2= 2.8
##$NSP= 1
##$NTH_PI= 0
##$NZP= 0
##$OFFSET= 15.70392
##$PC= 1
##$PHC0= -9735.52
##$PHC1= 18.60096
##$PH_mod= 1
##$PKNL= yes
##$PPARMOD= 0
##$PSCAL= 0
##$PSIGN= 0
##$REVERSE= no
##$SF= 200.130013532006
##$SI= 16384
##$SIGF1= 3
##$SIGF2= 2
##$SINO= 400
##$SIOLD= 16384
##$SREGLST= <1H.CDCl3>
##$SSB= 0
##$STSI= 0
##$STSR= 0
##$SW_p= 3612.71676300578
##$SYMM= 0
##$S_DEV= 0
##$TDeff= 0
##$TDoff= 0
##$TI= <>
##$TILT= no
##$TM1= 0
##$TM2= 0
##$TOPLEV= 0
##$USERP1= <user>
##$USERP2= <user>
##$USERP3= <user>
##$USERP4= <user>
##$USERP5= <user>
##$WDW= 1
##$XDIM= 8192
##$YMAX_p= 0
##$YMIN_p= 0
$$ End of Bruker specific parameters
$$ ---------------------------------
##NTUPLES= NMR FID
##VAR_NAME=  TIME,          FID/REAL,        FID/IMAG
##SYMBOL=    X,             R,               I
##VAR_TYPE=  INDEPENDENT,   DEPENDENT,       DEPENDENT
##VAR_FORM=  AFFN,          ASDF,            ASDF
##VAR_DIM=   8192,          8192,            8192
##UNITS=     SECONDS,       ARBITRARY UNITS, ARBITRARY UNITS
##FACTOR=    0.0002076,     1,               1
##FIRST=     0,             0,               0
##LAST=      1.7004516,     0,               0
##MIN=       0,             -102552,         0
##MAX=       1.7004516,     92872,           0
$$ Real data points
##PAGE= N=1
##DATA TABLE= (X++(R..R)), XYDATA
0@%%%%%%%%qJ6j6J6j6K4l2L9m7N6o4P2q8J04j20J36j57J82k09K39k71L05l41L83
$$ 0 0 0 0 0 0 0 0 0 -8 8 -8 8 -8 16 -16 23 -24 32 -32 40 -48 56 -64 72 -85 97 -112 127 -144 161 -180 203
32B03m31M84n41O02o72P49q30R19j018J127j249J384j532J698j887K100k342K623
$$ 203 -228 256 -285 317 -355 394 -436 483 -535 592 -657 727 -805 893 -994 1106 -1236 1387
50A387k952L345l822M415n181O210p671R934j3948K3208q3079k8022J53881J5986
$$ 1387 -1565 1780 -2042 2373 -2808 3402 -4269 5665 -8283 14925 -68154 -96176 57705 73691
64G3691q0418r5825J5737O7792N1330j2026k6048k6740j4580J906M5379N1578
$$ 73691 -6727 -102552 -86815 -19023 32307 20281 -5767 -32507 -47087 -45181 198 51776
76E1776j683p3991n8157L3432R6436L9198o1635q5225o506O6290N6865r522m8114
$$ 51776 50093 -23898 -82055 -48623 47813 87011 25376 -59849 -66355 -65 56800 47278 -836
89h36l5346N08K4138L2724J8821j8536n0871l1027L1328O5562K1496n1425o3380
$$ -836 -36182 -35674 -11536 21188 40009 21473 -29398 -60425 -29097 36465 57961 6536 -56844
102e6844L64N8349M4085j4072m3339k3484Q938K4710K3688J0396j5756l8133k2573
$$ -56844 -56480 1869 45954 31882 -11457 -34941 -26003 -1293 22395 32791 17035 -21098 -43671
115d3671K9321N6935J5196n1858n7657Q190O2053L6011l0856n1384j0345K7943
$$ -43671 -14350 42585 57781 5923 -51734 -43544 18509 54520 23664 -27720 -38065 -10122
127a0122K1397k258p025m586j4831j9489P709M0213K3863l4665n7100l685O0046
$$ -10122 11275 9017 1992 -2594 -17425 -36914 -29205 11008 34871 206 -56894 -60579 -533
140e33M7040k5916o1713j6177M4123M1392p455l0445r152J2119N905m90J1743
$$ -533 46507 20591 -41122 -57299 -13176 28216 20761 -9684 -18836 -6717 -812 -1302 10441
153A0441J6917q603l3707j2717L5937M3611q296n1856k7262L1534M6431K736l7417
$$ 10441 27358 18755 -14952 -27669 8268 51879 43583 -8273 -35535 -4001 42430 45166 7749
166G749k5981J0354K1849N965n795m004n721j2872m908J7947K3741n138l4020
$$ 7749 -18232 -7878 13971 19936 14141 10137 4416 -8456 -13364 4583 28324 23186 -10834
179a0834k0235K1571L5529L803k8619k1702Q633K1031P905n115m638m219q645
$$ -10834 -31069 -9498 26031 29834 1215 -20487 -11854 9177 17082 11967 7329 3110 -5535
192e535j849J7376K0670o633l2583j7209K4415L5727j569l6842k2020J8289K7468
$$ -5535 -7384 9992 30662 24029 -8554 -25763 -1348 34379 32810 -4032 -26052 -7763 19705
205A9705q91k0802q310R127K340j0239l07J7241P061k2901k4695J2181L7594J0780
$$ 19705 18814 -1988 -10298 -1171 1169 -9070 -9377 7864 14925 -7976 -32671 -20490 17104 27884
219B7884l3190l1692J4223L9260J0605k7116k0969J2053K1499K8j2810J823J3474
$$ 27884 -5306 -36998 -22775 16485 27090 -26 -20995 -8942 12557 12585 -225 1598 15072
232A5072j800j8086k902K4164J8644j7443l1603j062L2572K0839j9558l1327r39
$$ 15072 13272 -4814 -7716 16448 35092 17649 -13954 -15016 17556 38395 18837 -12490 -13429
245a3429K4401J2446j3114j4800K314P710l836o830N858J1111n690j8966m951
$$ -13429 10972 23418 10304 -4496 -2182 5528 1692 -5138 720 11831 6141 -12825 -17776
258a7776J9259J7095r474k2778m644J8606J4264o806j2782p3P495P61l152M599
$$ -17776 1483 18578 9104 -13674 -18318 288 14552 7746 -5036 -5109 2386 3147 -5 4594
272D594Q072m659j5349k895J8491J5118j1760k3667k725K1379J3535j2939j8591
$$ 4594 12666 8007 -7342 -10237 8254 23372 11612 -12055 -14780 6599 20134 7195 -11396
285a1396J671J4486J675j2348l162J1167M138j4591j1922J2730K1071l573k6243
$$ -11396 -9725 4761 6436 -5912 -9074 2093 6231 -8360 -20282 -7552 13519 9946 -16297
298a6297j0675K1846K3696p801k6263n549K1660J5762j0991j6169N033J6049k22
$$ -16297 -26972 -5126 18570 10769 -15494 -21043 617 16379 5388 -10781 -5748 10301 10079
311A0079j4844k456J6939R672j5083j8263P525K3730M873k2232j7041J1447K0947
$$ 10079 -4765 -7221 9718 19390 4307 -13956 -6431 17299 22172 -60 -17101 -5654 15293
324A5293l79j8877q869J0878R981o740r732L977R338l589j2469l18J4463P879
$$ 15293 14914 -3963 -12832 -1954 8027 1287 -8445 -4468 4870 1281 -11188 -11506 2957 10836
338A0836j2024j4655N375J7961M584j3396r478P629J1627j330q399N16Q209M15
$$ 10836 -1188 -15843 -10468 7493 12077 -1319 -10797 -3168 8459 7129 -1270 -754 7455 7870
352G870q990j710J1213P068r832j3569L640J5990M099j4531j1525P539J2615k538
$$ 7870 -1120 -2830 8383 15451 5619 -7950 -4310 11680 15779 1248 -10277 -2738 9877 7339
366G339j2481k280R891L413j0766p128R820J1748p146j6935o94J8706J0502j3721
$$ 7339 -5142 -7422 2469 5882 -4884 -12012 -2192 9556 2410 -14525 -15219 3487 13989 268
380B68j7802N285K0488N030j5908j0810J0644J4361l698j4435k73J4901N543j3632
$$ 268 -17534 -12249 8239 13269 -2639 -13449 -2805 11556 7858 -6577 -6850 8051 13594 -38
394c8j0867J0005J6340l085j8728o342J5172J3306q464j7138l69J4647N553j0925
$$ -38 -10905 -900 15440 12355 -6373 -12715 2457 15763 7299 -9839 -10208 4439 9992 -933
408i33r043O318R764l642j0792O50J1943L710j1294q392Q643J3113j741j3044
$$ -933 -9976 -3658 6106 2464 -8328 -7678 4265 7975 -3319 -11711 -3068 10045 8304 -4740
422d740m044J1245R171n769r541K685R252L85q128j809Q232M495q010q364N156
$$ -4740 -8784 2461 11632 5863 -3678 -993 8259 8644 516 -1293 6939 11434 3424 -4940 216
437B16J1272j306j2929n478R730Q784o301j1807N61J0221J956j0248n568P898
$$ 216 11488 10182 -2747 -8225 1505 10289 3988 -7819 -7258 2963 4919 -5329 -10897 -2999
451b999P767o553j1493K220J3454L623j2925r755Q910J4435j977j4455m161J2364
$$ -2999 4768 -1785 -13278 -11058 2396 6019 -6906 -16661 -7751 6684 4707 -9748 -13909 -1545
465a545R466p181j1293L511J2419J382j1779n230J0623R799o867j3477J220J4399
$$ -1545 7921 740 -10553 -7042 5377 6759 -5020 -10250 373 10172 3305 -10172 -8952 5447
479E447N333j2394j0915O668J3404p46j2889m948J0149Q153o497j0253L066J1252
$$ 5447 10780 -1614 -12529 -5861 7543 6797 -6092 -11040 -891 7262 765 -9488 -6422 4830
493D830R81j0536n231R283R497m829j1057J74J1539N151q324p327M634Q942j066
$$ 4830 5811 -4725 -9956 -673 8824 3995 -7062 -6888 4651 9802 1478 -5849 -1215 7727 6661
508F661q358j288P552L206p175n727N466P506l363j0307j229R165M744q324r045
$$ 6661 -1697 -2985 4567 7773 598 -5129 337 7843 4480 -5827 -7056 2109 6853 -1471 -10516
523a0516L754R407o72j0086l653Q075N866o487q817L202J0616M51j0530n028R236
$$ -10516 -6762 2645 1973 -8113 -11766 -3691 2175 -4312 -13129 -9927 689 1140 -9390 -14418 -5182
538e182R347m620j1119R3J1644N255q559p846N824J0293j251r965j885R822N945
$$ -5182 4165 -455 -11574 -11481 163 5418 -3141 -10987 -5163 5130 3879 -6086 -7971 1851 7796
553G796p604q983M544J1252L51j1385n239Q990R256m741j1322m0J0779M318q521
$$ 7796 192 -8791 -4247 7005 7356 -4029 -9268 -278 8978 4237 -7085 -7125 3654 7972 -549
568e49p447N507R313j744r581j949R390N716o757q470L780J0223P25r284m427
$$ -549 -7996 -2489 6824 5080 -4501 -6450 2940 8656 1899 -6571 -2791 7432 8157 -1127 -5554
583e554P263P306l996q401Q22Q147J683p534m535N534O211l983q246J49Q323K386
$$ -5554 1709 9015 5019 -3382 -2560 5587 7270 -264 -4799 735 6946 2963 -5283 -5134 3189 5575
599E575q043o133M736P461k167q904j462P675M075o376o264L958P863j386q223
$$ 5575 -2468 -8601 -3865 3596 1429 -7475 -8937 -1262 2813 -3563 -9827 -5869 1994 608 -7615
614g615j518Q123N572n886p677L400R723J004q419m186P354P775l717q510P57
$$ -7615 -9133 -1010 4562 -1324 -9001 -5601 4122 5126 -3293 -7479 -125 7650 3933 -4577 -3820
629c820R432L254p937n909N706Q611k093r499j896Q858N707o522q380K605R363
$$ -3820 5612 8866 929 -4980 726 9337 7244 -2255 -4151 4707 10414 3892 -4488 -1883 7480
644G480J240q526m606O317O805l735p977P56P978K170p093m956N340P157k456
$$ 7480 8720 194 -4412 1905 8710 4975 -3002 -2246 5732 7902 809 -4147 1193 8350 5894
659E894q216r15P857M071o318o582L516P562p76p937k552O671M684n098p242K125
$$ 5894 -2322 -3237 4620 8691 2373 -4209 -693 6869 6093 -1844 -4396 2275 6959 1861 -5381 -3256
675c256P500M73p631m019N499N964l443p593J97P330K293o152m778M458O279k166
$$ -3256 4244 4717 -2914 -6933 -1434 4530 1087 -6506 -6309 1021 3314 -2838 -7616 -3158 3121 955
691I55o638j49P083L043n802m723M176P320j123p356j446P169N042m951o663K715
$$ 955 -5683 -5832 1251 4294 -1508 -6231 -2055 5265 4142 -3214 -4660 2509 7551 2600 -4063 -1348
707a348P872P99p628l396O456N845l718p769P62P899K397p024n376M290P385j747
$$ -1348 6524 7323 -305 -3701 2755 8600 4882 -2887 -2125 5774 8171 1147 -4229 61 7446 5699
723E699p849j847O850M491n316o344K493P071j5p119k661N896N136m060o733J267
$$ 5699 -2150 -3997 2853 7344 2028 -4316 -1823 5248 5233 -1886 -4547 1349 6485 2425 -4308 -3041
739c041P143J594o534m297M640O102k358p125n46O447K923n652n119L628O015
$$ -3041 4102 5696 -838 -5135 -495 5607 3249 -3876 -4422 2025 4948 -704 -5823 -2195 3820
754C820j366o862j545O040L849m882n714K329O572K07o311k804N322M957l471
$$ 3820 2454 -4408 -5953 87 3936 -946 -6660 -4331 2241 2448 -3863 -6667 -1345 3612 141
769A41o049J345O747J501o000l374M835N736k370o389l5O773K973n180m958L538
$$ 141 -5908 -4563 2184 3685 -2315 -5689 -854 4882 2512 -3877 -3912 2861 5834 654 -4304 -766
785g66O219q16o321j752N854L913m442n449K061O298L0o174k778M968M735l220
$$ -766 5453 4637 -1684 -3436 2418 6331 1889 -3560 -1499 4799 4829 -1345 -4123 845 5580 2360
801B360o377O87O552J543n913m000M213N637k084o451o05O313K991m992n149K935
$$ 2360 -4017 -3330 3222 4765 -1148 -5148 -935 4702 2618 -3833 -4438 1875 4866 -126 -5275 -2340
817b340O349k94o271k628N466M528l540n881J148O136J058n375l396M099M695
$$ -2340 4009 3715 -2556 -5184 282 4810 1270 -4611 -3463 2673 3731 -1644 -5040 -941 3754
832C754k193n667J70N576J911n092l684L446N056j406n734p56N544K974m448m507
$$ 3754 1561 -4106 -3936 1640 3551 -1541 -5225 -1779 3277 1871 -3863 -4619 925 3899 -549 -5056
848e056K685N817m38n812k092N439M196l649n406J574O043R07n324l357M332M877
$$ -5056 -2371 3446 3008 -2804 -4896 543 4739 1090 -4316 -2742 3301 4208 -1116 -4473 -141 4736
864D736k097n651j80N412K351m680l989L150M880j015n528j166N184K962l894
$$ 4736 2639 -3012 -3192 2220 4571 -109 -4098 -948 3932 2917 -2611 -3777 1407 4369 475
879D75m625K073N389M5n386k229M539M185l173n078J175N372J250m901l150L768
$$ 475 -4150 -2077 3312 3357 -2029 -4258 281 4466 1293 -3785 -2610 2762 4012 -889 -4039 -271
895b71M743j908n437l42N412K510m409m060K593N146n55n375j488M719L276l644
$$ -271 4472 2564 -2873 -3215 2197 4707 298 -3762 -1169 3977 3422 -1953 -3441 1278 4554 910
911I10m655J655N243K79n168k507M129M093k609n119K86N379J506m599l445L190
$$ 910 -3745 -2090 3153 3432 -1736 -4243 -114 3979 1370 -3749 -3463 1916 3422 -1177 -4622 -1432
927a432M629j373n289n46M973K424l979l824K214M877m72m943j384M575K919l228
$$ -1432 3197 1824 -3465 -4011 962 3386 -593 -4417 -2203 2674 2202 -2741 -4125 450 3369 141
943A41m366J585N064L77m746k238L939L858k342m887N51N220J576m581l252L226
$$ 141 -4225 -2640 2424 2801 -1945 -4183 -244 3614 1272 -3615 -3064 2156 3732 -849 -4101 -875
959h75M681j288m995r10M931K841l532m111J876M832J39m572j895L915L347k515
$$ -875 3806 2518 -2477 -3387 1544 4385 853 -3258 -1382 3450 3589 -983 -2878 1037 4384 1869
975A869m227R39M626P17m199k526L357L710j968m474Q8M571J461m140l157K665
$$ 1869 -2358 -1419 3207 3924 -275 -2801 556 4266 2298 -2176 -2088 2483 3944 -196 -3353 -688
991f88M221j060n055r41M609K586l666m261J779M844J11m801k158L744L549k515
$$ -688 3533 2473 -2582 -3523 1086 3672 6 -4255 -2476 2368 2479 -2322 -4480 -736 2813 298
1007B98m354O26M537R93m043k663K888L896j477m331j43M294J978l695k998K364
$$ 298 -4056 -3430 1107 2100 -1943 -4606 -1718 2178 701 -3630 -3773 521 2499 -1196 -4194 -1830
1023a830M163o06m337q75L998K879l090l643J746M503J15m061j913L793L423k224
$$ -1830 2333 1727 -2610 -3485 513 3392 302 -3341 -1595 2908 3023 -1038 -2951 842 4265 2041
1039B041m099N84M645J060l825k615K621M014j179m419l82M259J952l338l412
$$ 2041 -2058 -1474 3171 4231 406 -2209 412 4426 3247 -1172 -1554 2705 4657 1319 -2093
1054b093J915L996l34m361j366L717K609k705l806R71M017N47m126k234K980L451
$$ -2093 -178 3818 3484 -877 -2243 1474 4083 1378 -2428 -1457 2560 3107 -1019 -3253 -273 3178
1070C178j990m123L4L936J351l519k858K167L796j130m164n69L691K047l027l192
$$ 3178 1188 -2935 -2901 1035 2386 -1133 -3991 -1824 1972 842 -3322 -3891 -200 1847 -1180 -4372
1086d372J846L740j94m036j331L574K801k532l709J235M282M65l854j930L148
$$ -4372 -2526 1214 1020 -3016 -4347 -773 2028 -504 -4213 -2978 1304 1769 -2085 -4015 -867
1101h67L633j718m134L56M290J498l256k653K306L811m87l922p48L712K258k696
$$ -867 2766 1048 -3086 -2730 1560 3058 -198 -2851 -545 3266 2779 -1143 -1891 1821 4079 1383
1117A383k970J439L570J00l552j509L269K449k066l503P91L596N47l594k103K644
$$ 1383 -1587 -148 3422 3522 -30 -1539 1730 4179 2113 -1390 -599 2997 3544 -50 -2153 491
1133D91L107j472m012k12L907J295l239l024J796L759o83m023j167L392K434k632
$$ 491 3598 2126 -1886 -2098 1809 3104 -135 -3159 -1363 2396 1713 -2310 -3477 -85 2349 -283
1149b83l445J014L716M74l865j701K752K891j809l488L95L596Q82l127k159K294
$$ -283 -3728 -2714 1002 1476 -2389 -4090 -1338 1553 -256 -3744 -3349 247 1129 -1998 -4157 -1863
1165a863L212j208l579J0L564J468k880k429K069L300l55l755o40L492K253k311
$$ -1863 1349 141 -3438 -3428 136 1604 -1276 -3705 -1636 1664 1309 -2446 -3086 406 2659 348
1181C48l036J328L700M14l343j603K942K857j631l264M23L487J088l049k074K196
$$ 348 -2688 -1360 2340 2754 -589 -2192 750 3607 1976 -1288 -865 2622 3710 661 -1413 783
1197G83L043j064l424l91L240J596k736k721J417L151k82l431j251K959K118k180
$$ 783 3826 2762 -662 -1053 2187 3783 1047 -1674 -257 2894 2612 -819 -2070 889 3007 827
1213H27l191N72L397M99l275j943K255K845j463l407J9L304J183k842k482J907
$$ 827 -2364 -1792 1605 2104 -1171 -3114 -859 1986 523 -2884 -2865 439 1622 -1220 -3702 -1795
1229a795L232p60l331m94L096J739k543k626J391L367J1l287j244K860K531j924
$$ -1795 1437 677 -2654 -3148 -52 1687 -856 -3482 -2091 1276 1287 -2000 -3244 -384 2147 223
1245B23l077P77L385Q04k923k035K449K908j189l183k0L295J328k412k133J691
$$ 223 -2854 -2077 1308 2112 -811 -2846 -397 2511 1322 -1861 -1881 1414 2742 330 -1803 -112
1261a12K918l92k930o28K849J717k203k386J285K981j68k906j024K661J962j893
$$ -112 2806 2414 -516 -1144 1705 3422 1219 -1167 118 3099 2931 25 -999 1662 3624 1731
1277A731k838O08L088N23l031j973K321K656j283l271l28K967J447k586k528J362
$$ 1731 -1107 -499 2589 3112 81 -1892 429 3085 1802 -1469 -1797 1170 2617 31 -2497 -1135
1293a135L012m03l260q96K657J874j894k634P17K993K55k738j432K410K316j522
$$ -1135 1877 1474 -1786 -2682 -25 1849 -45 -2679 -1962 1031 1286 -1452 -2884 -474 1842 320
1309C20k786M36L027Q62k579k003K130K698r06l218j66L143J417k523k251J262
$$ 320 -2466 -2030 997 1859 -720 -2723 -593 2105 1199 -2019 -2185 958 2375 -148 -2399 -1137
1325a137L199k15l152r70K727K087j797k648P24K923M41k663j392K196K246j220
$$ -1137 2062 1847 -1305 -2275 452 2539 742 -1906 -1182 1741 2182 -481 -1873 323 2569 1349
1341A349k657L71K597Q22k337j703J725K388o13k853k56K713J288k291k268J368
$$ 1349 -1308 -937 1660 2482 145 -1558 167 2555 1942 -911 -1167 1546 2834 543 -1725 -357
1357c57K733m37k929q38K289J921j802k531O36K620M32k646j419J863K385j330
$$ -357 2376 1939 -990 -1828 461 2382 580 -1951 -1315 1305 1737 -909 -2328 -465 1920 590
1373E90k781J21K738R81k399j862J511K717n92k849m33K645J512j871k423J150
$$ 590 -2191 -2070 668 1649 -750 -2612 -1101 1616 1024 -1825 -2258 387 1899 28 -2395 -1245
1389a245K835O1k690j178K381K056j594k424M16K567Q13k337j837J937K163r02
$$ -1245 1590 1651 -1039 -2217 164 2220 626 -1798 -1382 1185 1998 -339 -2176 -239 1924 1022
1405A022k522l18K632R71j991j937J439K284m87k445n29K301J453j835k042J077
$$ 1022 -1500 -1818 814 1785 -206 -2143 -704 1580 1093 -1352 -1881 420 1873 38 -2004 -927
1421i27K519P3k495r11K069J976j378k407L68K542P52k286j707J623K231o02k599
$$ -927 1592 1665 -830 -1741 328 2304 926 -1481 -1113 1429 2181 -105 -1812 -189 2042 1440 -1159
1438a159k86K379J093j804j912R93K321k27k338o70J910J622j590k210Q15K447
$$ -1159 -1445 934 2027 223 -1689 -696 1625 1398 -940 -1610 300 1922 332 -1878 -1063 1384
1454A384K56k425j139K154J873j457k346L34K675P46k373j634J665K302o56k585
$$ 1384 1640 -785 -1924 230 2103 646 -1700 -1366 1309 2055 -318 -1952 -287 2015 1359 -1226
1470a226n62K637J290j927k240J082K467n1k661q61K092J605j346k305O38K275
$$ -1226 -1788 849 2139 212 -2028 -946 1521 1470 -1191 -2052 40 1645 299 -2006 -1368 907
1486I07K41k113j215J661J827r93k237R4K364P48j925j524J654J908m53k398k08
$$ 907 1148 -965 -2180 -519 1308 315 -1922 -1828 536 1284 -641 -2165 -511 1397 944 -1454 -1662
1503a662K236J245j559j780R28K228kk179p88J802J690j187k149M10K281M98k092
$$ -1662 574 1819 260 -1520 -592 1636 1634 -545 -1333 469 2159 972 -1177 -767 1514 2012 -80
1520h0j354J682J831q81k193k8K228P41j849j683J286K246m97k366n04K187J281
$$ -80 -1434 248 2079 1198 -995 -1023 1205 1946 97 -1586 -300 1946 1449 -917 -1421 766 2047
1537B047j698k045Q50K284J73k374q82J736J644j229k078K44K212M85k000j472
$$ 2047 349 -1696 -846 1438 1611 -763 -1645 91 1735 506 -1572 -1328 884 1369 -631 -2103
1553b103J616J787r52k199m2K168P61j913j558J202J999m39k234l26J893J404
$$ -2103 -487 1300 348 -1851 -1893 275 1036 -877 -2435 -1233 766 327 -1907 -2233 -340 1064
1569A064j624j751N98K380K33k083r84J619J787q74j908K49K093O24j524j371
$$ 1064 -560 -2311 -1713 667 900 -1183 -2167 -548 1239 365 -1543 -1294 799 1423 -101 -1472
1585a472J355J849n02j905j73J926R63j498j462R83J868k33j947o26J879J124
$$ -1472 -117 1732 1230 -675 -848 1078 2041 543 -919 64 1932 1699 -248 -874 1005 2129
1601B129j325j739O30J843L46k078j139J646J678j136k117P7K128P36j860j605
$$ 2129 804 -935 -305 1538 1884 -194 -1333 313 1991 855 -1262 -1185 943 1679 -181 -1786
1617a786J121K091n19k160m38J967R90j566j620O81J896j08j894p13J554J352
$$ -1786 -665 1426 907 -1253 -1691 276 1266 -300 -1920 -1239 657 549 -1345 -2058 -504 848
1633H48j347j621M24J996J98j901r80J488J667r39j928K18J914O71j600j232J218
$$ 848 -499 -2120 -1696 300 498 -1403 -2383 -895 772 -167 -2095 -1877 37 708 -892 -2124 -906
1650i06J792j88k024l02K022J051j271j566Q09J863K88j815q51J967J250r99j720
$$ -906 886 698 -1326 -1628 394 1445 174 -1392 -583 1280 1568 -247 -1098 869 2119 1120 -600
1667f00M24J763M53j617j110J435J440o83k107K21J788O95j503j555J046J643
$$ -600 -176 1587 2040 423 -687 748 2188 1505 -602 -381 1407 2102 599 -956 90 1733
1683A733m10j719o50J618J036j286j503M25J812kj860p51J372J305j068j607J96
$$ 1733 1323 -396 -1046 572 1608 322 -1181 -756 1056 1054 -806 -1557 -185 1120 52 -1555 -1359
1700a359J796M34j628j230J228J651p16j856q2J847O93j472j436R79J933l68j770
$$ -1359 437 871 -757 -1987 -759 892 176 -1680 -1762 85 778 -694 -2130 -1151 782 414 -1356
1717a356n16J608J212j164j455M84J852J87j544q18J420J311p61j469J66J751
$$ -1356 -1872 -264 948 -216 -1671 -1187 665 852 -692 -1510 -90 1221 460 -1009 -843 908
1733I08N18j396j036J388J314l95j614p3J663O92j307j160Q41J625j57j861l71
$$ 908 1426 30 -1006 382 1696 1301 -313 -386 1277 1969 662 -498 343 1968 1811 -50 -421
1750d21J678R21j259j489M42J728K47j746r90J277J215o10j736j7J621M16j380
$$ -421 1257 2178 919 -570 -128 1600 1847 101 -889 388 1603 993 -743 -760 861 1277 -103
1767a03j350R11J580m45j659l37J538O66j148j247P05J514j00j736l47J398J025
$$ -103 -1453 -542 1038 593 -1066 -1403 135 801 -347 -1594 -889 625 525 -1211 -1558 -160 865
1784H65j204j239M35J669K75j736q38J436J352q84j535J16J668O66j414j041R37
$$ 865 -339 -1578 -1143 526 801 -935 -1773 -337 1015 131 -1404 -1288 380 1046 -368 -1409 -472
1801d72J516k48j759l09J639R92r78j417P96J483qj424n29J371R92p16j468L40
$$ -472 1044 796 -963 -1272 367 1359 381 -1036 -240 1243 1235 -189 -718 653 1645 929 -539 -199
1819a99J668J51j307q63J024J344o90j536o0J697L98j209j173O64J283Qj783k99
$$ -199 1469 1620 313 -550 474 1818 1128 -408 -468 1229 1627 418 -755 -91 1192 1200 -583 -882
1837h82J327Q25j009j447N33J479j5j430p93J358R70p68j612R7J853K90j505r67
$$ -882 445 1270 261 -1186 -653 826 811 -619 -1412 -54 916 148 -1464 -1367 486 776 -729 -1696
1855a696J139J292l57j731jJ427Q14j160j218P78J359Jj557l88J329Q84q66j273
$$ -1696 -557 735 378 -1353 -1354 73 887 -273 -1491 -713 646 647 -910 -1298 31 915 49 -1224
1873a224M85J343J61j305n05J060J158q08j215J67J443L05j368p62J014J285m60
$$ -1224 -739 604 765 -540 -1045 15 1173 365 -850 -683 760 1065 -303 -1065 -51 1234 774
1890G74j438o0J364P93j236j037O04J507k57j428l77J275R07q68j373L36J368
$$ 774 -664 -724 640 1433 197 -840 -236 1271 1014 -414 -791 484 1391 523 -850 -514 854
1907H54L02j262q83R83J080n51j244p4J282M24j075r89P85J203l94j235k20J323
$$ 854 1156 -106 -989 -6 1074 523 -721 -795 487 911 -164 -1153 -368 835 441 -794 -1014 309
1925C09N57r98j185O38J417k16j306m12J205R46r10j115K27J447L06j385p56J092
$$ 309 866 -132 -1317 -679 738 522 -784 -1196 9 955 45 -1070 -843 604 910 -475 -1231 -139
1943a39J134n94j327J19J244N29j045r37P20J174k08j332l56J373O25r24j065
$$ -139 995 401 -926 -807 437 966 -79 -1016 -296 878 670 -662 -1018 355 980 56 -1009
1960a009M67J339J8j409m64J133Q95n89j260L07J174K75j152o80R85R22m08j353
$$ -1009 -542 797 815 -594 -1058 75 970 381 -879 -572 602 877 -275 -955 30 952 544 -809
1978h09oJ322M47r47r00O83J107k68j178j68J094O88q58r70L22J199R4j178n23
$$ -809 -815 507 954 7 -893 -210 897 629 -549 -717 377 1065 207 -763 -441 758 852 -326 -849
1997h49Q98J033o49j255K92J256L18j295n88P52J067l04j352j5J187O36j097q91
$$ -849 49 1082 433 -822 -530 726 1044 -251 -839 -87 980 676 -676 -691 496 1132 35 -856
2015h56N08J274k16j187l48J055Q59r65j027M49J104Kj264l88R74R61q39j116
$$ -856 -348 926 710 -477 -825 230 1089 124 -903 -454 650 652 -612 -1000 -26 935 96 -1020
2033a020L03J156L84j335p56Q57J135l77j210j70J174P20r44j032N14J219j8j213
$$ -1020 -717 439 823 -512 -1268 -411 724 347 -863 -1033 141 861 -83 -1115 -601 618 600 -613
2051f13m88J096Q37n97r46J00J249J43j025o32Q87Q70m48j045J18J055M63r22
$$ -613 -1101 -5 832 235 -711 -611 638 781 -244 -876 11 881 433 -612 -494 561 1024 102
2069A02p91O89J079k58j100j64R58O20r16q43L22J207l0j140l70J025N65o16r54
$$ 102 -689 0 1079 821 -279 -443 515 1135 219 -624 -302 905 875 -265 -635 390 955 339 -615
2088f15J35J077J57r70m79P39Q23m85j037k8R34M35j002o58O96Q58l42j146j82
$$ -615 -480 597 754 -216 -695 44 867 382 -655 -683 251 686 -316 -974 -278 580 238 -908 -1090
2107a090J200N02r55r64O12J153j16j194m13J151P23o52j047J76J168L92j123
$$ -1090 110 612 -343 -1307 -695 458 342 -852 -1265 -114 609 -43 -1090 -914 254 646 -477
2124d77n69P29J097m53j043r3J133N30q63p52M73J232k16j017k77R86P08o12j076
$$ -477 -1046 -317 780 327 -716 -809 324 854 -9 -761 -288 944 728 -289 -566 420 1128 516 -560
2143e60L91J120Q1r87m78P43R08o07r34J23J024K27q61p17O37R59l15j102p1Q46
$$ -560 -169 951 1032 45 -433 310 1218 611 -323 -200 824 1051 190 -527 110 1069 754 -348 -419 427
2163D27N50p13q00M27Q41j78r03l26Q06N66p69p32K18Q65j1r25l59R99N48o32
$$ 427 977 264 -536 -109 732 554 -349 -675 131 697 -72 -804 -586 279 268 -657 -1016 -17 531 -101
2183a01j079L45R40K90q28p91Q11Q48m07j088K8J082M62q11p24M63J087j86r45
$$ -101 -1180 -835 105 395 -433 -1224 -413 435 28 -1060 -1032 50 512 -299 -1023 -560 527 341 -604
2202f04k56R63Q18q10p91L33J086J30j048m30Q21Q22m20r08m1J170M60r32r51
$$ -604 -860 103 921 111 -680 -347 739 869 -179 -609 212 1034 614 -294 -335 835 1295 363 -588
2221e88P48J035k25j086j98Q73O10n83r58L90P20K87q79o09O30N98l16p38j17
$$ -588 160 1195 970 -116 -314 559 1169 586 -372 18 738 1025 146 -463 167 765 449 -289 -406
2240d06Q78J14p09m92M75O53l30p72P1N88K39p37n16O12O49l09p75j00P90K95
$$ -406 472 586 -123 -615 -140 513 183 -589 -518 70 309 -428 -944 -332 317 8 -767 -867 -77 218
2260B18o52o57L36R91k55q51j85Q89N08n38q22L52J021j2p50m37O79Q72n35p41
$$ 218 -434 -1091 -755 236 -19 -870 -1055 -166 342 -196 -1018 -666 355 343 -407 -844 -165 707 172 -569
2280e69N5R51L71q52p38O42J066k17j048n4R02M75n52q43L12R83J76r89m06N34
$$ -569 -514 437 808 -44 -782 -140 926 709 -339 -393 509 984 432 -411 -99 884 1060 71 -335 199
2300A99Q93m54r37m6Q11M67o63o53L37R03k79q35k75O59O42n63p91L06P32j46
$$ 199 1092 638 -299 -345 466 933 270 -383 -46 857 578 -257 -532 127 769 206 -585 -279 453 307
2320C07n88m12O41N65n41o95R8Q17no13m98N97N98l81o75J55P67J15p19k94M57
$$ 307 -281 -693 -52 513 -28 -723 -625 192 187 -426 -924 -327 271 -110 -785 -630 137 252 -467 -761 -304
2341c04N59l44n45M2N68L18n21n70O46O54l02p31K0P20M46m07q13N03P60Q1j055
$$ -304 255 -89 -634 -592 -24 294 -227 -797 -151 503 201 -530 -510 210 656 249 -564 -61 699 780 -275
2362b75k93R11O63n45p97R3J040K26r38o22N02J051l21r83j26P77O52p57o36J63
$$ -275 -568 343 1006 461 -336 -243 797 1023 85 -537 -35 1016 695 -288 -414 363 1015 258 -378 -215
2382b15Q41J39q02n71N32O98k67o95j16Q35J02o65l99K93O53j82o01k18O77K27
$$ -215 626 765 -37 -608 -76 622 355 -340 -456 379 481 -184 -583 -290 363 181 -420 -638 39 266
2402B66m21n18L89N29L4q08j01N48L70l54n67K86P01j35n16k31L87N74n11l63
$$ 266 -155 -673 -284 245 279 -529 -630 -82 288 -66 -633 -347 354 219 -297 -528 -141 433 -78 -441
2422d41J21O30O1o00k61M86M60l20o98K30P83Q7o67m37N16P73k95p28j44Q74L79
$$ -441 -320 310 371 -229 -490 -4 456 136 -562 -332 451 538 -129 -566 -50 723 428 -300 -444 430 809
2443H09p03o34L03Q11J01j037j77P77N71n52p78N6R71K54q19n52N02P25j16q61
$$ 809 106 -528 -225 586 687 -350 -527 250 821 269 -509 -453 518 772 -47 -599 -97 628 512 -349
2463c49j62O63L76m22o34J32Q91P2q28m52O48O55l04q46J30O54J90n13m81L05
$$ -349 -511 152 528 106 -528 -396 495 567 -261 -713 -65 590 286 -560 -430 224 414 -99 -580 -275
2483b75N78n6o46P3L17L59m82k54J29M39O0o58R7L96L13m29k94J69N04n5o92M9
$$ -275 303 247 -399 -326 -9 350 -132 -386 -257 182 242 -416 -319 77 390 -39 -333 -164 340 285 -407 -358
2505c58M16K90l68m79M08N84j04o83j70N16N13m61n26K12O35M3n84m54N20N78
$$ -358 58 348 -20 -499 -91 493 389 -294 -464 52 565 104 -422 -210 425 468 -116 -570 -50 528
2525E28k92p03J19O62L04n81n09L49P71r3q65k20N29P18n50p22J65Q31K42p04
$$ 528 236 -467 -348 314 618 37 -472 -123 648 555 -310 -530 -1 717 167 -555 -390 441 683 -21
2545b1o36N14P73j32r92n7P57M09n48n52J78P46J9n08k29K56N22l06n00NN74J40
$$ -21 -657 -143 630 498 -494 -551 206 615 67 -485 -307 439 458 -50 -279 -23 499 193 -307 -302 272 412
2567D12n60k27K92L70n0m79q5O20L7m87k40K35L66j50n21LO89N7o00k65L86M60
$$ 412 -148 -375 -83 287 237 -242 -327 293 330 -157 -397 -162 204 54 -467 -464 225 282 -318 -583 -197 263
2589B63j66n19l3O26J33m96l67M37M08n3o52j19O16L27m14o44L65P47n9n73k69
$$ 263 97 -422 -455 171 304 -192 -559 -122 286 233 -419 -538 78 405 -9 -653 -288 459 400 -173 -442
2610d42N91M48k71p32k1Q92J74m72n32K87O93j5o92k97O17N19k60q72K08P31K7
$$ -442 149 597 326 -406 -427 465 639 167 -365 -78 615 600 -92 -389 228 747 487 -385 -177 554 581
2631E81n92n20N87N72q9p51j53N47J29k35m35K38M85l5m76k98M71K56k44n23J66
$$ 581 -11 -531 56 628 539 -212 -365 182 311 76 -359 -121 364 329 -147 -445 26 282 38 -485 -319
2652c19M47k9l08l06M22J64p4m55J45L65J20n79j08L99K17k44k81N9M58l2m39
$$ -319 128 99 -209 -515 -93 71 -3 -458 -313 52 172 -407 -515 -116 101 -143 -424 -365 93 61 -378
2673c78m0M39L13k44n03P2N72J26n20k59K20O39k52n30MO25L50m55n43J97P37
$$ -378 -418 21 334 90 -413 -341 231 357 -163 -422 -202 437 185 -345 -341 284 634 179 -364 -167 570
2694E70J85q31k14M49N76k32o59PN75K94n19n83M28O18k20n35l08N32N94m73n70
$$ 570 755 -76 -290 159 735 503 -156 -149 426 720 201 -382 46 664 444 -91 -399 133 727 254 -316
2715c16J31N23J23o69k41L15O23l39n15M0L68K98n10l28K22M28j8n38o8L25L20
$$ -316 -185 338 461 -208 -449 -134 489 150 -365 -325 43 341 -169 -497 -275 153 135 -403 -471 -146 174
2736A74m57k18J86K77J4l96q5M53J42l99j21J50L52n3l31m6M57J07k48k11K15
$$ 174 -283 -501 -315 -38 -24 -420 -505 -52 90 -309 -430 -280 72 19 -312 -358 99 206 -42 -253 -38
2757c8L20j5l12j99M45L39l94l46O5O07kl85l54L67N95j82m83k41M83L81l34n73
$$ -38 282 267 -45 -244 201 540 146 -200 -135 472 470 85 -269 98 693 511 28 -213 270 651 317 -256
2779b56K36N79l7m95l18N35L74m24n52J34N32K28o04n21N17M36j41n18j92M48
$$ -256 -20 559 522 27 -291 244 618 194 -358 -224 308 536 -68 -589 -72 364 223 -295 -487 -39
2799c9L42m02m36R3N08M2m21m08L54L89m6m25k4M59J25l56k70K33L20p2l81J01
$$ -39 303 -99 -535 -442 66 108 -313 -721 -367 22 -24 -449 -473 -14 111 -245 -515 -282 38 -34 -415 -314
2821c14L35O0k03k51K50L88j40k28j23L22J97k23l12L18K98j04m44j1L63L06k99
$$ -314 21 81 -122 -373 -123 265 125 -103 -226 96 293 70 -242 76 374 270 -174 -185 178 484 185
2842A85l16K38L99j09l87j03K94L87l26l93O7M99Ol54m28M19M37j17o02K1L69
$$ 185 -131 107 506 397 10 -93 201 588 262 -131 -64 435 441 87 -341 78 515 398 -204 -183 186
2863A86L00l42n19J85M69M1n76j98L16N07k38n90l2O52J11m44m33L78M25j10m06
$$ 186 486 144 -375 -190 279 320 -256 -454 -138 369 131 -459 -491 161 272 -172 -605 -227 198 88 -318
2884c18j98L57L11k82l26J83M46K7m85l02N78L00k45m46K12L13O0l51j28K98L03
$$ -318 -516 -159 152 -130 -456 -273 173 200 -285 -587 -9 291 46 -400 -188 125 185 -166 -294 4 307
2905C07j50l59Q6K89K15l84j47K17K94p6l26Q8K83J43m67j33K55K86l1m19q9K92
$$ 307 157 -202 -116 173 388 4 -143 74 368 292 -34 54 337 480 13 -120 135 421 390 -29 -118 174
2927A74L25m19k39K00L56l1m11k84L93L74k97m46N3M91J1m75r7K49M35j66n06
$$ 174 499 80 -159 41 397 366 -45 -329 64 438 141 -305 -252 239 250 -225 -322 -73 362 196 -310
2948c10o4L51K34j91m36J49N52j85m16j40J35N15j86m39K8N34J22m81j66L19L04
$$ -310 -374 -23 211 20 -416 -267 285 100 -316 -456 -321 194 8 -431 -403 131 253 -228 -394 -75 229
2969B29j45l78r0M72K14l71k63Q5M51N4l97k8L14K24k86k67J06K94M5l13j75L24
$$ 229 84 -294 -384 88 302 -69 -332 -247 204 258 -139 -167 147 371 85 -182 -76 218 263 -50 -225 99
2991I9J23rk99RK77R8j33l34K13K08p0l69JN05Nl45k65K62L25j74k72o8L48K56
$$ 99 222 213 -86 -77 200 298 165 -169 44 252 182 -187 -186 319 324 -21 -286 -24 301 127 -145 -213 135 391
3015C91l36m30K57M75q2n10m6K68L34k78l93P9L48J90l37l27K39M25j35l63p0
$$ 391 55 -375 -118 357 275 -235 -281 -13 321 43 -350 -271 77 267 -70 -397 -158 267 132 -231 -301
3036c01K65L46m03j77R1N00j33l33j23L07K58k34n10K03N38j8l78j10K23K64o6
$$ -301 -36 310 -93 -270 -179 321 188 -145 -268 39 297 63 -447 -244 294 276 -102 -212 11 275 209
3057B09n23O4L49K61m41j28J60L37j00k63k29M22M8j67k28J63L29p2l35p6K90
$$ 209 -314 -250 99 360 -81 -209 -49 288 188 -75 -304 118 166 -1 -229 -66 263 191 -144 -220 70
3078G0K09j85l93K98J48J8k81k43L71K83k58l40J99K53O5j89k60L13J56l1l38
$$ 70 279 94 -299 -1 147 165 -116 -359 12 295 37 -303 -104 149 214 25 -235 78 234 203 -135
3099a35QK57J42l12k08K14L54k06k61r0K72L68l38k51N3M54j94k18k59L82K29
$$ -135 -127 130 272 -40 -248 -34 320 114 -147 -237 35 403 65 -186 -133 321 127 -91 -350 32 261
3120B61j18l32K6K34K26l62k32L34J83m6m93N5K01K85k12l23JM85o1l38mJ46K30
$$ 261 143 -189 -163 71 297 -65 -297 37 220 174 -319 -264 -63 222 10 -313 -312 173 112 -226 -230 -84 146
3143A46j23l12N3M09J0k97k62K61L23j44k08R2K42k0l00j00K25K08O7l30j35K31
$$ 146 23 -289 -236 173 183 -114 -376 -115 208 64 -144 -52 190 170 -130 -230 -5 203 270 -60 -195 36
3165C6L58k98l07J90L14j1l83n2Q2L28j46k57N9L32j1k39j2L1K62q0l26K7J77
$$ 36 394 96 -211 -21 293 282 -101 -153 -71 257 111 -146 -87 245 234 -5 -17 14 276 196 -130 -103 74
3188G4K94m24k02K46K25o1l11q7K86J28j65k24P9K32J2m15N3K18J96j31k26o3
$$ 74 368 -56 -258 -12 213 152 -159 -246 40 168 3 -221 -142 90 102 -313 -260 -42 154 23 -203 -266
3210b66K49J43k89j34N3M09r9l12o8L37P2o9k52J24J73j7k33j29L12J48j10k28
$$ -266 -17 126 -163 -297 -244 165 66 -246 -314 23 95 26 -226 -102 71 54 -179 -308 4 152 42 -186
3232a86N8K06M2j53j63K42J17j41k8L2N8J59k99l8J38K45k37q2j03K98J71k87
$$ -186 -128 78 120 -33 -196 46 163 22 -6 26 84 243 -56 -94 44 289 52 -30 -133 165 336 49
3254D9j09P8K97k12n5j54J86K71k90k55P7K73R8k69j97K96R1n6k99j2L21Mk22
$$ 49 -60 18 315 103 48 -106 80 351 61 -194 -117 156 254 -15 -212 84 175 119 -180 -192 129 133 -89
3277h9j74R8K18j76o3j86L35J82j82k76J24K23j3k37r9K51K03j64k95K19K87j26
$$ -89 -263 -165 53 -123 -186 -372 -37 145 -37 -313 -189 34 21 -216 -315 -64 139 -25 -320 -101 186 60
3299F0j83j68K03K18l9k16m9L03J85m43j06J74K54j23j90rK51J01j09l27J71L00
$$ 60 -123 -291 -88 130 91 -125 -174 129 314 -129 -235 -61 193 70 -120 -129 122 223 114 -213 -42 258
3321B58L9k12k02K84K20k47k68K2L18L7l33l7J79K00j25k72j4L58O3j90k21J92
$$ 258 297 85 -117 167 387 140 -128 -106 212 249 -84 -121 58 258 133 -139 -153 205 268 78 -143 49
3343D9J84j10k19j74K57K20k34l68K20L09Jl28n1J09K22j44j75q5L18J23k64j68
$$ 49 233 123 -96 -270 -13 207 -27 -395 -175 134 135 -193 -244 -135 87 -57 -232 -317 1 124 -140 -308
3365c08J56K61j8j94j93K56J30r5j71l3K14O8j98n6J86K17k03j67l5L47L4j33
$$ -308 -152 109 91 -103 -296 -40 90 -5 -176 -209 5 73 -125 -181 5 222 19 -148 -183 164 198 65
3387F5j65J08K55r2k62M1K36J33k85j50J83J69n9j56j61K90J05l18pJ63J82l9
$$ 65 -100 8 263 171 -91 -50 186 319 34 -116 67 236 177 21 -140 150 255 -63 -70 93 275 236
3409B36k68p1K44J4j37k25K11N5J44k62n6J4J43j39j41J51J61P9k06j47L0K80
$$ 236 -32 -103 141 155 18 -207 4 59 203 -59 -115 -101 42 -97 -238 -87 74 153 -53 -200 -170 110
3431A10L8k81j11K64R1j42j92J3L24j08k26K9J47K17j86j95J04J77l3p3j39K63
$$ 110 148 -133 -244 20 111 -31 -223 -210 114 6 -220 -191 -44 173 -13 -208 -104 73 40 -33 -172 91
3453I1J16o6l04K6L08J09l26j41K38K34k33j15O5J7L09j34l33J13K84j7k17q1
$$ 91 207 141 -163 -137 171 280 -46 -187 51 285 52 -63 2 19 328 194 -139 -26 258 241 24 -57
3475e7J16K59k13j54K3J98J13k55j97K79J15q1k57l2J78J70k19j67NK93O8k88
$$ -57 59 318 105 -49 -26 172 285 30 -167 112 227 146 -111 -143 35 205 -14 -181 -176 117 185 -103
3497a03j2J45J18k58n8j2K67oj76l7P8K74j64j69pJ92R4l19J14r8K67Nk54J02
$$ -103 -115 30 148 -110 -168 -180 87 81 -95 -132 -54 220 56 -113 -120 72 166 -153 -39 -137 130 135 -119 -17
3521a7J44N2k82n9L7J60R6j28j10J91J38j80j73R5K43j3k35j50K80R6q3r3j29
$$ -17 127 179 -103 -162 -125 35 131 3 -107 84 222 42 -131 -36 207 194 -41 -191 89 185 102 9 -120
3544a20J79J37k68l6J16J62j47j19M7J00J59k22j68K31J55r4k05j24K79M5o3j85
$$ -120 59 196 -72 -108 8 170 23 -96 -49 51 210 -12 -180 51 206 112 -93 -217 62 107 44 -141
3566a41O8J38J19l06O9q0K55j02j61n1L69m7k76J04N9J33j10k26ML15J28k51j51
$$ -141 -73 65 184 -122 -53 -133 122 20 -141 -192 177 130 -146 -42 17 150 40 -186 -182 133 261 10 -141
3589a41Q9P5J61k63k0LL05j99j20qK21K8j44k19J44J49o8j15jN6K53k80l6J22
$$ -141 -52 23 184 -79 -99 -96 209 10 -110 -118 103 131 -13 -232 -88 61 -7 -122 -123 -67 186 -94 -130 -8
3613hJ07m4k03l3L05m3n3k26J74J73k0j79k9M6J98p2j77O1J62J25l00j70L17J00
$$ -8 99 55 -148 -181 124 81 28 -198 -24 149 129 -50 -79 -33 165 93 -84 -23 139 264 -36 -206 111 211
3637B11r7j80k8K84p6q2n0KJ25n2r1j82J46K20j36j24Q8J79q8j35r2Q7K11K2l04
$$ 211 114 -66 -94 190 114 32 -18 -16 109 57 -34 -216 -70 150 14 -110 -22 157 69 -66 -158 -71 140 162 -142
3662a42j8L17r0o4j21K74O6j64k94J95J67M5j89j71K49N9kk98N2K62oq4k38J05
$$ -142 -160 157 67 3 -118 156 222 58 -236 -41 126 171 -18 -189 60 119 117 -181 -129 133 127 43 -195 -90
3686i0J99K7j87k17K47J30j81JM3J61Np2k52J31J66l7j74l5K79jk13j28K54Q5
$$ -90 109 136 -51 -268 -21 109 -72 -71 -28 133 138 66 -186 -55 111 74 -100 -135 144 143 -70 -198 56 141
3710A41k1j85j9K53R8k72j29O1J73j07m9o5J42P8l2j57R4J84k3j12k12J33Q4O8
$$ 141 120 -65 -84 169 267 -5 -134 -73 100 -7 -56 -121 21 99 67 -90 4 188 165 53 -159 -26 58 126
3734A26k49N6K16J3k47rMN6J46k68K8R0J13j20k9L5K17j3k32o9j7K27j12j43N0
$$ 126 -123 -67 149 162 -85 -94 -90 -34 112 -156 -128 -38 75 -45 -74 -39 178 165 -67 -136 -153 74 -38 -181 -131
3759a31J86q4j21p0J56rJ9n7j40J05J15o4j08K12L6J4j95j21K95J11j24j41m5
$$ -131 55 -29 -150 -220 -64 -73 -54 -111 -251 -146 -31 -95 -203 9 45 59 -136 -257 38 149 25 -116 -161
3782a61J93O8j44k1N3O4J3o1j98L34P4j57j59K2K20R1k83J7J48jk8k47K56m5l1
$$ -161 32 100 -44 -65 -12 52 65 4 -194 140 214 57 -102 -80 140 231 -52 -35 113 112 84 -163 93 48 17
3807A7J34l12J05J62J9k46QK02M0j19j38P2K22j23j44LJ52J17j77j17nN8Q9k11
$$ 17 151 -161 -56 106 125 -121 -113 89 129 10 -128 -56 166 43 -101 -98 54 171 -6 -123 -128 -70 19 -192
3831a92P1J10N4n4k22O9N5R9j11OQ4J31j53j53j3K75L2j87r3J53Q3q5o9l6J56
$$ -192 -121 -11 43 -11 -233 -164 -109 -10 -121 -115 -31 100 -53 -206 -219 56 88 -99 -192 -39 44 -41 -110 -146 10
3856A0J56j39j63O5J91r8o9K8jK23j42R5j43O0J99k13q5J86M2o0j74j03K51rl
$$ 10 166 27 -136 -71 120 22 -47 -19 -20 203 61 156 13 73 272 59 -26 160 202 142 -32 -135 116 107 104
3881A04k13K07Lj12q3Q0P2L4Q9j66rO0%o1j47Q7K78j75k46K48L1J21k66q4J45
$$ 104 -109 98 101 -11 -94 -14 58 92 181 15 6 66 66 5 -142 -55 223 48 -198 50 81 202 -64 -148 -3
3906cO0m0j26J1N4J62j70r8J79J28j99j03n9J45J09p5j6oJ80J0k23k0J09J68r0
$$ -3 57 17 -109 -98 -44 118 -52 -150 29 157 -42 -145 -204 -59 50 -25 -41 -47 133 143 -80 -100 9 177 87
3931H7j48O3N0Q9j41k4J03M2L9j25j10J81J44k39q8K70m3j5j57qJ82N0r5j47N0
$$ 87 -61 2 52 141 0 -24 79 121 160 35 -75 106 250 11 -77 193 150 135 -22 -30 152 202 107 -40 10
3956A0J37n6j7n5j7P1l4k15Q0J41J07j09j95J74j0Rj02N6J82q4j06kQ3J61j85
$$ 10 147 91 74 19 2 73 39 -176 -96 45 152 43 -152 22 12 21 -81 -25 157 73 -33 -35 48 209 24
3981B4n7L0K2J08j45p6P1R1Jj41q6J31M6P1j77K6L5J00j81J3l5J05J15j27j4J46
$$ 24 -33 -3 19 127 -18 -94 -23 68 69 -72 -158 -27 19 90 -87 -61 -26 74 -107 -94 -129 -24 91 -36 -50 96
4007I6O1k09M3n9N2N3m2l3J28M0j13Mj80L58l3k61l4K36N9m8j13n6Q7Mk3n6%J68
$$ 96 157 -52 -9 -68 -16 37 -5 -38 90 130 17 21 -159 199 166 -95 -129 107 166 118 5 -51 36 40 17 -39 -39 129
4035A29j01j49J5Q1J87k62q8Q6O7M6l1q2M3K16l29M2R3J54j48q2n1J36J23Mj93
$$ 129 28 -121 -106 -25 162 -100 -188 -102 -35 11 -20 -102 -59 157 -172 -130 -37 117 -31 -113 -164 -28 95 99 -94
4060i4j23J96J67k05q1J50J50k06r2J32p0J92o3j62P0J93p7j38j01Q1N9N8r1N9
$$ -94 -217 -21 146 -59 -140 10 160 -46 -138 -6 -76 116 53 -109 -39 154 77 -61 -162 -81 -22 36 -55 4
4084DjJ45k94k0J31K19j03r4M8qJ32j63N2p4J13r5l3J37K7j51L8j31J00nJ54j70
$$ 4 3 148 -146 -166 -35 184 81 -13 35 27 159 -4 48 -26 87 -8 -41 96 123 -28 10 -121 -21 -26 128 -42
4110d2n8J23R0L4k77O1J22mp1j18K20J5o2p8k9J56p1O1k86J71J35o4n4j20K44
$$ -42 -100 23 113 147 -130 -69 53 49 -22 -140 80 95 33 -45 -74 82 11 72 -214 -43 92 28 -26 -146 98
4135I8p9nn4N3oQ9l0j52K26n1m8r4L1P8m5oj68Q2J52Kr2q7J90n5j7r3J30nN4j46
$$ 98 19 14 -40 13 7 96 66 -86 140 89 41 -53 -22 56 11 5 -163 -81 71 73 -19 -106 84 29 12 -81 49 44 98 -48
4165d8k5J9J37n2j39N4P5m6O1j48K10J14j13l7p9O9L2k3j52J39jQj43K9R9km2
$$ -48 -73 -54 83 31 -108 -54 21 -25 36 -112 98 212 99 62 -17 52 84 61 -91 48 47 55 -88 -59 40 38 -4
4192dm1M1M9r6O1j40J23N7j09o9l1K33r7l8On2P7MQ5k27J76O8nj22PR0N4q2j10
$$ -4 -45 -4 45 -51 10 -130 -7 50 -59 -128 -159 74 -23 -61 -55 -107 -30 -26 59 -168 8 76 71 -51 -44 46 100 18 -92
4221i2J24l4p4r9R8J00L0mk96J76Q5J0k63J39J15l4j03k3N9J96r1j74M1J83p6
$$ -92 32 -2 -76 -175 -77 23 53 49 -247 -71 14 24 -239 -100 15 -19 -122 -145 -86 110 19 -155 -114 69 -7
4246gj1j15J61k4oJj31Q2N5J2j37J31KJ22k50P7R7o9k7K2j3J89o7j87j8M6J23
$$ -7 -18 -133 28 4 -2 -1 -132 -50 5 17 -120 11 13 135 -115 -38 59 -10 -37 -15 -28 161 94 -93 -111 -65 58
4273E8J2r2m5P2K7L2q2j17J54P0j60o8K11J30j77j14J17n3J6Mj7M8M3K8k32N3
$$ 58 70 -22 -67 5 32 64 -18 -135 19 89 -71 -139 72 202 25 -89 28 -25 -9 -5 -22 26 69 97 -135 -82
4299h2J63Q4j43j21R5L7p0o5N6J4J57j30n8J9J22j67N5M4Q0j24L6j58J23J34l9
$$ -82 81 165 22 -99 -4 33 -37 -102 -46 -32 125 -5 -63 -44 78 -89 -34 10 90 -34 2 -156 -33 101 62
4324F2j21m3J12oO1m6m0P7Q0j69j14K37N0o5j02L4m4J67J5j54O4JPoL2j6O0on7
$$ 62 -59 -102 10 4 65 19 -21 56 136 -33 -147 90 140 75 -27 7 -37 130 145 -9 55 56 63 57 89 73 133 127 70
4353G0l4k8j5L9q7J94o1o0L3j00J56o3Lr1L5J04J5j50P4J05r4n7R8nN7o4O4j87
$$ 70 36 8 -7 32 -55 139 78 18 51 -49 107 44 47 -44 -9 95 110 -40 34 139 45 -12 86 81 138 74 138 -49
4381d9Q2P7k16P1m0J42m4Nn2J22q7n4j7J88l7j53J7p6J00K6J43j42n8J68M3j90
$$ -49 33 110 -106 -35 -75 67 23 28 -24 98 11 -43 -60 128 91 -62 -45 -121 -21 5 148 6 -52 116 159 -31
4407c1PL0O7l0r1nJ22L4k2j11J01m3M8K8k23J27J69j13n0n4Q5K2oj01J80p3J13
$$ -31 -24 6 73 43 -48 -53 69 103 81 -30 71 28 76 104 -119 8 177 64 14 -40 45 67 61 -40 140 67 180
4434A80l57J35M6m5j7O6Kj31K01j39j15K02J5mj26M6J35j37O0p7J35J5j24L3J
$$ 180 -177 -42 4 -41 -58 8 10 -121 80 -59 -174 28 43 39 -87 -41 94 -43 17 -60 75 90 -34 -1 0
4459@rJ17k02R9j99L28j25o0J8o9M5p5J82l2j7L9n3n7N4R7k7q1KJ71q5j5q4l2
$$ 0 -9 108 -94 5 -194 134 9 -51 -33 -102 -57 -132 50 18 1 40 -13 -70 -16 81 54 -27 -25 146 61 46 -38 -70
4487g0J58n5o6K1nK11k07l4j09J37K0M4l4M1K9%j12j17K64j40Q2q2M7O9j35r7
$$ -70 88 33 -33 -12 -17 194 -13 -47 -156 -19 1 45 11 52 81 81 -31 -148 116 -24 58 -24 23 92 -43 -140
4513a40R6k3Q2k4j5k32K73K6k2p2J04M2j57J1P6n4M3K4j94L3N5P7o0r6J89k6j34
$$ -140 -44 -67 15 -9 -24 -256 17 43 21 -51 53 95 -62 -51 25 -29 14 38 -156 -123 -68 9 -51 -147 42 16 -118
4540a18J07ML1L7j91K49o1M0r5q6M9J55j15j09nK09l3l8JJl9O5n4L0k8J37j20
$$ -118 -11 -7 24 61 -130 119 58 98 3 -83 -34 121 6 -103 -108 101 68 30 31 32 -7 58 4 34 6 143 23
4567B3k8j25K17j2j23p7K38k5J6j44p5J55k4k0n6J05M9p0j19k9R8M0r8J04k5M0
$$ 23 -5 -130 87 75 -48 -125 113 88 104 -40 -115 40 16 -4 -60 45 94 24 -95 -124 -26 14 -84 20 -5 35
4593C5m1j51J54k5QM9l2m2P1J58k69j2R1Q7n6k5q9M7J60o7r0l7J70p6J1r7O7Q7
$$ 35 -6 -157 -3 -28 -20 29 -3 -45 26 184 -85 -97 -6 81 25 0 -89 -42 118 51 -39 -76 94 18 29 -68 -1 86
4621H6m9k68J26K21j29K6o3Q0M8r5j23J29O9M5k62J59L6k4mj9N0m3j08J23l5j7
$$ 86 37 -231 -105 116 -13 13 -50 30 78 -17 -140 -11 58 103 -159 0 36 12 8 -11 39 -4 -112 11 -24 -41
4647d1O2L2l5j46J58qkL9q8J22R7j52r3R8Om3m1J9m2Q5N6j44Q1O7K7j01j21J37
$$ -41 21 53 18 -128 30 22 20 59 -29 93 190 38 -55 43 49 6 -35 -16 -58 27 83 -61 20 87 114 13 -108 29
4675B9J4K5j82J83rO3k20N0J3J33j4m6l0j0P4m6kOm9J1j8n4J12l7o5N6J64j51
$$ 29 43 68 -114 69 60 123 -97 -47 -34 99 85 39 9 -1 73 27 25 31 -18 -7 -25 -79 33 -4 -69 -13 151 0
4703@j00k6O0P9j3j2Jk0%L8l5j55K96r1K7j67P7P0Q4j4k34J52P9Mj96P6M2P1j27
$$ 0 -100 -126 -66 13 0 -12 -11 -31 -31 7 -28 -183 113 22 49 -118 -41 29 113 99 -135 17 96 100 -96 -20 22 93 -34
4732c4J8M8kk4j03J65j5K0m6l6j7K5J9j13N0M5K2o8p2Q8j3Q6j03p0O8R6m7jn1
$$ -34 -16 32 30 6 -97 68 53 73 27 -9 -26 -1 18 -95 -45 0 22 -46 -118 -30 -43 43 -60 -130 -62 34 -13 -14 -65
4761f5M0J60j88O5m7J70n8j82J21o9K02l6j08K0l2J41p6j14K51j57j02K4LJ80
$$ -65 -25 135 -53 12 -35 135 77 -105 16 -53 149 113 5 25 -7 134 58 -56 195 38 -64 -40 -37 143
4785A43j32o2p0P7J39n2o5J01j28J12o5j00J37K1L4l1l0P9j60N2ln2O4J9o3l0
$$ 143 11 -51 -121 -44 95 43 -22 79 -49 63 -2 -102 35 56 90 59 29 108 -52 0 -3 -55 9 28 -35 -65
4811f5P1j2q4j8J18j7J8p3KJ08N8j22j0K9R5L7j73P3p5P2M6j67J7J30j1M9j23
$$ -65 6 -6 -90 -108 10 -7 11 -62 -60 48 106 -16 -26 3 98 135 -38 35 -40 32 78 -89 -72 58 47 96 -27
4838b7K0K3r7O4K2J9j0P9k04J47J0l9J6n2j7R4l0m7l1J8J13j27j60J66M4J14j06
$$ -27 -7 16 -81 -17 5 24 14 93 -111 36 46 7 23 -29 -46 48 18 -29 -60 -42 71 -56 -216 -50 -6 108 2
4865Bp5J10N7p8r5J81j50J60l1j36J8J19j48O1k00J83J34j50N4L9q8J05j82R4
$$ 2 -73 37 94 16 -79 102 -48 112 81 -55 -37 82 -66 -5 -205 -22 112 -38 16 55 -33 72 -110 -16
4889a6j8J87j59O2M8j47O0qrj3J42q5J3o6L2N0j03k2J8R7r6j21J55J5M1K1q7N7
$$ -16 -34 153 -6 56 104 -43 17 9 0 -13 129 44 57 -9 23 73 -30 -52 -34 63 -33 -154 1 16 57 78 -9 48
4917D8r1J74j99K4N5o4J7O3k9L8o2j1L2O7n9m6o8K2M9RJ2k8MP3p0O4Q8j34P1j2
$$ 48 -43 131 -68 -44 11 -53 -36 27 -2 36 -26 -37 -5 62 3 -43 -111 -89 -40 -31 -19 -47 -43 30 -40 24 112 -22 49 37
4947C7q9K0R5j08N0q2J24n8j1n4J57o5N3j6o4m0J89k8j16p5J49M9k5m8M4J5n5
$$ 37 -52 -32 63 -45 5 -77 47 -11 -22 -76 81 16 69 53 -11 -51 138 110 -6 -81 68 117 92 44 88 103 48
4974D8n2j9L5R2k9l5j02Q3R4p4q4K6J39j57J02J8L6k5o4l6r9J11m0J07j06O7o0
$$ 48 -4 -23 12 104 75 40 -62 21 115 41 -43 -17 122 -35 67 85 121 96 32 -4 -103 8 -32 75 -31 36 -24
5001b4n8R5j3P1j15J17n5j4Q7j06j64J96l8l3OK5J76j37L8j65P8K4J87k75K6R6
$$ -24 -82 13 0 71 -44 73 18 4 91 -15 -179 17 -21 -54 -48 -23 153 16 54 -111 -33 -9 178 -97 -71 25
5027B5j8Q7m5j76J07Q0J0o1p1J96k9p1j58K12j83J26L7j33P6J07j20K6no2J36
$$ 25 7 94 49 -127 -20 60 70 9 -62 134 105 34 -124 88 -95 31 68 -65 11 118 -2 24 19 -43 93
5052I3o2j04J83n2r4q0O8O1n4K4j25J14J30j25q6K40j6o3j12J8Q1O1j8j23N5L5
$$ 93 31 -73 110 58 -36 -116 -48 13 -41 -17 -142 -28 102 -23 -109 131 115 52 -60 -42 39 100 82 -41 14 49
5078D9J24k80L2J52J1k4j01M8J1k4m0O7M9m1q1K9K3M3m8J1Or9O5l9K5l8Q2j14
$$ 49 173 -107 -75 77 88 64 -37 11 22 -2 -42 25 74 33 -48 -19 4 47 -1 10 16 -83 -18 -57 -32 -70 12 -102
5106a02J49o0j9M5J0k11O8J99j08n6J19j37J22M4o4O6p9R2p7j2p9J76j44O4L8
$$ -102 47 -13 -32 13 23 -188 -120 79 -29 -85 34 -103 19 63 -1 65 -14 78 1 -11 -90 86 -58 6 44
5131D4j27K27j98K6lp3R2J4P3k02K01r5j7P9j4q0K2m1J21j07J00j59M2J02k1j06
$$ 44 -83 144 -54 -28 -31 -104 -12 2 75 -127 74 -21 -38 41 27 -53 -31 -72 49 -58 42 -117 -75 27 6 -100
5157a00M4O2o2K11j11j55J08K6m6P0L0j1L1j22m0J31Q6j47R1j72mK05r7n8l8M8
$$ -100 -56 6 -56 155 44 -111 -3 23 -23 47 77 66 97 -25 -65 66 152 5 96 -76 -80 125 28 -30 -68 -20
5183b0N2n1m0J06lj24K0P7k7O7j35P4L9mm4J30j79oO4Q6j02KP5K5j46N7J33k50
$$ -20 32 -19 -59 47 44 -80 -60 17 -10 57 -78 -4 35 31 -13 117 -62 -68 -4 82 -20 -18 57 82 -64 -7 126 -124
5211a24J22K6o7NK7J12k91J41R9m4q8N1R5J8j36R9q8q5J35k5n0J07j1o5J37j01
$$ -124 -2 24 -43 -38 -11 101 -190 -49 50 6 -82 -31 64 82 -54 45 -43 -128 7 -18 -68 39 28 -37 100 -1
5237al7L9m8O1o6P0j13M4MQ2l6K3j11K2R4k5n4r7J00J34Ql6j40M5L0Qj4l2P8m4
$$ -1 -38 1 -47 14 -52 18 -95 -51 -47 35 -1 22 -89 -67 27 2 -52 -149 -49 85 93 57 -83 -38 -8 0 -14 -46 32 -12
5267a2J19m6n7j8k6q7J55o8M9pm8mP0R0m8k9o7K4NL3rr6n9J27j11P5J8M7p3p5
$$ -12 107 61 4 -14 -40 -127 28 -40 9 2 -46 -50 20 110 62 33 -34 -10 -5 28 19 -77 -136 -9 -120 -45 -27 20 -53 -128
5297a28J22k8j1J20n0l5o2L1O3N4j4m9P7pj16lN0J4q6N9j3nJ3P1k18R5k9MJ7J68
$$ -128 -6 -34 -45 75 25 -10 -72 -41 22 76 62 13 90 83 -33 -36 14 28 -58 1 -12 -17 -4 67 -151 -56 -85 -81 -64 104
5327A04j22Q3p2K7r5Q5k6K0k6n0m4K03j53L2k1QJ25kk00J24l1jO2On4L7M8j41
$$ 104 -18 65 -7 20 -75 10 -16 4 -22 -72 -116 87 -66 -34 -55 -47 78 76 -124 0 -31 -32 30 36 -18 19 67 -74
5355g4J85o7%j12P1k1N1j02M7J7pR5p5j66J31Q2lmj15M3n8K2j1m3J39l0l6ml7
$$ -74 111 44 44 -68 3 -18 33 -69 -22 -5 -12 83 8 -158 -27 55 52 48 -67 -24 -82 -60 -71 -114 25 -5 -41 -45 -82
5384h2J08M5l2j06O5J02r4%J01j61L4R3j38O7l8J07J0k58J11JK11j54Q4m8m2j8
$$ -82 26 71 39 -67 -2 100 6 6 107 -54 -20 73 -65 2 -36 71 81 -177 -66 -65 146 -8 76 28 -14 -32
5410c2J0Q5r9K9M9m7P9m0o3M6l6R6p0L1p3N2q0l8M9J46j32Q7l1N5q3M5k3m1N3
$$ -32 -22 63 -36 -7 42 -5 74 34 -29 17 -19 77 7 38 -35 17 -63 -101 -52 94 -38 49 18 73 -10 35 12 -29 24
5439B4J2N0j47N4l3O6p7K1J61k1p5j00J4J02L1r6k1j4J11kj00K0L6L9N1j01OM1
$$ 24 36 86 -61 -7 -40 26 -51 -30 131 110 35 -65 -51 51 82 -14 -35 -49 62 60 -40 -20 16 55 106 5 11 52
5467E2J0K6m4j0M6Nn0OK7o9m2lKJ02Po0p3J91j44J02n8j9J02n7J00j21J41j35
$$ 52 62 88 44 34 80 85 35 41 68 -1 -43 -46 -44 58 65 5 -68 123 -21 81 23 4 106 49 149 28 169 34
5495C4L7j06J49q6QO2j09j04J04O7r0M9j2mP8j7j17R8j35O2n3O2J21j79J25n4
$$ 34 71 -35 114 28 36 98 -11 -115 -11 56 -34 15 3 -1 77 60 -57 41 -94 -32 -85 -23 98 -81 44 -10
5521a0N6Rm1J07o2M6j20m9R0p7J08r0J55j52R9j06RL4r5O1M2M2Km7P9p8J9O8J21
$$ -10 46 55 14 121 59 105 -15 -64 26 -51 57 -33 122 -30 69 -37 -28 6 -89 -28 14 56 58 11 90 12 31 99 220
5550B20l52O8M2jk5o5J38n2n2J30n9pLJ02q1p8M9j2L8r6J76n0n1m6j2R8M4m1m6
$$ 220 -132 -64 -22 -23 -48 -113 25 -27 -79 51 -8 -15 -12 90 9 -69 -20 -32 6 -90 86 36 -15 -61 -73 25 69 28 -18
5579a8p6L8J7J25j00j6R8j09k1L0Q9O7j24m7m9K07j28j25Q7Q3j16LJ15j7N3r7
$$ -18 -94 -56 -39 86 -14 -30 68 -41 -62 -32 57 124 0 -47 -96 111 -17 -142 -55 28 -88 -85 30 13 66 -31
5605c1rL0l7Q1j05kL5P6p4m9oL1M1M0M4q6K1O2l1k5K1n6J84j23p5l6R9k6nl7J11
$$ -31 -40 -10 -47 34 -71 -73 -38 38 -36 -85 -91 -60 -19 21 65 -21 0 62 31 6 27 -29 155 32 -43 -79 20 -6 -11 -48 63
5636F3p7L3n2M2m4j31K27k8p9K6J91j68l5J3N0r1J2K1k2R5ll7J1R6j78RL0m2j1
$$ 63 -14 19 -33 9 -35 -166 61 33 -46 -20 171 3 -32 -19 31 -60 -48 -27 -49 46 43 6 17 113 -65 -56 -26 -68 -79
5665g9O2j2J11j27J15q6N7J39k11j31M0J43J8p3m2J45Rn6k0k7J0P2M2j58j1j7
$$ -79 -17 -29 82 -45 70 -16 41 180 -31 -162 -122 21 39 -34 -76 69 78 22 2 -25 -15 57 99 -59 -70 -87
5691h7M8N2J31j11o2J2o1J3J41j8j6j33Q2J09j84k2m2J87m0Ro5N7k5M4ln4M4O3
$$ -87 -39 13 144 33 -29 -17 -78 -65 76 58 42 -91 -9 100 -84 -106 -148 39 -1 8 -57 0 -25 19 16 -38 6 69
5719F9k6j15N6j8mN7M1j22K1k3J79l5M8j40k9J5K4J25k07J06l4O3o2J9K7J1O5
$$ 69 43 -72 -16 -34 -38 19 60 -62 -41 -64 115 80 128 -12 -41 -26 -2 123 -84 22 -12 51 -11 8 35 46 111
5746A11j33R0Jm3o4jK7J17L2j15m5O9M6o3mp0j2J93j95J15n8n5M2M6l5l8J9M8
$$ 111 -22 68 69 26 -38 -39 -12 105 137 22 -23 46 92 29 25 -45 -57 136 -59 56 -2 -57 -15 31 -4 -42 -23 25
5774B5R0j70LjJ61q2o3Qj2o3K4N0KQ5l1r5J42l2P8j79o0M7P0j1J31j84K8nO1L1
$$ 25 115 -55 -52 -53 108 26 -37 -29 -41 -104 -80 -30 -28 57 26 -69 73 41 119 -60 -120 -73 -3 -14 117 -67 -39 -44 17 48
5804D8k0k9pkm5J45j29J4J26k1m1j2n1M9P3j73Q6k5j27K31m4j22J32Pn2O1k22
$$ 48 28 -1 -8 -10 -55 90 -39 -25 101 80 39 27 -24 25 98 -75 11 -14 -141 90 46 -76 56 63 11 72 -150
5831a50J33J21m3j32m6J87Qr6OmP5Pj37P1l2M9r2n9J55M0j01K0K1r2J19J0j29
$$ -150 -17 104 61 -71 -117 70 78 -18 -12 -16 59 66 -71 0 -32 17 -75 -134 21 61 -40 -20 1 -91 28 38 -91
5858i1N7M6K8j02Q4P7n5Km3q8J08L2%p8o4J92j71j5l5J54m1j12J36J5L7j19R4
$$ -91 -34 12 40 -62 22 99 44 46 3 -85 23 55 55 -23 -87 105 -66 -81 -116 38 -3 -115 21 36 73 -46 48
5885D8j4l5lM5j16Q1qm4JK31j74N6kp6J2K1J3j8r0J7l1Q7j5L6k6n1J15j39J11
$$ 48 34 -1 -4 41 -75 6 -2 -46 -45 186 12 68 66 -10 2 23 36 18 -72 -55 -86 1 -14 22 -4 -55 60 -79 32
5914C2nj1l5o1J81j75J11p6o9K33j97J3r0J36J29p4Q6j17j1k5P3j55K31p8n5J36
$$ 32 27 16 -19 -80 101 -74 37 -39 -108 125 -72 -59 -149 -13 116 42 128 11 0 -25 48 -107 124 46 -9 127
5940A27j94J28l7l1Oo0Q9N9n2k04K31N8j42nn9M4kPM4QK3l8J3k3n7PL1j25J71
$$ 127 -67 61 24 -7 -1 -61 28 87 35 -169 62 120 -22 -27 -86 -42 -44 -37 7 15 38 0 13 -10 -67 -60 -29 -154 17
5969A7n8Q1m1l3m2Q8r7N5R0k0k2J9R8r5n7l0J9J7Q3j41J46n3p9Q0k7O6j4O4j75
$$ 17 -41 40 -1 -34 -76 12 -85 -30 60 40 18 37 135 40 -17 -47 -28 -11 72 -69 77 24 -55 25 -2 64 50 114 -61
5998f1j3o1J30LJ13j60P6M0Kk7k7k8R5p5L7qj5j49L7J63j14Q5j21J2J18j19Q8
$$ -61 -74 -135 -5 -2 111 -49 27 67 69 42 15 -13 82 7 44 36 21 -128 -91 72 -42 43 -78 -66 52 -67 21
6025B1N5j18l0P0L0p6J20j05oL7n6R2l9J9pj05J9P0J14j36P7l7J16j22r1J08m7
$$ 21 76 -42 -72 -2 28 -48 72 -33 -39 -2 -58 34 -5 14 7 -98 -79 -9 105 -31 46 9 125 3 -88 20 -27
6052b7O6j5j71J52JQ5l9l9r2J03p2o3K2j4J53r9J71j10m5j5m5J51m3K6N5j58q6
$$ -27 39 24 -147 5 6 91 52 13 -79 24 -48 -111 -89 -103 50 -49 122 12 -33 -48 -93 58 15 41 96 -62 -148
6079a48J40l7P3j69K11o8R7j29n0m0J33P1r6K4j02O0j8J50k31K13p4Q7o2p9J23
$$ -148 -8 -45 28 -141 70 2 99 -30 -80 -120 13 84 -12 12 -90 -30 -48 102 -129 84 10 97 35 -44 79
6104G9j63OJ02onr5K08k0r6n2P2RJ1q2P1j45R0j08P3Q6p4J63k00J08R3o2N2j42
$$ 79 -84 -78 24 18 13 -82 126 106 10 -42 30 39 50 -32 39 -106 -16 -124 -51 35 -39 124 -76 32 125 63 115 -27
6132b7J06j84Q8N4j71K15j71M6jJ9M2o9O7Po0N4M4r1l2J16l4o0J6n4O5N7K7J5
$$ -27 79 -105 -17 37 -134 81 -90 -44 -45 -26 16 -53 14 21 -39 15 59 -32 -64 52 18 -42 -26 -80 -15 42 69 84
6160H4k06R6n1o4J23J41K0j97N0J14k0l5q8O0Q1j30M5o8P6l9j13N7J31j9l2L7
$$ 84 -122 -26 -77 -141 -18 123 143 -54 -4 110 90 55 -33 27 108 -22 23 -45 31 -8 -121 -64 67 48 16 53
6186E3m7j6o3Q8j32J99j02N4n4K4J83k02O6j15J64o2j01P1P3Kj83J51Jk03R5L7
$$ 53 6 -10 -73 15 -117 82 -20 34 -20 4 187 -15 51 -64 100 38 -63 8 81 83 -100 51 52 -151 -56 -19
6212a9j5o4O8j9M0kQ5p0n8j8J10p9Q8L4n5KJ03j85J51r7J0J8J05j44o3J05K1k8
$$ -19 -34 -98 -30 -49 -9 -11 74 4 -54 -72 38 -41 47 81 26 28 131 -54 97 0 10 28 133 -11 -74 31 52 24
6240B4k1k4R7n6r4l9J30M5p6P2m2n5K6PJj6QJ8n7LJ0M1J00j65N6P0m7K0q0J21
$$ 24 3 -21 76 20 -74 -113 17 62 -14 58 16 -39 -13 -6 -5 -21 -13 5 -52 -49 -39 2 102 -63 -7 63 16 36 -44 77
6270G7m7p7J29L0K9k08l2K08j60J24j51J35k8r2J01nm6j5L0P2M5j28j5J20j03
$$ 77 30 -47 82 112 141 -67 -99 109 -51 73 -78 57 29 -63 38 33 -13 -28 2 74 119 -9 -24 96 -7
6295gomO2l1R0k72J32J15r2Q5l1J1p2J4L9o0L1M6j34l5J13%q2M5L8M1j53J22K6
$$ -7 -13 -17 45 14 104 -168 -36 79 -13 72 41 52 -20 -6 33 -27 4 50 -84 -119 -6 -6 -88 -43 -5 36 -117 5 31
6324C1o2K5j11J00o3J85k05R6J3L6l3K4j49O2J41j28N6rk4O1j36J09mK2p8J11
$$ 31 -31 -6 -117 -17 -80 105 -100 -4 9 45 12 36 -113 -51 90 -38 18 9 -15 46 -90 19 15 37 -41 70
6350G0n1r1J75j59KL0m3K2J90j90J22j30M5J8j01MO5M2O8l7m9k0mR4n7r6R3n9
$$ 70 19 -72 103 -56 -54 -24 -67 -45 145 -45 77 -53 -8 10 -91 -87 -22 20 88 51 2 -18 -22 72 15 -81 12 -47
6378d7J41j70R7l8J04m0o3K9J13j56J5J3o8J18j99J00J44j54J04m4O3j76L8R5
$$ -47 94 -76 21 -17 87 47 -16 13 126 -30 -15 -2 -70 48 -151 -51 93 -61 43 -1 62 -114 -76 19
6402A9j7m5o2J26r5J09K1p2n5j6N4M3l5j1N3m9L1N8k3J9j75J96q5m6J42o4k6m9
$$ 19 2 -43 -105 21 -74 35 56 -16 -71 -87 -33 10 -25 -36 17 -32 -1 57 34 53 -122 74 -11 -57 85 21 -5 -54
6430e4M9l2J03r5lkQ1nj03j2O6N2J7o5J16p3Q0o5J22j17r5P1L0L6m5j01PK4l4
$$ -54 -5 -37 66 -29 -32 -34 47 42 -61 -73 -7 45 62 -3 113 40 120 55 177 60 -35 36 66 102 57 -44 -37 -13 -47
6459d7Q0K2o3N9L8M8j52M4l2R8j60Q7J08q2L2j04N6m2Q9r4J06q2M4M9j82J66j57
$$ -47 33 55 -8 51 89 137 -15 29 -3 95 -65 22 130 48 80 -24 32 -10 79 -15 91 9 53 102 -80 86 -71
6486g1J12%L8m8Ll4R1j27o4j9J74K2j48K9J38j18J55j59Rk2M0j04J04o5J12r9
$$ -71 41 41 79 31 34 0 91 -36 -100 -119 55 77 -71 -42 96 -22 133 -26 -17 -39 1 -103 1 -64 48 -51
6512e1O3n2Q6l0j1J36p8po9p8m5K47j27m1jk8O3J9P0j52J59m1K2j26QK1J11r3
$$ -51 12 -40 46 16 5 141 63 56 -13 -91 -136 111 -16 -57 -58 -86 -23 -4 66 -86 73 32 54 -72 -64 -43 68 -25
6540b5LL2j7K2P0q1P3m6l5O7q9N2k6k2k1J50r9l6qK3M4k1J15j39m7R8l5R1j10
$$ -25 -22 10 -7 15 85 4 77 31 -4 63 -26 26 0 -22 -43 107 8 -28 -36 -13 31 10 125 -14 -61 37 2 93 -17
6569a7m2K2o7J69PnJ6j03J28j30M8j15K11K2j78o5J43m1J42k34J50o8j03J12R9
$$ -17 -59 -37 -104 65 72 67 83 -20 108 -22 26 -89 122 144 -34 -99 44 3 145 -89 61 -7 -110 2 101
6594A01j64L0K7n2M4P0o7J03l7j92L7P6M1j00P0N8J8n4n9m9Q8mJ28n1n5m2P1n3
$$ 101 -63 -33 -6 -58 -14 56 -11 92 55 -137 -100 -24 17 -83 -13 45 63 9 -50 -99 -11 -15 113 62 7 -35 36 -17
6622a7o8J03P8j16O2j20J25M2k00K68k72P3n2J88m8j95J45Jq%J23qj83K4N7K8
$$ -17 -85 18 96 -20 42 -78 47 89 -111 157 -115 -42 -94 94 46 -149 -4 -3 -11 -11 112 104 -79 -55 2 30
6648C0O6j02J63j03j02j6qKJ18j11O4Rm8j00J17L7mJ24k34O3J5Q3j08Q7q0O5k8
$$ 30 96 -6 157 54 -48 -64 -72 -70 48 -63 1 10 -38 -138 -21 16 12 136 -98 -35 -20 63 -45 42 -38 27 -1
6675aK3n6o5O6O4K2n9M7n8l8L7N4p3J15o7j11J49P5m5n6p8M0rL2o8J22n5j53J65
$$ -1 22 -34 -99 -33 31 53 -6 41 -17 -55 -18 36 -37 78 11 -100 49 124 79 23 -55 -15 -24 8 -60 62 7 -146 19
6704A9j45N8M7L0J7r2M7M4L2j38n2J46m9K7l2O6j35J64m5K1Rj32J17j81JJ92n
$$ 19 -126 -68 -21 9 26 -66 -19 25 57 -81 -133 13 -36 -9 -41 25 -110 54 9 30 39 -93 24 -157 -156 36 31
6731C1J5r1J30m9p6j0P7R8j02J7o2L2Mp4J01l5R8j78P6k8O9Pj23M1J8R1Pp3J52
$$ 31 46 -45 85 36 -40 -50 27 125 23 40 -22 10 14 -60 41 6 104 -74 2 -26 43 50 -73 -32 -14 77 84 11 163
6760A63k09N0pp6R8j2K0o4J9K5j04j7J23l1q1J11r0J88k10J12r3O8N2N8j06L5
$$ 163 -46 4 -3 -79 19 7 27 -37 -18 7 -97 -114 9 -22 -103 8 -82 106 -104 8 -85 -17 35 93 -13 22
6786B2j8n1k3rJ42j03M8pJ3J4J38j36l3L1j14J32l4n1M0m3N4l3Ll6J10m5q7l2
$$ 22 4 -47 -70 -79 63 -40 8 1 14 28 166 30 -3 28 -86 46 12 -39 1 -42 12 -21 -18 -54 56 11 -76 -108
6814a08J66l2J4j07L5n1Q1J5Kq5O8K3p0J78j18K0j22J35r0J32p6l7k7K2m3R3n4
$$ -108 58 26 40 -67 -32 -83 -2 13 15 -70 -2 21 -49 129 11 31 -91 44 -46 86 10 -27 -54 -32 -75 18 -36
6841c6PPJ68j91l1J05rJ3m8Q0p1K7M1Nj46Q9L1J1p5l5L9R5j52J71p7k6n4R8p4
$$ -36 -29 -22 146 -45 -76 29 20 33 -15 65 -6 21 62 67 -79 10 41 52 -23 -58 -19 76 -76 95 18 -8 -62 36 -38
6870c8m1R2JM3k5l0n4jl0J15j0j71Q4P0n2R0j9N9j36R6m3L4n4o6J4R3l1j6J01
$$ -38 -79 13 14 57 32 2 -52 -53 -83 32 22 -149 -65 5 -47 43 24 83 -53 43 0 34 -20 -86 -72 21 -10 -26 75
6899G5k3Nl04K09j4J27j49O9p8K00j34J04r7l9ON9OR8j47L5J6q3M0N1p6J72n2
$$ 75 52 57 -247 -38 -52 75 -74 -5 -83 117 -17 87 -10 -49 -43 16 22 120 -27 8 24 -59 -19 32 -44 128 76
6926G6j18JQ9mm2J4K0j4J7Q4j27J3j51J21J49j19k2M8l4Rm9k3L4O4k2m2O0n0j29
$$ 76 -42 -41 48 44 2 16 36 22 39 123 -4 9 -142 -21 128 9 -13 35 1 10 -39 -62 -28 36 14 -28 32 -18 -147
6955a47J28Kl4J71j53j5J6Q6q4L2M0Qn0j05J11kj0k7P3j36J45q5n3J15R4o5l4
$$ -147 -19 -17 -51 120 -33 -48 -32 54 -30 2 42 50 0 -105 6 4 -6 -33 40 -96 49 -36 -89 26 120 55 21
6982B1p7j3M4P9Q6k52N8P5L3J0k1N1q2o0R3q3L0j2K0q7rJ64k9Kj42J13j46J02
$$ 21 -56 -69 -25 54 140 -112 -54 21 54 64 43 94 12 -48 45 -38 -8 -20 0 -87 -96 68 39 41 -101 12 -134 -32
7010c2M7j4j4l0o5J51o7L7J9n5kq6J40r0Q2N1j79J80n5lq0K2N5j02J39q7K3J12
$$ -32 15 1 -13 -43 -108 43 -24 13 32 -23 -25 -111 29 -61 21 72 -107 73 18 15 -65 -43 12 -90 49 -38 -15 97
7038I7r8m8k6PL9N0qJ3L5k31N9M7J13m9m5J11r4J6K1m2K1j1L6q1o0J41m5J05j64
$$ 97 -1 -49 -75 -68 -29 21 13 26 61 -170 -111 -64 49 0 -45 66 -28 -12 9 -33 -12 -23 13 -68 -128 13 -32 73 -91
7067i1J78l7j38r5K43j6r2N9p4J56m5q1J25l5J01k07R1p2J00j7L3n1o6M1p7M2
$$ -91 87 50 -88 -183 60 44 -48 11 -63 93 48 -33 92 57 158 -49 42 -30 70 53 86 35 -31 10 -67 -25
7093b5N2K7r1J03m3n4J10j75J35N8j48L8J7J4N6n3q9m6R7k1J01r4q3Q8Ok4j45
$$ -25 27 54 -37 66 23 -31 79 -96 39 97 -51 -13 4 18 74 21 -68 -114 -17 -38 63 -31 -114 -26 -20 -44 -189
7120a89J04Q9K6O3k23J32J08j01%P1j7l5Qj19R1o8P3N2Kq7J7j7R2j07O5j6j40
$$ -189 -85 4 30 93 -130 2 110 9 9 80 63 28 36 -83 8 -60 13 65 67 -20 -3 -20 72 -35 30 14 -126
7147a26R8OQn0p8J00l7M2k2K1P4JL3j57N3L1L4l1J6L8l8p6J0L7N2l4J1j42J54
$$ -126 -28 -22 -14 -64 -142 -42 -79 -37 -59 -38 36 37 70 -87 -34 -3 31 0 16 54 16 -60 -50 -13 39 5 16 -126 28
7176B8M7q9O2q6mL1o1J4N6L0l2j4Mj28Q8Q1r7J67r5o5P0L5Kp4JNm7N0P3rro1J11
$$ 28 75 -14 48 -38 -42 -11 -72 -58 -2 28 -4 -18 -14 -142 -54 27 -70 97 2 -63 7 42 44 -30 -29 -24 -71 -21 52 43 34 -27 84
7209H4p4J8p1k2R9q4J20M1j12O2NQ7j82O2Q9j95M2PM8J1M5q1N1j4N9q6q7P1r5
$$ 84 10 28 -43 -65 34 -50 70 111 -1 61 66 153 -29 33 122 -73 -31 -24 24 35 80 -1 50 36 95 9 -78 -7 -102
7238a02J22O9j13j9M6M8j15J39q0k3p4J08j4PO6j37k5M8L9J6M6lo0NO4j29j08
$$ -102 20 89 -24 -43 3 51 -64 75 -5 -28 -102 6 -8 -1 65 -72 -97 -49 -10 6 52 49 -11 -6 58 -71 -179
7265a79K06K8j31J26r1M4j36J69n4J1J51j51J9%J5k8n9M5m9J42o3J8m0j56L54
$$ -179 27 55 -76 50 -41 3 -133 36 -18 -7 144 -7 12 12 27 -1 -60 -15 -64 78 15 33 -7 -163 191
7290A91k22Kl5K39j07m5QRp9J9L6n1J01p6P5o7O5o4p1N2P2p2L1r3K99k93Q2p5
$$ 191 -31 -29 -64 175 68 23 31 40 -39 -20 16 -35 66 -10 65 -2 63 -1 -72 -20 52 -20 11 -82 217 -76 6 -69
7318f9M5J38r2q5N4l6Q0Pp2J24q7j04LR7o3n7J77j33Q8j8L5k1p9P8o8qjQ2m3J0
$$ -69 -24 114 22 -63 -9 -45 35 42 -30 94 7 -97 -94 3 -60 -117 60 -73 15 -3 32 11 -68 10 -58 -66 -67 15 -28 -18
7348a8K2N6J3o7Kn8l1Q0J6r4N0L9JK1n4N1M1o4Nj8ML1M4j11MNR9q5M9j2KK8Om1
$$ -18 4 60 73 6 8 -50 -81 -1 15 -79 -29 10 11 32 -22 29 70 6 11 -7 -3 28 72 -39 -35 -30 69 -16 33 21 23 51 57 16
7382A6L6n5o1J85j31O1j06l4O2K4M5r6J09J9r8O4j03J18k2k4K2j20M2n4Q5m1J46
$$ 16 52 -3 -64 121 -10 51 -55 -89 -27 -3 42 -54 55 74 -24 40 -63 55 33 9 31 -89 -47 -101 -16 -57 89
7409H9j24N6K0n4PQ2j29K4R9j61P8M5L1j40J3P5o6L8R5j66J66j25mJ41r2j3rQ
$$ 89 -35 21 41 -13 -6 76 -53 -29 70 -91 -13 32 63 -77 -64 11 -55 -17 78 -88 78 -47 -51 90 -2 -15 -24 -16
7437a6%L8m1O7j1m7J0M5j51L4J04N7O6j70P5o5j0M3N1j02J57j70n7K20j45l1J16
$$ -16 -16 22 -19 48 37 -10 0 45 -106 -72 32 89 155 -15 60 -5 -15 28 79 -23 134 -36 -93 127 -18 -49 67
7464F7k1q0m9J53j63J10N9j97J09n6R6Q1r5K8l5k3k9M6K8Nj17J30n8O6l3m2J99
$$ 67 46 -34 -83 70 -93 17 76 -121 -12 -68 28 109 14 42 7 -16 -45 1 29 34 -83 47 -11 55 22 -20 179
7491A79k18J47o0n5L1m0p9J25k6Q1j1j49K07j19RL3p9j26K32p3m6K5lR3j09P0
$$ 179 -39 108 48 -7 24 -16 -95 30 4 85 74 -75 132 13 22 55 -24 -150 82 9 -37 -12 -15 78 -31 39
7517C9l8qj6L7L2k5j6K6m8Rk0r8J57m7m6P2m9J15p9N8o3J4JL3j45P3L5o5R7k4
$$ 39 1 -7 -23 14 46 21 5 31 -17 -8 -28 -126 31 -16 -62 10 -39 76 -3 55 -8 6 7 40 -105 -32 3 -62 35 11
7547A1QP1k07J38L3l5N9K3M7j64J17j45m0P3J25q6L8j10m9J79j52L8LN3J1j01
$$ 11 19 90 -117 21 54 19 78 101 148 -16 101 -44 -84 -11 114 28 66 -44 -93 86 -66 -28 -25 28 39 -62
7573f2Q4r2Q7nq5L8Q5j01J21m3Jro6o2O4k2J39q3l5N5j17J24o2Q4k2r7J27j04
$$ -62 22 -70 17 12 -73 -35 50 -51 70 27 28 19 -47 -109 -45 -67 72 -11 -46 9 -108 16 -46 38 16 -81 46 -58
7601e8K0O2O2j32Q9j1o1O0j7J6N3q9J1K2N3n0n7L7J1J5j6j06L5J26j17n7R2L9
$$ -58 -38 24 86 -46 43 32 -29 31 14 30 83 -6 5 27 80 30 -27 10 21 36 20 -86 -51 75 -42 -99 -7 32
7629C2r6k4L7O0N4j51k3J35j05O2R0p2l2K7m6J21p6m8K20n5j29K2m4J6n5J69r9
$$ 32 -64 -88 -51 9 63 -88 -111 24 -81 -19 71 -1 -33 -6 -52 69 -7 -55 165 110 -19 3 -41 -25 -80 89 -10
7656a0N4j25Q9n1P8J4j5j1l3J04o9J8R3j97Q9P0q8jJ01j80J12r9ML8j9J11j32
$$ -10 44 -81 8 -43 35 49 34 23 -10 94 25 43 136 -61 28 98 10 9 110 -70 42 -57 -53 -15 -34 77 -55
7683e5M2m4L0l5M1m8j04J13n2K2O2J55r7O6q9j16O2O7K0O9j61j1O6O4j4l5J00
$$ -55 -13 -57 -27 -62 -21 -69 -173 -60 -112 -90 -28 127 30 96 7 -109 -47 20 40 109 -52 -63 3 67 53 18 118
7710A18k37P3O4n7O7q3M8K1p4P9j16L9Q2j2j15K13j73j27L02o7Jj3n1k1qOJ24
$$ 118 -119 -46 18 -39 28 -55 -7 14 -60 19 -97 -58 24 12 -103 110 -63 -190 112 45 46 33 -18 -39 -47 -41 83
7737H3j47J25Oj35P0m0L6q7K56j43j05O1M1j17J24Ln4N0n0M2M0n9l8pR5j21kJ11
$$ 83 -64 61 67 -68 2 -38 -2 -89 167 24 -81 -20 21 -96 28 31 -23 27 -23 19 59 0 -38 -45 50 -71 -73 38
7765C8k6J0Q2j9O9j16R0j47k3MQ6L2n4r1Jk2O9k9k4K2P9K2l2j0p2K2j5QQ0n7N5
$$ 38 12 22 104 85 154 38 128 -19 -42 -38 48 80 26 -65 -64 -86 -17 -46 -70 -48 31 53 21 11 -61 -39 -54 -46 34 -23 32
7796C2r2Q5p2Q2o0k2L5J38j17j24J45j40J78r0q7K63k37M1K1RQ9j51L9O5j74J49
$$ 32 -60 25 -47 35 -25 -47 -12 126 9 -115 30 -110 68 -22 -109 154 -83 -42 -21 -12 77 -74 -35 30 -144 5
7822EO3j56O2j7PO4k7r2Q6q5R7M1m9k1n9J17j03N7P6l7Q1j40P3l6l7R3p6o5P2
$$ 5 68 -88 -26 -43 -36 28 1 -91 -5 -90 7 48 -1 -22 -81 36 -67 -10 66 29 110 -30 43 7 -30 63 -13 -78 -6
7851fk2J05o0l2L8op2Q8p3O3P2j19kJ8K9j00K13j11j19R9o2J35k3q0J6j01J50
$$ -6 -28 77 17 -15 23 17 -55 33 -40 23 95 -24 -26 -8 21 -79 134 23 -96 3 -59 76 53 -27 -11 -112 38
7878C8j32J08J51j31p3J29j4n4j58J31j12P6J0LN2P8j27M8q0Q4P2r3K3pn0K7N4
$$ 38 -94 14 165 34 -39 90 76 22 -136 -5 -117 -41 -31 -28 24 102 -25 23 -57 27 99 6 29 22 -28 -1 53
7905E3j09mj7L4m7P8k8j0p9J63j06OQ8j26J38J24k27q8J80N1p1j42J05J00p4M7
$$ 53 -56 -60 -77 -43 -90 -12 -40 -50 -129 34 -72 -66 22 -104 34 158 -69 -157 23 74 3 -139 -34 66 -8 39
7931C9k0nk0m6PJ03J4j1n6P3j27k6J48m2K4n8j12J92j11O5N9o2j01N6J00p6j01
$$ 39 19 14 -6 -52 -45 58 72 61 5 78 -49 -75 73 31 55 -3 -115 77 -34 31 90 28 -73 -17 83 7 -94
7958i4J50p2P7l2r6M0k8L0nr2Q2J03k6j6r2P1J30n8k9J2j22J59k30Q1J03j51M5
$$ -94 56 -16 61 29 -67 -27 -55 -25 -30 -122 -40 63 37 21 -71 0 130 72 43 55 -67 92 -138 -57 46 -105 -60
7985f0l0N7Q4q1Pl8J67Nq7j40M9K8O5J4l6p5J8K3j58P8J45k8k8Rl2j9J7J8P3N7
$$ -60 -90 -33 51 -30 -23 -61 106 111 24 -116 -67 -39 26 40 4 -71 -53 -30 -188 -110 35 7 -21 -12 -44 -63 -46 -28 45 102
8015A02Pj93J2O2R1j92J52j04Q4L0j49J87o7Lj8mk3l9L2J1k4J01j17L5j2O4p0
$$ 102 109 -84 -72 -10 81 -111 41 -63 21 51 -98 89 22 25 7 3 -20 -59 -27 -16 -40 61 -56 -21 -33 31 -39
8042c9J05j88Q0J05j96J03J7l1R7j53J40j0n6L0m9oQ7r2JJ23j56J31n4J87j20
$$ -39 66 -122 -42 63 -133 -30 -13 -44 53 -100 40 30 -26 4 -45 -51 36 -56 -55 68 -88 43 -11 176 56
8067E6j5l6nL9jn6L8q9J63j77L6K6l2J34o0l2N6L5p9J8N1m8N2n3j5L8j04J12j58
$$ 56 41 5 0 39 38 -18 20 -69 94 -83 -47 -21 -53 81 21 -11 45 80 1 19 70 22 74 21 6 44 -60 52 -106
8096a06K7J32j04k5J38o0jJ4K7m4r4R3MK4l0J41j03j6q4N3N5p6R7n3po3M2k2Q3
$$ -106 -79 53 -51 -76 62 2 1 15 42 -2 -96 -3 1 25 -5 136 33 17 -67 -14 41 -35 62 9 2 -61 -19 -41 42
8125D2M4j60R4n8K07k87J13j3loo4oJ12l1N2j1o9K7r0P9O1k0rM8j97O9J27j73
$$ 42 86 -74 20 -38 169 -118 -5 -18 -21 -27 -91 -97 15 -16 36 25 -44 -17 -107 -28 33 13 4 52 -145 -76 51 -122
8153a22R0K0K9j14K36q2j87N0J28o1n2J70k44J79j13J02l4n2N1R7p7oM7m6L8L2
$$ -122 -32 -12 17 -97 139 57 -130 -80 48 -13 -65 105 -139 40 -73 29 -5 -57 -6 91 14 8 55 9 47 79
8179G9l2q5K6J6j35J02R9m6Kj18J95o9
$$ 79 47 -38 -12 4 -131 -29 70 24 26 -92 103 34
8191C4
$$ Imaginary data points
##PAGE= N=2
##DATA TABLE= (X++(I..I)), XYDATA
0@%%%%%%%%%%%%%%%%%%%%%%%%JkKlMmPj0RqQrJ1j0QqJ0j1J3j6J7k0K3k6K9l4M2
$$ 0 0 0 0 0 0 0 0 0 0 0 0 0 0 0 0 0 0 0 0 0 0 0 0 0 1 -1 1 -2 2 -2 5 -5 4 -4 4 -5 6 -4 4 -4 6 -5 8 -8 9 -11 12 -14 15 -19 23
51B3n3O7q7J20j69K53m23Q17k077J1221Q3180j5469j05650o5389L5097P8610L1668
$$ 23 -30 37 -50 70 -99 154 -269 548 -1529 9692 92872 77403 -28247 -93636 -58539 20071 51739
68E1739l0850m7156k5143J682K7735M4598K3300l6743p0565k1512O6516Q3531
$$ 51739 20889 -26267 -51410 -49728 -21993 22605 45905 9162 -61403 -82915 -16399 67132
80F7132q65q4835o3666L2482Q2506L6293l7591n5506j6485K4785L5420K2708k056
$$ 67132 66267 -18568 -82234 -49752 32754 69047 31456 -24050 -40535 -15750 19670 42378 40322
93D0322l1881m1499n626M8338N4024p651o6693m7809K8519O7783K4548l9812m9904
$$ 40322 8441 -33058 -38684 9654 63678 56027 -10666 -58475 -29956 37827 62375 22563 -27341
106b7341p779K8912K9354J0383q535k3963k6971q51M0011M4289q051n9021l8829
$$ -27341 -35120 -6208 23146 33529 24994 1031 -25940 -26791 13220 57509 49458 -9563 -48392
119d8392L4157O6532J7287m9001m8302R258M3044K0516j3806j7113n642o257o280
$$ -48392 -14235 52297 69584 20583 -27719 -18461 24583 45099 31293 14180 8538 2281 -3999
132c999J4214L0757M641m3571m4269J6718O1871K5269m7961o0682K621N5271L1502
$$ -3999 10215 40972 45613 2042 -42227 -25509 36362 61631 13670 -47012 -44391 10880 42382
145D2382k6484m0144m750K0735J0137l540L634O843j2460k5499R96L9414L0329
$$ 42382 15898 -24246 -28996 -8261 1876 -1664 1970 8813 -3647 -29146 -28150 11264 41593
158D1593k3730n0205q841M6232M1580j3320m4232j6356K5123K7577N65j3941p307
$$ 41593 17863 -32342 -41183 5049 46629 33309 -10923 -27279 -2156 25421 25986 12045 4738
171D738k523m306K627J7142J3897j4817l2060q087K9703K9369r977l5409j5655
$$ 4738 2215 -2091 536 17678 31575 16758 -15302 -23389 6314 35683 25706 -9703 -25358
184b5358J8883K3429J032j3899q581j118j432L636J5283J1344j3809k8052l978
$$ -25358 -6475 16954 17986 4087 -4494 -5612 -7044 -3408 11875 23219 9410 -18642 -22620
197b2620L1740K8885j3504l8373j1105K9154K7505q743k5392n669J3892N727q665
$$ -22620 9120 38005 24501 -13872 -24977 4177 31682 22939 -2453 -8122 5770 11497 2832
210B832j100J2371J049k2581j6480J8599L1322k883l9046k3583K3868L7027k122
$$ 2832 1732 14103 15152 -7429 -23909 -5310 26012 23129 -15917 -39500 -15632 21395 19273
223A9273l5564j8369J8877K2527m798j7034K98J2344j653j4596J449K3020J1073
$$ 19273 -16291 -34660 -15783 6744 1946 -15088 -14790 -2446 -4099 -18695 -17246 5774 16847
236A6847k1431k5189J0357L5312J2623k6707k7038J0018L0067Q516j8423j4694
$$ 16847 -4584 -29773 -19416 15896 28519 1812 -25226 -15208 14859 23375 4952 -9742
248i742O654J1437k246o730M639P635p410j6049O76J9483J0672j6099k1943J741
$$ -9742 -3088 8349 6103 -627 4012 11647 4237 -11812 -11136 8347 19019 2920 -19023 -17282
262a7282K1458J0116j3359j4723K188J0215J545m360K282N173n208j1270K487
$$ -17282 4176 14292 933 -13790 -11602 -1387 158 -4202 -1920 3253 -1955 -13225 -10738
275a0738J8772R558j5831j9660N508K4457R305j7259j7016P075J7262P11j3266
$$ -10738 8034 17592 1761 -17899 -12391 12066 21371 4112 -12904 -5829 11433 12144 -1122
288a122l024J0850K840j3579p998J3808J5873r976k5324m207K4660J7406j6124
$$ -1122 -4146 6704 9544 -4035 -12033 1775 17648 7672 -17652 -21859 2801 20207 4083
301D083k6680K76K4468J1274j6225j6626P643J6350k022j4634k07J6364O257j5921
$$ 4083 -22597 -22321 2147 13421 -2804 -19430 -11787 4563 2541 -12093 -12300 4064 10321 -5600
315e600j3151J2785K2650j077k3541j0893J8057K0328n411k0454m940J4971R942
$$ -5600 -18751 -5966 16684 15607 -7934 -18827 -770 19558 14147 -6307 -11247 3724 13666
328A3666q496j0232M449Q789m482j1136J293J3470L097j4830j1985Q840J6559
$$ 13666 5170 -5062 -613 8176 3694 -7442 -6149 7321 10418 -4412 -16397 -7557 9002
341I002n72j6572q129J0520J1065l709j0046R76Q247L16p758J01J0755M813j0392
$$ 9002 8430 -8142 -16271 -5751 5314 1605 -8441 -7465 782 1098 -6660 -6559 4196 9009 -1383
356a383r778P905J5821P06j5367p879J1385J2976m764j2859k15J0966K663j0586
$$ -1383 -11161 -3256 12565 13271 -2096 -9975 1410 14386 9622 -3237 -3452 7514 10177 -409
370d09n579R898Q887r683j5299L225J8026M860j7466j5212R435J9419k13j8927
$$ -409 -5988 3910 12797 3114 -12185 -8960 9066 13926 -3540 -18752 -9317 10102 9889 -9038
384i038q664J3309J3231p126j4444K159J4735L293j4008p750J2635J4264o514
$$ -9038 -17702 -4393 8838 1712 -12732 -10573 4162 7455 -6553 -14303 -1668 12596 6082
397F082j7840j113J7936J0285j2016j5803M082J6405L219j3265p908Q233R043
$$ 6082 -11758 -12871 5065 15350 3334 -12469 -8387 8018 11237 -2028 -9936 -1703 7340
410G340n311j0648J901J0902Q41j2516o268R977J0744n513j3827j302J2440P032
$$ 7340 2029 -8619 -6718 4184 5025 -7491 -13759 -3782 6962 1449 -12378 -13680 -1240 5792
424E792q305r413M387R824l90q182o03Q858L494p528n932P475J0638k845j2003
$$ 5792 -2513 -11926 -7539 2285 1895 -6287 -6890 1968 5462 -2066 -7998 -523 10115 7270 -4733
439d733j746J1916P619p991j0479L256J1171P26j0572m273Q809O262q106j0228
$$ -4733 -6479 5437 13056 5065 -5414 -2158 9013 9739 -833 -5106 3703 9965 1859 -8369
453h369M075J2323p0j4103p458J0868J1916o001j5104j680J3647O924r889j0822
$$ -8369 -4294 8029 7959 -6144 -13602 -2734 9182 3181 -11923 -13603 44 6968 -2921 -13743
467a3743N454J2136r31j2175l043J1840P699q710j1554M447J4554K186j3546q441
$$ -13743 -8289 3847 2916 -9259 -12302 -462 7237 -1473 -13027 -8580 5974 8160 -5386 -13827
481a3827J0016J2716l656j3713k267J1697O565q359r761M704J0691j245j1198
$$ -13827 -3811 8905 5249 -8464 -10731 966 7531 -828 -10589 -5885 4806 3561 -7637
494g637l208J0104P178p161j0611K839J1779K726r837o339P006Q915k548q177
$$ -7637 -10845 -741 6437 -724 -11335 -8496 3283 6009 -3828 -10167 -3161 5754 3206 -4971
508d971M67Q471K817p034l594O731P150m140q721J452J0237L492r098o993N994
$$ -4971 -4504 3967 6784 -250 -3844 2887 10037 5897 -2824 -1372 8865 12357 3259 -3734 2260
523B260R398k231j0337j840Q549M545p681p943M435R207j950j1283l108R568O830
$$ 2260 11658 9427 -910 -2750 5799 10344 2663 -5280 -845 8362 6412 -4871 -7979 1589 8419
538H419p491j0851K189J1431K551j0508o753P235R272l378j0181j14J0147M162
$$ 8419 928 -9923 -7734 3697 6248 -4260 -11013 -3778 5494 2116 -8065 -8179 1968 6130
552F130q560p283O444J0484j990j1299k617J0496P598o769j0575K366J1416K451
$$ 6130 -2430 -9713 -3269 7215 5225 -6074 -8691 1805 9403 2634 -7941 -5575 5841 8292
566H292r933o040P039Q499l765r603Q7R538L896q226p149N528R508j143r823k549
$$ 8292 -1641 -7681 -642 7857 4092 -5511 -5424 4114 8010 -216 -7365 -1837 7671 6528 -3295 -5844
582e844Q759O527n378p855K798Q798Q49p622k816O869N625m546p175K243Q507
$$ -5844 2915 9442 4064 -3791 -993 7805 8654 1032 -1784 5085 10710 6164 -1011 1232 9739
597I739J080q276m395O357O759l773q611j42P872K503p365n754M716O694l303
$$ 9739 10819 2543 -1852 4505 11264 7491 -1120 -1262 6610 9113 1748 -4006 710 7404 4101
612D101q524p31P974L324p676p044M567Q575j186r604k799Q004O183n567q197
$$ 4101 -4423 -5154 2820 6144 -1532 -8576 -4009 4566 3380 -6224 -9023 -1019 5164 -403 -8600
627h600K370R252J417q518m396P213P595l773r023M36R560M067p596p086M701
$$ -8600 -6230 3022 4439 -4079 -8475 -1262 6333 2560 -6463 -6027 3533 7600 4 -7082 -2381
642b381R271p54r096k958P856N711n165p407K351Q230P51p867l561O371O220l804
$$ -2381 6890 6136 -2960 -5918 1938 7649 2484 -4923 -2572 5658 6409 -1458 -5019 1352 7572 3768
658C768p736R14Q263K671o959n456N141P393j937p685j089P616L836n926o119
$$ 3768 -3968 -3054 5209 7880 921 -4535 606 7999 6062 -1623 -2712 4904 8740 2814 -3305
673c305L781P367r24p917k332O592N032m912p341J527P306P86p180m041N047N189
$$ -3305 476 7843 6919 -998 -3330 3262 8294 3382 -3959 -2432 4874 5660 -1520 -5561 -514 4675
689D675l701o931P28O683J411o968m099N075N966l062p263k78P507L365o197n706
$$ 4675 974 -5957 -5229 1454 2865 -4103 -8202 -3127 2839 -223 -7486 -7764 -257 3108 -3089 -8795
705h795M108P594q05p677j798P091N115m964o784K574Q308R08p430m005O073O657
$$ -8795 -4687 2907 2102 -5575 -7373 -282 4833 -131 -6915 -4341 3967 4875 -2555 -6560 -487 6170
721F170l011p680k8P519L204o183n437L958O832j461p179j296O599L925n088n928
$$ 6170 3159 -4521 -4549 2970 6174 -9 -5446 -1488 5344 3883 -3296 -4592 2007 5932 844 -5084
737e084K631P345p7o745l088N836N383l535o498R16O937J550o189l864M574N647
$$ -5084 -2453 4892 4815 -1930 -5018 818 6201 2666 -3832 -2916 4021 5571 -618 -4482 92 5739
753E739k412o609j56O325K635n721n044L408O158j396o708j691N849L688m645
$$ 5739 3327 -3282 -3438 2887 5522 -199 -5243 -1835 4323 2927 -3781 -5472 377 4065 -580
768e80n818K265O338m5o663k484N496M631l656o178J161O817J680n989m038M595
$$ -580 -6398 -4133 2205 2160 -4503 -6987 -1491 3140 -516 -6694 -5533 1284 2964 -3025 -7063 -2468
784b468O024k013o272k41O282K907m898m526L454N978q43o237j341N793L780m243
$$ -2468 3556 1543 -4729 -4970 1312 4219 -679 -5205 -1751 4227 3384 -2853 -4194 1599 5379 1136
800A136n444K246O307M08o255k895N148M886l187o207O93O496J926n987m204M010
$$ 1136 -4308 -2062 4245 4653 -1602 -4497 651 5537 2350 -3857 -3164 3332 5258 -729 -4933 -923
816i23N944j629o571j001N977L648m580n275K289O069K02n854k253M703M208l319
$$ -923 5021 3392 -3179 -4180 1797 5445 865 -4410 -2121 3948 4150 -1704 -3957 746 4954 1635
832A635n215J228N739O50n360k816L992M508k508n692M32N634J721n040l872L627
$$ 1635 -3580 -2352 3387 4037 -1323 -4139 -147 4361 1853 -3839 -3407 2227 3948 -1092 -4964 -1337
848a337N135j722n944o29N538L005m492m855K775N685j20n859k267N200M157l111
$$ -1337 3798 2076 -3868 -4497 1041 4046 -446 -5301 -2526 3159 3039 -2820 -5087 113 4270 1159
864A159n379J004N753J351n154l104M001M545k086n330j22N510K084m491m015
$$ 1159 -4220 -3216 2537 3888 -1266 -4370 -369 4176 2090 -3240 -3362 2148 4232 -259 -4274
879d274L076N059j085n491j333N132L139l920m806K238N384J16n384k171M512
$$ -4274 -1198 3861 2776 -2715 -4048 1084 4223 303 -4503 -2265 3119 3235 -2149 -4320 192
894A92L859k815n134Q83N333J532m980l181L467M881j450n403l32N163K441m145
$$ 192 4051 1236 -3898 -3015 2318 3850 -1130 -4311 -844 4037 2587 -2816 -3148 2015 4456 311
910C11l985K650N204r02n179j399M674L259l282m733J473N378M33n017k574L977
$$ 311 -3674 -1024 4180 3278 -1901 -3300 1374 4633 1351 -3382 -1909 3469 3902 -1115 -3689 288
926B88L995k329n164L35N159J509m548l249L142M471j609m927o27M801K472m045
$$ 288 4283 1954 -3210 -2875 2284 3793 -755 -4004 -862 3609 2000 -2927 -3554 1247 3719 -326
942c26l917K363M826n69m991j379M303L183l415m380J505N047M48n002k410L909
$$ -326 -4243 -1880 2946 2377 -2614 -3993 310 3493 78 -4302 -2797 2250 2698 -2304 -4714 -805
958h05M211k302n031K18N138J818m344l366K754M553o48m906r32M412K630l111
$$ -805 3406 1104 -3927 -3709 1429 3247 -1097 -4463 -1709 2844 2196 -2710 -3642 770 3400 289
974B89l908J904M634p7m319j591L801L283k440m265J138M714Q61m384k467L577
$$ 289 -3619 -1715 2919 2842 -1477 -3068 733 4016 1576 -2689 -1551 3163 4024 -360 -2827 750
990G50L904j972m661O8M788J776l968l488K703M451j001m767j305M343K856l275
$$ 750 4654 2682 -1979 -1911 2877 4653 685 -2803 -100 4351 3350 -1417 -2722 1621 4477 1202
1006A202m162J541M495J18m500k084L476L319k392m210L97M387J004m181k699
$$ 1202 -2960 -1419 3076 3194 -1306 -3390 86 3405 1013 -3197 -2800 1587 2591 -1590 -4289
1021d289L182L547j741m110l42M327J622l650l204K420M133p86m470r18L986K834
$$ -4289 -1107 2440 699 -3411 -3753 574 2196 -1454 -4658 -2238 1895 1109 -3361 -4279 -293 2541
1037B541l115l841J622M517M39m164k024L510L535k005m071N30M597J265l695
$$ 2541 -574 -4415 -2793 1724 2163 -2001 -4025 -515 3020 1015 -3056 -2526 2071 3336 -359
1052c59k699K807L918j018m263m69M236K123l247l122J856M081l62l944j491L659
$$ -359 -3058 -251 3667 2649 -1614 -2083 2153 4276 1029 -2093 -237 3844 3482 -462 -1953 1706
1068A706K892k627l737R82M146M53l841k154K850L251j693m108K0M076J172l591
$$ 1706 4598 1971 -1766 -784 3362 3815 -26 -2180 670 3921 2228 -1880 -1860 2216 3388 -203
1084b03k880K379L586j180m116o40L713J888l252l360J852L776m18m165j320L560
$$ -203 -3083 -704 2882 1702 -2414 -3054 659 2547 -705 -4065 -2213 1563 1145 -3020 -4340 -780
1100g80K717k525l821Q77M150N92l787k096K711L527j453l841qL934J599l046
$$ -780 1937 -588 -4409 -3532 618 1210 -2577 -4673 -1962 1565 112 -3729 -3737 197 1796 -1250
1116a250k544K106L606m95l620n91L469K356k636k977J558L880P0l582j311L345
$$ -1250 -3794 -1688 1918 1423 -2197 -2788 681 3037 401 -2576 -1018 2862 2932 -650 -1961 1384
1132A384K686k134l512Q88L904Q52l783k040K753L249j248m097l56L839J830l068
$$ 1384 4070 1936 -1576 -688 3216 4068 285 -1755 998 4247 2999 -1098 -1454 2385 4215 1147
1148A147l094J694L561l42l847j126L125K289k237l447J018L479K14l661j567
$$ 1147 -1947 -253 3308 2966 -881 -2007 1118 3407 1170 -2277 -1259 2220 2434 -1227 -2794
1163b794K769K463j955l358L63L504P86l490j972K417L019j347l730j05L534J610
$$ -2794 -25 2438 483 -2875 -2512 992 1778 -1712 -3684 -1267 1752 405 -3325 -3430 104 1714
1179A714l167k715J987L592n52l593r19L202K360k140l027J023L498N95l281j383
$$ 1714 -1453 -4168 -2181 1411 859 -2734 -3653 -451 1909 -231 -3258 -2235 1263 1858 -1423 -2806
1195b806K600K814j351l180L83L671J153k901k045K078L262r43l177m75L258J743
$$ -2806 -206 2608 1257 -1923 -1540 2131 3284 383 -1662 416 3678 2735 -442 -917 2341 4084
1211D084k483k853J668L247k48l381j206K826K351k083l243P38L399M69l296j876
$$ 4084 1601 -1252 416 3663 3415 34 -1172 1654 4005 1922 -1321 -583 2816 3285 -11 -1887
1227a887K342K685j366l493l9L332J178l004k461J948L083q92l470o81L287J801
$$ -1887 455 3140 1774 -1719 -1758 1574 2752 -252 -2713 -765 2318 1426 -2044 -2725 562 2363
1243B363k648k783J300L135L4l296j312K765K399j820l256O52L250N75k762j765
$$ 2363 -285 -3068 -1768 1367 1401 -1895 -3207 -442 1957 137 -3119 -2467 783 1358 -1404 -3169
1259c169K039K746j106k951l4K941J348k480k037J792K814n21k859m33K905J779
$$ -3169 -1130 1616 510 -2441 -2475 466 1814 -666 -2703 -911 1903 1382 -1477 -1910 995 2774
1275B774k348k292J319L141N7l125j084K633K353j557l145N96L203Q20k866k149
$$ 2774 426 -1866 -547 2594 2651 -474 -1558 1075 3428 1871 -1274 -678 2525 3345 479 -1670
1291a670K159K712r50l186m33L011J345k466k455J337K796k56l071r43K450J902
$$ -1670 489 3201 2251 -935 -1368 1643 2988 522 -1933 -596 2200 1944 -1127 -2070 380 2282
1307B282j947k781J014K927J44l039j396K629K215j522l145M65L122P35k633k061
$$ 2282 335 -2446 -1432 1495 1639 -1400 -2796 -167 2048 526 -2619 -2154 968 1703 -930 -2991
1323b991J954K844q52l103n02K927J479k221k380J352K819j91k749j079K522J916
$$ -2991 -1037 1807 955 -2148 -2650 277 1756 -465 -2845 -1493 1326 1135 -1614 -2693 -171 1745
1339A745j640k536O89K889L21k572j295K054K270j146k675L12K873Q50k465j735
$$ 1745 105 -2431 -1742 1147 1468 -1104 -2399 -345 1925 779 -1896 -1584 1289 2139 -326 -2061
1355b061J883K429n63k761l82K618J403k041k133J199K707j72k734j129K435J974
$$ -2061 -178 2251 1688 -1073 -1455 1163 2566 525 -1608 -409 2298 2126 -608 -1737 698 2672
1371B672j832k708O14K860L93k651j630K161K149j017k986J7K938J058k540k045
$$ 2672 840 -1868 -1254 1606 1999 -652 -2282 -121 2028 1011 -1975 -1958 980 2038 -502 -2547
1387b547J679K535l57k895o63K638J773k010k406J012K718K16k605j306K202K249
$$ -2547 -868 1667 1310 -1585 -2248 390 2163 153 -2253 -1241 1477 1693 -912 -2218 -16 2233
1403B233j486k526M98K443N68k293j424J592K244r05k667j2K446R79k088j730
$$ 2233 747 -1779 -1281 1162 1730 -563 -1987 -395 1849 944 -1723 -1735 711 1690 -398 -2128
1419b128J330K320l99k650o95K517J473j779k170Q81K556L95k575j211K064K061
$$ -2128 -798 1522 1123 -1527 -2222 295 1768 -11 -2181 -1300 1256 1651 -924 -2135 -71 1990
1435A990j182k483K51K478R47k134j628J546K199p32k458l82K410J207k037j709
$$ 1990 808 -1675 -1424 1054 2001 -133 -1761 -215 1984 1252 -1206 -1588 822 2029 -8 -1717
1451a717J096K413m90k443o92K313J577j914k024R48K569O5k542j203K184K031
$$ -1717 -621 1792 1302 -1141 -1833 480 2057 143 -1881 -933 1636 1701 -841 -2044 140 2171
1467B171j252k395O8K690Q15k117j809J468K360m42k608m91K568J106j844j827
$$ 2171 919 -1476 -1408 1282 2097 -20 -1829 -361 1999 1557 -1051 -1542 1026 2132 288 -1539
1483a539R33K261j39k296q95J817J615j438k157M30K297L68k216j198J588J946
$$ -1539 -606 1655 1516 -780 -1675 142 1757 319 -1838 -1408 889 1257 -959 -2157 -569 1377
1499A377j226k185N2K414O34j944j509J331K161n04k299m54K291J161j563j766
$$ 1377 151 -2034 -1982 432 1066 -878 -2387 -1056 1105 601 -1698 -2152 139 1300 -263 -2029
1515b029Q41K317M5k273q09J877J786j201k273N95K271N31k093j283J584K089
$$ -2029 -1188 1129 1174 -1099 -1908 -31 1755 554 -1719 -1124 1147 1678 -415 -1698 -114 1975
1531A975r57k228pK281R23j963j719J301K300m97k255m60K156J272j421j959N95
$$ 1975 1018 -1210 -1217 1064 1987 24 -1695 -394 1906 1409 -846 -1306 850 2122 701 -1258 -663
1548f63K401J05k157j035J726J810j168k199L22K358K78j955j324J463J711p35
$$ -663 1738 1843 -314 -1349 377 2187 1019 -1180 -858 1500 1778 -177 -1501 -38 1673 938
1564I38k384m4K113Q34j858j654R41K168l93k233o26J825J439j464j860M49K103
$$ 938 -1446 -1490 623 1457 -401 -2055 -1114 1054 661 -1572 -2198 -373 1066 -398 -2258 -1809 294
1581B94J90j686j058J348J794j035j809K20K039O46j661j083J232J760n22j932
$$ 294 484 -1202 -2260 -912 882 -153 -1962 -1742 297 943 -718 -1801 -569 1191 669 -1263
1597a263o3K032Q60j471j534J193J868j21j965n81J879J444j385j869M82K199
$$ -1263 -1326 706 1566 95 -1439 -246 1622 1501 -464 -1045 834 2278 893 -976 -494 1705
1613A705M07k078j049J438J936r25k145O4K084O43j651j408J086J736m33j939
$$ 1705 2112 34 -1015 423 2359 1434 -711 -647 1437 2080 429 -979 107 1843 1410 -529
1629e29k95J852R67j563j654Q39J973k83k047o17J768J270j470j808M43J968K96
$$ -529 -824 1028 1995 432 -1222 -383 1590 1307 -740 -1357 411 1681 211 -1597 -1154 814 1110
1646A110k040j232J535J606q55k113J71J799Q52j725j316R56J896m28j786m92
$$ 1110 -930 -2162 -627 979 124 -1989 -1818 -19 833 -892 -2208 -1252 644 216 -1570 -2062
1662b062J990R69j198j382N97J820J23j658n84J577J237q40j688M73J919M80j478
$$ -2062 -72 897 -301 -1683 -1086 734 857 -801 -1385 192 1429 589 -1099 -626 1293 1773 295
1679B95j133J296J606o58j775r2J715R01j415j437R71J739j63j961m59J652J120
$$ 295 -838 458 2064 1406 -369 -461 1254 2155 740 -697 274 2013 1850 -111 -570 1082 2202
1696B202j430j387M83J921n6j871q88J616J330j114j692J73J780M62j886j020
$$ 2202 772 -615 -132 1789 1733 -138 -1026 590 1920 806 -886 -713 1067 1529 -357 -1377
1712a377J238J626p44j937j44J746O90j506j420Q53J764k54j710n77J472J109
$$ -1377 -139 1487 743 -1194 -1338 408 1098 -408 -1828 -975 789 535 -1175 -1752 -280 829
1728H29j252j458N69J444K03j442p81J388J153p56j577L76J791L64j598q91J266
$$ 829 -423 -1881 -1312 132 335 -1107 -1888 -500 653 -103 -1680 -1304 487 851 -747 -1638 -372
1745c72J549n10j695k2J844P53j306j290Q18J836j3j678p78J617J342j134j488
$$ -372 1177 667 -1028 -1050 794 1547 241 -1049 -231 1605 1592 -86 -864 753 2095 961 -527
1762e27M13J705K66j507r28J094J381p05j687O5J558N40j472j014P61J420l02
$$ -527 -114 1591 1857 350 -578 516 1897 1192 -495 -430 1128 1668 196 -818 -57 1363 1061
1779A061j740k86J564P75j325j231Q13J342j68j717n96J488J042j083j506L89
$$ 1061 -679 -965 599 1374 49 -1182 -369 973 805 -912 -1508 -20 1022 -61 -1567 -1178
1795a178J596L62j639j000J234J471p70j712M8J590N91j257j033P92J507l12j691
$$ -1178 418 780 -859 -1859 -625 846 76 -1636 -1588 2 593 -664 -1697 -905 602 290 -1401
1812a401j73J604Q01j023j293O07J624N5j525m99J318J088p77j497M39J505L94
$$ -1401 -1574 30 831 -192 -1485 -878 746 801 -724 -1223 95 1183 406 -1091 -652 853 1247
1829A247j276q47R89J379m64j612J73J448N85j355r31P36J259m6j538m53J326
$$ 1247 -29 -876 113 1492 1028 -584 -411 1037 1622 267 -664 72 1331 1285 -253 -706 620
1846F20Q50j070j267N31J433J06j692o03J274J112r14j588K77J718J29j343q25
$$ 620 1470 400 -867 -336 1097 1203 -489 -1092 182 1294 380 -1208 -931 787 916 -427 -1252
1863a252P52J497n12j449k68J357Q07j199j060N85J327j07j458l59J288Q58r88
$$ -1252 -500 997 485 -964 -1232 125 932 -267 -1327 -742 585 478 -980 -1339 -51 807 -181
1880a81j209M39J401K21j521n14J160J072p68j190J16J509L53j284r13J024J280
$$ -181 -1390 -951 450 671 -850 -1364 -204 868 100 -1090 -974 535 888 -396 -1309 -285 995
1897I95l74j488p6J454P28j095j158O90J306oj298n57J225R62p68j152J41J388
$$ 995 621 -867 -943 511 1239 144 -1014 -324 982 976 -322 -879 346 1308 540 -612 -471 917
1915I17J46j137p24R55J064o56j227M8J361L29j168q54P46J285m72j303l36J495
$$ 917 1063 -74 -798 157 1221 565 -662 -614 747 1076 -92 -946 -200 1085 613 -690 -1026 469
1933D69O94j121j166N50J422P6j538m77J256R06p96j384L10J363M14j278q55R85
$$ 469 1163 42 -1124 -574 848 924 -614 -1091 165 1071 275 -1109 -799 564 978 -300 -1155 -170
1951a70J207n96j204k0J254N06j148q81O86J226k78j295k07J091Q11q80j241N00
$$ -170 1037 441 -763 -783 471 977 -171 -1052 -366 860 582 -713 -920 171 982 102 -1139 -639
1969f39J257J30j403l43J070R34q15j144K33J208M17j260o79Q55J084m79j211
$$ -639 618 748 -655 -998 72 1006 191 -953 -720 488 905 -355 -1034 -179 905 426 -785
1986g85k8J216N96j089q49O70J132k06j378j72J228O56q74j041L82J329P1j269
$$ -785 -813 403 999 -90 -939 -269 863 657 -721 -893 335 991 117 -924 -542 787 858 -411
2004d11m97J037Q76o62j111J14J220L42r94p68Q76J017m26j192O6J126M40q46
$$ -411 -908 129 1005 343 -768 -654 566 908 -86 -854 22 1039 613 -579 -513 613 1053 207
2022B07r75O20J137j65j304j98J089P07r98j075N91J192L2j184o70J000Q53n16
$$ 207 -768 -148 989 824 -480 -678 411 1118 120 -955 -364 828 860 -324 -994 6 859 343
2040C43j274K39J186L34j085q79P41J105k26j329j10J120N87r39q81M32J069m8
$$ 343 -931 -692 494 828 -257 -1136 -395 710 484 -845 -955 165 752 -187 -1068 -636 433 385
2058C85j042m01Q78R09p43r91M04R56K26j003o82J001Q28m14j087J34J023M32
$$ 385 -657 -1058 -180 729 -14 -1005 -601 355 581 -422 -1104 -103 725 311 -776 -642 381 813
2076H13q54q23P39J060k81j124k57J217N91r21q38M81J197j02j100k99Q58Q32
$$ 813 -41 -864 -125 935 654 -470 -727 490 1081 160 -678 -197 1000 898 -202 -501 357 1189
2094A189o64r27L71R04K81j162o47R49P75o27r13N8J158K26r97q08P24R91k27
$$ 1189 525 -402 -31 873 1154 -8 -655 294 1069 442 -471 -413 745 971 -26 -834 -110 881 654
2113F54j222j86J180M02r03r04M75J009Q0j236m68R63Q05o55j147J73J155K77
$$ 654 -568 -754 426 828 -75 -979 -504 505 585 -651 -1119 -156 649 -6 -1153 -980 175 452
2131D52r76o65P26R65k43j096k37J051O71q17q33M86Q63K44j140k88R03P07n75
$$ 452 -524 -1189 -463 502 259 -837 -1074 -23 648 -169 -1002 -516 347 591 -549 -837 66 773 198
2150A98r71L21J062J43q18m25O80P86l89r05J47R01J94o87n80N57Q73l27r18r5
$$ 198 -773 -452 610 753 -65 -490 190 976 587 -318 -171 730 924 237 -343 214 1087 760 -158 -253
2170b53J042K56p39p37O23Q39k92r28k52R53N90r29p39K92J023r0j027l53Q05
$$ -253 789 1045 306 -431 192 1031 739 -189 -441 512 1102 173 -566 -274 749 659 -368 -721 84
2189H4O40o50q93K5J028L03r84n46N84Q00l22j070m6R42N37q62p61N95Q85k06
$$ 84 724 74 -819 -794 234 537 -447 -993 -409 391 69 -1001 -1047 -105 432 -430 -1191 -596 289 83
2209H3j027j92R62O75o19j059L74J129K46r25o54P17R42k05j037m8J061L71p51
$$ 83 -944 -1136 -174 501 -118 -1177 -803 326 572 -353 -1007 -290 652 447 -590 -638 423 794 43
2228D3o94O12R18p3r97j80O85N89m32p80L33Q76j5p37m08O12O32m15p85L11O85
$$ 43 -651 -39 879 806 -191 -371 314 903 471 -309 24 900 885 148 -260 352 984 569 -216 95 780
2249G80K7o75m15N31N95n18o82L6R50R0r28m75O74O34k84r57j28J045L51q68o88
$$ 780 807 132 -283 248 843 325 -357 -321 629 719 -209 -684 -10 624 340 -617 -745 300 651 -217 -905
2270i05M25P76j20r71j20P84N43o63p60K38R84j4p81n09O72Q66l50j086P3R21
$$ -905 -480 296 176 -795 -915 -131 412 -251 -1011 -773 211 197 -584 -1093 -421 445 95 -991 -918 3
2290CN64q82o18N75R02Oj021l05R24P89o97q93L82Q12K42o98m51N08P69k54p84
$$ 3 567 -315 -933 -358 544 550 -471 -776 148 937 240 -653 -271 541 783 85 -366 142 911 657 -127
2311a27p9P49M43p69m70M85O16j68o44l63P53M43n79n49K72P29j20p53k18O55
$$ -127 -206 543 986 217 -253 232 848 680 36 -327 426 869 290 -259 13 742 622 -131 -349 306
2331C06M89o75o25K18O62J0n55m22O14M00n22m67J05O24Q0o48l59N67L80l19p31
$$ 306 795 120 -505 -287 375 385 -170 -592 22 422 -100 -567 -462 162 242 -406 -765 -198 182 -137 -868
2352h68J18Q91K69q77o68P42Q72l42r99k4R83M97p13o49L13R45L00j046n33Q02
$$ -868 -750 141 410 -467 -1135 -393 479 137 -862 -886 97 594 -119 -768 -455 490 790 -256 -789 13
2372A3P58l48j073P2Q90N29p42o32M12Q40j1q77j65O29N40l92q33J41Q39K49p56
$$ 13 771 423 -650 -578 312 841 99 -533 -121 719 708 -169 -334 295 835 443 -390 -249 590 839 83
2393H3n51N90N56k29o39KN80J68n47m14L64O03k72n27k20O07L28l48n20J98N93
$$ 83 -468 122 678 449 -190 -188 392 560 13 -401 -37 566 294 -233 -453 154 482 134 -386 -188 405
2414D05j08o58j56O92J3l20m58K15O97k25n18k85O45L59n02n12L08P01j43o06
$$ 405 297 -361 -517 175 188 -132 -590 -375 322 97 -421 -706 -61 298 -204 -716 -408 293 150 -456
2434d56k81O35O48m80p21K84Q52R4q17n27N54P87k50p87m3P41N41o69p63N72P17
$$ -456 -737 -102 546 66 -655 -371 481 575 -242 -769 -215 572 322 -465 -508 233 774 105 -658 -86 631
2455F31l0q78k32N36Q04m15q95J25O98M74p37o27N19O80q4q12k80N91P24m85p59
$$ 631 601 -277 -509 27 831 416 -479 -354 344 818 81 -546 -27 653 569 -243 -523 68 792 307 -452
2476d52K06N85K99o95k92K36N67j95n44j23O45K10m75l38L66M46k52m10r7N43
$$ -452 -246 339 638 -57 -349 -113 454 259 -285 -408 237 447 -28 -366 0 446 194 -216 -313 230
2496B30o4l15k21L67L71k43n12R0N23K00m58n19K82P13r8q39N9N76L71n07o41
$$ 230 166 -149 -370 -3 368 125 -387 -297 226 426 -32 -551 -269 444 346 -493 -434 142 513 6 -635
2517f35M59O15jp47k60O90M02l89n95J02P38K39p63m77M68O33k01o40j34O68L59
$$ -635 -176 439 438 -309 -569 121 523 134 -461 -359 379 618 -145 -622 -154 479 278 -362 -496 172 531
2538E31n08p19L94O94K09p66n16O97N59k53p92k8P28L89o16n44K52P19J7o74l09
$$ 531 23 -696 -302 392 601 -165 -681 16 575 322 -470 -498 230 619 3 -541 -289 430 447 -227 -536
2559e36P61L41k87n36n6O79J1n43k02N30L35k00o27Q7N76J15m75j95M66K15l01
$$ -536 225 566 279 -257 -313 366 377 -166 -368 162 497 297 -330 -243 333 448 -27 -222 244 459 158
2580A58n06K04M22R3n83k14M48M58m39l38O2N30J53n81m55M37M60j73n52N7O84
$$ 158 -348 -144 278 371 -212 -426 22 480 41 -297 -235 295 448 -133 -588 -151 309 136 -416 -359 325
2601C25lm51n43L56O41o0p67k76P99N01n44o06J70P88J07o82l18L32O55j43o62
$$ 325 322 -129 -672 -316 325 265 -502 -778 21 522 -22 -628 -458 330 437 -245 -563 -231 424 281 -381
2622c81k60P42M85m98n47J99O56O8n54m24O17N27k26o93J23N74R5m15l47K32P29
$$ -381 -641 101 586 88 -459 -260 396 464 -90 -514 103 630 404 -289 -166 408 503 88 -259 -27 702
2643G02l31m83l0M31L81m18m02J31N43j86m37o4L71K96m07l03J42L49Qk93k08
$$ 702 371 -112 -142 289 670 252 -150 -19 524 338 -99 -163 208 504 97 -206 -64 285 293 0 -208
2664b08K59R1k48l47K14L68k9m81n3M10J02k14m12K53N29j14n33j50M56M48n68
$$ -208 51 142 -106 -453 -239 129 100 -381 -434 -24 78 -136 -548 -295 234 120 -413 -563 -107 341 -227
2685b27m08K14M58L35o89m18L43Q73j83p12j88O36N63n35m10mN83L43o97k86M89
$$ -227 -635 -421 37 372 -317 -735 -392 481 298 -414 -602 34 597 62 -348 -352 231 574 -123 -409 80
2706H0M73j73n90rO34K57m68l90K71M25K6m49l90N83M25l25o72K23M59K99o44
$$ 80 553 380 -210 -219 415 672 204 -186 85 510 536 87 -303 280 705 380 -292 -69 390 689 45
2727D5m49M72L94j01n61P0M72j8k54l82L14J45N6n73J09K61R9k87k00J69L28j23
$$ 45 -404 68 462 361 -200 -130 342 324 70 -312 2 147 203 -370 -261 0 99 -188 -388 -219 109 -14
2749a4m43R1K52K23l10n05M15M45k70l85P3M52J66l83m10L78L38J4n31r2M61L82
$$ -14 -457 -366 -114 109 -201 -706 -291 154 -116 -501 -428 24 190 -193 -603 -225 113 127 -404 -496 -35 347
2771C47k82l78q8N52K39m66k71L15N41n3o79p9M80N04l89o55K74O18Q9o43k07
$$ 347 65 -313 -401 151 390 -76 -347 -32 509 456 -223 -302 178 682 293 -362 -88 530 619 -24 -231
2792b31L68M87j77n79n0N91K17m30m42K74N14q2n09j29K81L13l12m95K01K86K92
$$ -231 137 624 447 -132 -182 409 626 196 -246 28 542 460 -49 -178 103 416 104 -391 -190 96 388
2813C88m18l41L29J85j02l33p1L17J02k74p8M7K13m9k63j05M25Q3k85k75K94M21
$$ 388 -30 -371 -42 143 41 -292 -363 -46 56 -218 -296 -249 -36 -85 -348 -453 -28 55 -230 -505 -211 210
2835B10k46m67QM65J38k51k95K65L64k8m59j39N13L50m17l15K26L52J74n54j84
$$ 210 -36 -503 -495 -30 108 -143 -438 -173 191 163 -296 -435 78 428 11 -304 -78 274 448 -106 -290
2856b90M69K97k68j94j34O41O4n24l40L00N52p8n63n7L56L65m21m55K41M90O5
$$ -290 179 476 208 14 -120 521 585 61 -279 21 573 495 -68 -125 231 596 175 -280 -39 451 516
2877E16o59j43M45L10k57m71K8L53K32l05m01L30L21k09k42l02N05J33k56k42
$$ 516 -143 -286 159 469 212 -259 -231 122 354 49 -352 -22 299 90 -152 -454 51 184 -72 -314
2897c14J66J90jl50o2K72K84l40l08J59K84L2l41j46M65K07j52m87K24L62K07
$$ -314 -148 42 41 -309 -371 -99 185 -155 -463 -304 -20 12 -329 -475 -10 197 45 -442 -218 144 351
2918C51n54p9L04K27k38j90NL73K59m99k23L50K07Jl98m2L24L82l50n28K37M15
$$ 351 -203 -282 22 249 11 -179 -174 199 458 -41 -264 86 293 294 -104 -146 178 560 210 -318 -81 334
2940C34Q6m14l61N23L22k68m33n9N77R2m93k42M41K20M5n41m0L24K09j78m12j1
$$ 334 420 6 -355 168 490 222 -211 -270 307 399 -94 -336 105 325 370 -171 -211 113 322 144 -268 -279
2962b79N22j5l57k35K88K95k26l02L5L96O0l41k67K86M76k68l36j61M57J46k84
$$ -279 243 228 -129 -364 -76 219 -7 -309 -274 122 182 -159 -426 -140 336 68 -268 -429 28 174 -110
2983a10j65J30L04O7l62j17J93J89p5l60J89L81p7k07j13J74L05l81j83j4M69
$$ -110 -275 -145 159 226 -136 -253 -60 129 54 -306 -117 264 187 -20 -133 41 346 -35 -218 -232 237
3004B37l0k80k34L24J98q4l08OL54N5l10k21L41L00j78l41NK69K00k81l27K51
$$ 237 207 -73 -307 17 215 131 -177 -171 183 238 -72 -293 48 348 170 -171 -166 103 303 22 -305 -54
3026e4M36j90m16n6K51L96l00k25r4N18K4l58k30K62M03j40m52o5L99J76l72k92
$$ -54 382 192 -224 -280 -29 367 67 -158 -252 266 290 -68 -298 -36 367 227 -225 -290 109 285 -87 -379
3048c79L15K59K4m34p0K74K04j13k99P2L03Mj82k30K00L31k39l09M3K78J79k52
$$ -379 -64 195 219 -215 -285 -11 193 80 -219 -147 156 160 -22 -252 -52 279 40 -269 -226 52 231 -21
3070b1qo0K41jk49j42M36k1k93k9M0J31K04m01k8L05J52k33k14O6L02l4k42j16
$$ -21 -29 -89 152 151 -98 -240 196 175 -118 -147 -107 24 228 -173 -201 104 256 23 -191 -125 177 143 -99 -215
3094b15K90K66l13j97k3L36J09k32l04K48J63P2m55J54J91L12m54k08J37L01J34
$$ -215 75 341 28 -169 -192 144 253 21 -283 -35 128 200 -255 -101 90 402 -52 -260 -123 178 312
3115C12m26p7J64L34k85k53J13K80J76k85l22L86J83j50l14J5K08K08j69l43J44
$$ 312 -114 -191 -27 307 22 -231 -118 162 338 53 -269 117 300 150 -164 -149 59 267 98 -245 -101
3136a01L24j18j26o6J17J41k70j90K10J33P8j48k01K06J75k16j85j18L30J75l63
$$ -101 223 105 -21 -87 30 171 -99 -289 -79 54 132 -16 -217 -11 164 -52 -237 -355 -25 150 -213
3157b13n2K23J37J1l26J06R6K24k48l26K98K91rm06L8K43N6j16k49J35L46n7k52
$$ -213 -265 -42 95 106 -220 -114 -18 206 -42 -368 -70 221 212 -194 -156 87 143 27 -222 -87 259 202 -50
3180e0r0J06L72k84k14J06K01J28j95k36K02L46k42k34k01M73K06l28k65L09K73
$$ -50 -140 -34 338 54 -160 -54 147 275 80 -156 46 392 150 -84 -285 188 394 66 -199 110 383
3201C83k24k39l0K40J34j86l26J63K89J25k83k52J52L16j13l27J1K30O2l82J24
$$ 383 159 -80 -110 130 264 78 -248 -85 204 329 46 -206 -54 262 149 -178 -167 63 125 -257 -133
3222a33j18L75o9k81L9K30l9j48j09j0K68O1k34j81L56P9j41j61l0N01j63k24
$$ -133 -251 124 55 -226 -187 43 4 -144 -253 -263 5 66 -168 -349 7 86 -55 -216 -246 255 92 -132
3244a32j59K15K07n7k06M2K70O8k18l36L28L17q3m36lL46O2j93k08J74L68r0k74
$$ -132 -291 -76 131 74 -132 -90 180 248 30 -306 22 339 256 -180 -183 163 225 32 -176 -2 366 276 2
3267Bk29L40J32j33j61N4J79J10l19m2J33L80k52m00L5K45K74l06j75J44J45j00
$$ 2 -227 113 245 112 -49 5 184 294 -25 -67 66 446 194 -206 -171 74 348 42 -133 11 156 56
3289E6j76o9J87K11k63k42J90Q8J42l62k6J79K34j79k64P4K51l2j78k13K89J32
$$ 56 -120 -189 -2 209 -54 -296 -106 -18 124 -238 -264 -85 149 -30 -294 -220 31 -1 -179 -392 -103 29
3311B9j09j93L5K32J4r2j95J85K12n8k51j7J44L44j65j55K1K20m3k57o7K73N1
$$ 29 -80 -273 -238 -6 8 -84 -279 -94 118 60 -191 -208 -64 280 115 -40 -19 201 158 -99 -166 107 158
3334A58l7j72P1J86J65k92q4J26J21Jk81k7K67J1ml11J26K49j22j87l3K07J39
$$ 158 121 -51 20 206 371 79 -5 121 242 243 -38 -65 202 213 209 -102 24 273 151 -36 -69 138 277
$$ [...]
8191G6
##END NTUPLES=NMR FID
##END=
