##TITLE=1H_CG-1118
 CDCl3, 8 sc, 
 19.8.2019
##JCAMPDX= 6.0         $$ Bruker NMR JCAMP-DX V2.0
##DATA TYPE= NMR FID
##DATA CLASS= NTUPLES
##ORIGIN= UXNMR, Bruker Analytische Messtechnik GmbH
##OWNER= root
$$ XWIN-NMR		Version 3.5
$$ Mon Aug 19 13:47:30 2019 Russian Standard Time (UT+4h)  she@DPX200
##.OBSERVE FREQUENCY= 200.13155
##.OBSERVE NUCLEUS= ^1H
##.DELAY= (6, 6)
##.ACQUISITION MODE= SIMULTANEOUS
##.ACQUISITION SCHEME= undefined
##.AVERAGES= 8
##.DIGITISER RES= 18
##SPECTROMETER/DATA SYSTEM= spect
##.PULSE SEQUENCE= zg30
##.SOLVENT NAME= D2O
##.SHIFT REFERENCE= (INTERNAL, D2O, 0, 15.7039)
##AUDIT TRAIL= $$ (NUMBER, WHEN, WHO, WHERE, WHAT)
$$ ##TITLE= Audit trail, XWIN-NMR		Version 3.5
$$ ##JCAMPDX= 5.01
$$ ##ORIGIN= Bruker BioSpin GmbH
$$ ##OWNER= she
$$ F:/spectra/data/she/nmr/H-F/1/audita.txt
$$ ##AUDIT TRAIL=  $$ (NUMBER, WHEN, WHO, WHERE, WHAT)
(   1,<2019-08-19 13:46:07.70 +0400>,<she>,<DPX200>,
      <created by zg, POWCHK disabled, PULCHK disabled
       configuration hash MD5:
       00 E9 B6 7A A2 85 ED C7 34 08 36 98 17 FE 4E 26
       data hash MD5: 16K
       B7 A1 02 D6 2A EB 07 1A 8F E1 BC 0A B1 C6 C2 F7>)
$$ ##END=
$$ 
$$ hash MD5
$$ 48 DC 20 1B EB BA 1E 92 7C 2F CA 30 AE A5 D3 B9
##$RELAX= 
##$RELAX= 
##$RELAX= 
##$RELAX= 
##$RELAX= 
##$RELAX= 
$$ Bruker specific parameters
$$ --------------------------
##$DU= <F:/spectra>
##$EXPNO= 1
##$NAME= <H-F>
##$PROCNO= 1
##$TYPE= <nmr>
##$USER= <she>
##$AMP= (0..31)
100 100 100 100 100 100 100 100 100 100 100 100 100 100 100 100 100 100 
100 100 100 100 100 100 100 100 100 100 100 100 100 100 
##$AQSEQ= 0
##$AQ_mod= 1
##$AUNM= <au_zg>
##$AUTOPOS= <>
##$BF1= 200.13
##$BF2= 200.13
##$BF3= 200.13
##$BF4= 200.13
##$BF5= 200.13
##$BF6= 200.13
##$BF7= 200.13
##$BF8= 200.13
##$BYTORDA= 1
##$CFDGTYP= 0
##$CFRGTYP= 5
##$CHEMSTR= <none>
##$CNST= (0..31)
1 1 145 1 1 1 1 1 1 1 1 1 1 1 1 1 1 1 1 1 1 1 1 1 1 1 1 1 1 1 1 1 
##$CPDPRG= <>
##$CPDPRG1= <>
##$CPDPRG2= <>
##$CPDPRG3= <>
##$CPDPRG4= <mlev>
##$CPDPRG5= <mlev>
##$CPDPRG6= <mlev>
##$CPDPRG7= <mlev>
##$CPDPRG8= <mlev>
##$CPDPRGB= <>
##$CPDPRGT= <>
##$D= (0..31)
0 1.2 0 0 0 0 0 0 0 0 0 0.03 0 0 0 0 0 0 0 0 0 0 0 0 0 0 0 0 0 0 0 0 
##$DATE= 1566207967
##$DBL= (0..7)
120 120 120 120 120 120 120 120 
##$DBP= (0..7)
150 150 150 150 150 150 150 150 
##$DBP07= 0
##$DBPNAM0= <>
##$DBPNAM1= <>
##$DBPNAM2= <>
##$DBPNAM3= <>
##$DBPNAM4= <>
##$DBPNAM5= <>
##$DBPNAM6= <>
##$DBPNAM7= <>
##$DBPOAL= (0..7)
0.5 0.5 0.5 0.5 0.5 0.5 0.5 0.5 
##$DBPOFFS= (0..7)
0 0 0 0 0 0 0 0 
##$DE= 6
##$DECBNUC= <off>
##$DECIM= 24
##$DECNUC= <off>
##$DECSTAT= 4
##$DIGMOD= 1
##$DIGTYP= 9
##$DL= (0..7)
0 120 120 120 120 120 120 120 
##$DP= (0..7)
150 150 150 150 150 150 150 150 
##$DP07= 0
##$DPNAME0= <>
##$DPNAME1= <>
##$DPNAME2= <>
##$DPNAME3= <>
##$DPNAME4= <>
##$DPNAME5= <>
##$DPNAME6= <>
##$DPNAME7= <>
##$DPOAL= (0..7)
0.5 0.5 0.5 0.5 0.5 0.5 0.5 0.5 
##$DPOFFS= (0..7)
0 0 0 0 0 0 0 0 
##$DQDMODE= 0
##$DR= 18
##$DS= 0
##$DSLIST= <SSSSSSSSSSSSSSS>
##$DSPFIRM= 0
$$ [...]
##$SUBNAM2= <"">
##$SUBNAM3= <"">
##$SUBNAM4= <"">
##$SUBNAM5= <"">
##$SUBNAM6= <"">
##$SUBNAM7= <"">
##$SUBNAM8= <"">
##$SUBNAM9= <"">
##$SW= 24.9336996594482
##$SWIBOX= (0..15)
0 0 2 0 0 0 0 0 0 0 0 0 0 0 0 0 
##$SW_h= 4990.01996007984
##$TD= 16384
##$TD0= 1
##$TE= 0
##$TE2= 300
##$TE3= 300
##$TEG= 300
##$TL= (0..7)
0 120 120 120 120 120 120 120 
##$TP= (0..7)
150 150 150 150 150 150 150 150 
##$TP07= 0
##$TPNAME0= <>
##$TPNAME1= <>
##$TPNAME2= <>
##$TPNAME3= <>
##$TPNAME4= <>
##$TPNAME5= <>
##$TPNAME6= <>
##$TPNAME7= <>
##$TPOAL= (0..7)
0.5 0.5 0.5 0.5 0.5 0.5 0.5 0.5 
##$TPOFFS= (0..7)
0 0 0 0 0 0 0 0 
##$TUNHIN= 0
##$TUNHOUT= 0
##$TUNXOUT= 0
##$USERA1= <user>
##$USERA2= <user>
##$USERA3= <user>
##$USERA4= <user>
##$USERA5= <user>
##$V9= 5
##$VALIST= <valist>
##$VCLIST= <CCCCCCCCCCCCCCC>
##$VD= 0
##$VDLIST= <DDDDDDDDDDDDDDD>
##$VPLIST= <PPPPPPPPPPPPPPP>
##$VTLIST= <TTTTTTTTTTTTTTT>
##$WBST= 1024
##$WBSW= 4
##$XGAIN= (0..3)
0 0 0 0 
##$XL= 0
##$YL= 0
##$YMAX_a= 224317
##$YMIN_a= -273795
##$ZGOPTNS= <>
##$ZL1= 120
##$ZL2= 120
##$ZL3= 120
##$ZL4= 120
##$ABSF1= 10
##$ABSF2= 0
##$ABSG= 5
##$ABSL= 3
##$ALPHA= 0
##$AQORDER= 0
##$ASSFAC= 0
##$ASSFACI= 0
##$ASSFACX= 0
##$ASSWID= 0
##$AUNMP= <proc_1d>
##$AZFE= 0.1
##$AZFW= 0.1
##$BCFW= 1
##$BC_mod= 2
##$BYTORDP= 1
##$COROFFS= 0
##$CY= 11.3945322036743
##$DATMOD= 1
##$DC= 2
##$DFILT= <>
##$DTYPP= 0
##$F1P= 20.1720416913024
##$F2P= 0.152960286110954
##$FCOR= 0.5
##$FTSIZE= 0
##$FT_mod= 4
##$GAMMA= 1
##$GB= 0.15
##$INTBC= 1
##$INTSCL= 1
##$ISEN= 128
##$LB= 0.24
##$LEV0= 0
##$LPBIN= 0
##$MAXI= 10000
##$MC2= 0
##$MEAN= 0
##$ME_mod= 0
##$MI= 1.114404
##$NCOEF= 0
##$NC_proc= 0
##$NLEV= 6
##$NOISF1= 3.799351
##$NOISF2= 2.8
##$NSP= 1
##$NTH_PI= 0
##$NZP= 0
##$OFFSET= 15.70392
##$PC= 1
##$PHC0= -9220.786
##$PHC1= 23.60097
##$PH_mod= 1
##$PKNL= yes
##$PPARMOD= 0
##$PSCAL= 0
##$PSIGN= 0
##$REVERSE= no
##$SF= 200.130013532006
##$SI= 16384
##$SIGF1= 3
##$SIGF2= 2
##$SINO= 400
##$SIOLD= 16384
##$SREGLST= <1H.CDCl3>
##$SSB= 0
##$STSI= 0
##$STSR= 0
##$SW_p= 3612.71676300578
##$SYMM= 0
##$S_DEV= 0
##$TDeff= 0
##$TDoff= 0
##$TI= <>
##$TILT= no
##$TM1= 0
##$TM2= 0
##$TOPLEV= 0
##$USERP1= <user>
##$USERP2= <user>
##$USERP3= <user>
##$USERP4= <user>
##$USERP5= <user>
##$WDW= 1
##$XDIM= 8192
##$YMAX_p= 0
##$YMIN_p= 0
$$ End of Bruker specific parameters
$$ ---------------------------------
##NTUPLES= NMR FID
##VAR_NAME=  TIME,          FID/REAL,        FID/IMAG
##SYMBOL=    X,             R,               I
##VAR_TYPE=  INDEPENDENT,   DEPENDENT,       DEPENDENT
##VAR_FORM=  AFFN,          ASDF,            ASDF
##VAR_DIM=   8192,          8192,            8192
##UNITS=     SECONDS,       ARBITRARY UNITS, ARBITRARY UNITS
##FACTOR=    0.0002004,     1,               1
##FIRST=     0,             0,               0
##LAST=      1.6414764,     0,               0
##MIN=       0,             -273795,         0
##MAX=       1.6414764,     224317,          0
$$ Real data points
##PAGE= N=1
##DATA TABLE= (X++(R..R)), XYDATA
0@%%%%%%Qj6J6j7K5l3M1n6P1q5J02j20J38j63J94k26K64l05L47m01M64n27N93
29C14o71P57q50R56j073J199j337J489j656J837k037K259k501K768l063L394l763
46a978M176m648N186n804O528p393Q441r740J1409j3643J6804k1660L0181m9513
60c1654J72148K5560k14004J29698J18030K3300j08887p7552J5241Q5580m9817
71H7643o5370O4235N6456j29455r8377P2086J25670P664j30989j46007P1590J98207
83A13353k370j90524n2863J00365O0147k3006m1478j1667M7325K50q1397K0711
95f1154J43434p95j61006n1048J21848J18580j0936j37809q7500J18246J41603
106A33463o5174j17412K7879O1179j3365k2901Q217L5145J8922q0655p9282J04350
$$ plain form
0 0 0 0 0 0 0 0 8 -8 8 -9 16 -17 24 -32 39 -46 56 -64 74 -89 105 -121 143 -162 185 -216 248 -279 314
29 314 -357 400 -450 506 -567 632 -705 784 -872 965 -1072 1187 -1314 1454 -1609 1785 -1978
46 -1978 2198 -2450 2736 -3068 3460 -3933 4508 -5232 6177 -7466 9338 -12322 17859 -31654
60 -31654 140494 166054 -47950 81748 199778 223078 114191 36639 51880 137460 87643
71 87643 22273 86508 142964 13509 -84868 -12782 112888 120552 -10437 -156444 -84854 113353
83 113353 110983 -79541 -132404 -32039 28108 5102 -36376 -48043 -718 -468 -81865 -61154
95 -61154 82280 81485 -79521 -130569 -8721 109859 98923 -38886 -126386 -8140 133463
106 133463 68289 -49123 -21244 39935 26570 3669 11886 47031 65953 -14702 -93984 10366
118A0366J39003p9083j65006r25J24239Q1590m3898j27618l2097J18564N2278
129G7413q7427k6471O2947p329n9521Q10N7881N8135k9656j30532l0460J61653
141D7443R1111j26265j19901L9180R6015M1213n3107q4728J7954P3385l3321n9160
153g0181N9054M9174p8281p6542K8804Q6071M7059q2543j37588K8701J59026J8096
165C0850j27109n3751M7840M8279P966l9164k4057M4674N036p7241J1571J17053
177h053J2230j11602n3462O4665J04234L1963j03641r3518Q4507J21625l1065
188A7883p5718J2647L6772N299o185l045L6545L8796o5351p8694Q2146J24868
200A25963l8980j20740k7427P4709R0432m304j10474m2517R1591M3910o2373j4836
$$ plain form
118 10366 149369 70286 -94720 -95645 28594 110184 66286 -61332 -93429 25135 77413
129 77413 -10014 -36485 26462 19133 -40388 -39578 18303 76438 46782 -83750 -114210 47443
141 47443 138554 12289 -107612 -68432 27583 68796 15689 -69039 -51085 22300 -11021 -70181
153 -70181 -11127 38047 -40234 -116776 -87972 -1901 45158 -37385 -174973 -146272 12754 30850
165 30850 -96259 -150010 -102170 -53891 -45925 -85089 -109146 -64472 -59436 -136677 -125106 -8053
177 -8053 4177 -107425 -160887 -96222 8012 39975 -63666 -157184 -72677 48948 17883
188 17883 -57835 -45188 -8416 -3117 -9302 -12347 24198 62994 -2357 -81051 1095 125963
200 125963 86983 -33757 -61184 13525 103957 99653 -10821 -53338 38253 82163 19790 4954
212D954M2017p355m0836j5474L1907O7650l298j20788m8131J24757Q6817p6956
224D5264r5545m63O6573N9762k9622p8036J4762O3168k9645m4964N2553M5281
236F9088m7260o0285j803O8033P4611m7944j27387O940J27841L2670p9392m8632
248c3520J4736M1822K3743l5340k5225M6493M954p4495N4R3130K2233p4808o1121
261e7344J6267Q8110N4324q1917r8176N0323R3010j4217n1603m496J4054J1588
273A9923o119k0106L2043M6772n5927q1060N1336J01167q692q2722m8990L2136
285b0239Q7860K0227r0844m6515O5124L4024l9631q765K4733k127k3026k6133
297b5312Q323O8543J7464j00304n6758Q4251P5794l4165o9968k9403L8151O4669
$$ plain form
212 4954 46971 39616 -1220 -16694 15213 82863 79565 -41223 -89354 35403 122220 45264
224 45264 -50281 -50744 15829 75591 45969 -32067 -17305 45863 16218 -28746 23807 69088
236 69088 21828 -38457 -40260 27773 102384 54440 -72947 -66007 61834 94504 15112 -33520
248 -33520 -18784 23038 46781 11441 -13784 32709 37663 -36832 -36778 56352 78585 3777 -57344
261 -57344 -41077 47033 101357 19440 -78736 -28413 64597 50380 -1223 -5719 8335 19923
273 19923 13804 -6302 25741 72513 16586 -64474 -13138 88029 79337 -3385 -52375 -20239
285 -20239 67621 87848 -2996 -49511 15613 49637 10006 1241 25974 23847 821 -25312
297 -25312 -16989 51554 69018 -31286 -88044 -3793 72001 37836 -32132 -61535 -23384 41285
309D1285j3083o7453P517M7161k5598l3572L7515L4572k1195m4381k6577M3241
321b0568Q1628k0615j06887j1634Q9184L7017l7645m0968j0247L3293L1902k9883
333e423k1553M3537O296o2601n022O6829K8046l7658n6352j5644O8382O6127n4857
346B0107q5032K5285O4504L61k6779j2508J076J6707n003k8134K7898N0010m2708
359E784p2825K7307P4656J3251m7932n6049K997P7430L2587o8093m0677M4253
371g311K3014k2237l294J2886N637o793l3095o311O6792L0918p6441n4099N2126
384a8208O0914k185m5369m2590K0337O2203m236n4577P657L6106k1548k5331K2720
397d107K7116Q38l1461m3789K4148P9371l460q5849k2002N5706L4867j1166l4588
$$ plain form
309 41285 28202 -39251 -31734 15427 -10171 -43743 -6228 28344 7149 -37232 -63809 -20568
321 -20568 61060 40445 -66442 -78076 11108 48125 10480 -30488 -40735 -7442 24460 -5423
333 -5423 -26976 16561 22857 -39744 -44766 22063 50109 12451 -43901 -59545 8837 74964 20107
346 20107 -64925 -39640 24864 25225 -1554 -14062 -12986 3721 -1282 -29416 -1518 48492 5784
359 5784 -67041 -39734 34922 48173 241 -55808 -52811 24619 57206 -10887 -51564 -7311
371 -7311 15703 -6534 -9828 3058 8695 1902 -31193 -37504 29288 60206 -16235 -70334 -18208
384 -18208 42706 40521 -4848 -47438 -27101 35102 30866 -23711 -16054 20052 -1496 -26827 -4107
397 -4107 23009 23847 -7614 -51403 -27255 52116 48656 -37193 -59195 -3489 31378 20212 -14376
410a4376k4637K7850L0842k9185j9575M0652O902n0465j2387M1557L1187q105
422B0260n0160l6705N1520O7722l3128o8586Q539M2561J0445j0030j7462l304
434a8328K2763m529l3513K2558N0414k5707n9018O673M9359K8285j7122n6243
446c4408j6850O3391L7736m7582l3133K5727J4943q271k534N75J0563O731l4267
459a7379j9606N4416L6842n0499m7585K1047M2452J9303k3615m8642L593N3652
471B3979K788m0281M419K3072j3500j4639Q613J4931J6352j4900m8121O334O6375
484C5422J0812n7296k4357K4881K9137J2045k3196l1078K0169K9594k1529j4751
496a0147L1750P765l1901j1979J8519K7122J4391l4908m4149L1687N9074j3470
$$ plain form
410 -14376 -39013 -11163 19679 -9506 -29081 11571 18473 -31992 -44379 -2822 28365 20260
422 20260 -29900 -66605 -15085 52637 19509 -49077 -40538 2023 12468 2438 -15024 -18328
434 -18328 4435 -94 -33607 -11049 39365 13658 -45360 -38687 10672 38957 21835 -34408
446 -34408 -51258 12133 49869 2287 -30846 -5119 9824 1553 -981 -406 10157 16888 -17379
459 -17379 -36985 17431 54273 3774 -43811 -22764 19688 38991 15376 -33266 -29673 23979
471 23979 26767 -13514 -9095 13977 477 -14162 -5549 9382 25734 10834 -37287 -30953 35422
484 35422 46234 -11062 -35419 -10538 18599 30644 7448 -23630 -3461 26133 4604 -10147
496 -10147 21603 29368 -2533 -14512 4007 31129 45520 10612 -33537 -1850 57224 43754
508D3754m4929k955J9173J5049N389j8800r009K3772l066l1881J5194M0777j3655
521C8813l9974o330K2366L1059L477m7566k8120M3215L2000k8952k3059R019M354
534A0302K92r73r009J0566J2930l2065k4549L9638L2010k9902l5122m32K3237
547c077K8053p690m5042m712M0142L223k6113M788J2087q998p090j576O971K3753
561A4719m229m6026m719N0729J4731l3610k2057L051K0666K1874j6351l0445J4288
574a7379K2756k0025j1285K4648N297j9122j2342m16K1578K6568k4389m5241J7098
587c2254M5607k420k6843q458M133J5987J0583j8117p132K3923j798k9263J0154
600a5898L2854k121k3364j3481N015L1221J8011l7113k9885K9099K6475j5077
$$ plain form
508 43754 -1175 -4130 15043 30092 35481 16681 7672 31444 28378 -3503 11691 52468 38813
521 38813 -1161 -7491 14875 45934 49411 1845 -26275 16940 48940 19988 -3071 5948 10302
534 10302 10594 9621 612 11178 24108 -7957 -32506 7132 39142 9240 -25882 -26314 -3077
547 -3077 24976 17286 -27756 -32468 7674 10897 -15216 -10428 1659 -7339 -14429 -16005 -9034 14719
561 14719 10490 -35536 -40255 10474 25205 -8405 -30462 -27411 -6745 15129 -1222 -31667 -17379
574 -17379 5377 -14648 -25933 -1285 4012 -15110 -27452 -27868 -6290 20278 -4111 -49352 -32254
587 -32254 13353 10933 -15910 -24368 -20235 -4248 6335 -11782 -18914 5009 3211 -26052 -15898
600 -15898 16956 14835 -8529 -22010 -16995 14226 32237 -4876 -34761 -5662 20813 5736
612E736j3084J79m13P438j955j4368J1840J8191k7255k6945K5240K6183j1701
625i14k2976j4972P572L1388L063l8213r239K8254L198j4602M105M554k695L47
639b1130q645j05K8709O481l7148r525L5045J8510j0726j3940r910J4452K9401
652B1469o748k4877J2255J9050j2930m797J6801N568l556p465j1903J4016L2774
665D9657j1248l7685M196K9376N049r020j1955r258J4236J4028j8032r218J9851
678B9977j919k3549L412J8423K212p457j6595j1684K4162K3841k4478k7354J4256
691C247J6070l331l118o917m278J1935o81j6734J1287J8993j8295k1619J2802
704f39J6544J964q293k0345m873K9038J0152k8150r414J5991O73n369K675l366
$$ plain form
612 5736 -7348 -7169 -7582 -144 -2099 -16467 -4627 13564 -13691 -40636 -15396 10787 -914
625 -914 -23890 -38862 -31290 98 3161 -35052 -44291 -16037 -12839 -27441 -23336 -18782 -21477 -21130
639 -21130 -29775 -29880 -1171 5310 -31838 -41363 -6318 12192 1466 -12474 -22384 -7932 21469
652 21469 14721 -10156 2099 21149 8219 3422 20223 25791 22235 14770 2867 16883 49657
665 49657 38409 724 4920 34296 39345 30325 18370 9112 23348 37376 19344 10126 29977
678 29977 28058 4509 7921 26344 28556 21099 4504 -7180 16982 40823 16345 -11009 3247
691 3247 19317 15986 12868 5951 1673 13608 12927 -3807 7480 26473 8178 -13441 -639
704 -639 15905 17869 9576 -10769 -15642 13396 23548 -4602 -14016 1975 2648 -2721 -46 -3412
718c412l23N266j3781p879K5345R397k8241j2690J6784J2836K937q721j9652N417
732a6717K7025m198j9729Q661J0684j0214j302Q826K244N122l587j9207P239L1257
746B6104l243k8099q72J4722O477L293j0251j4730J1847J4008j5729p071J6877
759A3333j813j8159j64P905N077L673j6484k0301J7038K3518j5910k1050N490
772a7847N776K075K719j0237o046J3402j858j7562R751J8163j1676j5702L994
785b5048Q675J0386L098k1093j0071K5372J2724j7291n721Q617o4J645M095o352
799a1028M759R959j4640r985K1954J2428j7499j0331M850P330J2958k568k2681
812a4494P63K2852k198j4022O266M405n878J199M52r16J1922N51k2220M7K6585
$$ plain form
718 -3412 -3735 1531 -12250 -20129 5216 14613 -13628 -26318 -9534 3302 6239 -2482 -22134 -16717
732 -16717 10308 6110 -13619 -4958 5726 -4488 -5790 3036 5280 10402 6815 -12392 -5153 26104
746 26104 22861 -5238 -6110 8612 15089 18382 8131 -6599 5248 19256 3527 -3544 13333
759 13333 11520 -6639 -6803 1102 6179 9852 -6632 -26933 -9895 13623 -2287 -23337 -17847
772 -17847 -12071 -9996 -7277 -17514 -23560 -10158 -12016 -29578 -19827 -1664 -13340 -29042 -25048
785 -25048 -16373 -5987 -2889 -23982 -34053 -8681 4043 -13248 -18969 -10352 -10416 -8771 -4676 -11028
799 -11028 -6269 3690 -10950 -20935 1019 13447 -4052 -14383 -9533 -2203 10755 8187 -14494
812 -14494 -13731 9121 6923 -7099 -833 3572 -2306 -1107 -655 -1571 10351 10902 -11318 -11271 15314
827A5314K382j6914m403K265P301J2892p829j6961J0743J2889j1918m333J3353
840A4781o73q332m67j939N834J4209j1163k2413J0006K0434o313j1458j474j978
854i46O521P714j2094p186J3453j574j5936N815J3203n883p995l149j991J2593
868B545J0974j8865j4765J7008J0992q732k475K19k986P475K469r380N705J2107
882A2291j2920j0758J5492J0442p090n393m798N85J7898L069k0949k604J6615
895A1880p49q082M983r41k946M092n167m619J4629K839k1480l447J7193L166o821
910D530m525p959L722J5754n906j6361P443Q836j0153k257Q852j855k308n92q457
925a1236M557J8214p581k0296O520J4085j460k586l374o853P961J0092j1024m922
$$ plain form
827 15314 17696 782 -3621 -1356 5945 18837 11008 -5953 4790 17679 5761 1428 14781
840 14781 14108 5776 5309 3370 9204 23413 12250 -10163 -157 20277 13964 2506 1032 -946
854 -946 5575 13289 1195 -5991 7462 5888 -10048 -4233 8970 3087 -4908 -8057 -10048 2545
868 2545 13519 -5346 -20111 -3103 7889 -843 -3318 -3099 -6085 1390 3859 -5521 184 12291
882 12291 -629 -11387 4105 14547 7457 2064 -2734 -2149 15749 18818 -2131 -4735 11880
895 11880 11131 3049 8032 7091 4145 8237 3070 -1549 13080 15919 -5561 -9008 8185 11351 4530
910 4530 5 -7954 -4232 11522 5616 -10745 -3302 5534 -4619 -6876 1976 121 -2187 -2779 -11236
925 -11236 -6679 11535 3954 -16342 -9822 4263 2803 217 -3157 -10010 -2049 8043 -2981 -7903
939g903J3363k239j2438N536R100k313o19n707p875J3472J3703j5647j3161J1433
953a295O182l896J160l805m238Q388L16j1248P064J1262j1899j0221R747O495
967D012p37j524j0828l650J8392M700j7809k223J0832j790k536M147l728j19O086
982C225p996n898J6231M938j7406l947J1090L030J690k514j2411L154J6763m726
996E223j3250P275N924p912R45M187k551M002l01j2936L348J8220m422j6356K348
1011f256P130J622L498n948j0084Q890R413j1229m002J1240k256q981L713K573
1025f77Q29N177p708j2401J1673J4572j1007j0339N793K095J360L835p236m637
1039h671J0812j80j1411O674J0137q832o386M678J183M957L936j3379o610J6593
$$ plain form
939 -7903 5460 3221 -9217 -3681 5419 3106 2487 -3220 -11095 2377 16080 433 -12728 -1295
953 -1295 4887 991 2151 -1654 -5892 2496 2812 -8436 -1372 9890 -2009 -12230 -2483 4012
967 4012 3275 1751 -9077 -12727 5665 10365 -7444 -9667 1165 -625 -3161 986 -2742 -2861 3225
982 3225 -4771 -10669 5562 10500 -6906 -10853 237 3267 4957 2443 -9968 -6814 9949 5223
996 5223 -8027 -752 5172 -2740 -1795 2392 -159 3843 3542 -9394 -6046 12174 7752 -8604 -6256
1011 -6256 874 2496 5994 46 -10038 -1148 8265 -2964 -6966 4274 2018 -6963 -3250 -677
1025 -677 152 5329 -2379 -14780 -3107 11465 458 -9881 -4088 -1993 -633 3202 -4034 -8671
1039 -8671 2141 1961 -9450 -2776 7361 -1471 -7857 -3179 -1996 2961 6897 -6482 -13092 3501
1053C501N919j2741j688N341k074K356K723o749K164Q412r895o997J4415M626
1067I313j1915k479L241O54Q056n14j5050J673J4904l707q997N532J337m651L349
1082G46j72l706Q023Q66j4210J600J6087k521j0129O11M65K611Q071n186j1442
1097h286Q377P844r667o55Q640k873m851L047j729J816R037p205j2912R645J1617
1112A1845p564n038K104j865L845O247q614l913J0525j939j0177O790P525o251
1126C520l468J109k237O869O119j3276o335J3599L312q507R29Q75l149M896J215
1141E471q002M572P573j0909n355J2443K575p505m68j906k06R958K03j4112J997
1156c671J1574m636n107N261j812k856M659l013l979J0011O17j4098J517J2104
$$ plain form
1053 3501 9420 -3321 -5009 332 -1742 614 3337 -3412 -1248 7164 -2731 -9728 4687 9313
1067 9313 -2602 -5081 -1840 -1186 6870 6356 -8694 -7021 7883 4176 -4821 711 2048 -2603 746
1082 746 574 -3132 4891 5757 -8453 -6853 9234 6713 -3416 -2805 -2340 271 8342 3156 -8286
1097 -8286 91 7935 -1732 -2387 6253 3380 -1471 1576 -153 1663 10700 3495 -9417 228 11845
1112 11845 4281 -757 1347 -518 3327 9574 960 -2953 7572 5633 -4544 2246 9771 3520
1126 3520 52 1161 -1076 5793 11912 -1364 -7699 5900 9212 705 1634 2509 -640 4256 5471
1141 5471 -2531 2041 9614 -1295 -6650 5793 8368 863 395 -1511 -1717 8241 8444 -5668 -3671
1156 -3671 7903 3267 -1840 3421 1609 -1247 3412 399 -3580 6431 7048 -7050 -5533 6571
1170F571k127n380L6m600K563J0157o595j0089P883M653q213N87N821l871j282
1185c886J984o033K655J0461o979j1918P780P178m312j008j111m169N899O214
1199B755r328k358J0271k703q094O136M130l635J489k175n015R037P679j1743
1213c554n458J0223J954l708K216k575k893P567k64q540N477P280r246l988Q038
1228B529P57k155J121o411j912J1893J77j2946J907P528l724j160L078m622j5
1243c955N610n790m174J0443N28j1829J675P208j782M89M23q042K834J0842n512
1258a032p881P173K523n977L184K593m137K927K108q044L232J0702n638q896O385
1273g78L627j897K775k535n766O629N807q809l57Q066l930m532N855L67k276M023
$$ plain form
1170 6571 4444 -936 -900 -5500 -2937 7220 625 -9464 -1581 3072 -5141 -4554 1267 -2604 -3886
1185 -3886 -1902 -7935 -5280 5181 -1798 -13716 -5936 1242 -3070 -4078 -5189 -9358 -3459 2755
1199 2755 -6573 -8931 1340 -1363 -9457 -3321 809 -2826 -1337 -3512 -8527 510 8189 -3554
1213 -3554 -9012 1211 3165 -543 1673 -902 -3795 3772 3508 -5032 445 7725 -1521 -5509 2529
1228 2529 3286 1131 2252 -4159 -6071 5822 5999 -6947 -5040 2488 -1236 -2396 682 -3940 -3955
1243 -3955 1655 -4135 -8309 2134 2662 -9167 -7492 -284 -2066 -1577 -1154 -9196 -6362 4480 -1032
1258 -1032 -8913 -1740 783 -5194 -2010 583 -3554 -627 1481 -6563 -3331 7371 1733 -7163 -778
1273 -778 2849 952 3727 1192 -4574 2055 7862 -947 -1304 6762 2832 -1700 4155 4522 2246 6269
1289F269k949o701Q829O734r868l056O849j198n17L433m470k850P922j460p632
1304f65O177N011q476j387N402j614Q49K589p817k291J0306k08r848K651L847
1319D526m692J695K387n579J051N147p174k658R422j179q551K733K567k429L812
1334A078k87q344K889R224n932m803O072k48m470M582j04l417N130M42q420M046
1350b562R004o171m967M864M78j049N061l342o308O575L298p328J365N973m372
1365E19k358M212k265j78N445m916o924Q520M261p894r98L445k301J517L782o503
1381b636j403P726k947o416O572K773o387J169J983l241L665L487q410j976R421
1396C380r29o398L341J120l995M521Q17o557L559M687p359k149Q445j819n263
$$ plain form
1289 6269 3320 -3381 5448 12182 2314 -742 6107 4909 4392 7825 3355 505 8427 6967 -665
1304 -665 5512 10523 2047 660 6062 4448 5297 7886 69 -2222 8084 7876 -1972 679 4526
1319 4526 -166 1529 3916 -1663 -612 4535 -2639 -5297 4125 2946 -5605 -2872 -305 -2734 1078
1334 1078 791 -7553 -4664 4560 -1372 -6175 -103 -351 -4821 -239 -343 -3760 1370 1812 -6608 -2562
1350 -2562 6442 271 -4696 168 646 -403 4658 1316 -4992 1583 4881 -2447 -1082 4891 519
1365 519 -1839 2373 108 -70 5375 459 -6465 2055 6316 -1578 -2576 869 -1432 85 3867 -2636
1381 -2636 -4039 3687 740 -5676 896 3669 -2718 -1549 434 -2807 858 4345 -4065 -6041 3380
1396 3380 2451 -3947 -606 514 -3481 1040 1857 -4700 -1141 3546 -3813 -5962 2483 664 -4599
1411d599K796o26k444O214q11q836L337O973n505k035M566k641k038M755k296
1426c190l174O492Q5q411M066O348m468j387L273k801R26O389m489n012P246J826
1442C719o040K931L715m291R32L224m465J328O362n071n322P218J666n295J767
1457B378J083m160L395L251o460m74O319m068m136N753j07m876L087j0m842M791
1473I24L183p732j075P326k718l158M301k137l194N298j36n385M121L453o585
1488c514L07O139l070j542L752l020j644O821j184o598L916L891n351J282M039
1503D224m262m99M762l712k457O788j882o235L807L520m629R33K330n210J414
1518a108N486m791l186N896p59n028L962J376m449K535J880n131J756N880n125
$$ plain form
1411 -4599 -1803 -2429 -4873 1341 530 -8306 -4969 2004 -3501 -5536 -970 -3611 -5649 -894 -3190
1426 -3190 -6364 128 213 -8198 -4132 2216 -2252 -3639 -366 -3167 -2241 4148 -341 -5353 1893 3719
1442 3719 -2321 610 4325 34 966 4190 -275 1053 7415 2344 -2978 4240 5906 611 2378
1457 2378 3461 -699 2696 5947 -513 -987 5332 1264 -2872 2881 2774 -2102 985 975 -3867 924
1473 924 4107 -3625 -4700 2626 -92 -3250 1051 -1086 -4280 1018 882 -4503 -382 3071 -3514
1488 -3514 -3207 2932 -138 -1680 2072 -948 -2592 4229 3045 -3553 363 4254 -1097 185 4224
1503 4224 -38 -537 4225 513 -1944 4844 2962 -3273 534 4054 -575 358 2688 -2522 -1108
1518 -1108 4378 -413 -3599 2297 1538 -3490 472 1848 -2601 -66 1814 -3317 -1561 4319 -806
1533h06m022O418n16l221L443k78m291M490K415n974J376N067m178j884M924j470
1549A493k321L705j356m341N665K053o726J061M585l375p95M307m312j511N835
1564C967k118m788M641K170n772J546L401l745Q45L201n042j291O765j808n256
1579c284L691J593m077K361J821m918J999M121n158j154N915j841m637M136Q95
1594A463l518L095M21n598K528M662m411j963M600j556k614M349j074l639M335
1609A080O07n689K381M856m524j654M279k100j539M648k397l681N048J354n482
1624b813K323L058l895L4L961l332n73M560l041l654M718J561n039J789K183l453
1640a613J490L131m570q28N219k899l290M456M51m262K683J197m447K338L231
$$ plain form
1533 -806 -4828 1590 1074 -2147 1296 1018 -3273 1217 3632 -2342 -966 4101 -77 -1961 2963 1493
1549 1493 -828 2877 1521 -2820 2845 4898 -1828 -767 3818 443 -352 3955 -357 -1868 3967
1564 3967 1849 -2939 1702 3872 -1900 -354 3047 -698 147 3348 -1694 -2985 3780 1972 -3284
1579 -3284 407 2000 -2077 284 2105 -2813 -814 3307 -1851 -3005 2910 1069 -3568 568 1463
1594 1463 -2055 1040 1461 -4137 -1609 3053 -1358 -3321 1279 -277 -2891 1458 384 -3255 1080
1609 1080 1687 -4002 -1621 3235 -1289 -2943 1336 -764 -2303 2345 -52 -3733 1315 2669 -2813
1624 -2813 -490 2568 -1327 -1293 2668 -664 -1237 3323 282 -3372 1346 2907 -2132 -343 1840 -1613
1640 -1613 -123 3008 -1562 -2390 2829 -70 -3360 1096 1547 -2715 -32 1165 -3282 -944 2287
1655B287n123o81N449k473k905L753r09l251L914O35m652K611L201m936K98M522
1671A740k749k119M070k027k393M722K08n273L075K998m405P90L645l594j161
1686b473M380k320k807M669p3m970L082K608m154Q34K601l173k53M547k910k831
1702c243M416k21l898L134J651m512J923K812l865O54M480l453k595M672j26l474
1718a645L317J8l483K736K830m892O44M342k986j982M500j135k903L172l77l679
1734a523L523K508n226L92L670l010r89L627k340k360M151p54m245L818J779m956
1750a935R34L339k672m85K962l103j463N188p86m714L406J658l573J612K125l654
1766a161Q25L980l750j379N039r99m141L246J530l407K616R64m241J707L976l801
$$ plain form
1655 2287 -2836 -3517 1932 -541 -3446 307 -602 -3853 61 696 -3956 -1345 1856 -3080 -2782 1740
1671 1740 -1009 -3128 942 -1085 -3478 1244 1452 -3821 -746 2252 -2153 -1363 2282 -1312 -2473
1686 -2473 1907 -413 -3220 1449 1376 -3594 -512 2096 -2058 -1224 1377 -1796 -2049 2498 -412 -3243
1702 -3243 1173 952 -2946 188 1839 -2673 -750 2062 -1803 -1149 3331 -122 -2717 1955 1829 -1645
1718 -1645 1672 1690 -1793 943 3773 -1119 -475 3867 881 -1101 3399 2264 -639 2533 2156 -1523
1734 -1523 2000 4508 -718 -326 3344 334 -655 2972 632 -1728 2423 1669 -2576 1242 3021 -1935
1750 -1935 -1001 2338 -334 -819 2143 -960 -2423 2765 1979 -2735 671 2329 -1244 368 2493 -1161
1766 -1161 -336 3644 -106 -1485 3554 2555 -1586 1660 3190 -217 2399 3363 -878 829 4805 1004
1782A004j700M075j030k941L377m22l148K926Q67m652J523M081m085j341L037
1797A571j304j863L198j444l468L606J347m494Q94L087k984o84L075j969j423
1812b855L880k127l279M311J435m235Q66K724k972R43K862l349j068M219j210
1827A45l520M079L35l165J734J562k929J715K662m387n21M523j378k847K638l4
1843F12k555K733Q94l757J628K625l398q17L877j951j960K398l08k579L297K53
1859I92m717J974L342l181o00K950k179j234L354j416k348L115J75m139K285K681
1875A054l475J25K023k556r6L729k121k657L478L68l162J732J867l014R60K340
1891E95k767J27L395k221l155M899M80l165J914O50k589K399K056l617l1M070
$$ plain form
1782 1004 -696 3379 2349 -592 2785 2363 -785 2141 3008 -1644 -121 3960 -125 -1466 1571
1797 1571 267 -1596 1602 158 -3310 296 1643 -2851 -1957 1130 -1854 -2538 537 -1432 -2855
1812 -2855 1025 -1102 -4381 -70 1365 -2870 -2004 720 -2252 -1309 1553 -1796 -2864 1355 145
1827 145 -3375 704 1039 -2126 -392 1170 -1759 -44 2618 -1769 -2290 2233 855 -1992 646 612
1843 612 -1943 790 1684 -2073 -445 2180 -1218 -2035 1842 -109 -2069 329 21 -2558 739 992
1859 992 -3725 -1751 1591 -1590 -2190 760 -1419 -2653 701 -715 -3063 52 227 -3912 -1627 1054
1875 1054 -2421 -2296 -273 -2829 -2925 804 -1317 -3974 -496 -128 -3290 -1558 309 -2705 -1745 595
1891 595 -2172 -2045 1350 -871 -4026 873 1353 -1812 102 752 -1837 562 2618 -999 -1030 3040
1907C040k058k400L653J51k778K384L79k871K595K056m373j10M234k036j677K823
1923C012j161j971L385l49l528K313K049m250J18L831k334j323K190j652j559
1938a229M126j043m385K652K543l284J34K239k383J02L053k446j618L871r22l748
1954b338K613J949k619N17J265k441O57L636l436j963L843j65k964K019P65k897
1970a559J973J310l419J372L073l181k124L618p4j859J395j42k710L151R53l753
1986a976N10L354k208j411K902k99j901K606j042k348L424J232l996L31L335j734
2002G79n06J807k079q02L679j055l251K736J785l981J088J751k101J04J853l117
2018a310j91L892j455l528K222J002k643J496Q84l078P29K674l230m87L419j276
$$ plain form
1907 3040 982 -1418 2235 2386 -392 1992 2371 -500 2095 4151 -222 -332 3902 1866 189 3012
1923 3012 1851 -120 3265 2916 -612 1701 3750 -500 -382 3449 1115 -208 1982 330 -1229
1938 -1229 2897 1854 -2531 121 2664 -620 -486 1753 -630 -528 2525 79 -1539 2332 1410 -2338
1954 -2338 275 2224 -395 122 1387 -1054 -397 3239 -197 -2160 1683 1518 -1446 573 1338 -1559
1970 -1559 414 1724 -1695 -323 2750 -431 -2555 1063 989 -870 525 383 -2327 824 1777 -1976
1986 -1976 -1466 1888 -320 -1731 1171 872 -1029 1577 535 -1813 1611 2843 -1153 -822 2513 779
2002 779 273 2080 1 -801 2878 1823 -1428 1308 3093 -888 200 1951 -150 -46 1807 -1310
2018 -1310 -1501 2391 936 -2592 -370 632 -2011 -515 369 -2709 -1980 694 -2536 -3023 396 -880
2034h80k862K406N41j920J655J96l236K289K925l026j423K860n70j375K433n46
2050e33j922K576K98l068K046L032l217j080K822p18p34K073j679k061L515P48
2066B098l616J258K273k686NK219j692q54K947k259k169L682Q28l606M17K314
2082A159j917P91J390k986M6L313j740k165L207K79k848J126J705j961J038J475
2098A912l496Q69L866j701k839K451L94j840J667M81k427J418J766l255p3L679
2114B872j865k165K267k01q42J883j031k942K511K081l177n67K659j369r39J595
2130G70j130j386K856l72l380K621J977k782p94K047j221K63J863k730j066L699
2146A235k39l296J778J504k034J61J720j765K83K425l103j370M008K82l573J506
$$ plain form
2034 -880 -3742 -1336 -795 -2715 -1060 -864 -4100 -1811 1114 -1912 -3335 -475 -1045 -2420 13 -533
2050 -533 -2455 121 419 -2649 -603 2429 -788 -1868 954 236 -498 1575 -104 -2165 1350 2098
2066 2098 -1518 -260 2013 -673 -668 1551 -141 -995 1952 -307 -2476 1206 2034 -1572 -1155 1159
2082 1159 -758 33 1423 -1563 -1517 1796 56 -2109 1098 1377 -1471 -345 1360 -601 437 1912
2098 1912 -1584 -715 3151 1450 -1389 1062 1456 -384 1283 1764 -663 755 2521 -734 -807 2872
2114 2872 1007 -1158 1109 908 66 1949 918 -2024 487 2568 -609 -1176 1483 114 -825 770
2130 770 -360 -1746 1110 738 -2642 -21 1956 -826 -1620 427 -794 -531 1332 -1398 -2464 1235
2146 1235 996 -2300 -522 982 -1052 -891 829 -936 -653 1772 -1331 -2701 1307 1589 -1984 -478
2162d78Q49j222J405J038l267J072K961k598j109K674J7k553K051J13j841K058
2178A170P69l558J334L394j976j783K316o06j113K287q98k335K501J184l363N52
2194a25K891k029j337J737r57l29K529j720l173K982J234k595l25K128k272L47
2210a014J651j720r05K552j037k522K188J186k357L72R08j836J568K096l239o69
2226b778L425m74k360J644P72j883J600O79k186J544K165l280o97L658n28j792
2242d91J444q4j282J979K91l031J322K612k453r31K264o29j581J914m03j469K479
2259A951j14l297J208K691k103r05J595j082p56K631j592j556K550K75l083J172
2275d15K107j951k24J313j416j02K815k337j924K867R21k731Q67P97j722R77J173
$$ plain form
2162 -478 371 -851 554 1592 -1675 -603 2358 -240 -1349 1325 1342 -1211 840 953 -888 1170
2178 1170 1939 -1619 -285 3109 1133 -650 1666 1060 -53 2234 1336 -999 1502 2686 -677 -125
2194 -125 2766 737 -600 1137 180 -149 2380 660 -2513 469 1703 -892 -1217 911 -1361 -1014
2210 -1014 637 -1083 -1988 564 -473 -2995 -807 379 -1978 -1606 -698 -2534 -966 1130 -2109 -2778
2226 -2778 647 173 -2187 -543 229 -1654 -54 625 -1561 -17 2148 -1132 -1829 1829 1301 -491
2242 -491 953 869 -413 1566 1857 -1174 148 2760 307 -624 1640 1011 -570 1344 941 -528 1951
2259 1951 1837 -1460 -252 2439 336 -569 1026 -56 -812 1819 227 -1329 1221 1496 -1587 -415
2275 -415 1692 -259 -483 830 -586 -688 2127 -210 -2134 733 1654 -1077 -210 587 -1135 -158 1015
2292A015k346j10L007k288k072K681Q82k419Q89O6j818K064J370l510j93L275
2308D93j517j585K130l85j338J715l82j759J765J722l208kK995q49r10J399r63
2325f79l67K396p70k296J614K088k442L00J912j237l65J452j525l45L086r10l110
2342a198J588J841k226K46J184j980N27K087k136j266K486k97k488J451P95j380
2358g66L33J002k680J255K208k165j650K690j84j530J363j47j459J509J115k729
2374a835Q11K523k084j392K344J84j082J376l72j582K214P56k618K88K571j415
2390F87p84J608n64j129K120q53k081K446J185k890L58J942j397k22J403j791
2406C8l83K981j198k396J973J236k337M47J285j561J87J935k519m58L125j523
$$ plain form
2292 1015 -1331 -1441 1566 -722 -2794 -113 769 -1650 -761 -695 -2513 -449 921 -2589 -2782 493
2308 493 -1024 -2609 -479 -864 -2202 -487 -869 -2628 -863 859 -2349 -2351 644 -205 -1115 284 -679
2325 -679 -1046 1350 580 -1716 -102 1986 -456 -156 1756 519 154 1606 81 -264 2822 1912 -1198
2342 -1198 390 2231 5 251 1435 -545 -18 2069 -67 -1333 1153 856 -1632 -181 614 -766
2358 -766 -433 569 -2111 -856 1352 -813 -2463 227 43 -1487 -124 -271 -1730 -221 894 -1835
2374 -1835 -1024 1499 -585 -1977 367 551 -531 845 473 -1109 1105 1861 -757 -469 2102 687
2390 687 -97 1511 947 -182 1938 1085 -996 1450 2635 -255 103 2045 648 426 1829 38
2406 38 -345 2636 1438 -958 1015 2251 -86 361 1646 85 272 2207 -312 -770 2355 832
2422H32k417K177P81j573R69L64k029P81K288k913l17K321p26j846J484J64j496
2439a156J346L75k666J317K435k790n95K128m09j092J854q17j714K451K17k846
2455a962J409J930j938o09J876o60m26J014n73j745K735N21k939J269J217j596
2471d77qJ799j479o61K427j933j158K386L42k750O22J173j277M02R22k051L92
2488a329K383j697k276K533O48k281J068K74j319J040R58k546N62K435j506j672
2504b725K230N6j093J349m1j961J781J417k391n2K149q68j066J644m36o69J939
2521A263p80j962K105J494k743k47K343j365l04J433j495j031K430m21k194J797
2537C23J083j972R9J522j464L32J586k129p50K802J55k308Q41J017j515R03Q67
$$ plain form
2422 832 -1585 592 1373 -200 769 1133 -896 -115 2173 -740 -1057 1264 538 -1308 176 340 -1156
2439 -1156 190 565 -2101 -784 1651 -1139 -1734 394 -15 -1107 747 -70 -1784 667 884 -1962
2455 -1962 -553 1377 -561 -1170 706 46 -380 634 61 -1684 1051 1572 -1367 -98 1119 -477
2471 -477 -485 1314 -165 -826 1601 -332 -1490 896 1238 -1512 -890 283 -994 -592 330 -1721 -1329
2488 -1329 1054 -643 -2919 -386 262 -2019 -951 -677 -1996 -956 2 -2544 -1982 453 -1053 -2725
2504 -2725 -495 -439 -1532 -183 -224 -2185 -404 1013 -1378 -1430 719 -149 -1215 429 -7 -676 1263
2521 1263 483 -1479 626 2120 -623 -870 1473 108 -196 1237 -258 -1289 1141 720 -1474 323
2537 323 1406 -566 -467 1055 -409 -77 1509 -620 -1370 1432 1587 -721 120 1137 -378 525 1392
2554A392j865M84K034k015r25K502L27k308J365L81j522J453M01k312M44K360
2570B196j502r60J459j85r68J197p23j261J769J99k413M37K110j456j095J621
2586D25p91n00J643n74k093K008P98k565R58J734j853j03J780j448k87K414r72
2603E74k326K445P65j942K03J479j040J93J535j826n08K441p67k251K110N41j680
2620e4P95N24j591R93J172k335l87K158m19j963J570o07r07J087K08j610O87J390
2638G11k123k84J931p13j338J480m46q50J690N5k515J054J931k134r9K040j067
2655f77n65J605q24j120J821K93k439J313J260j727L40J072r53k09J717j148j345
2672a586K105J91k029J184Q66j693M76J006j655M02J923j420j229K133Pj347R23
$$ plain form
2554 1392 -473 11 2045 30 -895 1607 1934 -374 991 1372 -150 1303 1704 -608 -164 2196
2570 2196 694 -266 1193 1008 40 1237 514 -747 1022 1221 -1192 -755 1355 -101 -1196 425
2586 425 -366 -866 777 203 -1890 118 916 -1649 -691 1043 -810 -913 867 -581 -868 1546 574
2603 574 -1752 693 1458 -484 -281 1198 158 351 1886 60 -448 1993 1226 -1025 1085 1626 -54
2620 -54 741 1265 -326 667 1839 -496 -883 1275 856 -1107 463 -144 -1051 36 244 -1366 -679 711
2638 711 -1412 -1696 235 -478 -1816 -336 -782 -1632 58 113 -2402 -1348 583 -1551 -1650 390 -677
2655 -677 -1242 363 -461 -1581 240 533 -1906 -593 667 -1060 -720 352 -601 -810 907 -241 -1586
2672 -1586 519 710 -1319 -135 731 -962 -486 520 -1135 -733 1190 -230 -1459 674 681 -666 257
2689B57L64j716J435R14k125L74J683j065q84J530L30j482J422o4j916J950R04
2706A911k354j39K669j403j075J252m08r03K073o82j792J560R64j929n80J956
2722A120q93l46J376p67j319K292o90k060J886R31j781q2J586j306J28J472j383
2739A64p63K068l87j881J470O88j222J11Q64j621P77J594j681q54J764k84j630
2756h23J367p3j133R48O99j951K79J954j599r02J670p87q93J099j95j313J338
2773c15P94k532Q94J616j885k00J900j109k78J375m58j508J613P83k363J182J589
2790A098j385j93J239j142j12J595n68j814J933O82k200P31J215j381J30J443
2806A271j679k98J806n53j861J642K68j638O28N35j489N35J341j707l92J765o78
$$ plain form
2689 257 621 -1095 340 1254 -871 -497 1186 121 -763 767 1097 -385 1037 973 -943 1007 1911
2706 1911 -443 -582 2087 684 -391 861 453 -450 1623 941 -851 709 1673 -256 -836 1120
2722 1120 227 -119 1257 490 -829 1463 773 -1287 599 1530 -251 -333 1253 -53 75 1547 164
2739 164 -599 1469 1082 -799 671 1359 137 248 1112 -509 268 1862 181 -673 1091 807 -823
2756 -823 544 471 -662 286 985 -966 -687 1267 -332 -1234 436 -351 -1244 -145 -340 -1653 -315
2773 -315 479 -2053 -1159 457 -1428 -1628 272 -837 -1115 260 -198 -1706 -93 690 -1673 -491 1098
2790 1098 -287 -480 759 -383 -495 1100 532 -1282 651 1333 -867 -136 1079 -302 -172 1271
2806 1271 -408 -706 1100 547 -1314 328 596 -1042 -414 121 -1368 -833 508 -1199 -1591 174 -504
2823e04j574J585J65j199R75J57j482Q46J282j144p21K056o33j004J309n1j052
2840i89J374M72k068R43J747j520n46J382n00o90J395o80j227K147j15j843J046
2857C28J158j452j07J369j096j37J703j242j169J750J23j688R30P43r50o2J142
2874A343j329J50J612r75j236J770K22j446R12K77j068Q94J041j955j67K186j184
2891A047j191J952j30j434R70J61j643J012R39j514k76J837j608q23J592o67p28
2908e04R37J15j988J345J117j980q7J149p70k62J164p27j015J606l93j476J123
2925f46J057j872O23R36j205K5J583j398n51J787j09j652J382O30j570O91R21
2942F32j601K22K018j825l40J594m83j120J407l4j224O81Q76j614rJ793j385o13
$$ plain form
2823 -504 -2078 -493 -328 -1527 -552 -395 -1877 -1031 251 -893 -1614 442 -191 -1195 114 63 -989
2840 -989 385 857 -1211 -268 1479 -41 -587 795 295 -395 1000 320 -907 1240 1125 -718 328
2857 328 1486 34 -73 1296 200 63 1766 524 -645 1105 1228 -460 470 1213 263 201 1343
2874 1343 14 164 1776 801 -435 1335 1557 111 1023 1300 232 1126 2167 212 45 2231 1047
2891 1047 -144 1808 1678 244 1214 1375 -268 744 1683 169 -107 1730 122 -701 891 224 -504
2908 -504 433 548 -1440 -95 1022 -958 -1045 104 -666 -928 236 -491 -1506 100 -293 -1769 -646
2925 -646 411 -1461 -838 98 -1107 -1082 501 -897 -1448 339 230 -1422 -40 590 -980 -289 632
2942 632 -969 -747 1271 -554 -894 700 217 -903 504 470 -754 -73 803 -811 -820 973 -412 -1025
2960a025J595k95j468J375k29j074J070P64k124Q14J050j174n83J601r18r04J690
2977A65n84j269J068Q91j675L93J512j722k39J871j331r58J916n54j241J135P24
2994A02j508J016R16j644K40J332j128l16J550l70j438J310M60j291J182N93j393
3011c87L08J793j903j92J481l19j050J235J01j062R88L17j256N21Q93j024k03
3028B41J412n12j141J185l41j050J064L92j406N77J224j727l5J375j028l41J234
3045A123o21r34J376j47j558Q81R37j384kJ267r79o35J789j082p08J300M20j964
3063i21R63Q30j558N23J252j390j91J830j167j052J559J7j419J117M70j178K2
3080b93J173j318J83J342j037q16J217l3j151R01M35j384M20J100j523m2J535
$$ plain form
2960 -1025 570 275 -1193 182 -47 -1121 -51 713 -1411 -597 453 -721 -1304 297 -621 -1525 165
2977 165 -419 -1688 -620 271 -1404 -1011 501 -1221 -1460 411 -920 -1878 38 -516 -1757 -622 102
2994 102 -1406 -390 526 -1118 -878 454 -674 -990 560 190 -1248 62 522 -769 413 1006 -387
3011 -387 -79 1714 -189 -381 1100 781 -269 966 1067 5 993 1310 54 575 1468 444 241
3028 241 1653 1141 0 1185 844 -206 858 1250 -156 421 1645 -82 -117 1258 230 -111 1123
3045 1123 502 -432 944 797 -761 120 1057 -327 -329 938 -41 -676 1113 31 -677 623 1043 -921
3063 -921 42 872 -686 -163 1089 -301 -492 1338 171 -881 678 695 -724 393 863 -315 -293
3080 -293 880 -438 -255 1087 50 -766 451 418 -733 168 603 -781 -361 739 -784 -826 709
3097G09j172o31J412l11j074J215J38j549Q78Q60j181k34J389r21m41J588j203
3114e28q16J681k02j422Q99O71j353L59J091j439l58J763q29o81J456k76j266
3131a250J141L34j399N32J082j586K9J529r23m32J079r9j173R47P07j798J209
3148g1O13j485M16J110r41n56J269j79j223J574k87j220J083P81j527K94J439
3165A090r88m99J317q00n93J277P2j509J106O15j553M60R16q92k39J453j418r3
3183b78J379j1j866J429K99j316M32Q75j030k19J183o41p84J214l79r97R84K33
3201E07j135Q84N44j278K39J058j180k25J490p37r82J214K02j611J089O53j341
3218f09J54J578j453l77J323n26r02J398k41j022J450k05j247M90J325j419l66
$$ plain form
3097 709 -463 -1094 318 7 -1067 148 286 -1263 -385 475 -706 -940 449 -472 -913 675 -528
3114 -528 -1344 337 135 -1287 -388 283 -1070 -711 380 -1059 -1417 346 -483 -1164 292 16 -1250
3131 -1250 -109 225 -1174 -642 440 -1146 -1117 412 -511 -943 136 37 -1136 -189 518 -1280 -71
3148 -71 542 -943 -527 583 -358 -914 355 176 -1047 527 240 -980 103 884 -643 -349 1090
3165 1090 102 -397 920 120 -473 804 876 -633 473 1088 -465 -5 911 19 -220 1233 -185 -278
3183 -278 1101 1090 -776 653 952 -364 68 943 -87 -306 877 236 -548 666 287 -710 274 507
3201 507 -628 256 800 -478 -239 819 -361 -586 904 167 -815 399 601 -1010 79 732 -609
3218 -609 -455 1123 -330 -707 616 90 -812 586 345 -677 773 568 -679 -189 1136 -283 -649
3235f49J540m77r88J230l54r88J082K87j137N47O35j357L87Q94r68j40J230q87
3253a13q91J358J57j309N84P81j600N13Q91j016l61J329r37o69J060L45j383R90
3271b71O88j674R2J449j230N2J433j025o05J054k8j120J237L82j323N64J029j447
3289g43K64J190q01o99J206l76m68R00J67j271M53J265j477L08J178q65l56J142
3307A017n11q68J509m36j404J353N94j500N0J073j052l1J114n16r05J052K68j519
3325g12R37M37q93K16O02r14k49J726j131m36J382o60q76Q33O70j661P92Q65j106
3344a78p4J284o86r85J506m44p04J156k61q84N78R56j596M87R59r40n77J157m34
3363C20j097J361r6j053R63P04j941N92Q24j035M1J185j008n36R80m42j005J085
$$ plain form
3235 -649 891 414 -574 656 302 -686 396 683 -454 93 728 -629 -242 652 -316 -456 774 -113
3253 -113 -1004 354 511 -798 -214 567 -1033 -520 371 -645 -1006 323 -614 -1283 -223 122 -1261 -271
3271 -271 417 -1257 -1165 284 -946 -894 539 -486 -1091 -37 -65 -1185 52 434 -889 -325 704 -743
3289 -743 -479 711 -90 -789 417 41 -427 473 640 -631 -178 1087 -390 -82 1096 231 -125 1017
3307 1017 506 -362 1147 711 -693 660 1254 -246 -196 877 -175 -206 908 392 -513 539 807 -712
3325 -712 225 662 -231 -15 587 -327 -576 1150 19 -417 965 305 -571 262 932 -729 63 928 -178
3344 -178 -252 1032 346 -639 867 423 -281 875 614 -270 308 1264 -332 155 1114 174 -403 754 320
3363 320 -777 584 488 -565 398 1102 -839 -247 577 -458 -417 768 -240 -776 204 -238 -1243 -158
3381a58N40r92J35P91j271Q0J300p54o67J443n94q62J311L16j547O91P85j191
3399f44J56R32p14m66J058l01q02R62K85j097Q14Pq36J21R56j029l23J175n81
3418c27j013J296j98r87J005l7j450O02J269r40p23J554p92p82J259j91q97R61
3436c91N20j415N77J050r55k73J124p23o87J454j36q60J130K28j187N93P42j109
3454c18L08Q08r09r0J445n17j471J517M07j718Q72O54j074M88Q05j052n41J390
3472A004p28o42J279k61j072R16L19j052M13R78j224m73J471p40j50Q63j01j022
3490b22J058M51j261L51Q35r83J79M88m10p87J240k02j079J254J24j217M79R11
3508A209j318N40O92q90j02R27o92p33J205k97r92P51M48j193P34M22q14J2J070
$$ plain form
3381 -158 382 -610 -475 316 -955 -875 425 -329 -996 447 -147 -1009 302 618 -929 -238 547 -644
3399 -644 -488 444 -270 -736 322 21 -781 181 466 -631 183 190 -646 -525 431 -598 -921 254 -327
3418 -327 -1340 -44 -242 -1229 -224 -261 -1711 -1109 160 -780 -1503 51 -741 -1523 -264 -455 -1352 -391
3436 -391 129 -1286 -709 341 -614 -887 237 -486 -1173 281 145 -715 415 643 -544 49 791 -318
3454 -318 -10 798 -111 -201 1244 727 -744 773 1180 -538 334 988 -86 402 1207 155 -386 1004
3472 1004 276 -366 913 652 -420 496 815 -237 176 1154 -70 -543 928 188 38 901 800 -222
3490 -222 836 1287 26 377 1212 229 408 896 486 -301 939 737 -342 912 1036 -181 298 1209
3508 1209 -109 431 1123 233 131 1058 366 -367 838 541 -451 300 748 -445 289 711 -103 -91 979
3527I79q45o21J041k5j067R70J04j069M19J072j156r1J254j139m69J067m28r32
3545i36J255J33j432R38L76j000K88R75j141j20Q63m14n54Q49j35q86Q31L61j368
3564a117M34Q32q15R7P91m89p23J170m39j063J338K22j269L40Q98j024J9Q57l50
3583b91o46R94l05p17N90K28n92OO02r08N18O93p80m07P89j60p61J020lq39O12
3604c57Q22j526N43N22o06j78R91k01p87R94J05j160J279j80q73L77O20n96J15
3623i6Q79n92o60J280l80r90J023L17j056O29Q06j014L6O11n36k80Q37m22p06
3642c14Q79M58j168L97O52r55L20M81n80k74P80k52r76J057k0p18N09J53p81M84
3662A32P03r91L29N82l44o42N97K1p73N45K66r64N07Q07r16k49J254p79n90P99
$$ plain form
3527 979 134 -487 554 529 -538 432 536 -533 -114 958 -198 -289 965 -174 -643 424 -4 -936
3545 -936 319 452 -980 -42 334 -666 -378 597 -544 -664 199 -215 -769 80 -55 -941 -110 251 -1117
3564 -1117 -683 149 -666 -569 222 -267 -990 180 -259 -1322 16 238 -1031 -691 207 -817 -798 59 -291
3583 -291 -937 57 -248 -965 -375 -147 -739 -733 -131 -1039 -521 172 -608 -1015 -226 -386 -1147 -127 -130 -969 -357
3604 -357 465 -1061 -518 4 -602 -780 211 10 -777 217 322 -838 441 261 -612 -235 385 -211 -96
3623 -96 783 191 -469 811 431 -559 464 781 -275 354 1160 146 182 793 257 -23 814 392 -314
3642 -314 565 1023 -145 252 904 -51 269 750 170 -104 676 424 -552 505 485 -233 276 429 -352 132
3662 132 835 -156 173 755 411 -231 366 387 -386 159 425 -539 -32 775 -141 -390 864 85 -505 294
3682B94j26o01R22J22j148O06N23n42l06Q82p38n6J035l64r17R41L0j077P05Q42
3702A027j049k0P36r39J75Q92q86k77J110l03j088O74M44j036M56O14r45J08Q75
3721E68o36q99J225Q7j110P31pn50J16Q23o53k37J143p01o25J157n24n60Q77j14
3741A11m63O37K05j076J40J161q88n53Q52O9q41R83l29n15M17O53j149J49N83
3760A46k15l62P52m09n80R54k73p10P62L93j130J80Q67r92R8J019q50j91J023
3779D82n77l50N83K39q25L14Q83r94O9Q71o93k92P42k19m32O16L1m40M78J02q76
3800b88L38P25q61l20J372m53j020J119k43o98O09J83r95J95Q26p96k71Q35m24
3819a67m87Q59l21r80Q46M73j197N07N42r58K80Q90p27m67J156n99k71R65k09
$$ plain form
3682 294 168 -433 489 611 -537 69 592 50 -256 626 -112 -168 867 503 -414 527 557 -520 185 1027
3702 1027 -22 -42 694 -245 -70 822 -64 -341 769 466 -622 52 496 -540 -84 530 -415 -307 568
3721 568 -68 -967 258 345 -765 -34 -41 -591 -475 348 -305 -542 601 -100 -725 432 -92 -652 225 111
3741 111 -352 285 490 -586 -446 715 -173 -726 126 195 -646 337 8 -507 -90 563 -586 -437 146
3760 146 -69 -431 321 -88 -668 286 13 -697 65 458 -672 -492 375 -617 -519 500 -350 -541 482
3779 482 -95 -445 138 377 -448 -134 749 -245 -176 695 2 -290 452 233 -199 417 448 8 486 588 -288
3800 -288 50 775 -86 -406 966 513 -507 612 369 -329 280 463 -532 -337 489 -307 -578 257 -167
3819 -167 -654 205 -116 -1096 -250 223 -974 -467 75 -883 -603 287 -440 -907 249 -350 -621 344 135
3838A35p37L87M70m48j60Q22q74l1Q41j62p85Q12K75r68L85L23k95l40R65p22
3858a07m20R83m76l90O61J5p14N39K0m31M80P0q35N1Q02o5p17Q52n43m82Q28n9
3880F2p28N52K99n03j92Q80n45l31J007m01l59N89K23j241P15M89o17l13J158
3899G44q44O7M69l76n07J043j09p46M77N82r78L81N88q28N4Q85m58l35N81l66
3919C24p41J060m9n83K47P23r89O4O07j58o30O98j4m87O18J97j126O39O99j497
3939c98N22Q46r93o5P42o43l48O43K37r88J093J25r03L20L64m21k0M89m59l00
3959a57R21k05n75J59M76r30L55N33p46r7R39o32o22Q69M3j011Q84L49j444P42
3979a49L43p97K44N21m85m56R26J62j168M33N10p88M90K98j181N67Q72q36l57
$$ plain form
3838 135 -602 -215 255 -193 -353 469 -405 -436 405 243 -542 270 545 -423 -38 285 -10 -350 615 -107
3858 -107 -527 456 -20 -410 251 266 -448 91 111 -320 160 230 -605 -554 248 183 -534 318 -225 -707 121 62
3880 62 -666 -114 185 -318 -510 370 -175 -506 501 100 -259 330 553 -688 27 516 -101 -414 744
3899 744 -100 -33 436 60 -447 596 487 -259 218 800 -178 203 791 -37 17 902 444 109 690 324
3919 324 -417 643 594 11 258 981 -8 56 663 505 -125 573 559 72 690 887 -239 400 1099 -398
3939 -398 124 970 -23 -88 654 11 -337 306 543 -445 648 773 -130 190 554 133 113 602 143 -157
3959 -157 764 559 -16 143 619 -311 44 577 -169 -266 673 41 -581 288 331 -680 204 553 -891 -149
3979 -149 194 -603 -359 162 -323 -779 147 309 -859 -426 84 -704 -214 84 -1097 -530 342 -494 -851
3998h51R94k76p37J024l95l73M15K95r51K36R76o76m85Q92k24k75N16l97q24J138
4018B2k4q86M19Q08q92J8M42k49m13N80k50n51Q22K86r04K89O11p15J1P74q70
4039f72k00J172q21m86J231j51r83R25om93K31O83j086K5R65m12o30P80J24n53
4059c57N10N4q43O87N71p38j54Q45m73m07P14k96k93N23K32q47L80P46r66K8Q70
4080G86o05l59Q78k27n72P88M2j317R17N22n42k72N69j37k70L44j10p46J149O0
4100H98j176Q25M70j055L77N93q78k93J048p53n07J253m59m67K81N58r17N20M75
4119G93q82R4N15m77m20Q42J90r21L67M88j319P90M71q10K11N73m53m35Q82m12
4139H7k58N53j82m30N04L82q68R5N09k21m51N53j32n14Q47m1j047P63L04j019
$$ plain form
3998 -851 143 -133 -870 154 -241 -614 -199 96 -855 -619 357 -319 -804 88 -136 -411 105 -292 -1116 22
4018 22 -2 -888 -469 339 -553 -535 -93 -342 -755 -175 -425 -976 -154 132 -772 -483 128 -587 -576 198 -672
4039 -672 -872 300 -521 -1007 224 73 -910 15 9 -484 -253 430 -656 -631 334 -78 -708 72 196 -357
4059 -357 153 207 -636 51 622 -116 -270 575 102 -305 409 113 -180 343 575 -272 108 854 -112 -84 786
4080 786 181 -178 700 473 -99 689 731 -586 331 853 311 39 608 471 201 545 435 -311 838 898
4100 898 -278 547 1017 -38 339 932 54 -239 809 56 -451 802 343 -124 157 715 -202 318 793
4119 793 -89 5 520 43 -377 465 655 -266 101 589 -730 60 531 -279 -68 505 52 -383 499 87
4139 87 -171 382 200 -230 274 656 -212 -117 392 171 -280 273 141 -373 474 433 -614 149 453 -566
4159e66L69N42p75M8O14l91k29N94kr29O73K76o12K93R2n00R8N61l71l09P22o0
4181A38q77N11M25n66J45M69r71N53N91p36l11O69J79o31L32J47o81M83M6m12
4201d97J48P48q83L23K16k37m28N30k63k11L26L13o47L69N46r61K63M78j25n55
4221e47Q21k36q47J061p8o98J94O45m82j51N57m31k60P79j12o88Q36rm15K17J31
4242B87m79K0Q61j111p9Q22j29p73O90M3o68J015R2j170P53M01q51O2O48l96l79
4263c41O77m13o32R19P9o33K20O94j023l7Q06m60o6M44k79o42J125J16j366O95
4283a17M73q43J31O74m26j65Q63o83l68R19K17r69M53J33m54K12M06n56j04P87
4303E83n74n60J221j21q66M33J93p74N20N62j066M15N50p42j8N58J14q02J45L19
$$ plain form
4159 -566 -197 345 -430 -382 232 -159 -388 206 204 -725 -52 224 -388 -95 -3 -503 -405 156 -215 -524 198 138
4181 138 -739 -228 197 -369 -224 245 -726 -173 418 -318 -629 40 219 -412 -80 67 -614 -131 -85 -497
4201 -497 -349 399 -484 -161 55 -182 -610 -80 -343 -554 -228 85 -562 -193 353 -608 -345 133 8 -547
4221 -547 274 38 -809 252 174 -524 -330 315 -167 -318 239 -192 -452 327 215 -473 363 354 -61 156 287
4242 287 -192 -172 689 -422 -501 321 192 -581 109 152 -516 499 591 -579 174 575 -276 -214 434 38 -341
4263 -341 336 -77 -709 210 289 -344 -124 570 -453 -490 316 -144 -210 234 -45 -687 438 554 -812 -117
4283 -117 356 -487 -356 318 -108 -273 590 -93 -461 458 675 -294 159 292 -162 50 456 -100 -204 583
4303 583 9 -551 670 549 -317 116 309 -465 55 617 -449 -34 516 -226 -244 314 428 -374 -229 90
4323I0m29M45K52q36J90O80m13m55R53n33j45N42k12p61L86N05q09K56Q71n77
4343@l89O30o49P4P76j19p59L72Q02q73L48L15m92J38L82n11n24J014R7j016O43
4364B59M85p16L90j61k26N8O94o60l56R99m41m85N69l18o25R00J35j283O92O17
4384E27p52k05Q49j91n36P54m21l98N58J29o96J41O61k94m56M92K5m57P28m17
4404D1j53K50K71q11K09Q92p17j58P15o96j81R57n04p08N32K14n79J91L36n46
4424d45K46J72k37j49R05m15o36L57K17o55M79Po44N76M11n07k57O08k4o66O34
4445b3j44j69J71J76m00K57P41r43O0N42j07l57K27J29n86N64j05p23O15L94p67
4466d48QN88m64k77Q29n97r6L48J80q90O69K71m82M0K27n22M21L10l69j27M84
$$ plain form
4323 90 -339 106 358 -478 -288 392 -21 -476 477 -56 -201 341 129 -632 -246 259 -550 -294 577 0
4343 0 -389 241 -408 -334 442 323 -436 -64 738 -135 213 528 36 174 556 45 -479 535 632 -384 259
4364 259 744 28 418 257 31 89 783 123 -233 766 325 -160 409 91 -534 366 501 -782 -90 527
4384 527 -225 -430 419 228 -308 446 25 -373 185 314 -382 -241 420 126 -330 162 187 -270 458 41
4404 41 -112 138 409 -402 -193 699 -18 -176 539 -157 -338 619 115 -593 -61 153 -426 -235 101 -445
4424 -445 -199 -27 -264 -413 492 77 -559 -202 15 -640 -161 -154 -798 -222 189 -318 -575 33 9 -657 -23
4445 -23 -167 -336 -165 11 -389 -132 609 -334 -274 268 161 -196 31 160 -426 138 33 -690 -75 319 -448
4466 -448 -440 148 -316 -593 236 -361 -457 -109 71 -819 -150 121 -361 -321 -94 -616 -195 115 -254 -381 103
4487A03J7j057R72K66q96N44J67n95k8J088q26j09Q05k38n56L36J80m40L72K85
4507C90n64R6R19k06q60O67k42l59M61J2o12P02L62p91J25O23o46m11J187l79
4527D74n18M34j37n01P58L34o33k28N59l49j71N61l84l26P46j84o21O83L83r68
4547h8L13L33m18qL72m29m05R27k07m74L92J68j44l33M60l76k5M18m83j15O37
4568E15k66m57L90J09n62N09J24n61JR91n21l19M95l92l36O06k44m83R07k89p83
4589e66K70R00q26L9K85l0m31P87l26o73Q22K76j057K26M20l98M4L19l44k4N51
4610B64l11o20O16L99q63J28K84m31K59K92n53j2P28k29n14L96M66q68K7N38n96
4631f00N41L17j018pQ15j91k68M23j28n20Q13l72j27J49N81p26k79O34j41l57
$$ plain form
4487 103 120 -937 35 301 -595 -51 116 -479 -507 581 -245 -354 451 213 -343 -7 173 -267 105 390
4507 390 -174 -78 841 635 -225 442 200 -159 302 314 -298 404 766 -25 100 723 77 -334 853 474
4527 474 -44 390 253 -248 510 844 211 -17 542 193 22 583 199 -127 619 435 -186 497 880 -88
4547 -88 225 558 140 132 504 75 -330 597 390 -84 308 476 332 -1 459 83 58 476 -7 -122 515
4568 515 249 -208 182 291 -271 238 362 -199 -198 793 272 -47 448 56 -280 326 82 -401 506 217 -566
4589 -566 -296 604 -222 -183 102 72 -359 428 102 -571 251 527 -530 -304 116 -282 -238 81 -263 -287 264
4610 264 -47 -667 -51 348 -515 -387 -103 -534 -275 17 -536 -548 180 -49 -563 -167 299 -569 -542 -4 -600
4631 -600 -59 258 -760 -767 48 -143 -411 12 -116 -636 177 -195 -322 -173 408 -318 -597 37 -104 -461
4651d61K30j12n04R13J15p54L72M53m86j7O30o19N9N25n51m17P13Q8p66M72L92
4672B75k69M4R1l24j32O22o5o35M41M09q09L11N72p33o7N66k86J13N58m23p76
4693e17P56J02l95M66J98r41O02J04n76j66J314o12m32J65K92k81L41j5p95M62
4713G2M27n96q9O91m67n9O12n91l09N94j72m97P45J82r00N37K7r5k58K32j40k14
4735b68R71k41j154O74LQ3J49K91n62PQ45o30k88N91Qp14L85M93n33L88k58m36
4757a96M17K80m53m90P37j43l56M22j19O3M0k17n82N91L53m55m41N34K57o46P19
4778C15m20m73O09P4m69K3R05n98k90M26N7m36M56l60m77P86M53n98l41N23k26
4799f1J8L04m91nP50l41p02O49J66l76j98O04n87K36K77n94k88Q49K52j067M87
$$ plain form
4651 -461 -231 -343 -847 66 181 -573 -201 252 -234 -251 379 -240 -181 344 -207 -624 89 177 -589 -117 275
4672 275 6 50 141 -183 -315 307 242 -393 48 457 -352 -41 531 -202 -269 297 11 124 682 259 -517
4693 -517 239 341 -54 412 610 -331 271 375 -201 -367 947 335 -97 68 360 79 420 405 -390 72
4713 72 499 -97 -186 505 38 -21 591 0 -309 285 113 -384 361 543 -357 180 207 112 -146 86 -54 -268
4735 -268 703 462 -692 -18 -15 68 217 508 -54 -47 798 168 -120 471 479 -235 150 643 110 498 240 -196
4757 -196 221 501 48 -442 295 152 -204 218 99 162 202 -15 -597 -6 347 -108 -549 -15 242 -404 315
4778 315 -105 -578 31 105 -364 -341 564 -34 -324 102 159 -277 179 -181 -658 128 581 -17 -358 165 -61
4799 -61 -43 261 -230 -235 515 174 -528 121 287 -89 -287 317 -270 -34 243 -351 -639 210 462 -605 -118
4820a18P6k97J54J51n07L66M99r55J94Q14n45rK5n3J31K08j37m94K99M83k95l55
4842c65O12k39k64K42M51p51P60m49n19M52N99l70n33L38J15J13J49n57m36Q30
4862A78J28n21O4K83j60k49L02l4k94O67o72m19R88L52q24J08J35m87P31R5q82
4883e11J14O73m81k12O07M46r09J88n4j65L97K21j198M26R81K3q95N7L79j74L67
4904B80J32j006Q24Q5o52L32M54j54m46K21l61J07O91l72n89K93N82k77j92L26
4924B78k10L6J60l04l8K13O6n98M17O36o23j89N07l47L44q9n79n5O12R5p24N61
4946A69K0j27J87j92k65L34L56n51p29R44J88k99l7l32J08O71j16q35L51O25l82
4967H8m92R21k56n13N52j46l58R40k84q60l4R79l26m57K51j81J19M79l19m81O38
$$ plain form
4820 -118 -42 -339 -185 -34 -541 -175 324 -631 -437 377 -168 -177 -152 -205 -74 134 -3 -497 -198 285 -10 -365
4842 -365 247 8 -256 -14 437 -314 446 -3 -522 -70 529 159 -374 -36 79 192 341 -216 -652 178
4862 178 306 -215 -151 132 -28 -277 25 -9 -303 364 -308 -727 261 613 -211 -103 32 -455 276 371 -511
4883 -511 -397 276 -205 -417 190 636 -273 -85 -139 -304 93 314 -884 -458 523 546 -349 -292 87 -87 280
4904 280 412 -594 230 315 -337 -5 449 295 -151 70 -291 -184 507 135 -454 -161 421 144 -48 278
4924 278 68 104 264 -40 -78 135 201 -397 20 656 33 -156 351 4 348 259 -320 -375 237 332 -392 169
4946 169 189 62 249 57 -208 126 482 -69 -798 146 334 35 -2 -334 -226 445 329 -506 -155 470 88
4967 88 -404 517 261 -252 300 154 -204 736 452 -408 -442 537 211 -246 5 -176 -57 422 103 -378 260
4988B60M19r94O2P41j24n44K41j92o4Q59k55p76M90J37Mj77k01o9K04L74p27L18
5010a4O83n02p81L77N43k02Q7l20l32N02N69q94l47Q18n2o14O33k07j46J55j85
5031b29j80M77M89j151N4O21J27l06L7m79K32K16L72r83M34L90l53k04M91l0j48
5052a23N8m31l8O45K86j145O2P45j58lJ27n32N63N27q60k53O79L63q76J40M81
5073B57k22L24k88m68L83P77p61q39R97J06k60n0K9k2L07K76j090M91O49m44o89
5094e37K52K19K34o2k33m79O87N38j146M0N49j18N4N7m20L29P00p18n62M68M92
5115C44o09J76j15o1L41j63k29l05Q78K20q52K35N45n15K7m3K72j30M43o36k25
5136d02Q47J65r26k0N65j96O32k17o78N01N26q22j34N34O2p4m26J28nM60k72j113
$$ plain form
4988 260 679 -315 -253 488 364 -180 61 -131 -195 664 409 -367 123 260 264 87 -114 -183 21 395 -332 -14
5010 -14 669 167 -614 -237 306 104 191 -129 -461 41 610 -284 -631 187 135 -479 154 -53 -199 -44 -229
5031 -229 -409 68 557 -594 -540 81 208 -98 -61 -540 -308 -92 280 -703 -269 121 -232 -436 55 25 -123
5052 -123 -65 -496 -534 111 397 -748 -686 59 -99 -102 25 -507 56 583 -277 -530 149 512 -364 -224 257
5073 257 35 359 71 -397 -14 763 2 -837 160 266 6 -44 -15 -37 270 546 -544 -53 596 152 -537
5094 -537 -285 -66 168 106 -127 -606 81 619 -527 -487 62 -56 -2 55 -365 -36 664 -54 -616 -148 344
5115 344 -265 -89 -204 -265 76 -87 -316 -621 257 477 -375 -140 405 -110 -83 -126 146 16 459 -177 -402
5136 -402 445 610 -316 -336 229 33 665 448 -230 271 797 -25 -159 375 437 363 -63 65 60 520 248 -865
5158h65O28Q83k77n97J47k10M76l7N0m63M06K83q21M27M88k23n43K93J54p1L71
5179D99q82m32R78K74l58m56M01k94K94J16n15L21M16m84l35N42M50k91m38M6
5199a48O9L84k4o47j42Q25j3n47q9L91k36R9K70n17M13R6n62m31J257p1p05j7
5221c45J28J34L87k04k12l55R06n00j88L14J17k65K4k5l6N43l19q17M27Q09l46
5242A77l20L0P9K15J38o42j17O30p3l69k50R81l22k52j13p6L51N82j086k64N44
5263a57L57l50Q9p0j3L44j0l94n4O86o86m25O40O92m46k43j91j77O76L94j218
5284e56j8O26K40n11J31K33l8K7k24j77O78J43r10l12J135j30m16j4j58L01N79
5305F29r2n66J97N14m54l34N02j35l14L94n88J50O78k42r64N28N31l21o3j99j81
$$ plain form
5158 -865 -237 646 369 -228 -81 -291 185 148 198 -265 141 424 -397 30 518 295 -248 45 199 128 499
5179 499 -383 -815 163 437 79 -377 24 -270 24 140 -375 -54 362 -122 -457 85 535 244 -194 -148
5199 -148 -79 305 281 -366 -508 317 304 -243 -332 59 -177 -78 192 -325 88 184 -378 -809 448 377 -328 -345
5221 -345 -217 -83 304 100 -112 -467 439 -61 -249 65 182 -83 -59 -84 -120 423 104 -713 -286 523 177
5242 177 -143 -113 -34 181 319 -323 -440 190 117 -252 -502 479 157 -95 -208 -284 67 649 -437 -701 -157
5263 -157 200 -150 -61 -131 -144 200 190 -204 -258 428 -258 -683 -43 649 203 -40 -231 -408 268 662 -556
5284 -556 -574 52 292 -219 -88 145 107 134 -90 -267 411 554 -356 -668 467 337 -79 -93 -251 50 629
5305 629 537 -29 168 682 228 -106 396 261 -53 341 -247 -97 581 339 -625 -97 434 113 50 -149 -330
5326c30N33M96j017k01R55k77o75K17M24j35L20o38j31L66J017p93n42N44K69
5345D02m27O72r03n4K34J30l90O11O43o52q42L62Q96k67n98o9r3P34L47j178k9
5366d71M57L86k28K47n53M03M5m52r7O50J19q53o1K73J66M74n73k33K76O15k93
5387B97n51l9O25l94l66L55K68J65k19m96k44J078j03o41m05R13k46N3Np10P54
5408I9N62o01k47N29M2n66O5K66r2K72m46k93q9J497o42j017O23K19J2J03o36
5429c40j76Q21j95l74J59L39k34l22k62N40M97j02k59p38R88L49q63p2J66J86
5449A08K17n45J27K60J17o11j63N83N00p43m21J08N67M01k85p95Q2R08k83o31
5469d99K91M58l44Q5K16l82O31m0r41PJ094K8o11j56J4L03L21j82o98J69O14l16
$$ plain form
5326 -330 203 699 -318 -519 436 159 -516 -299 125 -10 310 -328 -459 -93 924 131 -411 133 402
5345 402 -25 647 -256 -310 -76 54 -336 275 918 266 -576 -214 682 415 -183 -252 -345 389 736 -442 -471
5366 -471 -14 372 144 391 -162 241 286 -166 -263 387 506 -347 -408 -135 31 505 -68 -301 -25 590 297
5387 297 -254 -293 332 -62 -428 -73 195 360 141 -355 -599 479 376 -265 -670 243 -3 50 55 -655 99
5408 99 661 60 -187 342 384 -182 -117 149 57 329 -117 -410 -499 998 356 -661 -38 181 193 296 -340
5429 -340 -516 305 110 -264 -105 234 0 -322 -584 -44 453 351 92 -646 342 691 -172 -244 -78 108
5449 108 325 -220 -93 167 284 -327 -490 93 593 -150 -571 -463 104 505 220 -575 -493 415 132 -499
5469 -499 -208 250 -94 -9 207 -175 456 416 -525 -518 576 604 -7 -163 -149 154 475 293 -405 -236 378 62
5491F2l61M51L18k59l34J66K16J44k88q55L67R66l10o40M1M60j4R8l43k53M40
5512G2m5l98O9Q09j97l97k21J59N46K30o96q02J176j10o8k50k30M09J40k79L8
5533d5J24L91o28k80O11N76m37q07N5O55M21j92p98j82O65q0l60L26j40k3J35
5554a3l46J71N25M1q73j69J114L1l19m20k71K72Q17j44r94L58L58l03k29O42l58
5575a10K59j22m83L09O43m76m15O4P86j96j52k19l84O92K96n11p2P45k93m44J32
5596D9L60l57J72k98n81P95K74m31p36Q72L57k74l18M2j89M57k96j60K03M42n19
5617a36m47L73N29J7j4j078M67R90j11r93l56R27K1k96m4J35M91l14m79q3Q46
5638D45M2p27m67N88L43J86m63l99J88R98m21q50M04M32l65M7R6j31Q2K37o79
$$ plain form
5491 62 -299 152 470 211 -123 43 259 403 115 -740 -373 593 283 -357 -316 144 130 228 -115 -368 72
5512 72 27 -371 -302 507 310 -87 -308 -149 397 627 -69 -871 305 195 127 -123 -353 56 196 -83 -45
5533 -45 79 470 -158 -438 173 749 312 -495 -440 215 636 444 -354 -536 129 49 -311 15 -125 -148 -13
5554 -13 -359 -188 337 378 -495 -664 450 481 162 -258 -529 -257 560 416 -578 -220 138 -165 -394 248 -110
5575 -110 149 27 -456 -147 496 20 -395 -331 455 259 107 -112 -496 196 492 -19 -91 654 361 -83 49
5596 49 409 52 224 -74 -655 140 414 -17 -753 119 476 202 -116 -74 -263 194 -102 -262 -59 383 -136
5617 -136 -583 -210 319 336 322 -756 -289 701 590 -403 -759 168 189 -107 -151 -16 475 161 -318 -401 445
5638 445 487 -240 -707 -119 224 410 -53 -452 -264 734 313 -537 -133 299 -66 -19 77 -54 28 265 -414
5659d14J70J010p70n36o8O16J01j28k63m33P41N58q88l09Q95O6q11M57J90q5L52
5680D51p78j1L62J004j168m48M36K91J46r2m63oN77j48m48N47M01m92o50N04K68
5701B83L90l59r82J30J010L86r73R9mK99j94L7m4J47K90r48k37J043K61r04k17
5722d87L42K53M25m96n41L92M87J15q32K46M56m65j95J42K38K50l0j042M63R66
5742F87j99q18l41Q09K42L54o68p53P34O61r06k70P45k59k7k71J14K61M69p49
5762a85p01R09P82l62q42J03K50L37L3n57J01M08o0n14K38N47k86o27J93o2R41
5783F46L0j447j72J275N61r73j03j75L57K84o0n17K74J63r32J56Q93L25n25o78
5803f18j2N76P96p07r03M90R71q9o65o5J38M2K56l44j87J124n18j304P49Q23j11
$$ plain form
5659 -414 -244 766 -4 -540 -608 8 109 -19 -282 -715 26 584 -304 -613 282 348 -463 -6 184 99 451
5680 451 -327 -338 24 1028 -140 -588 -152 139 285 193 -270 -276 301 153 -295 252 653 161 -489 15 283
5701 283 673 314 -668 -538 472 858 -115 -16 -20 279 85 122 78 225 515 -433 -670 373 634 -270 -487
5722 -487 -145 108 533 37 -504 -112 375 490 -342 -96 360 -105 -300 -158 80 330 300 -742 -279 687
5742 687 488 -330 -671 138 380 734 66 -687 47 708 -198 -468 277 18 -9 -280 -166 95 564 -185
5762 -185 -886 23 805 443 -399 -296 -46 291 324 -233 -132 276 216 -298 -60 487 201 -426 -233 -295 646
5783 646 676 -771 -943 332 893 -80 -183 -358 -1 283 223 -294 -20 143 -789 -633 260 585 60 -618
5803 -618 -630 -54 742 35 -868 -378 593 504 -161 -226 -88 -46 210 -134 -321 803 285 -1019 -270 553 442
5824D42o62k47K79K25M01k02q99P21M38l76j61J91K99n36N5l86M35P71o84r48
5844h44N58Q58o4n23m95M81N05P0o71n76P07J77p05N20M16j74o08j52J53P91L94
5865H18j057o46J045Q07o47m22l42L11M92n22m03P87L07n83m86N33O23m60k06
5884e1q58M28R83k3r19j83J319k48o00J17l7J99k23l18j10J015j24j194L26M71
5904c0N28n57l60n11Q32J094o99r45L93N14N9l93J85J56j15j79p52P84R12n85
5924C31j070L65Q08K79n65m90J6O50j41k06O0K18K4m72N4M93J63m38p33J66Q65
5945C77O92j033r29P18O17o0o96j31L27J50J31p18N08L86n05o96K82P79K82n24
5965d3p10O30J019m44j055L78L70J4p2r5j91K80J63q28L26P51k40n96j50N23L05
$$ plain form
5824 442 -220 -467 -188 37 438 236 -663 58 496 120 -41 150 449 -87 -32 -418 17 788 104 -844
5844 -844 -286 572 508 -15 -510 -29 476 546 -125 -701 6 183 -522 -2 414 240 -368 -520 -367 424 818
5865 818 -239 -885 160 967 320 -102 -444 -133 359 -163 -566 221 528 -55 -541 -8 615 155 -51
5884 -51 -909 -481 502 479 -440 -623 696 448 -152 -35 -72 127 -96 -414 -524 491 367 -827 -501 -30
5904 -30 498 -59 -419 -930 -98 996 297 -648 -255 259 318 -75 110 266 151 -28 -780 4 916 331
5924 331 -739 -374 434 713 148 -342 -326 324 183 -23 37 255 279 -193 -139 354 517 79 -654 -488 377
5945 377 1069 36 -893 -175 442 382 -314 -445 -118 32 163 -555 -47 339 -166 -862 -580 199 481 -43
5965 -43 -753 -123 896 452 -603 -225 145 159 87 -8 -199 81 244 -584 -258 493 253 -343 -493 30 335
5986C35K82j021l58P74L19m4o12L61L88k70j40J06J6O0j75q51M99J154n47j253
6006i77M56O54L42k89n22m09R33M96o97m83L34K70R2o86N65L14R6r74m37J025
6026A03O89p71o82P0P49M77j93q13K10O36l29m40M59K70n17l79K11M66L59k96
6046B79p88k0J008L47j119J54r1O07j35o0m54M57J73n99k62Q56K71q13l25N79
6066F5K91L99j263m93O25J268o08o28L5O15o0l57N0J52N26p93p18O21J490p22
6086D95j239R4M21N63J94p44m56O18Q28q55l06P68n23Q2l3M0M61K90j134o52J160
6107G2Q73m96r09P6M12P11m99o08R2Q48n26p27P45L24l47n89R1L27O93K40j462
6128f59K40P61L97p46n06K02N54j2l60j34L74L95j103J49O67M87q16l12j56Q08
$$ plain form
5986 335 617 -404 -762 12 331 287 -325 36 424 154 14 120 136 196 21 -830 -331 823 276 -977
6006 -977 -521 133 475 186 -336 -745 188 684 -13 -496 -162 108 200 -486 79 393 489 -485 -922 103
6026 103 792 21 -661 -591 158 635 442 -371 -161 475 146 -294 165 435 -82 -461 -250 216 575 279
6046 279 -509 -529 479 826 -293 -139 -230 377 242 182 -272 185 358 -241 -503 353 624 -189 -514 65
6066 65 356 755 -508 -1001 -376 892 284 -344 -309 306 246 -111 -61 91 617 -176 -894 -273 1217 495
6086 495 -744 -650 -229 334 528 -216 -672 -54 774 -81 -387 381 -142 -60 -93 -53 408 698 -436 -1088 72
6107 72 945 449 -460 -384 28 739 240 -368 -276 572 46 -681 64 388 41 -548 -457 -130 563 803 -659
6128 -659 -419 342 739 -7 -513 -311 243 231 -129 -263 111 506 -597 -448 219 706 -110 -422 -578 230
6148B30O48n14j187K38Q72J27k77N5k84K21O7n86K91N58j04j161L97Q78K17o84
6168Bq47J88R85M23j069l31O03N11o20k03K35M55m14k59k23J008L31j017n48M96
6188b94P91J05p14m74L92N14O5q05K23N28j98m60N33K42j44m92j90K16J039k5
6208H52r30o50R90N04m44o18k23O20K39n12M1L75l3k91m99N01Q31l86p75m75Q07
6229g6P82l63j001J02Q30J43m34m32M60M26k18o84K42R63k97j058J1P80N59m91
6249B44p76l7O04P26p49o48L87P33l44m05J17K02P3n11k94P70P58q51j054P27
6269c28P92K7k91q79K90P35J95o34j46N38j65l53j16P82Nl88p49K32J195o2j194
6290e14l86R17M17J31m66o40L41Q29l73p77O52M76p76l17J65P37l03j62o08L50
$$ plain form
6148 230 878 364 -823 -585 287 414 137 192 -92 129 196 -390 -99 459 355 -806 -409 469 686 2
6168 2 -845 -657 328 751 -318 -649 -46 465 -155 -358 -123 332 -82 -341 -564 444 775 -242 -790 -294
6188 -294 497 602 -112 -586 -194 320 385 -420 -197 331 133 -327 206 448 304 -188 -378 -162 877 852
6208 852 -78 -728 262 766 322 -296 -519 101 340 -172 -131 244 211 -80 -579 -78 753 367 -408 -883 -76
6229 -76 706 343 -658 -556 274 417 -17 -449 11 437 219 -465 -223 740 443 -615 -604 176 735 244
6249 244 -532 -569 35 761 12 -636 -249 484 140 -265 -148 54 127 -384 -678 92 850 -1 -1055 -328
6269 -328 464 491 200 -679 -389 346 541 -93 -239 299 134 -219 -335 447 452 64 -685 -453 742 680 -514
6290 -514 -900 17 434 565 99 -541 -200 629 256 -521 131 607 -169 -486 -321 416 113 -49 -657 -307
6310c07Q46K20j344R2M74O31m28n0l73L54K06q19K72O73J78j060K20K23N58L6
6330F02j041l04Q19N80o83m85J64O30k21j95N0OL59n20l18M96O83m72q50N6Q14
6351A70N66n57o51J43O97K53q70q8M95K05m30k5K01M10n7j029oJ072K15p27q16
6372h29O19R23j53m90m94K39N48l24m13N68K76o38m38L11P37o1k57p73L01P13
6392C65J69p44k65N06K62q3k64l01M76K45o48p4P16Q9r89j15M73L26L14q78k43
6413f63N89P60n96j95n7K13O6m7k44L02K57o44m81P78P02k53o59k39Q50J02j25
6434D16o92l58R45Jm61n9ON21m29j91J36Q46l2j063k50O80P66o57o76J09P06J30
6456C94r5n84K55K31k27k51J51P84n07m81R8K95O66o23q45N3J294j1o35k35O8
$$ plain form
6310 -307 539 759 -585 -493 -19 612 184 134 -239 115 321 -498 -226 447 625 -435 -215 8 566 602
6330 602 -439 -743 76 656 -27 -512 -348 282 61 -134 -84 -78 281 -239 -557 -61 622 150 -700 -644 170
6351 170 736 179 -472 -329 368 621 -249 -337 158 363 -67 -92 109 519 462 -567 -573 499 714 -13 -829
6372 -829 -210 713 560 70 -424 -185 363 39 -374 194 470 -168 -606 -295 442 381 124 -649 -348 365
6392 365 534 -210 -475 31 293 210 -54 -355 121 366 -282 -356 360 449 -540 -655 -182 144 458 -420 -663
6413 -663 -74 686 90 -105 -162 51 117 70 -174 128 385 -259 -740 38 740 487 -172 -411 439 541 416
6434 416 -276 -634 311 312 -149 -208 -202 319 -110 -301 -165 681 649 -414 -664 16 782 125 -551 -442 264 394
6456 394 299 -285 -30 201 -26 -277 -126 658 151 -330 -232 63 729 106 -739 -686 608 597 -38 -273 -205
6477b05N44k50Pl85N40K91j038k25J000K69o56m26j87J447J04q54q56N91Q49m25
6497A35l49j74M10l2L84n95L48L51m95p26M15J012l4o38l90L6P47J90j013r3O11
6518A00K36l08j36L48k78J70m41K62L45N1o72m81O62P34l56j89o18L69P36l98
6538A36l67R7L04J57m09o6M55j40m17K7OP02L0j302K51R92j15m34n1j85K79M91
6560D41l09o60N54L12o07k49M46N93l51p13k25R96L52o08p96M08P53j81k26l51
6580d21J91K11n0m21L29O01M6p09M2M63J80o04k68j94R41K92q31j45M68K93k98
6601A16l16L51l67K99m17p4N47M21n79n99O20L60o8l65m70M54J61J27n37J04N32
6622C00m17P0j86M25L44k97p93M74M07k46n89m1M29N59o4p16K6M36O9l44NN08
$$ plain form
6477 -205 339 89 96 -289 251 542 -496 -721 279 548 -108 -534 -721 726 830 -24 -880 -289 560 135
6497 135 -214 -388 22 -10 374 -221 127 478 -17 -743 -328 684 650 12 -378 -342 405 595 -418 -511 100
6518 100 336 28 -108 240 -38 132 -309 -47 298 349 -323 -804 -142 592 236 47 -571 -202 534 136
6538 136 -231 -134 170 327 -82 -148 307 167 -250 -223 -217 485 515 -787 -536 456 341 -93 -144 -329 -50 441
6560 441 132 -528 26 338 -269 -518 -72 521 170 -543 -768 228 580 -28 -824 -416 337 156 -70 -421
6580 -421 -230 -19 -69 -490 -161 440 486 -223 -181 282 462 -142 -410 -604 337 629 -202 -347 121 414 116
6601 116 -200 151 -216 83 -334 -408 139 560 -19 -618 2 362 294 -71 -541 -87 74 201 -336 -232 300
6622 300 -117 -47 -233 192 536 239 -554 -80 327 81 -508 -549 -120 439 375 -341 -315 121 190 -154 -149 359
6644C59j34j80l43M27KJ77m25m22L30J079p11p75M01O32j81k97j54oK29K00p14
6665e06M73L07r3n24K39M17M9j24k67k96K87O63m04l88JL48j12k47l0J76N72q16
6687b75l59Q22L06l64m26l0N07L43l13p25J58P01Q0n48q8L27K09m13K30J10K11
6708D63k35p88L25O59M2p89K07j35K22L35l88j75N8O92k35l61M3M00o54k31N84
6729C9J50L74q57m5L1P12j04n69M8Q4M25l78N1J48k26NKm49Q21r2m66JK37M51
6753C93J62p35m16L74P56n36l39M31p1J64K0k35k5L17l87m93N08M13J16o86p8
6774c47N03J32M63r12K24j3j14l36N04l6J9m05J1L15K31J7p98j75R83Q0o76l0
6796c60M41J7K05n22R8o1O44m29k26M29j1n2l52j22M01K19j57n99K4M61L16l35
$$ plain form
6644 359 225 45 -298 129 131 308 -117 -539 -209 870 159 -616 -215 417 236 -61 -215 -221 8 208 -506
6665 -506 -33 274 181 -343 -104 313 362 238 -29 -325 -38 625 221 -167 -166 182 70 -177 -207 -31 541 -275
6687 -275 -634 188 494 130 -296 -326 181 524 211 -514 -356 345 425 -123 -211 116 325 -88 142 252 463
6708 463 228 -560 -235 424 466 -323 -116 -251 -29 306 -82 -257 -199 493 258 -103 -60 340 -314 -545 39
6729 39 189 563 -294 -339 -308 404 300 -269 -221 -137 288 -90 -39 109 -117 -112 -110 -559 262 170 -296 -295 -58 393
6753 393 555 -180 -596 -222 534 -2 -341 90 19 183 203 -32 -57 260 -127 -620 -112 301 417 -269 -347
6774 -347 156 288 751 -161 63 50 -64 -400 104 68 87 -318 -307 8 239 256 -542 -717 266 346 -330 -360
6796 -360 81 98 303 -219 -121 -182 462 33 -193 236 225 173 -179 -301 100 319 162 -437 -413 48 364 29
6818B9l80K86J55L05j89l22N06m32l28L60K38j32K94p03j16M86O18m77o86L48
6838a40L48P7m12K29j26l00O83n34J78J82m38K19m03P63j23q6j92l77Q23p4k14
6859H3k51J75q6J53N3J08N6k93J33k32L06K04n27k54M97j84M18l03m80M29K17
6880B22J51n15J22o8J75k02K5M48l52n4p6j03O81k60l12k45M20J08J17m10q2J58
6902e2N1K4JJ70K24m54k29J12K15K34p51J06L61M58j63n15J70L30k35K8j52K3
6924d4P5K98n56K67N93n42m18K43L68q8k01j96K28K58L18m73m07K77L9q5K05l44
6946a85j33L52j12k54L45L84p98q1M46L9J52J5o70J61O55l01n75M10K63J61m25
6967a51k53M76M8o9m82J49N74j38m66K30j02L94ok30j53j41L69n4j10K30M6j44
$$ plain form
6818 29 -351 -65 90 395 206 -116 390 -42 -370 -10 228 96 390 -313 -429 57 675 198 -488 -140
6838 -140 208 285 -127 102 -24 -324 359 -175 3 185 -253 -34 -437 326 203 117 -75 -452 371 297 83
6859 83 -168 7 -79 74 127 235 291 -2 131 -101 205 409 -118 -372 125 -59 359 56 -424 5 222
6880 222 373 -142 -20 -88 87 -115 -90 358 6 -48 -124 -227 454 194 -118 -363 57 165 282 -128 -210 -52
6902 -52 -1 23 24 194 418 -36 -265 -153 62 296 -455 -349 12 470 307 -208 -38 292 57 85 -67 -44
6924 -44 31 329 -227 40 633 91 -327 -84 284 196 -5 -201 27 285 603 130 -277 0 39 -46 159 -185
6946 -185 -318 34 -78 -332 13 397 -401 -482 -36 3 155 170 -500 -339 316 15 -560 -150 113 274 -151
6967 -151 -404 72 120 51 -431 -282 292 154 -312 -82 -184 210 204 -26 -179 -320 49 -5 -115 115 161 17
6989A7k49O3N18l17R8n99J53N51n2l35j42L24P6nk92o3K07R7k75M07J21J21p44
7012c20J71Q5L81J85o77l62O02M34o43j17O7l4M04m82K04K01o0j2o31N66O42p26
7034a22P9j17n6N32j63k94n49R50j71k05L49k31J5K28k47l75N29l0l64O3J06N43
7056D70m91j51NJ47L90Kl97k63O65n63j6J36L62m24Q0j34M57K43o04n03J89Q40
7078D40k40j02l39Q9Q7K34j76m25P81j30n26L50J08O2n62J96M1K34J77m00m76
7099e77O12L13k89k60L87l18J16n2K94k27J38l48j4O61m03O9l74R4M8N55Q2q92
7121c85K79L13k25k41K27j26k9L4n40N56L06J96l72l18L99P2k54j8pQ6J26J07
7143A86k62j07K23j05L2K61n6j66J17k95L08M17l62n64M08L17Nj50m2k67K63R2
$$ plain form
6989 17 -232 -169 349 32 130 -469 -316 235 183 -152 -294 30 106 101 -191 -254 -47 50 -225 182 303 424 -320
7012 -320 -149 -64 317 502 -175 -537 65 499 -144 -261 -194 -228 176 -306 -102 99 39 27 -604 -38 604 -122
7034 -122 -43 -160 -216 316 153 -141 -690 260 89 -116 233 2 17 245 -2 -377 152 122 -242 -179 -73 470
7056 470 -21 -172 -167 -20 370 372 -25 -288 377 -186 -202 -66 296 -128 -48 -182 275 518 -86 -589 -400 440
7078 440 200 98 -241 -152 -65 169 -7 -432 349 219 -307 43 151 213 -349 -153 -112 122 299 -101 -577
7099 -577 35 348 59 -201 186 -132 -16 -68 226 -1 137 -211 -225 436 33 102 -272 -178 -130 425 507 -385
7121 -385 -106 207 -18 -259 -32 -158 -187 -153 -693 -137 169 365 -7 -325 74 146 -108 -126 -133 -47 79 186
7143 186 -76 -183 40 -65 -33 228 172 6 123 -172 136 553 191 -373 35 352 357 207 165 -102 161 253
7165B53m41m7J92K54m28k31O87J12l17o7k65K24M60l28l47K56J71L37l93l09J42
7186h5J59k06R8P6l6J8j69k7J08M68j6p74j82Q19M96r87n8J76L94k36K75Kl24
7209a1R3J15q7J84K03o10l24K97J25L34k57l54l43Q36l2m80K40J1o8QMK09Q9k42
7233f0p9Q2M93m12l27l9M23j71K78k60l44M29J66j8p10Q32l30k08J87N0L25k35
7255G2j9p9J2M84l98m25L99j62q9L20j84k01O31Qo24r1M88K0k41K00J33p4j66
7278A4o2k15M55J37l48j23M0J90Q7J15k37p3J8j03m30P98q9N0p55N40n7K86K02
7301D40o57J44J56K27n26K25l3j24J10K50J3J40j59n84J57O40j11l63j64L38J8
7322A37K03j88n18M15M59l83o2MJ57k68m0k04N03J09q9n27K03N85k95j97j16P8
$$ plain form
7165 253 -188 -235 -43 211 -217 -448 239 351 34 -33 -298 -74 386 58 -289 -33 138 475 82 -227 -85
7186 -85 74 -132 -34 42 6 24 -145 -172 -64 404 388 -386 -568 251 747 -240 -298 -122 272 36 311 313 -11
7209 -11 82 197 110 294 497 -113 -437 -140 -15 319 62 -292 -635 201 169 -311 -71 -60 -128 -120 -116 93 182 -60
7233 -60 -139 -57 436 24 -303 -342 81 -90 188 -72 -416 13 179 161 -549 283 -47 -255 -68 -18 307 72
7255 72 53 -26 -14 470 72 -353 46 -116 -205 115 -69 -270 361 369 -255 -346 142 162 -79 121 254 180 14
7278 14 -48 -263 192 329 -19 -142 -102 88 175 290 53 -20 -2 -105 -535 263 174 224 -531 9 -48 238 440
7301 440 -217 -73 83 310 -216 9 -24 -148 -38 212 225 365 206 -378 -221 419 308 -55 -219 119 137
7322 137 340 152 -366 49 508 125 63 67 224 -44 -84 -288 215 324 235 -292 -89 496 201 4 -112 -34
7344c4J20J36l87K52l7m2j95L88l1j68p3j30K50O6L37j045L34K16N10n61j96M42
7366A52j98K30k52K1J47K10m80jK13J18k16j97K1J69K68J95n91j68P44j84k14
7387a3j99K41j74L59j38j46J61J68m76M8r9L72J4l33M4p2M74k73j94J01L94l01
7409d2k35M57k35K22k88Op8L99q7l29R4M17l38K2j45QK89j13k49qK28j52j85K23
7433a19R2J45k90j69J54j1O53m86n57L99J47J70J90o24L09J47K09m53J1J54p4
7454cj75N2L72k64K88m09J01P4J29k31l9J20l0k93K31J30j65K48j99j21K40K28
7476B84n83K67Q2M9j73L0k1O1M76o16l0J04J17M7J81j95P0J8Oo31M93N51l78k53
7500d4k51L45K53j88J80o88Q91j63l08j89K81J27k41L41k27J01L4n65r5L00L62
$$ plain form
7344 -34 86 222 -165 87 50 8 -187 201 170 2 -71 -201 49 115 452 -593 -259 -43 467 -94 -290 152
7366 152 -46 184 -68 -47 100 310 -170 -171 42 160 -56 -253 -232 -63 205 400 -191 -359 385 201 -13
7387 -13 -212 29 -145 214 76 -70 91 259 -217 -169 -268 104 118 -215 -171 -243 231 -42 -236 -135 259 -42
7409 -42 -277 180 -55 167 -121 -115 -193 206 119 -210 -116 301 -37 -15 -160 -152 137 24 -225 -233 -5 -157 -342 -119
7433 -119 -27 118 -172 -341 -187 -198 455 -31 -588 -189 -42 128 318 -306 3 150 359 -94 -83 71 -3
7454 -3 -178 -126 246 -18 270 -139 -38 36 165 -66 -105 15 -15 -308 -77 53 -112 136 -63 -184 56 284
7476 284 -299 -32 50 99 -74 -44 -65 -4 472 -144 -174 -70 47 94 275 80 150 168 174 -457 36 587 209 -44
7500 -44 -295 50 303 115 295 -393 498 335 27 -162 119 246 5 346 119 220 254 -311 -406 -106 256
7521B56m16k41L96K3j5r9q3K59Ok2n03L82K41N2k79O9J29k37K35k59K41K8K79
7544D42n82k10M95l07J83J76k54K99k79l3k17L58L69m83j30J23M9N74n20m14J64
7565a97N26k04j39j94p7J24L43k68LJ1o1k70L31N51K1p55j73Q1L54K10l30l06
7587d19L01J76l49L18L46l74k91L66k14O4N9P6n21K40R11o80K00j46O5J7j90l0
7609g5J97K78m0n55J91J56m08P5j3KK32K38n00j28M25M35q44L0J60J50K67m44
7631a71q6L08j10j45K57j08M50m50j67J72M5R0J66o54K48M71j23p3j76K08j20
7652C2J33k0j42Q7n6m73J54N97j57K58m23j52K38J89j72l27M54j5j29R2K23j63
7674B28o20M91l11L18L26m60O8p4M06l14k01N0L14k31j25K60n5J94j62k49K8K20
$$ plain form
7521 256 -160 -401 -5 18 3 -96 -179 80 86 64 -439 -57 184 236 -43 26 155 -82 153 -106 135 163 442
7544 442 -140 -350 145 -162 21 197 -57 242 -37 -70 -287 71 440 -43 -173 -50 -1 573 53 -361 -197
7565 -197 329 125 -14 -208 -285 -161 182 -86 -83 -72 -133 -403 -72 479 500 -255 -428 -347 7 217 -113 -419
7587 -419 -118 58 -291 27 373 -1 -292 74 -140 -76 -17 59 -462 -222 689 9 209 63 128 145 -45 -75
7609 -75 122 400 360 -195 -4 152 -256 -181 -194 -192 40 278 -222 -350 75 510 -334 -304 -144 6 273 -171
7631 -171 -257 51 -59 -204 53 -55 395 -55 -222 -50 -5 85 251 -403 -155 316 193 120 -56 152 32
7652 32 165 145 3 90 34 -439 -285 312 155 413 -10 -162 76 265 93 -234 220 205 76 168 391 228
7674 228 -392 99 -212 106 432 -28 40 -34 372 58 -143 -93 221 -10 -135 125 70 264 102 -147 -119 101
7696A01n21N18j91k6J10J32M8l15Q8N4k21R0M0K09j18n1J6J9J16l97M65n8L06
7719D14m79P9k24K23Q1k28p4O1qK65j84J75n97M04J22m4k71R6J51k47K14pm1R3
7743b6j30R5kJ57k19RL62j21J9k89L13j02r6q0l36L21O05k37n85K08J60L28k83
7766G1r2l3R9j08J01j23J90N6j57j00L84n28J70M2j63N64j51j52m37M54p1K99
7788C15j49m05M1J82k0K1J47J39m94l47P93N0m32M66j98l31N10M3m71p1L37j64
7810c8k62J15L33n0J45kl86L96k81J80j56qK42j04p7k73K10J86o9n93M70j23%
7833a45P3j40K21m06L30k41n2M42k04K3j37K44J07j30K93l12l49N82j01k47M7
7854a02O3m2Q9L31l24n3m6m7L73k04j70OK83l32R6Q0m9p1J00J12n29L33J47j85
$$ plain form
7696 101 -420 98 -93 -119 -9 123 171 -144 -56 -2 -223 -133 -93 116 -2 -53 -37 -18 98 -299 166 108 414
7719 414 -65 14 -210 13 94 -134 -208 -147 -155 110 -74 101 -496 -92 30 -14 -285 -189 -38 -285 -71 -78 -119 -26
7743 -26 -156 -61 -63 94 -125 -116 246 125 144 -145 168 66 -30 -110 -446 -125 480 243 -342 -134 26 354 71
7766 71 -21 -54 45 -63 38 -85 105 161 4 -96 288 -240 -70 -28 -191 373 222 70 -367 87 16 315
7788 315 166 -239 -198 -16 -36 -15 132 271 -223 -570 223 273 -159 307 109 -222 288 331 -140 -211 126 -38
7810 -38 -300 -185 148 98 243 241 -145 251 -30 150 -6 -14 228 124 47 -226 -16 170 101 -492 -22 -145 -145
7833 -145 -72 -212 9 -397 -67 -308 -360 82 -122 -99 -236 8 115 -15 278 -34 -383 199 98 -149 -102
7854 -102 -39 -81 8 339 15 -38 -84 -131 242 38 -132 -126 157 -175 -79 1 -48 -119 -19 93 -436 -103 44 -141
7878a41J18K30k16J99J1m12j36K93L04q0k21L36o59O09Qj03Mp5m3j29N68m30k76
7901b41N03k60qJ85K50o61L56o0K45m09J65j43P0j4O1K09O7P4m36J72J34m14Q7
7924f8K48J6j0j41m38P2M01P8l17J69k6K42k91P7j2r8J02j72k3K49J82l30O9K93
7948B72j75n6K17l12J4J77K1m01R1L75k59j77O64n25P4j85J10o7M75J45m31k66
7970b19L44j61K23p8n76N62L6k96j52L89q1J01j2o8l36K28K14n49L34J74mj5j97
7993a39P8n2K14k07k17L98J01k06k13M27k63J4J74l40K8M26l27J08J87l44K23
8014G0k66L53n5j23k5m9K54J20k28m16K93l4K55k1q0j32M0J14m38L88K9R4k21
8037g8O7P4k63N79k59l99J68P02p41j03K57M3j90L07k40j47J54K15n33L38L83
$$ plain form
7878 -141 -23 207 -9 190 201 -211 -347 -54 250 170 -51 285 -374 235 243 140 144 69 26 -103 465 35 -241
7901 -241 262 2 -6 179 429 -232 124 64 309 -100 65 -78 -8 -22 39 248 315 389 -47 125 259 -155 -68
7924 -68 180 196 186 45 -393 -321 80 158 -159 10 -16 226 -65 12 0 -98 4 -168 -191 58 240 -90 -21 272
7948 272 97 41 258 -54 -40 137 158 -243 -152 223 -36 -213 451 -74 0 -185 -75 -142 333 478 47 -219
7970 -219 125 -36 187 109 -467 95 131 -165 -317 72 -9 92 80 12 -324 -96 118 -431 -97 77 73 58 -139
7993 -139 -61 -113 101 -106 -323 75 176 -30 -243 184 -79 -65 109 -231 -203 223 -104 4 191 -153 70
8014 70 -196 157 102 -21 -46 -95 159 279 51 -365 -72 -106 149 128 48 -84 -44 70 -368 20 49 143 -78
8037 -78 -11 63 -200 379 120 -279 -111 591 -150 -253 4 47 -143 164 -76 -223 -69 146 -387 -49 334
8058C34l31j46K37J09k98M07n22J63R2L5l65K7M74m32K55J46l70R9m6K67o7J29
8080A97k97J49l82N10J24r7k88k69L48J18l29j88M04r9o4nO80l41J00jj83m26
8102c39O92m49l17L07K91n0j39M8j11L7jk06J48J64j72O3K16m11p3N35j61k07
8124a35J82K30l77K61k1l19K05K7n6l45N35M7m65O20j39l11l88L91K57j37L09
8145C71n87J53L26j24m80K98M4K3j60J53j65R5L36m84M5N50m52R9k79M89j17L1
8167A65O8m25N9M78n33J0L68k51no0K86j29K30m48o%L67k61l22J55L76K79m41
8190d0J25
$$ plain form
8058 334 3 -143 94 203 -95 312 -210 -47 45 80 -285 -258 216 -216 39 185 -185 -86 -132 135 68 197
8080 197 -100 49 -333 177 301 204 -84 -353 -5 113 -216 -404 0 -99 -163 -168 512 171 271 270 87 -339
8102 -339 353 -96 -413 -106 185 135 -4 44 -67 -30 -31 -237 -89 75 -97 -34 182 -229 -302 233 72 -135
8124 -135 47 277 -100 161 140 -179 26 53 -3 -348 187 234 -231 389 250 -61 -449 -58 199 62 371
8145 371 -216 -63 263 139 -341 -43 1 24 -136 17 -148 -53 283 -201 -156 394 -58 41 -238 251 134 165
8167 165 233 -192 -133 345 -188 -178 190 -61 -66 -126 160 31 261 -187 -193 -193 174 -87 -409 -254 122 401 -40
8190 -40 85
8191H5
$$ Imaginary data points
##PAGE= N=2
##DATA TABLE= (X++(I..I)), XYDATA
0@%%%%%%%%nJ3j6J6j6K4l2L3m1M9n7P0q3R7j13J28j45J69j93K18k49K80l14L53
32A86l95M42m94N50o11O79p53Q35r25J021j130J255j389J542j717J911k132K394
50A269k704L074l527M100m851N876p375R778j4244K5290r8747j91734J72423J45229
64D3857l9184j30327n3397M9806R2509k9713p1618N2631O1409j02077o8025J14192
76g9937J21571l4115j26419p3125J15124J88493k7595j97489k1646J57006P1034
87I2902n0083m3117N467M7053J6441n3878J7685J18591j1784j55073j8194J54134
99A20144Q9571o8315j33382m1085J33427J23957r3021j37854M2987Q9246j8655
110A07020l8305J0352K1324N8n8758m8088R6392J10022j01068j60429M1824J50244
$$ plain form
0 0 0 0 0 0 0 0 0 0 -5 8 -8 8 -8 16 -16 17 -24 25 -32 38 -45 52 -61 67 -78 91 -102 116 -133 147 -167 186
32 186 -209 233 -261 289 -322 357 -396 439 -486 535 -595 660 -729 813 -904 1007 -1125 1269
50 1269 -1435 1639 -1888 2212 -2639 3237 -4138 5640 -8604 16686 -82061 -273795 -101372 43857
64 43857 4673 -125654 -179051 -129245 -36736 -66449 -138067 -85436 -24027 -126104 -194129 -79937
76 -79937 41634 7519 -118900 -192025 -76901 111592 83997 -113492 -135138 21868 92902
87 92902 42819 -298 5169 52222 68663 14785 32470 151061 139277 -15796 -33990 120144
99 120144 209715 141400 8018 -33067 100360 224317 131296 -6558 36429 125675 107020
110 107020 68715 79067 100391 100449 41691 -6397 89995 200017 98949 -61480 -19656 130588
122A30588M2398q7357j13026r6J26896M7982j05320m5071P1047N026o1032Q190
134B0225N8235K0459n1221r9634j152J50732N9499j56781j15030Q1544J09573
145G6449M74p8996p3880K6819P9801k4707o9058M2356M7694p7085o3434N8712
157e4855Q1683M851q9939r7224N9185J57704m067j49001l8640R0059N6367j3093
169C030m0379j9294M0704J9661n4950Q885J02935j643j18149k8100R6825Q3382
181I2907j5363j08190o6446R8748J16010n7999j03426J8373N3822k595j7624m463
193C754J4678J5685n3881o0621P6958J01892p0189j31294M357J00061O0017m1879
205A9538j09086k6223J02948M6803p7997l2287M8533n86m1574J066L8553L8625
$$ plain form
122 130588 172986 85629 -27397 -27493 99403 147385 42065 -3006 68041 73067 12035 20225
134 20225 78460 98919 47698 -51936 -53088 97644 157143 362 -114668 -33124 76449
145 76449 76923 -2073 -75953 -49134 30667 5960 -63098 -20742 26952 -50133 -113567 -54855
157 -54855 26828 31679 -58260 -155484 -96299 61405 57338 -91663 -130303 -40244 16123 3030
169 3030 -37349 -56643 -15939 3722 -51228 -42343 60592 58949 -59200 -87300 9525 92907
181 92907 77544 -30646 -97092 1656 117666 59667 -43759 -25386 28436 25841 8217 3754
193 3754 18432 34117 -19764 -80385 -3427 98465 28276 -103018 -98661 1400 61417 19538
205 19538 -89548 -115771 -12823 33980 -44017 -76304 -27771 -28357 -69931 -68865 -30312 8313
217H313k0416r7560k0306J30492P1365j05547r4818M0292Q5789L5813m5438p2960
229h4981J9400P4645j7614n1145M3794M4001n3480n0594K8891O8427L8698o0130
241h8j04478K9647J36274J5926j06886m2959M7246M8332J0445l5973k7080L9158
253I564J6685n8246K088Q8566Q713q8153l9582N0582P8767K1361q8412q0601O8976
266i692J02543k9812p4505L484L0760R898n390j3794J6606L0777m5856o4829N8626
279H816R4178l4887r7329k1536N9689P1815n488r4522l9550P9252M2926n2183
291A1181k1729K9067j557k4679q737J6685M6647J874q9426l7235R7771O9213o2729
304B6346p6476J224N5369N1187k3129o9849P081N8516j4833l8003L3807L2592
$$ plain form
217 8313 -12103 -109663 -129969 523 71888 -33659 -128477 -88185 -2396 33417 -12021 -84981
229 -84981 -65581 9064 -8550 -59695 -15901 28100 -25380 -75974 -47083 21344 60042 -88
241 -88 -104566 -74919 61355 77281 -29605 -72564 -25318 23014 33459 -2514 -29594 9564
253 9564 26249 -31997 -29909 58657 67370 -20783 -60365 -9783 68984 90345 1933 -78668 -9692
266 -9692 92851 63039 -11466 -7982 22778 32676 27286 13492 30098 60875 15019 -49810 8816
279 8816 102994 68107 -29222 -50758 8931 80746 75258 -19264 -58814 20438 63364 11181
291 11181 -10548 18519 16962 -7717 -16454 231 46878 48752 -40674 -77909 19862 89075 26346
304 26346 -50130 -48906 6463 57650 34521 -35328 -28247 30269 15436 -22567 11240 43832
316D3832l3356l9341K02M6475N6084l3907r9678M411J03873K6516o5829m1915
328c2633J1552L7283K4933k9862k9707L4007J2691n3402l175O7264J3733n6948
340d264m3143J2091O4896M2804o5184q0914M0413P8543j1330m5951q138J0485
352i692J4538J87k0659J5591L7766l8089o2589L9196P7671r535o3936l5703K6312
365b8942P0957J7655p5345m0597N7114L4014l1674j1416J6524J171j0374j6418
377a7331K276N0961J7920p5808m3956O8824O0943k9155n5754k2228L2516N6143
389D5351j0329o1610L750M4498j4371k9326K4805K5060j4989l0119k1596K9630
401i246O3832j5307q7536j0355P4597L0066l3886l6312r350L1044L0691k6822
$$ plain form
316 43832 10476 -28865 -28663 17812 73896 39989 -59689 -55278 48595 75111 9282 -32633
328 -32633 -21081 16202 41135 11273 -18434 15573 28264 -25138 -28313 38951 52684 -4264
340 -4264 -47407 -35316 29580 72384 7200 -73714 -33301 45242 33912 -12039 -20177 -9692
352 -9692 4846 5033 -15626 -35 37731 -358 -62947 -23751 53920 44385 -19551 -55254 -28942
365 -28942 42015 59670 -15675 -56272 842 34856 3182 -8234 8290 9461 -913 -17331
377 -17331 -15055 35906 53826 -21982 -65938 2886 63829 34674 -21080 -43308 -10792 45351
389 45351 35022 -26588 -22838 21660 7289 -22037 2768 27828 12839 -17280 -38876 -9246
401 -9246 54586 39279 -48257 -58612 15985 46051 12165 -24147 -33497 -2453 28238 1416
413A416k6475L3848J1884m6405p264M8929K0580k7335m2037j4095N3380N5520
425F1946m4093p2443K0854N8050K280k5162j5175l8J9572J740k7348J3218M1698
438C5099k6941n6800J8331N6990J0121l5858m4935o03O1904L0342n8231l9145
450d9726L5859K4458j6125p312L270L220K454k2283j2707M6278K7726n6524m4172
463f5584L8492M6753o85l4418l6773J2794N4229J297m8254k15L1450r790j7385
476b8089J4045J4985K150j5266l2614J2311O1218K505o4675j8641M4381K9231
488B1541m841k6070k3568K1675L3696j8736k2053K7700J0253l3452p024K8454
500G575J9369k688l1716l0182L5495N5064k3102n5094M579L2986J0606n639j7729
$$ plain form
413 1416 -25059 8789 20673 -25732 -32996 15933 36513 9178 -32859 -46954 6426 61946
425 61946 17853 -54590 -33736 24314 26594 1432 -13743 -13781 5791 7531 -19817 -6599 35099
438 35099 8158 -48642 -30311 26679 36800 942 -43993 -44596 17308 47650 -10581 -49726
450 -49726 -13867 10591 -5534 -12846 -9576 -6356 -3902 -26185 -38892 7386 35112 -21412 -65584
463 -65584 -27092 19661 18976 -15442 -52215 -39421 14808 16105 -32149 -32364 -914 -10704 -28089
476 -28089 -14044 941 3091 -12175 -44789 -32478 28740 31245 -33430 -52071 -7690 21541
488 21541 16700 -9370 -32938 -11263 22433 3697 -18356 9344 19597 -13855 -20879 7575
500 7575 26944 24256 -7460 -37642 -2147 52917 29815 -25279 -20700 12286 22892 17253 -476
513d76r555K0378L793k7338R818L6476j6911m2791N498L3120J8393j0562m1050
526b1207j7537M7387L2722l7500k9185J8854J3367k922o95m210M490J1148k1022
539f310j7994L8785K9408l6738l4090J7032L0586J6066j4342l8671J073M5650
551C0455O297l3303J080J8575p914q051O092P281J1553n843l6232P32N1399R420
565E1541m4737j9505J8976K1897J0658j8663k9012J4488K7988j6802j6919K2161
577B2071O986k3821q355J1396J7315J2504k4047l7523K1343M7800j0118l7975
589b424m519J4802J2238M894j8003j1832K0271K290k8111O808L1155r278l1337
602a3046o059J3190K2092N259l7281k7561L2895K8028k4199k1237M951L894L022
$$ plain form
513 -476 -10031 10347 14140 -13198 -3380 33096 16185 -26606 -21108 12012 30405 19843 -21207
526 -21207 -38744 8643 41365 3865 -25320 -6466 6901 3979 3284 -926 3564 14712 -6310
539 -6310 -24304 14481 43889 7151 -26939 -9907 20679 36745 22403 -16268 -15195 30455
551 30455 36752 3449 4529 23104 15190 7139 13231 20512 32065 26222 -10010 -9278 42121 51541
565 51541 6804 -12701 6275 28172 38830 20167 -8845 5643 33631 16829 -90 22071
577 22071 29057 5236 -3119 8277 25592 38096 14049 -23474 -2131 45669 35551 -2424
589 -2424 -6943 7859 20097 24991 6988 -4844 15427 17717 -10394 -3586 27569 18291 -13046
602 -13046 -19105 -5915 16177 21436 -15845 -43406 -10511 17517 -6682 -27919 -22968 -19074 -16052
615a6052p56j1948N392J4916k1561k3304K7682K7343k0638k5699j128J6227K5449
628d077r28l6447o248L6407P977k0569K378J0638l384L13p7R82K0427M256l2913
643b1265o244L9485J5453k2840j6218N47J5591K1916j0107k9171R076K2363j2598
656E988j1211J5018L084j2108o609m422J0265K2224j4593l8046P374L4509n48
669A0925k0808r776j916J2988J2955j6082j3713J8947L255k2506M013K2679j468
682e07j3643r286j500K1851J9743k5141k6495K0813K3003p669q351j821j508J0523
696A2M202j3955N794J8736j5298k0672J7805K0418n880j2458j1197J703K7024
709A6234Q922k9434j0142K2702O151r892K901P71k235N480m986n409K0530J0009
$$ plain form
615 -16052 -16808 -28756 -23364 -8448 -30009 -53313 -25631 1712 -18926 -44625 -45753 -29526 -4077
628 -4077 -5005 -41452 -47700 -11293 -3316 -23885 -21507 -10869 -14253 -13940 -14017 -13035 7392 11648 -21265
643 -21265 -27509 11976 27429 4589 -11629 -11082 4509 26425 16318 -12853 -3777 18586 5988
656 5988 -5223 9795 12879 771 -5838 -10260 5 22229 7636 -30410 -23036 11473 10925
669 10925 -9883 -19659 -21575 -8587 4368 -11714 -25427 -6480 -3225 -25731 -21718 961 -507
682 -507 -14150 -23436 -24936 -3085 16658 -8483 -34978 -14165 8838 1169 -7182 -9003 -10511 12
696 12 4214 -9741 -3947 14789 -509 -21181 -3376 17042 11162 -1296 -12493 -10790 16234
709 16234 25156 -4278 -14420 8282 14433 4541 7442 8213 5978 11458 6472 1063 21593 31602
723C1602k7645j0762K5665J3798o481j0190j1285P350K5431l767k3932O298J5990
736C2072j0386n225J0724N14k812l397j2935M660K5903o898l2760J02K1178K964
750B3704o935j0816j1272J0066J3471j5131j2086J5135N03j9514J027J2522J006
763A680l383j1593j3603J7274K2795j7822k2807J0352J3630p36j036n852n560
776a6661J2478L487j5081O672J9145j1965j6890R767J3082L694k580j5948o630
789a7430K4408J2801k2185r571J3360K182l068K698m583l90P912r651j0271J8991
803E203J1219k1431j2116J1352Q922M171m795j9143O07K3819q94j9697M538R250
817A005o578j195M370j463N560L74j8105O54K6006J050k3145l805J0073O190N973
$$ plain form
723 31602 3957 -6805 18860 32658 26177 15987 4702 12052 37483 33716 9784 16082 32072
736 32072 21686 16461 27185 27699 24887 21490 8555 13215 39118 32220 -540 -438 20740 23704
750 23704 16769 5953 -5319 4747 18218 3087 -8999 6136 6639 -12875 -11848 674 1680
763 1680 -1703 -13296 -26899 -9625 13170 -4652 -27459 -17107 -3477 -4213 -5249 -11101 -16661
776 -16661 -4183 -696 -15777 -9105 10040 -1925 -18815 -9048 4034 7728 5148 -10800 -17430
789 -17430 6978 19779 -2406 -11977 1383 3565 497 3195 -1388 -1778 6134 -3517 -13788 5203
803 5203 16422 -5009 -17125 -5773 3149 7320 2525 -16618 -16011 7808 6914 -12783 -8245 1005
817 1005 -5573 -6768 -2398 -3861 1699 2073 -16032 -15378 10628 11678 -11467 -15272 -5199 991 6964
832F964q005j5949Q787J5855j1930q927J2982Q39j1574k63L666K879Q026r383
846f033j9904J1034K3049r237j6790K367M744M025O082r068q722J3569L864j4902
860a5922M774J5869o643j0559K978M189R152P321j6149j2639K0086J4470j2939
873C988o229N145l95M502M519q081J022J1539r291j1586J5630J0753j2565p756
887A195N37L364J1559J559k1099m169J9620M24j2647L177K075n272K631n86m933
902b565Q954L552j9362l113K0293L053j3146l785j129M518J2860m641j7098O876
916d733J3077r350m536R932o23n655J546k861K611J4062o131j9836P465J8016
930A2984l697q792p88k732O012R252r678q537J2597J362j3388M375J1290m649
$$ plain form
832 6964 -1041 -16990 -8203 7652 -4278 -13205 -223 616 -10958 -11221 -7555 -4676 3350 -6033
846 -6033 -25937 -14903 8146 -1091 -17881 -15514 -10770 -6745 -663 -9731 -18453 -4884 -1020 -15922
860 -15922 -11148 4721 -1922 -12481 -9503 -5314 3838 11159 -4990 -17629 2457 16927 3988
873 3988 -2241 2904 2509 7011 11530 3449 4471 16010 6719 -4867 10763 21516 8951 1195
887 1195 1732 5096 16655 18214 -2885 -7054 12566 12990 343 3520 5595 323 2954 2368 -2565
902 -2565 6389 9941 -9421 -12534 7759 10812 -2334 -6119 -7248 -2730 10130 5489 -11609 -4733
916 -4733 8344 -1006 -5542 4390 3767 -1888 -342 -3203 -592 13470 7339 -12497 -5032 12984
930 12984 9287 495 -293 -3025 2987 12239 2561 -5976 6621 7983 -5405 -1030 10260 5611
944E611n876j830l450R743J0763j4867j4484J4002R356p486k596k11l754O505
958A426L170j0504L119J1749j0514j1120J2228Q630o158l834m761j580J5316N055
972A2222j8674m124J5360J08o716L616j001k559N493l588o109J2445N405j7920
986f042m053J5184L405m599l066p691L225J5189m010j5570N756R943q412j849
1000b590O321k362m04J217q696J671J6658m352j8450L355J2663p59k043l266q373
1015i410P457J0654j0134p163J1841M18j0645L515O468k001J367m349r445J0517
1029i10J4109j2224j2484Q293O586k216J720m835n181R667K766j1542L339J1653
1043H741q645q745P210M172J65J181r453n684J5788O479j5134m442R239m62j458
$$ plain form
944 5611 -265 -2095 -5545 4198 14961 94 -14390 -388 8968 1482 -1114 -1325 -5079 1426
958 1426 4596 -5908 -2789 8960 -1554 -12674 -446 8184 2026 -1808 -6569 -8149 7167 12222
972 12222 -6452 -10576 4784 4892 -1824 1792 791 -1768 3725 137 -5972 6473 11878 -6042
986 -6042 -10095 5089 8494 3895 829 -6862 -3637 11552 7542 -8028 -2272 7671 -741 -2590
1000 -2590 3731 1369 965 2182 -6514 -4843 11815 7463 -10987 -7632 5031 4272 2229 -1037 -9410
1015 -9410 -1953 8701 -1433 -8596 3245 3663 -6982 -3467 3001 1000 2367 -1982 -11427 -910
1029 -910 13199 975 -11509 -3216 3370 1154 2874 -1961 -7142 2525 5291 -6251 -2912 8741
1043 8741 96 -8649 -1439 2733 2898 4079 -5374 -11058 4730 11209 -3925 -8367 872 410 -1048
1058a048K854n315p39P944n948q185J2669N734j3925l889P962J709K499q05j2306
1073a0789J056J6042k670j2549M522N135n746J722K578l888L678L129j1522M39
1087h863J6239k671j3870J886N836Q42M468m152j0212O967J0569q927m823R865
1101C154j712p136L826J969q31N331m466j1441R361J2701r139q523N070J544J169
1116H77M460o082n793R771J282j0421M799Q955p562n301M904J54L232M481j0719
1131b963o863J4084N744j1634j149N333k520J913L131o572J058Q506p905o378
1145f215J1930M138j0023j863L250M40O110N75j3614J286J3289k930q816N289
1159B846J379m504L380N03m608O380K366j2805O81J3708k160r318J258M2J345
$$ plain form
1058 -1048 1806 -3509 -4248 3696 -2252 -10437 2232 7966 -5959 -9848 -1886 -177 2322 1517 -10789
1073 -10789 -9733 6309 3639 -8910 -4388 747 -4999 -3277 -699 -4587 -909 2220 -9302 -8863
1087 -8863 7376 4705 -9165 -7279 -1443 -601 3867 -285 -10497 -3530 7039 -1888 -6711 3154
1101 3154 1442 -5694 -1868 101 -730 4601 135 -11306 -1945 10756 1617 -6906 -1836 -292 877
1116 877 5337 -745 -6538 3233 4515 -5906 -1107 7848 286 -5015 -111 43 3275 7756 -2963
1131 -2963 -9826 4258 10002 -1632 -2781 2552 32 1945 5076 -1496 -438 8068 163 -6215
1145 -6215 5715 9853 -170 -2033 1217 1657 7767 8342 -5272 -3986 9303 6373 -2443 2846
1159 2846 4225 -279 3101 3604 -1004 5376 7742 -5063 -4382 9326 7166 -2152 -894 -852 493
1174D93P650m312j0921O963Q096q673j759P567l213l419L546k489N16Q724n057
1189C712j1914P687J1101o570m289J901j790L692O175q057m560R885K0r352N016
1204B657O260n435j795J236l283N780O212j1355p185J1598L742p743j10j7l250
1219b688N110J647q959K559P950q632n684R018K034o299K29k294k556R735J199
1234B369j3231O6J0891l147m610M171k060k275N698k489n320Q323K731j1681R77
1249i587R951j889l137J361m323J647J0224m103r651O851N648o996O67N015m210
1264b532J60L806n555R55R728m813j0161O836O576m606j06J09n050M732O668q086
1280a339l302Q678j594o974N468L068m530J835m46n666O318O824r886n069Q799
$$ plain form
1174 493 8143 3831 -7090 -127 7969 -704 -2463 5104 1891 -1528 2018 -471 45 8769 3712
1189 3712 -8202 -515 10586 4016 -273 1628 -162 3530 9705 1648 -2912 6973 6993 -2359 2657
1204 2657 8917 3482 1687 2923 -360 5420 11632 277 -6908 4690 8432 689 579 562 -2688
1219 -2688 2422 4069 -4890 -2331 5619 -3013 -8697 321 2355 -3944 -3715 -6009 -8565 1170 2369
1234 2369 -10862 -10796 95 -3052 -7662 -3491 -5551 -7826 -2128 -4617 -9937 -1614 1117 -10564 -9587
1249 -9587 364 -1525 -4662 -3301 -7624 -5977 4247 144 -9507 -2656 2992 -4004 -3337 1678 -2532
1264 -2532 -2372 1434 -4121 -3166 6562 1749 -8412 -1576 5000 394 288 397 -4653 79 6747 -1339
1280 -1339 -4641 4037 2443 -4531 937 4005 -525 1310 864 -4802 1516 8340 -1546 -6615 2184
1295B184R00m171K434j511m263O717P90q066L880O064q012l119P466q01k728K412
1311A76m462l053R848J082j0784J764O779l747q88L981m110q23O050m120l791
1326f098Q823R66r498K322O476k237L08J734o218K246R528m854o697O629K488
1341E918n540K784K859m124K216K867o988J564R729n273p475N730K451k980K610
1356F348j595o356N597N029q326r44P322l666m756M929j18k618L637k218o687
1371d422O618N904q742l029O002q52j452L698m208l111P287o44p136M374N048
1386E335p461q62M831k455N73L731o749k885R305O81q662J943M037l995K001K201
1402A569o178J354O043n780l673Q124L3p108K330K332k752L891Q54p950K418Q174
$$ plain form
1295 2184 3084 -1087 1347 -164 -4427 2290 3080 -4986 -1106 4958 -3054 -6173 1293 492 -2236 176
1311 176 -4286 -7339 2509 3591 -7193 -5429 1350 -2397 -3285 696 -3414 -4237 1813 -2307 -6098
1326 -6098 2725 3691 -5807 -3485 2991 754 1062 2796 -3422 -1176 8352 3498 -3199 3430 5918
1341 5918 378 3162 6021 1897 4113 6980 -8 1556 11285 6012 -1463 4267 6718 3738 6348
1356 6348 4753 -1603 3994 9023 697 -247 7075 3409 -1347 3582 3464 846 4483 2265 -4422
1371 -4422 2196 8100 -642 -3671 2331 1479 27 3725 -483 -3594 3693 3049 -4087 287 5335
1386 5335 -2126 -2988 1843 -612 -39 3692 -3057 -5942 3363 4044 -4618 -2675 1362 -2633 -632 1569
1402 1569 -4609 -3255 2788 -2992 -6665 1459 1492 -5616 -3286 -954 -3706 185 1039 -6911 -4493 3681
1418C681m367m605N548l21l420M127K32m393M702K548p649K368P612m351m122
1433b410M407q39j182N470k925o325O241L886p112P68N023m028j583L758k926
1448B23j446N240l205o575O238L354o642l68L559l836J358M060n552k327O940
1463A021k229n550M939K302n965J830K832m009K534M314o499j848Q212r54n489
1478d559M155M49l868M439J550n512K400N166n858j216O732j522m636L900o15
1493A005k949N446M39p315K434N702m982j635M802k940k122M662k142l632N479
1508B252K19p043L018M947m827j154L641l168m16N923l642m469N618J346n295
1523c050K410L193m323N09L563l607j89N882l830m895O306J766m880K180J191
$$ plain form
1418 3681 -686 -5291 257 -64 -3484 643 875 -3518 1184 3732 -3917 -1549 6063 1712 -2410
1433 -2410 1997 1158 -24 5446 2521 -3804 2437 6323 -789 -21 5002 974 -609 3149 223
1448 223 -1223 4017 812 -5763 475 3829 -2813 -3181 378 -3458 -2100 1960 -3592 -5919 1021
1463 1021 -1208 -6758 -1819 483 -5482 -3652 -820 -4829 -2295 2019 -4480 -6328 1884 930 -4559
1478 -4559 -404 45 -3823 616 2166 -3346 -946 4220 -1638 -2854 3878 2356 -2280 1620 1005
1493 1005 -1944 3502 3941 -3374 -940 4762 -220 -1855 2947 7 -2115 2547 405 -3227 2252
1508 2252 2471 -4572 -1554 3393 -1434 -2588 1053 -2115 -2531 3392 -250 -4719 899 2245 -3050
1523 -3050 -640 2553 -1770 -1261 2302 -1305 -1494 4388 558 -4337 1969 3735 -1145 1035 2226
1538B226l769K504L884n777o47N905l139l679M896L92m051L058K5m591L775L499
1554D511o625o04N895k211l102L667j360k927M614q9n541L653L558n885J54M952
1570B660k750j818L961k809k824O234m25o515L241M042m393N28L046l892L4M849
1586C169l564k734N649k96n741L313K889l845J343K342m698N47O165l986l601
1601c048N243M1l841L288O76m209K973K294n454J205N776l756l349M694m19k870
1617g56L749q42m359L950K719n464M06M637l412j681M176j956k382M376j359m710
1633b908M529K288n250N8L990l414j27L447l389k593N663j208m706M136J637m845
1649b692J568K759l541L65L869l819k174N491o41m163L019J326l943K543K264
$$ plain form
1538 2226 -1543 961 4845 -932 -1579 4326 1187 -2492 2404 2796 -1255 1803 1828 -2763 1012 4511
1554 4511 -2114 -2718 3177 966 -2136 1531 171 -2756 1858 1769 -3772 -119 3439 -2446 -2292 2660
1570 2660 -90 -1908 2053 -756 -3580 2654 2229 -4286 -1045 2997 -1396 -868 2178 -1714 -1680 3169
1586 3169 -395 -3129 2520 2224 -3517 -204 2685 -1160 183 2525 -2173 -1626 4539 553 -3048
1601 -3048 2195 2236 -1605 1683 2359 -1850 1123 3417 -2037 -832 4944 1188 -2161 2533 2114 -756
1617 -756 2993 2151 -2208 1742 4461 -1003 -597 4040 628 -1053 3123 1167 -1215 3161 1802 -2908
1633 -2908 1621 3909 -1341 -1283 2707 -707 -834 2613 -776 -3369 2294 1086 -3620 516 2153 -2692
1649 -2692 -1124 1635 -1906 -1541 2328 -1491 -3665 1826 1185 -2978 41 1367 -2576 -33 2231
1664B231m523Q17M660m277j653N082j380l840L580L97l467L060J629n020J033
1679a671M322l779j764M740k194k850M283p77l596L400J212n029K185L797l940
1694a661q49L668k487j608M405j617l865M099J536m838K297K662m052K82M006
1709A978l185j214M401j862m049M440J314m135J828J834l482J194L320m099p17
1724b434M119j658l368M018N01m131K325J324l797K084L048m539j189M975j819
1739e41k672L243m08l035L455Q24m360K203L432m374p60M446j713j608L134j479
1755b13k254M520N74n172K202L485l246k82L331k402p50L399j860k899M870P6
1771C379m863K485K751l207J69J829l388N03M261k932l053L978J38l316J975J321
$$ plain form
1664 2231 -2292 -1475 3185 -1092 -2745 2337 957 -2883 697 1094 -2373 687 2316 -2704 -1671
1679 -1671 2651 -1128 -2892 1848 -346 -3196 1087 310 -3286 114 1326 -3703 -1518 2279 -1661
1694 -1661 -2510 1158 -1329 -2937 1468 -149 -4014 85 1621 -3217 -920 1742 -2310 -2028 1978
1709 1978 -1207 -2421 1980 118 -3931 509 1823 -2312 -484 1350 -2132 -938 2382 -1717 -2434
1724 -2434 1685 27 -3341 677 1178 -2953 -628 696 -3101 -1017 2031 -2508 -3697 1278 -541
1739 -541 -3213 30 -378 -3413 42 866 -3494 -1291 2141 -2233 -2993 1453 -260 -1868 1266 -213
1755 -213 -2467 2053 2627 -2545 -343 3142 -104 -386 2945 543 -207 3192 1332 -1567 3303 3379
1771 3379 -1484 1001 3752 545 714 2543 -845 -342 3919 987 -2066 1912 2050 -1266 709 2030
$$ [...]
8191a55
##END NTUPLES=NMR FID
##END=
