##TITLE=1H_CG-1117-7
 CDCl3, 8 sc, 
 20.8.2019
##JCAMPDX= 6.0         $$ Bruker NMR JCAMP-DX V2.0
##DATA TYPE= NMR FID
##DATA CLASS= NTUPLES
##ORIGIN= UXNMR, Bruker Analytische Messtechnik GmbH
##OWNER= root
$$ XWIN-NMR		Version 3.5
$$ Tue Aug 20 13:54:21 2019 Russian Standard Time (UT+4h)  she@DPX200
##.OBSERVE FREQUENCY= 200.13155
##.OBSERVE NUCLEUS= ^1H
##.DELAY= (6, 6)
##.ACQUISITION MODE= SIMULTANEOUS
##.ACQUISITION SCHEME= undefined
##.AVERAGES= 8
##.DIGITISER RES= 18
##SPECTROMETER/DATA SYSTEM= spect
##.PULSE SEQUENCE= zg30
##.SOLVENT NAME= CDCl3
##.SHIFT REFERENCE= (INTERNAL, CDCl3, 0, 15.7039)
##AUDIT TRAIL= $$ (NUMBER, WHEN, WHO, WHERE, WHAT)
$$ ##TITLE= Audit trail, XWIN-NMR		Version 3.5
$$ ##JCAMPDX= 5.01
$$ ##ORIGIN= Bruker BioSpin GmbH
$$ ##OWNER= she
$$ F:/spectra/data/she/nmr/H-F/1/audita.txt
$$ ##AUDIT TRAIL=  $$ (NUMBER, WHEN, WHO, WHERE, WHAT)
(   1,<2019-08-20 13:52:46.81 +0400>,<she>,<DPX200>,
      <created by zg, POWCHK disabled, PULCHK disabled
       configuration hash MD5:
       00 E9 B6 7A A2 85 ED C7 34 08 36 98 17 FE 4E 26
       data hash MD5: 16K
       CE E2 26 A9 1C 7A 5E 79 A4 E0 44 98 03 FF 6C 4E>)
$$ ##END=
$$ 
$$ hash MD5
$$ 80 B4 51 38 22 A6 FD 09 E7 40 48 C0 22 01 DB 62
##$RELAX= 
##$RELAX= 
##$RELAX= 
##$RELAX= 
##$RELAX= 
##$RELAX= 
$$ Bruker specific parameters
$$ --------------------------
##$DU= <F:/spectra>
##$EXPNO= 1
##$NAME= <H-F>
##$PROCNO= 1
##$TYPE= <nmr>
##$USER= <she>
##$AMP= (0..31)
100 100 100 100 100 100 100 100 100 100 100 100 100 100 100 100 100 100 
100 100 100 100 100 100 100 100 100 100 100 100 100 100 
##$AQSEQ= 0
##$AQ_mod= 1
##$AUNM= <au_zg>
##$AUTOPOS= <>
##$BF1= 200.13
##$BF2= 200.13
##$BF3= 200.13
##$BF4= 200.13
##$BF5= 200.13
##$BF6= 200.13
##$BF7= 200.13
##$BF8= 200.13
##$BYTORDA= 1
##$CFDGTYP= 0
##$CFRGTYP= 5
##$CHEMSTR= <none>
##$CNST= (0..31)
1 1 145 1 1 1 1 1 1 1 1 1 1 1 1 1 1 1 1 1 1 1 1 1 1 1 1 1 1 1 1 1 
##$CPDPRG= <>
##$CPDPRG1= <>
##$CPDPRG2= <>
##$CPDPRG3= <>
##$CPDPRG4= <mlev>
##$CPDPRG5= <mlev>
##$CPDPRG6= <mlev>
##$CPDPRG7= <mlev>
##$CPDPRG8= <mlev>
##$CPDPRGB= <>
##$CPDPRGT= <>
##$D= (0..31)
0 1.2 0 0 0 0 0 0 0 0 0 0.03 0 0 0 0 0 0 0 0 0 0 0 0 0 0 0 0 0 0 0 0 
##$DATE= 1566294766
##$DBL= (0..7)
120 120 120 120 120 120 120 120 
##$DBP= (0..7)
150 150 150 150 150 150 150 150 
##$DBP07= 0
##$DBPNAM0= <>
##$DBPNAM1= <>
##$DBPNAM2= <>
##$DBPNAM3= <>
##$DBPNAM4= <>
##$DBPNAM5= <>
##$DBPNAM6= <>
##$DBPNAM7= <>
##$DBPOAL= (0..7)
0.5 0.5 0.5 0.5 0.5 0.5 0.5 0.5 
##$DBPOFFS= (0..7)
0 0 0 0 0 0 0 0 
##$DE= 6
##$DECBNUC= <off>
##$DECIM= 24
##$DECNUC= <off>
##$DECSTAT= 4
##$DIGMOD= 1
##$DIGTYP= 9
##$DL= (0..7)
0 120 120 120 120 120 120 120 
##$DP= (0..7)
150 150 150 150 150 150 150 150 
##$DP07= 0
##$DPNAME0= <>
##$DPNAME1= <>
##$DPNAME2= <>
##$DPNAME3= <>
##$DPNAME4= <>
##$DPNAME5= <>
##$DPNAME6= <>
##$DPNAME7= <>
##$DPOAL= (0..7)
0.5 0.5 0.5 0.5 0.5 0.5 0.5 0.5 
##$DPOFFS= (0..7)
0 0 0 0 0 0 0 0 
##$DQDMODE= 0
##$DR= 18
##$DS= 0
##$DSLIST= <SSSSSSSSSSSSSSS>
##$DSPFIRM= 0
$$ [...]
##$SUBNAM2= <"">
##$SUBNAM3= <"">
##$SUBNAM4= <"">
##$SUBNAM5= <"">
##$SUBNAM6= <"">
##$SUBNAM7= <"">
##$SUBNAM8= <"">
##$SUBNAM9= <"">
##$SW= 24.9336996594482
##$SWIBOX= (0..15)
0 0 2 0 0 0 0 0 0 0 0 0 0 0 0 0 
##$SW_h= 4990.01996007984
##$TD= 16384
##$TD0= 1
##$TE= 0
##$TE2= 300
##$TE3= 300
##$TEG= 300
##$TL= (0..7)
0 120 120 120 120 120 120 120 
##$TP= (0..7)
150 150 150 150 150 150 150 150 
##$TP07= 0
##$TPNAME0= <>
##$TPNAME1= <>
##$TPNAME2= <>
##$TPNAME3= <>
##$TPNAME4= <>
##$TPNAME5= <>
##$TPNAME6= <>
##$TPNAME7= <>
##$TPOAL= (0..7)
0.5 0.5 0.5 0.5 0.5 0.5 0.5 0.5 
##$TPOFFS= (0..7)
0 0 0 0 0 0 0 0 
##$TUNHIN= 0
##$TUNHOUT= 0
##$TUNXOUT= 0
##$USERA1= <user>
##$USERA2= <user>
##$USERA3= <user>
##$USERA4= <user>
##$USERA5= <user>
##$V9= 5
##$VALIST= <valist>
##$VCLIST= <CCCCCCCCCCCCCCC>
##$VD= 0
##$VDLIST= <DDDDDDDDDDDDDDD>
##$VPLIST= <PPPPPPPPPPPPPPP>
##$VTLIST= <TTTTTTTTTTTTTTT>
##$WBST= 1024
##$WBSW= 4
##$XGAIN= (0..3)
0 0 0 0 
##$XL= 0
##$YL= 0
##$YMAX_a= 74467
##$YMIN_a= -132925
##$ZGOPTNS= <>
##$ZL1= 120
##$ZL2= 120
##$ZL3= 120
##$ZL4= 120
##$ABSF1= 10
##$ABSF2= 0
##$ABSG= 5
##$ABSL= 3
##$ALPHA= 0
##$AQORDER= 0
##$ASSFAC= 0
##$ASSFACI= 0
##$ASSFACX= 0
##$ASSWID= 0
##$AUNMP= <proc_1d>
##$AZFE= 0.1
##$AZFW= 0.1
##$BCFW= 1
##$BC_mod= 2
##$BYTORDP= 1
##$COROFFS= 0
##$CY= 11.3945322036743
##$DATMOD= 1
##$DC= 2
##$DFILT= <>
##$DTYPP= 0
##$F1P= 20.1720416913024
##$F2P= 0.152960286110954
##$FCOR= 0.5
##$FTSIZE= 0
##$FT_mod= 4
##$GAMMA= 1
##$GB= 0.15
##$INTBC= 1
##$INTSCL= 1
##$ISEN= 128
##$LB= 0.24
##$LEV0= 0
##$LPBIN= 0
##$MAXI= 10000
##$MC2= 0
##$MEAN= 0
##$ME_mod= 0
##$MI= 1.114404
##$NCOEF= 0
##$NC_proc= 0
##$NLEV= 6
##$NOISF1= 3.799351
##$NOISF2= 2.8
##$NSP= 1
##$NTH_PI= 0
##$NZP= 0
##$OFFSET= 15.70392
##$PC= 1
##$PHC0= -9221.435
##$PHC1= 26.00096
##$PH_mod= 1
##$PKNL= yes
##$PPARMOD= 0
##$PSCAL= 0
##$PSIGN= 0
##$REVERSE= no
##$SF= 200.130013532006
##$SI= 16384
##$SIGF1= 3
##$SIGF2= 2
##$SINO= 400
##$SIOLD= 16384
##$SREGLST= <1H.CDCl3>
##$SSB= 0
##$STSI= 0
##$STSR= 0
##$SW_p= 3612.71676300578
##$SYMM= 0
##$S_DEV= 0
##$TDeff= 0
##$TDoff= 0
##$TI= <>
##$TILT= no
##$TM1= 0
##$TM2= 0
##$TOPLEV= 0
##$USERP1= <user>
##$USERP2= <user>
##$USERP3= <user>
##$USERP4= <user>
##$USERP5= <user>
##$WDW= 1
##$XDIM= 8192
##$YMAX_p= 0
##$YMIN_p= 0
$$ End of Bruker specific parameters
$$ ---------------------------------
##NTUPLES= NMR FID
##VAR_NAME=  TIME,          FID/REAL,        FID/IMAG
##SYMBOL=    X,             R,               I
##VAR_TYPE=  INDEPENDENT,   DEPENDENT,       DEPENDENT
##VAR_FORM=  AFFN,          ASDF,            ASDF
##VAR_DIM=   8192,          8192,            8192
##UNITS=     SECONDS,       ARBITRARY UNITS, ARBITRARY UNITS
##FACTOR=    0.0002004,     1,               1
##FIRST=     0,             0,               0
##LAST=      1.6414764,     0,               0
##MIN=       0,             -132925,         0
##MAX=       1.6414764,     74467,           0
$$ Real data points
##PAGE= N=1
##DATA TABLE= (X++(R..R)), XYDATA
$$ [...]
2326A789k084j816K559J13j753J729L15k399J825J898k064n28J395j173l2K879
2342B653j150k101J329Q70j596J312K12k661J267K768j993j164J632j363r75K556
2358A596k11k451J402J310k129P49R28k591r9L205j406j282J809p83j800K332
2374E79N61l103Q23J976j488N61J493k375o73K759n87j611J754J95j933J939J178
2391B048k784L0J823q37k17J855j141j592K271K80k581J324P52k389J613K377
2407B832k575j186K080j142l85J745p36k195K102J303k831O52O95j759M91K408
2423A499j657j366K019m09j785K019K22k648J156K127k117k2J460j906p2K614
2439A134j495j374J839K76j473K035K72k653L44K469j263k81J203q81j283K711
$$ y = [1789, -295, -2111, 448, 561, -1192, 537, 852, -1547, 278, 2176, 112, -416, 979, -194, -226, 2653, 1503, -598, 731, 1601, 5, 1317, 1529, -1132, 135, 2903, 910, -254, 1378, 15, -960, 1596, 1385, -1066, 336, 1646, -483, 266, 1194, -1397, -1496, 1709, 303, -979, 830, 47, -1753, 579, 1140, -1963, -1140, 836, -652, -91, 1402, -973, -1646, 1113, 526, -1085, 669, 864, -1069, 870, 2048, -736, -706, 1117, 280, 63, 1918, 777, -815, 1456, 1736, -845, 479, 1231, -1158, 455, 2832, 257, -929, 1151, 9, -376, 1369, 633, -1562, 540, 1843, -988, -336, 359, -1400, -909, 1499, -158, -1524, 495, 86, -1699, 320, 542, -2106, -950, 1177, -940, -962, 498, -1408, -1480, 1134, -361, -1735, 104, 380, -1093, 942, 1214, -1439, -1095, 1374, 111, -170, 1033, 152, -1131, 1580]
2455A580l07k354J494Q93j886J385J300k797k46K489j382p37J775q07j624K165
2471I41M67k594P70R83j459N89K138k754n06K327j075j302J723k06j779J683J703
2488A649k550J29J142j114k74K333j700q88K329J39j781J245O42k440J219K177
2504B257k142j29J668j197p78K433o92k397J999L03j069J043Q64k735P44K058
2520B230j635p82J615r83n10J682k04k690J450R09j732P48J198k175l28K189j037
2537e5j497J649J55j853K072L78k291L18J381j482O19J477j420p34J904J97j974
2554a156J190K76k024K344R97k111r7J747j346j36J582j070j312K096M02j800
2570d18J026Q72k728J079K043j941q54J964n41j125J971p25k361J925R06k045
$$ y = [1580, 1273, -1081, 413, 1306, -580, 805, 2105, -692, -938, 1551, 169, -568, 1207, 400, -1224, 941, 1408, -1186, -416, 567, -892, -303, 1835, -919, -1425, 902, -173, -1475, 248, 42, -1737, -54, 1649, -901, -772, 370, -744, -1018, 1315, -385, -1273, 1056, 1195, -586, 659, 1301, -1139, 80, 2257, 115, -14, 1654, 457, -321, 2112, 1420, -977, 1022, 1325, 256, 1299, 2163, -572, 172, 2230, 595, -187, 1428, 445, -65, 1617, 1413, -1277, 173, 1082, -650, 98, 1296, -879, -1207, 982, -55, -1552, 97, 252, -1601, 471, 849, -1442, -1124, 257, -1225, -606, 871, -549, -1283, 621, 818, -1156, 34, 310, -1714, 630, 1627, -484, -581, 1166, -180, -316, 1266, 196, -1116, 980, 1382, -418, 608, 1480, -1248, -169, 1874, -67, -921, 1043, 502, -623, 1348, 623, -1738, 187, 1093, -952]
2586i52R27J088k007J07J928j676j187J654M2j404J869j0k401R95J803j846q7
2603a157J717j665n31K709o17j967J252P08j680J692O11k092K48J868r11o01J542
2620A126j090r61K532k96j726P10Q03j470Q36J196k026j64J817q22r65J635p23
2637D12j760J751Q49j912O35Q41j635L02J823j569j384J731L67j461J867o13k151
2654a907J397J654k127J32J252j467L63J970j341j962K055M14j247J458L76k038
2670a018P80J662j372m28J090r60m46K303k89k506J318R80j366R85O10j856Q9
2687d24K462j284j441J337p47p43J896K81k416P56J426j800M40J046j782j60K054
2704I01q13r85J277n78j476J728Q25k293K98J384p27m6J214j675j187K833q9j704
$$ y = [-952, -25, 1063, -944, -837, 1091, -585, -1772, -118, -76, -1480, 389, 379, -2022, -1027, 776, -1070, -1157, 560, -1105, -1636, 1073, 456, -1511, -259, 449, -1231, 461, 1072, -1020, -772, 1096, 185, -416, 1126, 36, -925, 1607, 1311, -415, 295, 1098, -372, 464, 1660, -366, -530, 1287, 465, -500, 1135, 412, -1348, 403, 1252, -660, -25, 816, -819, -517, 1306, -263, -1647, 84, 451, -1010, 857, 244, -1907, -510, 1144, -983, -851, 401, -1066, -703, 1267, -74, -2036, 19, 433, -814, 644, 1020, -1018, -238, 1424, 52, -376, 714, -246, -692, 1611, 1322, -1184, 134, 1114, -252, 733, 1343, -513, -424, 2038, 754, -687, 650, -97, -840, 1056, 1337, -1079, -323, 1103, -697, -257, 789, -993, -1153, 901, 88, -897, 380, -198, -1674, 54, 879, -1414, -1116, 268, -459, -505, 709, -966, -2153, 680, 591, -1113]
2722a113Q05N99j402J395J135k206k45J880m11p51J775j084j625J872N77j732
2738e31P29Q79j760R00J909j768j120J543l22o71J430n21j892J589Q78j737K63
2755b02O06j309J30K356j568j305J360J88j614J557L72k239J089J286j283K63
2771c13Q28j360o09K138k90j478J080L47j437J491O81k176J48K240r61j016J836
2788A149j137q78K035J75k435J426N44j251Q81P47j428q43K100o13j080J361m28
2805C25j432J398J101k120M9J118j069L13J508j780j130J642K38q39M97m6j709
2822a936J693J162k078k69J833j185k32J680j306r22J620M63j736J109L91j526
2838a239O53J782j462p24J722j020n07J888k84k151J238J286j674O98J010k074
$$ y = [-1113, -308, 291, -1111, 284, 1419, -787, -1032, 848, 437, -314, 1461, 377, -1248, 624, 1201, -531, 198, 1077, -683, 217, 2126, 358, -762, 781, 459, -212, 1218, 697, -1195, 394, 1272, -465, -202, 404, -905, -775, 1581, 13, -1292, 68, 256, -1358, 199, 571, -1668, -579, 707, -576, -313, 515, -845, -1454, 684, 394, -1084, -4, 343, -1094, 397, 1078, -1098, -950, 1290, 329, -687, 1149, 12, -866, 1169, 1344, -1091, 335, 879, -372, 509, 1256, -172, -1015, 1085, 472, -608, 753, 325, -1107, 291, 1392, -728, -679, 439, -630, -317, 1191, -589, -1719, -77, 161, -678, -181, -227, -1936, -243, 919, -1159, -1428, 405, -780, -1012, 668, -638, -1560, 60, 523, -1213, -104, 287, -1239, -586, 1196, -266, -990, 732, -288, -795, 1093, 809, -1342, -104, 1182, -492, 206, 1216, -858]
2854h58K73K032j286j094J605n20j135J701J19k156P67J270r42k21J665j667j183
2871a630K277j79j499R89P1j416J204J151k281K98J545j005l50J580j304r17J933
2888D67n3j530J285M26j626J090J034j396p70J817r67n45K151j157j355J583R06
2905A360j688N30Q22j727K79J947j212r64J316m61n78J299l52j864J115J235j524
2922d67K74Q14j628J14K048p29j376J063m55q74J578J15j685O14J319r30l71J231
2940F55j075p03J978k10j739J116M80j325Q88J091j785j37J917r29p85J407p30
2957A14r42J883M1j620Q87O51j534O91J345j522p10J691p36q77J412m99j419J405
2975B61N21j466K43Q58j245J88J512j704p72J900j80j233J062J42j620R79J273
$$ y = [-858, -585, 1447, 161, -933, 672, 152, -983, 718, 837, -1319, -552, 718, -224, -445, 1220, -447, -1630, 647, 468, -1031, -42, 29, -1387, -183, 968, -1313, -1015, 530, -475, -825, 755, -549, -1466, 467, 414, -1116, 169, 595, -1031, 59, 1093, -303, -1073, 744, -223, -768, 1383, 226, -1129, 454, 1360, -328, 202, 1024, -703, -424, 1523, 311, -653, 663, 202, -376, 923, 571, -1293, -178, 1057, -467, -193, 621, -1007, -893, 1155, 426, -950, 113, -342, -1216, 362, 477, -1208, -594, 725, -205, -576, 655, -420, -1123, 855, 645, -1094, 22, 502, -823, 65, 1156, -629, -766, 1151, 222, -563, 844, 114, -828, 1055, 1096, -524, 363, 1014, -520, 171, 1516, -6, -716, 975, 239, -638, 774, 275, -1144, 261, 782, -684, -441, 417, -828, -640, 872, -832, -1604, 296, 116, -1117, -55, 87, -1533, -554, 719]
2992G19j594l60J474j274k2J691n83j520J147O14j307J165M12j578P80J448j247
3009c5l91R76q29o15J975l87j558P37J238j288J09J138j561k89K092j076q77J352
3027G11m40j439J961Q2k291J103Q23j032l6J238j284p22K048n02j106Q27l11q21
3045a191J210R85k086j20J672j219k3J519q22j462J774L87j442N27Q31j354N10
3062c04J534j379p69J585o91m20J521p69j440J335J090j626J75J047j565L05J827
3079A456j307p86R06j02n24P54N0j647R75J123j322J84O18j128O9J261m34j243
3097a097J051O3q71J013L60k028N00J527j022l12J244r91n40J542j81j334Q89
3114a87L75o37O28Q44j562l02J917q48n74J309q00j061J746J82j437M69Q42q85
$$ y = [719, -875, -1235, 239, -1035, -1057, 634, 51, -1469, -322, 292, -1015, 150, 562, -1016, -236, 1212, -35, -426, 550, -279, -894, 1081, 694, -864, -127, 1111, -177, -68, 1070, -491, -780, 1312, 236, -641, 711, 271, -1168, 793, 875, -1416, -313, 510, -522, -558, 680, -604, -1326, 722, 220, -886, -59, -370, -1191, 19, 1004, -1082, -1202, 470, -749, -772, 747, -75, -1537, 237, 624, -818, -291, 540, -814, -304, 1230, -149, -918, 667, -24, -444, 1077, 308, -1132, 203, 1293, -333, -158, 889, -676, -371, 1456, 149, -637, 269, 167, -357, 397, 447, -1200, -225, 898, -424, -240, 378, -750, -681, 580, 146, -1097, -46, 17, -854, 159, 519, -1509, -1009, 518, -504, -816, 428, -563, -1103, 439, 258, -1076, -187, 188, -449, 179, 1023, -539, -841, 1076, 228, -346, 963, 163, -898, 848, 1030, -407, 62, 904, 19]
3132A9K54R63j675q4J460l04j171J092k51j361J349R63j642j90J340j498L11J315
3150H90j105r57J297M17j487J198j99j142P56J094j513m28J421o08o00J482k41
3167B75j572R70Q04m89r2O01j284L33J758j228p74J299k53r16J424P3j875J064
3185A18Q45p38k27R32j197N8J198m58j291J485m82j037J254L79j296r3J097p94
3203b47j40P36p19n70J365k70j379J010J94j143J271N91j636K12J167p56o96J135
3221A25n60r12J833Jj428J012K18j245N45J514j292n66J345m56n80J259n52p85
3239e24R89N18j073l1J134j172l40K077j273j106J492n2q65J033K00j796M62J083
3257G56j395m8J079q99QR56l80j066R84K16j128R48O40j640K88J262r75m36J160
$$ y = [19, 273, 1236, -439, -523, 937, 633, -538, 554, 303, -1058, 291, 1254, -388, -578, 762, -736, -425, 890, -215, -1172, 125, 542, -945, 253, 54, -1088, -332, 762, -751, -1179, 242, -366, -966, 516, 275, -1297, -327, 477, -12, -104, 497, -787, -454, 1304, 76, -698, 601, 348, -568, 856, 929, -946, 118, 963, 225, -2, 930, -267, -209, 989, 531, -760, 725, 243, -794, 460, 839, -457, -550, 547, -247, -387, 349, -370, -940, 425, 155, -1224, -214, -20, -1163, 108, 699, -937, -725, 442, -314, -1010, 125, -435, -1347, 486, 487, -941, 71, 289, -956, -411, 1103, -189, -755, 590, 134, -446, 813, 261, -524, 465, 983, -90, -121, 1013, -159, -499, 1578, 305, -801, 691, 639, -226, 807, 1007, -789, -327, 756, -639, -687, 392, -507, -499, 457, 77, -989, -5, 211, -917, 31, 671, -969, -681, 581, -394, -830, 330]
3276C30q41l93J221M1j377Q36K36r13J083N46j442k56J641m44q66J179l94p63
3294e76J195J60j310O47P22r48L73P04r91o93J305j32p51R84k49j156P10Q86j221
3313c41L0Q23r42j95J251r98n76J206K16j330J004M00j488L23J369j204m48J227
3331C27p11n75J422k83j284J118K95p54O83N09j226J87J488q84j009J144n21m36
3349e10J376j69j343P91Q02j222J53J265j468j56J562m09j170J109k78q17O20
3366A36P71j487K03J010r99j1R75j015l50J022K66j071L95K80j265J047Q26j470
3384g37l11J602o83m17P54n75n03R73P51j182L04L09j006O33J043j420k28J149
3402D56j65r21J623o36p77Q13M48p79j56Q27j198O17J192r97p92P15L2p73J061
$$ y = [330, -511, -904, 317, 358, -1019, -183, 53, -860, 223, 769, -673, -929, 712, 268, -598, 581, 187, -576, 619, 779, -531, 116, 838, -110, 263, 967, -24, -717, 588, 456, -295, 689, 440, -716, -6, 880, -341, -311, 512, -430, -625, 626, -372, -948, 258, 474, -856, 148, 548, -940, -617, 752, -452, -900, 327, -384, -959, 463, 180, -1104, 14, 309, -445, 238, 747, -479, -292, 1196, 312, -697, 447, -74, -510, 866, 697, -646, 145, 947, -275, -122, 1143, -325, -481, 1081, 672, -498, 611, 333, -484, 136, 907, -580, -377, 633, -366, -377, 598, -417, -767, 255, 521, -550, -155, 125, -1140, -93, 733, -737, -1048, 554, -129, -546, 208, -367, -870, 103, 854, -328, -24, 285, -721, -88, 955, -465, -693, 456, 291, -630, 993, 357, -420, 393, 841, 62, -94, 733, -465, 152, 1344, 347, -445, 270, 302, -471, 590]
3421E90K27j378N31J145j093k75Q25j047j89J198j64r71J063j61j343R63L33j237
3439i83K15J291r29m9R33p44o20J070L36j008K15P33q76K71P05j154l18J586j85
3458D89r09J016m64m50P09L26j163M23M96p33O49Q82j349o26J167L4r16M60L04
3477C45j001Q00N15j180K51O15m47m37J024o77q20J008L85q73M27R3j020P23R49
3496F80r18p13J180n96r3J043k86j195Q45O71q06K70P4n51O5J123n83q59J067
3515D18l83n75J281J64j382L23O25m52j39P81o70m31J297m80o35N60j30o94R43
3534D21R3j138J75J101q42l37J189q94m57J130j1j109N56L36q22O75L32o02n78
3553g82J106o16j64M64k16m88R10M57r97K08K23n20J20J034r54l16J011k87k32
$$ y = [590, 817, -561, -30, 1115, 22, -253, 572, -475, -664, 534, 370, -601, 462, 301, -1042, -79, 254, -983, -768, 523, -406, -455, 478, -266, -886, 184, 520, -488, -273, 460, -416, -145, 560, -594, -912, 674, 489, -420, 596, 132, -318, 391, 717, -446, -23, 473, -260, 389, 1271, -78, -704, 463, 497, -419, 41, 345, -656, 144, 659, -521, -270, 345, -102, -539, 485, -192, -1012, -4, 381, -492, -65, 28, -992, -269, 680, -238, -951, 229, -367, -460, 583, 297, -898, -53, 618, -188, 82, 156, -395, -330, 793, 210, -649, 418, 35, -540, 741, 905, -477, -154, 471, 19, -120, 661, -9, -440, 857, 377, -258, 302, 172, -522, 421, 514, -624, -449, 652, -190, -527, 662, -232, -689, 441, 430, -679, -123, 213, -609, 66, 398, -204, -782, 324, -292, -456, 8, -208, -696, 214, 671, -326, -118, 105, -415, -295, 739, -215, -531, 480, 193, -39]
3572c9N33L2j146J118M45j002J37N64r37K38Q33q45n63J133k2p73N72j18r34N98
3592a76R82j017m53J085o56l26R40l49r66P43L46q89N85O10j459O11Q54o22n91
3611g48R21j99n84J075j31q31M72M70p42RQ93r25n0J099m72j010J550l52j042
3630e97J089M29r97j83R42q38j0P99l87r26J386j64q76O52P1p88M23P65j001j66
3650c77J034n01l77M83j18r97P04L72p74P23J10q49K81O91p98O3N18j85n22R75
3670D56m2j181Q17P31p39J32N54j127K92R67q29l07N94J34n27O52R4j272N61P38
3690F98p80%O72q11p9R39k88o83L50K97r63O55P22j084K9P57p47k01J224r66l95
3711f54O07M59r60N18L16q08N04J68q45L10Q19m95l10P38l08j212J239M85q69
$$ y = [-39, 494, 526, -620, 498, 943, -59, 78, 642, -295, -57, 776, -69, -632, 501, 479, -294, 278, 160, -774, -176, 806, -211, -664, 421, -235, -561, 379, 30, -936, -193, 153, -736, -151, 459, -1000, -389, 465, -157, -748, 173, -26, -610, 465, 334, -497, -25, 445, -297, -288, 605, -320, -370, 729, 257, -753, 797, 445, -597, 492, 921, -76, -259, 683, -155, -165, 634, 247, -679, 707, 543, -333, 319, 390, -398, 25, 790, -211, -377, 657, 156, -221, 262, 144, -853, -149, 223, -551, 172, 282, -567, -286, 405, -393, -330, 188, 3, -519, 456, 414, -767, 50, 781, 42, 174, 728, -399, -107, 860, 31, -276, 318, 452, -75, 577, 671, -601, -40, 698, -82, -82, 590, -221, -300, 639, 351, -332, 18, 315, -648, 7, 729, -355, -326, 431, -316, -517, 707, -259, -654, -47, 412, -548, -30, 286, -522, -18, 150, -695, -385, 434, -61, -371, 367, 59, -1153, 86, 571, -298]
3730b98K33N89r25M09O89o05n27M74L18l82N72j21q99N16Q96j104J23N50o81M7
3750a26O90l36o43O27J07l75K08L83j490Q35N59p62k60J155p57j82P97j84j063
3769h17J63Q13p84N23J27p40K35R76k20j070Q14J46j256J388R7r83M87M83o41
3788b59R2N89p65k12R43m7k91M36l74p64J072L36j014L46K82m00R8O84o84n32
3808d64P38K68q96O71J41j051P63N51j289L78P38o89k20Q55l99p08Q29K23j131
3827f92M55O26q15K56O98o41m14N38l06m45J087l45q91P86O69n69k44O31p92L21
3847h7Q01m26n51O84l71k6M03L13j119O70N77p04p1O33p31m08R59j82r11N83J96
3868B32q92Q46K32q75j04J058m15k80K87l16k89R01k98r35P31J20l44L02N39r34
$$ y = [-298, -65, 524, -401, 8, 697, 92, -435, 39, 357, -25, 547, 426, -473, 43, 939, -165, -42, 508, -173, -126, 564, 228, -415, 212, 319, -56, 152, 535, -955, -120, 439, -323, -583, 572, -185, -367, 430, 246, -817, -654, 159, -625, -102, 25, -715, -480, 496, 276, -794, 20, 166, -1090, 298, 395, -588, -101, 382, -259, -167, 422, -343, -555, 388, 341, 50, 486, 112, -652, 420, 756, -258, 88, 370, -30, 68, 752, 68, -464, 274, 542, -354, 317, 458, -593, 170, 721, -568, -190, 548, -141, -361, 494, 95, -613, 216, 439, -692, -237, 389, -426, -170, 528, -113, -527, 11, -295, -740, 347, 2, -889, -103, 566, -3, -247, 384, -408, -87, 714, 288, -263, 421, 50, 24, 427, 740, -379, 291, 868, 164, 93, 726, -5, -413, 546, 364, -547, 36, 232, -660, 186, 418, -457, -561, 497, 82, -198, 89, -227, -516, 385, 87, -848, -117, 3, -341, -39, 500, -434]
3888d34l51J319m47p20R86l76n29N81L95p77J83P33j028L23P10n81n08P80J00
3907C59m30P82m87o63R47O35j007m54P74p24K60R40o64q71R20M48r06L50q7l12
3927a90j31J021q57l91P92j44r27J103Nq55N22J01p83N37Q85j448K64Q17m55o80
3947h14N34L13o36P92L67j292K51O06j24k86R07m69p51J332o04k20N77l10p41
3966e68R29K70q15K08N72n87k40R59o19m67P41l4n05J87L36p93N57N22j000J89
3986a58P36q38k36P65k65n09P38R1o98K45Q6m93k19J159l30m52L46o3m73O25K01
4007B58r85O45M74n13K67K08p12J8Q90m40m73P49K81p48P56k28p23L36N75o33
4027Bj91P38m59l61P35J4p90K74L05p79M90Q37j198k2R66o32l23P54n33l07O80
$$ y = [-434, -785, 534, 87, -633, 353, -23, -552, 29, 424, -353, -170, 563, -465, -142, 568, -13, -521, 259, 359, -71, 711, 224, -439, 508, 1143, 136, -318, 456, -268, -8, 932, 268, -603, 317, 765, -141, 209, 122, -190, -321, 700, -157, -548, 244, 100, -827, 276, 281, -574, -52, 49, -734, -197, 688, -760, -496, 321, -134, -814, -280, 33, -603, 189, 556, -736, -485, 121, -3, -289, 618, 149, -602, 730, 126, -94, 483, 173, -568, 361, 631, -184, 24, 596, 9, -231, 728, 109, -358, 383, 349, -156, 31, 367, -426, 131, 653, -347, -158, 578, -260, -496, 269, 4, -505, 233, 324, -374, -129, -43, -536, -755, 404, 74, -378, -32, -95, -568, 57, 258, -727, -82, 392, -121, 146, 354, -358, -340, 550, 110, -363, 386, 667, -81, 675, 447, -276, 60, 635, 2, -189, 549, 90, -271, 464, 478, -312, -38, 267, -512, -22, 815, -383, -405, 561, -71, -394, 360, -173, -480, 200]
4048B00L73r73J6M09l92o0O57o01k76R59m07k90P10k51p44P38M38r68R7O38m63
4069a90j31J103p83r14J073K1l50O34K87j105L64O82n66k65N19k57j74O86k28
4088D06o32L33K31o16O57Q2r89PQ86l53m80O04j28n78J074m04n37L52M68p46o7
4109d30O46m74j24O84n05n08J080m48m80O75O6n16K15N11n63j0M55l84k05P92
4129D77j87o12P53j85o62O50M40q05p8R20r02O4Q09p99m42Q63N6p75L33O47j120
4150e55L47P45r88J08O99k1p51L76L11q83M37M32m29k08Q65p88j88P56m19m41
4170e95P13r6l54K94M63p82J95M21k68k47P88o26r7Q31m42n17O26q9l57M18J88
4191D67m25J23N31r21J88M38m30m84R67K08r91M39R1p03N85M30q25j02L98J85
$$ y = [200, 573, -400, -384, 25, -367, -427, 230, -371, -647, 312, -95, -385, 325, 74, -670, 68, 506, -462, -365, 273, -190, -321, 782, -1, -915, 158, 179, -171, 463, 750, -355, 9, 691, 125, -140, 379, 122, -52, 634, 406, -226, 107, 338, -278, 379, 461, -528, -521, 365, 12, -468, 136, 8, -570, 504, 100, -437, -85, 383, -363, -430, 216, -258, -382, 302, -203, -711, 369, -79, -559, 116, 182, -334, -119, 392, -171, -181, 274, -110, -315, 477, 290, -322, 431, 246, -416, 234, 674, -131, -209, 711, -191, -127, 682, -117, -559, 304, 360, -415, -82, 565, -555, -208, 537, -451, -343, 356, 335, -416, -40, 271, -612, -175, 257, -172, -380, 485, -303, -491, 265, -154, -595, 118, 22, -332, -38, 425, -357, -162, 259, -9, -256, 532, -94, -191, 640, 198, -319, 307, 218, -139, 279, 467, 42, 165, 696, -225, -37, 401, -29, -513, 454, 662, -329, 110, 201, -502, 83, 513, -312, -414, -16, 169]
4211A69l26N48o51m57Q57K24r53J62O96p24J36P88r05k01R02l54j85M69K29j060
4231f36O48J97p36K56Q09j001M51Q69q33m25M79M65o81L20J72q13O83K01l40l19
4251b34O10m61l76Q90j72n82N74K48n28J9K92k90l79J009o11l07P43o83k31O91
4271B22j89n52K55Q19o59m3N44p49l55J217m72l1J74Mp00N28J4o14K22O51n37
4292b51j65M86l88k73J181k67n57N60j54n92M63N90o84l60J042o80m02P59J88
4311D96j015O85K45n07n3J14q4K73M99p43o50Q23j32l42N91n4p02K27O68o06L85
4332A18J28m82j43N75l80j63M26K33o24J22J29o15N87N56l02m93O66k69l91R12
4352E90k63l63J45K39o63N63O8m95K65N24p49l0Q37q20j27N84l5p01L18J76j35
$$ y = [169, -157, 391, -260, -717, 140, 364, -589, -427, 269, -455, -319, 469, -436, -637, 265, -89, -274, 195, 424, -636, 12, 209, -527, -271, 538, -463, -12, 857, 24, -401, 78, 543, -138, 182, 354, -459, 224, 425, 85, -234, 376, -85, -461, 429, 257, -325, 249, 497, -31, -12, 280, -10, -389, 620, 9, -298, 445, -238, -469, 222, 33, -519, -264, 555, -104, -147, 397, -352, -707, 510, 38, 7, 181, 185, -515, 13, 27, -587, -365, 286, -251, -416, 70, -318, -591, 590, 323, -234, 326, 172, -420, 43, 633, -51, -411, 631, -49, -451, 308, 496, -519, 166, 411, -96, -149, -35, -119, 154, 653, -90, -740, 83, -49, -391, 200, 146, -556, -329, 339, -267, 118, 246, -236, -379, 196, -184, -347, 79, 312, -312, -190, -61, -676, -89, 467, 165, -328, 338, 69, -322, 590, 327, -36, 109, 348, -315, 248, 316, -179, 86, 610, -139, -169, 668, -152, -279, 305, 270, -431, -113, 63, -72]
4373g2J86L12p61P1O39k38k46o9r1k02N65lm96J40N67o27j04Q38n99l52O31j93
4395a04l74M77M2n36M06O48m23l93P76o63p9R31m12o57Q17Lo33M43j8m68L27N61
4417F71q69J22K81r4n27J042k68q83P52K10o85L02J65m09p6M78l9k96M92l42j11
4438h4L94k31m34K62L77p73L61M69m80k95R82n83l56L76j31n0J77M84q07K62K37
4459A57j55j94L93l9o85J154j29r78N19J86n16L86M41n95k27N47j21k72M57J05
4479D34q30M86M44p49K07K85l59q3N03l09m18P78k56l55M69L6j039N26L95l30
4499a65N6M59r24J3R08m32n14Q22K6o01M20N2o38K23L65R2m73P97m62m33R57k98
4521B50m46K54J60n33O62r0n01K17M24m81R8L24l18l27O77j06k13J72J26l86K6
$$ y = [-72, 114, 426, -335, -264, 375, 137, -109, -178, -269, -471, 94, 91, -405, -265, 302, -325, -429, 409, -190, -542, 89, -104, -478, -1, 41, -495, -89, 559, 136, -257, 519, -144, -223, 708, 296, -361, 456, 459, -174, 269, 251, -217, 110, 671, -198, -76, 205, 111, -416, 626, 358, -525, 227, 437, -248, 54, 219, -190, -266, 212, 173, -123, 369, 27, -84, 310, 79, -355, -93, 284, -489, -128, 341, -139, -434, 548, -35, -391, -15, -146, -196, -19, 465, -342, -80, 157, 2, -192, 201, 162, -523, 631, 502, -476, 43, 229, -287, 99, 540, -55, -282, 265, 144, -128, 329, 434, -396, 90, 534, -215, -8, 277, -82, -165, 338, 29, -389, 389, 133, -222, 247, 283, -756, -230, 165, -165, -109, 350, -574, -561, 347, -85, -599, 223, 249, -352, 68, 120, -518, -295, 70, 162, -311, 486, 24, -409, 548, 250, -196, 58, 218, -315, 347, 257, -244, -27, 397, -84, 14, 338, 20, -307, 370, 264, 51, 223, 349, -37, -11]
4542a1O71j093L06N47k16o23M39L00o83J91O15p95J14L95l46m6N71n23r6N16Q7
4563C20o03O33k72r44O86N30m86oM06l62r2O66m47l39M34J83k10j74J91k57J33
4584a0N49o45n8O04n39N0J80K09n21M77N9n33L39L11o37l7N75m84k67Q85p68l50
4606f11Q00N3o01L28L96p42J90M08n35j42N38Ko09Q15j38n12J13N63j023P37J77
4627B07l41K52L71o59M0M08j74j59J93M6m45M53M50r17L63L60k23k80N42l22r2
4648G3L09K38q55R1L24n85L79P49r08k94Q23j29o99P68j13p66L69K04j16J00J52
4669A14o09L09M84j84m05M93m8n02N93K08o32J62M61o31j08M60k69j8M89k98k17
4690a48L09N05q73K34L40p96L42P25n68j04K63k72r1O46j31o47K08J75l35l8N98
$$ y = [-11, 660, -433, -127, 420, 204, -419, 20, 320, -363, -172, 443, -352, -238, 157, -189, -235, 336, -187, -283, 233, 320, -283, 350, 78, -866, -180, 350, -136, -142, 264, -98, -190, 476, 29, -310, 124, 307, 97, -77, 114, -143, -10, 539, -106, -164, 440, -99, -49, 131, 340, -181, 296, 355, -178, 161, 472, -165, -202, 373, -111, -378, 507, -261, -611, 189, 242, -359, -31, 365, -377, -187, 221, -314, -456, 82, 84, -525, 290, 152, -360, -247, 316, -707, 30, 207, -134, 118, 489, -170, -130, 278, 104, -55, 138, 184, -261, 192, 642, -275, 88, 448, 225, -55, 487, 165, 73, 382, 620, -235, -144, 180, -405, -26, 723, -185, -479, 344, 215, -484, 284, 171, -595, -226, -22, -138, -38, 114, -495, -186, 298, 114, -291, 202, 154, -348, 245, 453, -179, -17, 444, -187, -295, 165, -104, -122, 367, 69, -148, 161, 666, -207, 27, 367, -429, -87, 638, 70, -34, 229, -43, -134, 512, 381, -266, -58, 117, -218, -256, 342]
4711C42o38k03N45j1l38N86J40j041P71K55q11L04J63k0j75O0m8N9L17O2n56L54
4733A17j58o10N28K62l81J63L22j05k88O20k83l65N75j74j57L13k88k74R2M81
4753C90k34k96N54l48m45N87J07q47N49Q3l28N7K04k19n9L92k13k25L01P9l76
4774b87L79M1o29M52K7k94J91M01n52J20K07j07m55P74j27p07O03L84m65j64N37
4795C29j88l29N65k55m13Q40l22n71L72K09o04J80N93p34K82J13k13L71k4j4m56
4816b69M07K27l84J55j09j78o0R21p57j14L41k57k9J55N07r57K41L90n59L47L87
4837D05o02l51P63k58M5j73K01l33M07K52p59K92K52l27J62K15k78m8L59k79k33
4858b88M87j09n01N03M84o82k10O20k68l66K13q3R0K63J33p40N97q3P3j71K49
$$ y = [342, -296, -499, 46, 35, -303, 283, 423, -618, 153, 408, -403, -99, 64, 44, -131, -71, -119, -60, 257, 319, -237, 117, -41, -651, -123, 139, -242, -79, 243, 138, -150, 470, 187, -178, 397, 223, 66, 379, 91, -183, -91, 390, 156, -140, 414, 66, -379, 208, 315, -532, 17, 100, -228, -171, 33, -186, -245, 147, -66, -291, 10, 89, -287, 92, 133, -496, -44, -17, -311, -120, 281, -271, -151, 56, -51, -506, 268, 141, -566, 37, 421, -44, -208, 329, 141, -188, 377, 122, -291, 549, 227, -344, 28, 237, -367, -187, 406, -328, -46, 67, -146, 225, 201, 187, -269, 138, 365, -19, 136, 27, -151, -211, 710, -47, -161, 180, -77, -106, 49, 556, -401, -160, 230, -329, 18, 405, -197, -548, 215, -43, 2, -171, 30, -303, 104, 356, -403, -111, 141, -186, -24, 191, -87, -135, 224, -55, -288, 199, 90, -411, 92, 576, -106, -316, 304, 36, -330, -117, -200, -110, 153, 286, -454, 143, 60, 133, -38, 211]
4879B11l08l18N86j50m68L59L54p28M25J66k66R9M13n47p3K42k72q3L14j58j19
4900c21L62J92o38N00M8l89k44P50m24k2M71n37j41M63J05j75J39K25l84j95N37
4921C22k00j28N16j79l55K40Q9p18P79k99k47l7K46Q3l31N96l97k92K79M4p4m3
4943a06K63m94J97K34m56J99N12m68k68M51R8n2k0J15m61M88j26m86L66J47l24
4964a91M16k79r5Q1J85K32m51J34N1j87K25K52n74j59O76j83k67L17j42j86K78
4985A33J95l10n4L1j49O3L71l71k38R1L32k99j52L26m20r4O84m44M2N04l68j24
5007b51L95l05m35O46M0p4l69J85J87l03N82j43l08J81l1J81K08j10l58J18J41
5028A77m88P30j81j57j56L07j9k56J48N3l11M47l9n05J77L75m06J68O2p5k66K82
$$ y = [211, -97, -415, 171, 21, -447, -88, 266, -462, -37, 129, -137, -38, 375, -172, -245, -3, -275, -358, -44, -202, -321, 41, 233, -405, 95, 143, -246, -490, 260, -164, -186, 285, -252, -393, 70, 175, 0, 139, 364, -20, -215, 322, 122, -6, 510, 331, -24, 216, 305, -413, 366, 67, -180, -217, 29, 112, -219, 377, -20, -312, -33, 11, -63, -106, 157, -337, -140, 94, -362, -163, 349, -119, -387, 64, 162, 110, 90, 205, -256, 232, 106, -380, -14, 133, -191, 225, -54, -149, -68, 117, 349, -102, 32, 83, -104, 121, 373, -201, -360, 316, 133, -134, 183, 41, -145, 133, 328, 18, -36, -5, -154, -91, 280, -91, -329, -238, 94, -205, -357, -31, -451, -545, 139, -305, -263, 241, -127, -251, 144, -161, -596, 50, 90, 16, -353, -168, 19, -284, 298, 155, -153, 28, -3, 178, 386, 276, -82, 36, 177, -311, 419, 238, 81, -75, 232, 213, -43, 105, 158, -153, 294, 255, -250, -73, 302, -104, 64, 126, 51, -215, 67]
5050F7k85R3MK01p10O81K12n34rM78j36p2J81k46l95N41n3o0j23M73o12K28J02
5073B6j8l29P47m34l97N09Q2j36k00M75p41M83J22m99K74N70p53L31k57K50k24
5094a19O13l08m48J23L21Ol30L97l96m34Q07j0m48K52J80m33M67J1n24L7L36j64
5116f4j08K53l02r2M23O1m88J32L67m19K52M41o05O4K65m3L7K20m13k34K19N61
5138E27p07N09k50P4r6N66j60n08L90k78j81m6Pj23M66N6j75l45P14m27M2j32
5160g7J34j87l9J86l03M42r3m22J78L08k11p7j54K80k60K94L78r23N81l4k23L21
5182I9J62j98m3J88k60m6K94k69J01r2J39j63k4L70k54P8J7k17R8M32m5l39K48
5205B76j64R8M9K6m61k07L77l1j99N71k69k2rK47l17P5k58m7J44K67m05r1M67
$$ y = [67, -218, -125, -121, 80, -630, 51, 263, -271, -280, 198, 62, -10, 171, -75, -470, 71, 18, -42, -165, 308, -304, -76, 26, 8, -321, 426, -8, -405, 104, 186, 50, -150, 325, -416, 67, 189, -310, -36, 534, -219, 112, -145, 105, -119, 494, 186, -262, -139, 182, 188, -142, 255, -141, -575, 232, 222, -226, 26, 206, -227, 240, 251, -273, -236, 100, -64, -172, 81, -221, -313, 110, 171, -317, -185, 182, -237, 15, 456, -149, -85, 180, 137, 174, 394, -19, -253, -34, 527, -180, 329, 79, 153, 57, 623, 463, -45, 345, 67, -114, -160, -153, -276, 190, 246, 71, -274, 440, 13, 55, -77, 57, -130, -169, 17, -286, 156, 63, -359, -181, 127, -84, -161, -315, -35, -295, -1, 377, -546, 35, 1, -222, 99, 261, 63, 20, 208, -52, -98, 196, -73, 28, -64, 75, -88, -112, 258, 4, 82, 99, -118, -20, 412, 367, 28, 276, 112, 210, 259, 285, -176, -383, -6, -37, -236, 335, 66, 44, 35, 282, -35, 40, -218, -265, -121, 146, -259, -350, 117]
5228A17J0k50L15k32l43J85M3J22J51M0k22K31j55Q4k28K38r6j4J48j61j83N38
5250C38k6n41J70K19q0k66M80O6l42l8K84m56J72m2o8J6J47RP7K49o95K19L38
5273B30j06l37Q7L79q63O61j69r7j23M04O0n81M09l37M4O04l57m08O48o7m8j47
5295a14M26n69J27M09j53k48K80l1m12N83j99k97M28n3k85J62J5j03K2J98k98
5316a12K00kK6p3n7L49k83l65L87O0m04N70p6m71o8K18l39J57N17l79O4J60n4
5339B5k57J90j56j40N84j41l13R0L13j05L6J84m11m8K73j06k42M19j03k50J04
5360e4K95o42L39M84n63J50J03k79L16j89M48o04L90K9o55O14K51n15J18k59o4
5381b87J72L74n42J4L57l6m04M51l7n11L47J67k63oO2o4j8M99j37l06J42J47j39
$$ y = [117, 127, -123, 192, -40, -383, -198, -155, -33, 118, 158, -64, 167, 12, 96, -132, 106, 10, -4, 144, -17, -200, 338, 312, -229, -59, 160, 80, -186, 294, 360, 18, -20, 264, -192, -20, -62, -130, -114, 33, 42, 119, 368, -327, -108, 230, 124, -213, -126, 253, -610, 51, -118, -215, -338, 66, 126, -455, -46, -383, -339, 265, -92, -500, 148, 81, 33, -114, 312, -257, -130, 279, 126, -122, 158, 127, -285, 298, 99, -198, 230, 177, -108, 54, 69, -34, -12, 186, -112, 88, 86, 112, 39, -18, 331, 48, -317, 70, 130, -274, 296, 220, -251, -319, -101, -440, -283, 234, -145, -81, 79, 25, -232, -42, -198, -338, 246, 105, -208, -118, 195, 90, 126, 310, -101, -149, 124, 18, -224, 195, 92, -158, -54, 241, -401, -62, 422, -141, 9, 112, -167, 149, -40, 408, -196, 194, 223, -432, 182, 433, -82, 36, -223, -287, -115, 259, -283, -269, 88, 52, -352, 99, 62, -449, -102, 65, -198, -204, -142, -206, -224, 275, 138, -168, -26, 121, -18]
5404a8k31J08L2LM43l35J45J18k80m27N41J3l14L7M58k93j51K18j86L10k64M35
5426C62m77L82k51k8J09K30o49M2O15o8k41j26j26m1L86j57l28L52j83k3M1K82
5448A03k47k78M56l95O22m33K48j66K40k21q8K78k8q0L4K57m79R8L67j69l05L66
5470A80j77k57K13K06l69K63k5Q8m11M81p6k92M03L8m03J17j90m9K83K45l00r4
5492a26J36l81K28L35qk09J27j66k98M74j64l22N75Mn3k70J79j95k3J52p0j19
5514a94M58r5k66j73J65k07J98L86l78j64L15K52k92M0K3k77J30L22j28m2M72
5535E45m13l51N38j48k00K19R4k79K62j44j53J28n8j53K49k11j06M0j57K78M4
5556B4j77NK61n57N16J71l81K64O3j09n2J3j61K19K5l37J70K5K6N2K00k25j39
$$ y = [-18, -249, -141, -109, -106, 337, 2, 147, 265, -15, -442, 99, 112, -202, -165, 293, 0, -151, 67, -119, 191, -73, 362, -115, 267, 16, -12, 97, 327, -322, -280, 335, 267, 26, -100, -226, -267, 119, -38, -366, -14, -197, -220, -179, 103, -144, -422, 34, -361, 261, -172, 76, -90, 150, -71, -159, 119, 91, 11, 45, 302, -177, -79, 288, 119, -186, 180, 3, -254, -41, 165, -204, 59, 34, 122, -289, 192, 116, -176, 227, 265, -138, -21, -211, -260, 23, 268, -32, -126, 10, -371, -143, 192, 184, -25, 102, -64, -362, 112, -52, -374, 201, 205, 152, -118, 61, -134, -157, -5, -75, -194, 264, 169, -97, -270, -105, -312, -114, 272, -106, -270, 45, 297, 5, 45, 68, -209, -79, 243, 115, 73, 545, 132, -219, 319, 171, -29, 190, 284, 5, 267, 123, -30, 98, 40, -113, 136, -75, -181, -141, -298, -20, 24, -153, -148, 113, -444, 72, 243, -138, 126, 189, 80, 28, 41, -120, 99, 124, -213, -43, -18, 8, 60, 260, 35, -104]
5579a04L94j31j01R4k98KL87K1n04K23K08j23l47J23J69m34Q11j45j44J90k04
5600H7l93K70J39n74N40K06k91j70K14L3l72L63k20nJ30Qp2k32N67l13k49K66
5622f8k02q0L06J43k94K64k14kj10M77j74k85O55k84l16K82Jl05K50J6N7L9m4
5645A12j82L72j73K16l64l0L28k29M0J18l65j46L81j20K67k52K61l40M26l63j72
5666b15O5M57j67O8Mm11k4K44k02k9N36k01j26m4K17l65J34J40l35J37K82j0k45
5689i0K60o0j88J17j40J63m3K09j83Q5J32l37J66m0O1m35L81L6k60K63K13j68
5711A42j1k64j40J65J19j0j79K04q1R5N3o6l73J99L94j45qJ50k59j04n6M8r6L64
5735A41o7m07K09n3rL79Kn02N15j70J56l90J82J33j90L0M20n41M86K37n60j59
$$ y = [-104, 290, 159, 58, 152, -146, -144, 243, 264, -240, -17, 191, 68, -279, -156, 13, -421, 390, 245, 101, 291, 87, -306, -36, 103, -471, 69, 275, -16, -186, 28, 61, -311, 52, -168, -173, -43, -35, -107, -339, 228, -85, -334, -68, -270, -350, -44, 99, -195, 69, -145, -147, -257, 220, 46, -239, 416, 132, -184, 98, 99, -206, 44, 60, 117, 156, 112, -70, 302, 129, 345, -19, -49, 279, 50, 90, 208, -157, -303, 78, -42, 225, -27, 234, -106, 320, -43, -215, -150, 307, 140, 208, 212, -199, -223, 21, -181, -210, 326, 125, -1, -45, 172, -193, -59, 81, -254, -117, 165, 155, -90, 170, 110, -78, 39, -101, 62, 19, 228, 45, 130, 262, -75, 91, 51, 112, -323, 58, 94, -166, 97, 310, 142, 131, -133, -273, -108, 11, 1, -178, 26, -55, 40, 93, 27, -346, -147, 247, 102, 94, 244, -15, -119, -175, -127, -223, 141, 74, -333, -124, -177, -186, 193, 195, -307, 208, 38, 194, -196, -14, 119, -71, -41, 379, -162, 324, 561, 1, -158]
5757a58K82j43J20j23MQ3n4K1j77l8O74l86l7J83l11j45K46J71n54N01k32l07
5779c80J88L34j11LP4l55n1O24k15j44J98q6l83J68K93k80MK87J2l80K86j61J75
5802A00k25N2J93k5pj03j15L56j68r9K22m10O5K78j33l10N02j48j4p1J73l20J99
5825hM2P8l62R3L69m95J25L75l76J01J23j57R6k49K38j55K15k69p2M96k22J86
5847A72J48l17n5o4K10j68j32M32k55K93j94j00o1M32k83j8L05j94k04m5L22r0
5869A34o6N8j54o9R7J3k74M00K50m87J39K08m77L44J68m33k4M54m00l11N20k26
5891a36k75K62L19k66K89r7k24J24p7J70j91K86l22J00O1J64l08J38J79q1n36
5912d21N62j97J53l1r3m2J23J09j49o4L00l54j20K92Q3j23j34K18n24L33K34k72
$$ y = [-158, 124, -19, 101, -22, -18, 65, 11, 32, -145, -183, 491, 105, 68, 251, -60, -205, 41, 212, -342, 159, -73, -380, -192, 142, 31, 34, 108, -247, -298, 326, 111, -33, 165, 79, -304, -136, 157, -123, -119, 168, 180, -200, 86, -75, 100, -125, -73, 120, 95, 88, -15, -130, 226, 58, -41, 181, -229, -164, 114, -19, -329, 173, 25, 11, -60, 113, -207, -8, 34, 112, -250, -157, 212, -283, -158, 217, -159, -58, 65, -92, 4, -245, -7, -162, 53, -216, -288, 208, -14, 172, 320, 3, -52, -116, 94, -74, -206, 226, -29, 264, 70, -30, -91, 341, 58, 40, 345, 151, -53, -98, 224, 134, 68, 126, -28, -97, 0, 13, -261, 139, 389, -98, 41, 249, -228, 116, 284, -149, -173, 281, -119, -430, 90, -136, -411, -149, 170, -96, 193, 96, -128, -4, -81, 89, -102, 184, -138, -38, 23, 187, -121, 17, 196, 115, -421, 141, -56, 97, 66, -27, -69, 54, 163, 14, -50, 250, -104, -224, 68, 151, 28, -106, 112, -412, -79, 155, -117]
5934a17L09K00k78r6K39l62pJ35K09l14J04K01l53o2K80k74L5L65k60k36J77j30
5956b35R7M44k96l21M29j38o67Q12m2l46J37K85m95L52j20N3o6K53n9j86K18J24
5978B33j76k01K38j78o2K15m2j53J19qj08J85Q6m99M44J35q2m20N25l74k25N09
6000A61k73q7R5M84l91M4k87J81j29L98p3n03L51r7j17K51pm24K62L88n07K31
6022d9K56k37k61M10p5k29N68k90J8J73n4n18L19J55n4j63K54k47j44J41K39j35
6044G7k71N76j34k10K99m35j19M40j22j33L0J53k31J31j40nJ36n4L4l33N40k49
6066b0j1J11k53K16k1J74m58K61kn5J57J60m25J74L31k72j46k11M30l70L27Q8
6088A85k27j47M11m05j24R4L07k98K85o6l0L17k70j28K49J75l97n4L14k07l4K69
$$ y = [-117, 192, 392, 114, 18, 257, -105, -112, 23, 232, -82, 22, 223, -130, -192, 88, -186, -151, 214, -46, -282, -105, -235, -138, 306, 10, -311, 118, -20, -687, 125, 83, -263, -126, 159, -336, 16, -104, -51, -117, 136, 77, -109, 109, 233, 57, -144, 94, -84, -146, 69, 27, -126, -7, -15, -123, 62, 148, -351, 93, 228, 146, -274, 251, -123, -348, 161, -112, -199, -104, 380, -11, 33, -254, -73, -202, 196, 123, -380, -29, -126, -243, 8, 1, -423, -161, 227, -280, -49, 207, -30, -291, 119, 44, -185, 383, 93, 111, 284, 230, -288, 31, 186, 132, -31, 223, -24, -168, -27, 212, 77, -194, 382, 248, 38, 337, -98, -217, 223, 101, -32, -2, 151, -80, 51, -89, -94, 42, -12, 22, -311, 229, -20, -31, 80, -173, 43, 22, 196, -262, -1, -3, -58, 99, 259, -166, 8, 339, 67, -79, -290, 140, -230, 97, 185, -42, -189, 222, -183, -307, -213, 94, -204, 81, 15, -15, 302, 32, -96, 153, 328, -69, -123, 191, -16, -50, 219]
6110B19m69N3K4J60N0L5n3n9k81M37j16k09M01r3k27K13pl17J61J83l54M8J76
6133b5o1p3K84m3qj83K37M7Ll1m77J96M48j52j90K38j09J69J8l01j6K30n26J6
6157c09L65r0l29K62K35l28N87m71K19l40M26l3l16j09L66o3l91O10l40j6p9R4
6179e0L9k07P8m9J56L8J56K5J6m58M00m52K09q4L0q7J24J08K18j78M5m8j83J24
6203c0J04q7M89m62J36n15M58J20r0p4L23m05j7l5J42l8J13l19J77L4k4r3r7M53
6227B63k43K5o3j7l42N19q8J34k14K87m20L43%o91J65L28m5j23P4J72o9J08l20
6250b17Q4J02L2J88r8J45k22j32K58m12K23L81M2m55K25q5k88L17m6R3l7l03J85
6273b0k14O33m27k52N85k51Q8o3N8j31MJ57k38l16L51K08k49K42j44j52L59k27
$$ y = [219, -250, -197, -173, -13, 37, 72, 19, -40, -321, 116, 0, -209, 192, 99, -128, 85, 78, -239, -78, 105, -249, -201, -25, -86, -159, 125, 82, 74, -109, 128, 175, 178, 147, -330, -134, 314, 162, -28, 210, 101, 270, 288, -13, -29, 201, -325, -309, 56, -34, -363, -101, 134, -194, 393, -78, 141, -199, 227, 194, -122, -231, 135, 72, -319, 291, -49, -65, -144, -50, -11, -218, -140, -189, -33, 5, 161, 186, 202, -256, 144, -308, -99, -183, -153, -240, -116, -8, 210, 32, 77, 29, -154, -30, 74, -13, 476, 14, 150, -365, 93, 213, 123, 49, 372, -33, -50, -85, 57, 19, 132, -187, -10, 24, 0, -93, -190, 263, 20, 45, -18, -35, -377, 142, 54, 188, -26, 261, -159, 184, 184, -507, -342, -14, -59, -182, -108, 64, -5, 103, -217, -133, -31, 1, 189, 91, 236, 14, -118, 140, -272, -49, 332, 374, -81, 144, 59, -229, 88, 42, 135, 98, -205, -20, -234, 399, -28, -280, 305, 54, 142, 79, 137, 6, 10, 167, -71, -387, -36, 172, -77, 165, 21, -131, 228, 1]
6295Aj98R9k6K90m19O6J73q3J54k25K57j79K05j53J2K39n03J66K93m77N34ol56
6318a36K56J06l53k3P1N7k91L10K86l94r5J54P5j3J53j35m58P87k27k88J26J16
6340H4M9j23L37l21j6J96l07J30K85m34J84K08l33R4k32J93L0p0K51k45k66M75
6362A69j48J35q0J79n3P7J1l75l2J41K7j69L19k57K5j43K36J26j26L1k5r7J85
6385A56k69K05J4m96M14K3N9n84L13N72l70j39k30K86j23L68P5l17j02K71P5k1
6407A80j25n67M88J14Qk79M12j40j73RLK54k42J0K11j16j5k33o1M57k52K33n5
6430A21J8k82o3N33l63K00k8l14L44k07J77l23J95j75N4K64M8J6j88j78j41J97
6452i5K07k21k5J73j48K51l14P3N7K22m15N60m09J13j79j22J75P0L55k71k64j08
$$ y = [1, -197, -98, -124, 166, -253, -187, -14, -97, 57, -168, 89, -90, 115, -38, -26, 213, -290, -124, 169, -308, 226, 220, -136, 120, 226, -127, -150, -79, -22, -313, -3, 283, -111, -206, -52, 23, 10, 163, 28, -430, 357, 130, -158, -32, 84, 133, 10, 347, 26, 10, 206, -101, 29, 314, -120, 64, 272, -61, 33, -199, -6, 24, -46, 205, -40, -306, 169, 21, 156, 76, 255, 202, 279, 290, -85, -117, 24, 51, -118, 201, -56, -31, -174, 62, 188, 62, 93, 68, -29, 156, -113, 92, 106, -390, 24, 47, 106, -478, -165, 407, 37, -102, -332, -46, -169, 199, 274, -43, -145, 126, 201, 180, 55, -512, -24, 90, 98, -181, 231, 91, -82, -73, -70, 184, -58, -48, 163, 47, 32, -201, -262, 195, -57, 176, 121, 139, -143, -206, 327, -36, 164, 136, -178, 166, -41, 136, -187, 8, -167, -113, 151, 199, 215, 27, -151, -292, -95, 112, -109, -134, 39, -109, 142, -172, -99, -42, 180, -235, 325, -84, 29, -150, -272, -97, -27, 328, 57, -207, -315]
6474c15K44M5Qn7K73m37L09k38j75J57K86j93K29Rj86J25K5J29o59L42O6m0j8
6497g1M07m01J7j16K19P1p9j13j18Q1k4K91mo2k45k7K92k07rK8j16J30L9Q7O8
6522A38Q9k29p4J68j70n0L89j02l9k79L06J65k70J33j28J04p6J27l73O9J72M1
6544A11k48L91J99o66J70J02n4J72j26q6j82O5K73O9N7j29j28J10j46q5q4Q1Q1
6567e3Q5r0J57j94k8j9j09K69q2k19L54N9J3j64k14K10J28k97K51k46J70K51j8
6590B14k23J84j88l22L27j16l9R7K46l6l56K67l14L60K71l51p1k55L35J4k32j62
6612c50J19K87j87k05M22l3Mj43n5K4J56QJ26m71J64K11lJ16O7l48m2J0l2M9L29
6637B23r3j31J04k07J45k06K75l44K27j06J81J18J6j80rj84KJ59O9K58o55M55
$$ y = [-315, -71, -26, -18, -75, 198, -239, 70, -168, -343, -186, 100, -93, 136, 145, -41, 84, 109, 238, -421, -79, -13, -53, -71, 336, -65, -48, -164, 55, 126, 47, -66, -184, -103, -127, 164, 160, 98, -147, -174, 118, -89, -98, -70, -186, -56, -17, 70, 138, 227, -2, -76, 92, -78, -128, 261, 159, 120, -159, 147, 312, 42, 175, 47, 151, 75, 202, -171, -102, 70, 111, -137, 254, 453, -213, -43, 59, 5, 177, 51, -35, -217, -152, 121, 190, 247, 118, -10, 100, -46, -131, -215, -134, -53, 32, -58, 99, -95, -123, -142, -251, 18, -64, -283, 71, 130, 143, -21, -235, -25, 103, -194, 57, -189, -19, 232, 214, -9, 175, -13, -335, -8, -124, -163, -66, 180, 144, -212, 55, -259, 101, 372, 21, -50, -305, 30, 44, -188, -350, -231, 56, -131, -336, 86, 53, 57, -86, -141, -117, 39, 47, 173, -298, -134, 77, 74, 190, 257, -91, -133, -123, -155, -106, 223, 130, -1, 103, -104, 41, -165, 110, -234, -7, -113, 68, 186, 202, 22, 13, -171, -169, -10, 59, 317, -338, 117]
6659A17J39l93n2J28J33l61J88J19m5K54k68l3k2L4J15j67K34k06J49m23M17o9
6681a2l65M91K1j23k29J32Jk8J18k0J57l02L06kl09K7K35j38k50L87J8l1J55p8
6705A61m98J49N20k47j77N2P5k00K85J10m14J37K18j22p1K4k83O3K22K9m6j73
6727a86j3K52K34k81n67N56P0m7m50N87j50k10O7K76k59L30l01M7j82P3R2r9J98
6750C7l13J43M61j13m17J97j5O6J8o7J18k81M52q5j89j2P3J24j18j83M9p1Q4K33
6774A91l85K02Rj63N1J27O1k38K24l18J83J56j59K2J58o3l38K68J15k42L95l14
6796e8k19Q8J47O3o1J46L7j52M1k9K37K8m5l55J48Q5j82j43N10k43L05n1l15K04
6820A86J5j08Ml0J44k38P6J81k05j20L14j07mJ22o8k65j2q5J1l73O17J74k47J96
$$ y = [117, 256, -137, -189, -61, 72, -289, -101, 18, -27, 227, -41, -74, -96, -62, 53, -114, 120, -86, 63, -360, 57, -12, -377, 114, 135, 12, -217, -85, -84, -112, 6, -14, 143, -159, 147, 145, -164, -137, 98, -40, -290, 97, 115, 84, 239, 161, -337, -188, 332, 85, -92, -40, 35, -165, 120, 230, -184, -47, 171, 49, -22, 2, -281, -218, 4, 33, -13, -186, -199, 53, 287, 6, -561, -5, 65, 18, -432, 155, 5, -205, -138, 138, -121, 209, -92, -45, -227, -154, -62, -161, 37, -276, -133, 328, 215, -202, -5, -20, 46, 64, -3, 115, -166, 286, 201, 12, 0, 73, 197, 79, -104, -55, -126, -42, 191, -194, 8, 17, -146, -95, 32, 93, -145, 79, -239, -56, 100, -59, -37, 121, 58, -280, -12, 103, -139, 256, -58, -277, -189, -42, 21, -40, 106, 143, -9, 32, 3, 240, 268, 223, -132, 16, 101, -81, -224, 286, 43, 348, 297, -18, 186, 201, 93, 97, 67, 211, -27, 49, 230, 25, -95, 219, 112, 108, 230, 162, -103, -115, -200, -189, -562, 55, 229, -18, 178]
6844A78j79j1m9j09J18J19J59l61j17K40m9Q9N4j18j11K74m6o1j40J66j62J58
6866D2J4j32J96J36l16K54r5k7n9R3j17J38l43R1l8L95r7j95K70j47J93l48R6
6889Dr2j6N4K5q0jk4K66k08o9K44j21j2J86k87J62k14J98k18J33K72l32L5P7P9
6914F1j22K7p6J61k13L40k32k0N7J15k85J12R3K2j94J60J9k22K73k41Q9K07j61
6937c0l6K71k66J99k10M2m8K0N5M5j52N0j43L76l29l10M72k8J29j95L10j09N0
6960A63j9j21mL29m75m4L79L0j58J06j13k58j06K83j8M7L0N4J8Q5l86O8J41l29
6984b98L70Q4j44J19j11k24J34K73k56r5K7K20n3L4%J55n65J07L22J7j65K08m12
7007b53K84j97j50L51j29L03n36N09r7j52q4M0J26l4j60K94m0k97J64K76j45n5
$$ y = [178, -1, -12, -61, -170, -52, 67, 226, -135, -252, -12, -61, 28, 82, -36, -147, 127, 81, 20, -120, 46, -116, 42, 56, -76, 120, 256, -60, 194, 99, 72, 13, 106, -11, 127, -216, -125, -163, 232, 135, -60, 210, 63, 256, -92, 4, -88, -104, -50, -25, -105, -106, -130, 136, -72, -141, 103, -18, -30, 156, -131, 31, -183, 15, -203, -70, 202, -130, -95, -18, 61, -61, -34, -110, 51, -162, 178, -54, -74, -17, 98, -187, -75, 18, 40, -154, 6, 25, -197, 76, -165, -76, 131, -30, -66, 205, -61, 138, -72, -30, -78, -58, -3, 42, -110, -60, -203, 173, -156, -466, 6, -22, 107, -88, 222, 113, 163, 144, 23, 19, 348, -127, -171, 208, 238, 80, 186, 73, -185, -291, -8, -26, 21, 51, 105, 123, 208, -178, -110, 31, -298, 72, 156, 12, 131, 20, -204, -70, 203, -53, -148, -121, 99, 46, 80, 80, 235, -330, -223, 99, 116, -49, 159, -253, 31, -166, -316, 35, -94, 209, -327, 182, 85, -67, -151, -111, 15, -19, -179, 115, 75, -222, -58, 218, 73, 18]
7029A8K64k21o7k35L18J23j98m9l7r8J03J84lk44L23j11q2j25M55l02J20j50r
7052b3j08K87j80J43K18n48J99L1q3J34j45J15K1j5r1j51O34l29j6m53N19l87
7074b28J68mK8K21j88m9J48l54J00K89o17N32q8l2N0J65k03o7J09K56l52J12j73
7097a77j56K68k52J71L94J75o23J97j78J49J60l50J06N6K1K83k99m0Nr0J10J02
7119C2K0k37L19J73k59J28k81K5L7N3m3j77L06j13K41J3m14J28L67m82J62J3j86
7142a75k05K13PJ08K12l4j5l6K93m12j49N6K5J06J58j50j77J31J03J7K08k45N7
7165I6j46n6K73m26J15K66k89O8M26n98M02k78k3J71L69k01l64L39Qj37pK5J1
7188D4l0K34j11l96L10m7k05M43j73k67N64n74k0L24l5j65R4k34M74M8l13M8l5
$$ y = [18, 282, 61, -6, -241, 77, 200, 2, -47, -84, -182, -79, 105, 102, -142, 181, 70, -12, -137, 318, 16, 136, -14, -23, -131, 156, -24, 119, 337, -211, -12, 19, -64, 70, -75, 40, 61, 46, -45, -196, 438, 109, 93, -360, 159, -228, -60, -64, -36, 185, -3, -52, 96, -258, -158, 131, -486, 46, -42, -74, -24, 141, -62, -129, -20, 236, -116, -4, -177, -333, -65, -317, -146, 248, 423, -200, -3, -181, -32, 128, -222, -116, -60, -39, 244, -55, -95, -90, -180, -70, 32, 52, -185, 134, 307, 48, 176, -105, -80, -43, 10, -33, -210, 96, -17, 224, 237, -177, -49, 318, -164, -2, 11, -175, -380, -167, -160, -52, 160, 126, 111, 75, 368, -44, -193, -137, -112, -6, 152, 2, -175, -44, 59, 76, 284, 39, 96, -50, -106, 167, -259, -144, 122, -167, -99, 327, -271, 131, -147, -170, 1, 370, 169, -195, 144, 152, 15, 8, 33, 44, 14, 248, 137, -259, 51, 4, -201, 242, 69, -198, 366, -208, -228, 96, 61, -104, -10, -244, 230, 278, -35, 13, -22]
7211b2j98R2J98j84K10k45J08J18J21m76N82m29J73k70k43K85J18K30l14k62L81
7232b7K7k54L97k54K4R8Q9k27K38M3n47K77K38o2p1j10L50k48p0J1J44R6j26k98
7256b62K15J39k03M5O9n5q9J87J14j38k45M47j53r7l11K02J39K26j14k82LQ6j9
7279i6J73l71R8K45o6k82M07l63N04l08K18m0n3j00L8o2K03m9J7O6j61j02m4M94
7303C66n13K5L59k24m6J86n23L91J73m48J82j29J49M0M9J19j41j98N52n5k57j68
7325a11J53j86l8L58m4m36O10j3k24K8L6j80Q9Pl28M46k60k36M13J2o6P2j79K44
7349A67m49K83m8N4R1j93k46N82j13k2j54J40J26n67K15J67J23p9J14n72L07K78
7371B04l02o2K77N3r3n3Q9j01J52k81J13L0Q5j05j65N35n96K71M6j85J94q1Q8
$$ y = [-22, -220, -128, 70, -114, 96, -149, -41, 77, 198, -278, 304, -125, 48, -222, -465, -180, -62, 168, -146, -408, -27, 0, -254, 143, -111, -87, 11, 100, -127, 111, 154, -393, -116, 122, 60, -11, -121, 229, -19, -89, -78, 66, 162, 36, -262, -47, 92, -111, -66, 3, -52, -141, 46, 160, 22, -223, 224, 71, -26, -337, -135, 4, 230, 116, -166, -163, -77, -96, 77, -294, -196, 49, -17, -299, 108, -255, 249, -59, 159, 119, 66, -34, 4, -58, 145, 96, 113, 179, 18, -84, -128, 366, -147, -122, 237, 13, -33, 153, -370, 21, 194, -254, -72, -201, -52, -12, 37, 156, 15, -183, 369, 314, 57, -111, 42, -144, -182, 176, 132, -304, 306, 293, 69, 97, 133, -47, 42, 49, -279, 167, -93, -329, 84, 96, 30, 102, -77, 167, -282, 1, -47, 7, 98, -95, -341, 241, 128, 106, -48, 92, 218, -349, -134, 33, 156, 77, 191, -381, -74, 204, -98, -160, 117, 170, 77, 24, 113, 12, 164, -117, -4, 26, 111, 6, -159, 376, -220, 51, 97, -88, 106, 25, 113]
7394A13j05N87l43m48m2J92J68J28p7l84L75k21n2R8M7l21L1K23k7j06L54l51
7416a61L71k96J72k59J79q2M5j47J30J57j55J92k41R5J38j19k47M19k19j96K20
7437dR2j49n6%L45l34L49j52k39q8L19j59j36L43q1l05L45J36n28L49j81O0j03
7460a77J54J49J35q4m11K72l0KM3j47J36j24K16j62q8n4LQ3L42o3k22q3j92M64
7484A62k81p5R8K89k16K45j62j65L1J03k20J59M17n37K1R7L73p1j81J4j48m6j64
7507b57L03PK87j02j77j42J16R1k62M65j83k05L2m1jJ34K3k74L23k41j17M06j45
7530D0k96K24L76l40o6J16l0oJ47k24j57j8J02L54j35N1j64M2K38l19J55rK3O0
7554A64l17L78k02O4j67J4K09Q7l05l7K00o1L2Rj10j97L40Ok9n0j00j54K38J29
$$ y = [113, 8, 595, 252, -196, -238, -46, 122, 250, 173, -211, 164, -57, -109, -11, 36, -285, -254, -31, -58, -164, 190, -161, 210, -86, 86, -173, 6, -76, -31, -178, -48, 109, -46, 146, -95, 0, 138, 19, -228, 191, -28, -224, -4, 88, -61, -117, -117, 228, -106, 243, 91, -148, -236, 83, -76, -212, 131, 50, -255, 90, 226, -302, 47, -134, -74, -177, -23, 126, 261, 177, -234, 38, 8, 10, 53, -94, 42, -82, 134, -28, -116, -170, -167, -84, 258, 195, -27, -110, -302, 162, -119, -194, -96, 193, -23, 222, 60, -105, -74, 29, -191, -32, 385, -152, -131, -34, 339, 268, 87, 101, -47, -93, -257, 46, 53, 340, 238, 61, -81, 35, 126, -136, 329, 146, -59, -27, -68, -69, 65, 88, -186, 137, -104, -221, 185, 40, -256, -32, 344, 4, -62, 54, 24, 18, 165, -59, -216, -234, -132, 222, 87, 138, -26, 16, 254, -65, 90, 81, 104, 164, -153, 225, 23, 87, -80, -66, 143, 230, -75, -112, 88, 27, 59, 68, -42, -239, 101, 107, 78, 28, -72, -226, 12, 141]
7578A41j84j79N2m8K02J41k11k6J42Kl5R3R9q2q3M73o12M8J39o4j86J38L00n04
7602b44N6M62j81j48J16J85k22J48l11o9L91l50J97K29k8j50M6o2j22q9J72j13
7624h7M4m0J73j30J01j89j2K06J49k24NJ71kj59k03J11j36K36J6j06n0lK16J87
7648B74k82L6k15j13L84q2L53j51n75K84K74j72Q3r0J21l59M66m37QN80mm04P4
7671E3j52L9J63k04j01q4L76j28l8J13pj07J11j26J41K9k15J02R7q7n0J8K32k68
7695i3j16M0J41j3P4J20k91O1j01J37MJ31J01j01L34m45K2KP5j07l6L42k61Q8
7719A08n9k39L33j73P0N3P8j25qk2K47l25K21r8j52K11n1Jj23J4l32J11K11J17
7743F8J3J29m1p6j71O3m16L35K63j85J1K26k40m12L39k1k0k6j2r6M39j24k06M22
$$ y = [141, -43, -222, -170, -218, -16, 125, -86, -112, 30, 32, -3, 90, 189, 107, 24, 497, -115, -67, 72, 8, -178, -40, 260, -244, -188, 274, 93, -55, 61, 246, 24, 172, -139, -208, 183, -167, 30, 259, 231, 81, 127, 65, -57, -146, 26, -87, -43, -83, 90, -40, 61, -128, -140, 66, 215, -9, -4, 167, 165, 6, -197, -86, -222, 14, 30, -76, -126, -129, 87, 274, -8, 28, -187, -300, 84, 2, 355, 204, -371, -87, 187, 15, 98, 8, 129, -230, 236, -201, -193, 387, 383, -21, 53, -99, -60, 103, -101, -202, -286, 90, -38, -76, 37, 30, -77, 34, -92, 49, 78, -137, -35, 62, -25, -75, -57, 175, -93, -209, -169, -28, -41, 33, 153, -138, -77, -178, -41, -37, 94, 195, 94, 428, -17, 5, 7, 82, -25, -61, 281, 20, 108, 49, -190, 143, -30, 40, 93, 171, 46, 38, 16, 263, -62, 159, 61, -91, 120, 69, 70, -53, -39, -371, -260, -49, 68, 81, 210, 169, 93, -78, -15, -431, -96, 167, -18, -7, 219, -21, -433, -94, -115, -135, -161, -173, -269, 170, 46, -160, 262]
7767B62k23J08l53J31P8k54L77L9k52j8Mo4M29r1j9m16K97M92o24J21k46J46k31
7790c07P32k95j34K36k87mK10m1l51J30K44l52J19J59m4k89K11j75J38K5K35k34
7812g4L4L62n11J08J71j90J21L27q0m91K01K16k40K2P6r3K39j86j49J2O2J09o8
7835b2J66m04K67j73k02K21R0J78k83J56J18N0J70j90n2l7j3j22j29J64K81l77
7857a43J00r2J84q6K6k2N7j3K27rol61K34M5o5O5n8k3r2n3L9K21j95J96j90k2
7883c6q7L14j62o9J53L4k8l6j11K01j38K34j88k7n7j48K17J22Mk52O5l67K74R5
7907Gj68K33k33J82j89kp6M76m95k1J10q7J69o6K36l5J12m19j51K80RJ5K66j84
7931c1J10q8J70k64K48k9k77K17J23j30k08J97n5ON29n91k8J87j70k59L55Kj91
$$ y = [262, 39, 147, -206, -75, 3, -251, 126, 165, -87, -105, -101, -165, 264, 173, 154, -262, 35, 527, -97, 24, -222, -76, -307, 425, 130, -4, 232, -55, -59, 151, 110, -241, -111, 133, -219, -100, 59, 15, -274, -63, -238, -100, -75, 160, -74, -40, 322, -189, -81, 90, -100, 21, 348, 268, -223, -22, 194, -46, -24, 52, -41, 198, 12, -137, -125, -63, 46, -22, 144, -260, 7, -166, -368, -147, -57, 121, -162, -6, 112, 162, 332, 142, 90, 53, 40, -82, -211, -47, 234, -143, -43, -135, 49, -37, -11, -33, 24, 11, 238, 229, 223, -138, 96, 141, 76, 141, 83, 60, -32, -85, -46, 175, -20, 176, -14, -36, -123, 191, 29, -40, 113, 147, 119, 83, -28, 173, 35, 269, 81, 54, -3, -151, 66, 188, 192, -60, 5, -362, -88, 7, -161, 72, -161, 21, -168, -170, -246, 230, -265, -286, -176, -263, -94, -160, 76, 41, 153, -266, -417, -137, -128, -113, 153, -31, 79, -9, 161, -103, 145, 116, -161, 56, 179, 49, -159, 38, -17, -11, 518, -73, -101, 86, -84, -343, 12, 14, -177]
7954a77K66J01j92Q5j76J0K58j55l70J34K84K19j74L8J02l14k9j49J01l0j64N28
7976A96m3l5%k34k9L86k65L85j90k96J99J3j49N3K44k15R6l06L33m20M03k70L12
7999A68R1l60L9M41m19l7K08o0q5L18l55M39o12N9L13j27K27k55p4J56J22j87
8021A0l87L77Q0m02L95J7j90J25J36q9l39K98J53l4l04L09J24k49P6q2R3P1m03
8044b15L86o4oj84K28n4p5n5M9K96l63L5N9N6m69N68j33L06l67k3j01K13nj47
8068f5J41j75Q8J2k98L95j56K38r2k25J41j60L19j41j18m5J6J9J6J8J61O4J54
8091C07p13K89J99K2k92K47J99l48j9j33M27m07J09J35k68L14rk14p3N3M6l0K90
8114A31o7J43m22L61l77N12j59j35j77NK97j23j67K79k48J33k0j25r1J16K21m1
$$ y = [-177, 89, 190, -2, 83, -93, -83, 175, 20, -350, -216, 68, 287, 113, 151, 253, -61, -90, -239, -138, -168, -332, 196, 153, 118, 118, -116, -145, 241, -24, 361, 171, -125, 74, 87, -62, -9, 235, 20, 116, -190, 143, -277, 126, -144, 168, 259, -101, -62, 379, -40, -77, 131, 71, -14, 304, -51, 388, -224, -165, 148, 21, 248, -7, -81, 75, 197, 10, -377, 0, 80, -322, 73, 90, -100, 25, 161, 72, -267, 31, 184, 150, -154, 155, 279, 30, 106, 24, 117, 188, -215, 171, 107, 101, -83, 145, 91, 16, -39, 10, 306, -57, -22, 37, 93, -376, 192, 59, 365, -2, -25, -126, 87, 82, -65, 76, -99, -11, 1, -297, 98, -58, 180, 88, -137, 4, -156, 163, 22, -96, -141, -125, -106, -90, -72, 89, 153, 307, -406, -117, 82, 104, -188, 59, 258, -90, -109, -242, 185, -222, -113, 22, -246, 68, 59, -155, -228, -175, -129, -159, 131, 64, 207, -215, 146, -231, 281, 122, -13, -190, -185, 112, -11, -178, 101, -147, -14, -34, -159, -250, -134, 87, 46]
8136D6j47K34j45J65n9j90J03Kk19L71j72Q8j62J40m81K59N12m09K01Q1k51K08
8158A75k64q4J49J34l5j22K02l8j7kJ08Kj38j52N2K58m14M69k17j41J51j47Ll2
8182a00j72O0M65l94L60j84J84j94j12
$$ y = [46, -101, 133, -12, 153, 94, -96, 7, 9, -210, 161, -11, 77, -85, 55, -426, -167, 345, -64, 137, 218, -33, 175, -89, -173, -24, 110, 75, -47, 155, 117, 100, 98, 206, 208, 70, -82, -30, 228, -186, 283, 66, -75, 76, -71, -68, -100, -272, -212, 253, -141, 219, 35, 219, 25, -87]
8191h7
$$ Imaginary data points
##PAGE= N=2
##DATA TABLE= (X++(I..I)), XYDATA
0@%%%%%%%%%%%JrJ6j6J6j7K4l1L2l9M7n1N9o8P7q9J02j14J29j46J63j82K04k28
35a20K53k82L13l45L83m25M72n23N79o41P12p91Q79r84J104j246J419j632J901
54A026k254K740l452M599o747J2081m6254r4664R0026N5395k0523k1774j4537
67d4338q742M4705J0862n2188j4752K7169j880J5363K2865l2321j9760L5176n834
80b3675k4204L4681R398m4879J4957M7853j4090k2732K571j4962J4780M6384j6940
93I142m1290K5168K4606j5222L610j0034l5205L0062N3594k7808l3843K2240J901
106F921j2501J9341p405k7680K2573J8482k2028P933J1884l8533o746M1534k861
119A0914j8672J4618j2294j7887L7484Q875n2303o003L7294N747L774J853l6751
$$ y = [0, 0, 0, 0, 0, 0, 0, 0, 0, 0, 0, 0, 1, -8, 8, -8, 8, -9, 15, -16, 16, -23, 24, -27, 32, -36, 41, -48, 54, -60, 69, -77, 86, -96, 108, -120, 133, -149, 164, -181, 202, -223, 249, -274, 305, -336, 376, -415, 464, -520, 584, -662, 757, -875, 1026, -1228, 1512, -1940, 2659, -4088, 7993, -38261, -132925, -42899, 12496, -8027, -29801, -44338, -53080, -8375, 2487, -49701, -64453, -37284, -39164, -23801, -936, -33257, -53017, -17841, -23675, -47879, -13198, -3800, -48679, -33722, 14131, 41, -22691, -20120, -35082, -20302, 26082, 9142, -32148, -6980, 17626, 2404, 6014, -4020, -39225, -9163, 44431, 16623, -17220, 5020, 6921, -5580, 13761, 6356, -21324, 1249, 19731, -2297, 5636, 17520, -21013, -27759, 13775, 10914, -7758, 6860, -5434, -23321, 14163, 23038, -29265, -35268, 2026, 7773, 11547, 13400, -23351]
132b3351l892M7099n812l8468J2584J5330o652K2797M745m2413J545L4792j3876
145D428j0527K5318r849j8329K6040K830k5629J1590N341k4795J9874L2935k8317
158A0910k2109J8273n078m731K1388j8137k7617L5299K5159l1804j1668N795j5506
171a9826J2728K5429k6709j7511L1264O54k1982J3996l113k7195J8812K4781k0042
184h714j491J4099k3150m740L2124p778k4308J6916R194q549K0313k066l9758
197b7908Q078L5421j1510r716J6378j1965n155L0602q818l5739J4418J9515j2751
210H50Q410J1312k4755p10K3022j7491j2508K4618p493k0477K5086R225k8735
223i646J449R783j9408Q851K4916k2137j6265K4422j400j5842J0160r278j9882
$$ y = [-23351, -27243, 19856, 14044, -24424, -11840, 3490, -3162, 19635, 24380, -18033, -16488, 18304, 4428, -6099, 19219, 9370, -8959, 17081, 19911, -5718, 5872, 11213, -13582, 6292, 39227, 10910, -11199, 7074, 1996, -2735, 18653, 516, -27101, 8198, 33357, 1553, -10115, -4320, -19826, -7098, 18331, -8378, -25889, 5375, 6029, -15953, -1957, -5070, -32265, -13453, 11328, -8714, -10205, 3894, -19256, -23996, 8128, 350, -23958, -7042, 2152, -6397, 13916, 11850, -27908, -19830, 15591, 4081, -5635, 10743, -1222, -6377, 24225, 15407, -20332, -5914, 13601, 850, 9260, 20572, -4183, -4893, 18129, 638, -11870, 12748, 5255, -15222, 9864, 19089, -9646, -8197, 1586, -17822, -8971, 15945, -6192, -22457, 1965, 565, -15277, -5117, -14395, -34277]
236c4277K8835J9034k9785l528J8581j6067k572K1554j5548j5994K8043P587j9750
249a3887Q241J956k0886J3075K1191j8849j578K0138j4741q478K5886p777k6192
262b1901J7828J4096j2796J0955O939k7462J748K5669j3029j3990J6294m155o366
275f170K3376n126l1030J0471J6141j6928M952J6418j9253o551K3018r307j6503
288a6492J4166k395j4763K2356J0487k5535O64J3309j5468L202K0593j8167j3394
301b1437K8194N978j9676N821j746j5972J9826J8008k3911m234K1077p875n289
314a236J4752j4607j5457K7042R081k0378O953P552k0301M701J9184j5870q154
327f738J8830o041q609J8719p544k5543J3365J3828j4525N645R221k0916N96K4807
$$ y = [-34277, -5442, 13592, -16193, -19721, -1140, -17207, -19779, 1775, -13773, -29767, -1724, 5863, -13887, -5646, -3690, -24576, -11501, 9690, -9159, -10737, 9401, -5340, -13818, 12068, 4291, -21901, -4073, 10023, -2773, 8182, 15121, -12341, -10593, 15076, 2047, -11943, 4351, 196, -6170, 17206, 12080, -18950, -8479, 7662, -9266, -4314, 12104, -7149, -13700, 9318, 11, -16492, -2326, -4721, -19484, 2872, 13359, -12176, -11512, 1797, -13671, -10469, 10124, -8043, -21437, 6757, 12735, -6941, -1120, -2866, -18838, 988, 18996, -4915, -9149, 11928, 4053, -1236, 13516, -1091, -16548, 10494, 19575, -803, 6150, 13702, -6599, -1898, 17286, 1416, -6738, 12092, 6051, -2558, 16161, 8617, -16926, -3561, 10267, -4258, 1387, 10608, -10308, -9712, 15095]
341A5095j3690k0292J3403K207o042J8130j078k6833P705J7585j4439k529J2526
354A748j2495j364K4202p374k1263J2131M185j3597J5884J1245k1818j52J8604
367I936q638m615J1271j4118q366K7971M991k2638L742O173j1390J1357J0617
380A6293k4453l986K7047k372j3779P469q610j2357K0717P122k1652M796J2330
393H565j3789J589J3796j8159j0551K0716O54j0404J4042l402k2901J1746J7059
406H961j5106l898R202q694N402K0479j6087k1901J6566R986q982Q949J17j8110
420a3116J1957K0078j8474j2275J4202k570k159J8382n959j9873J1481Q141j3489
433c674O707P623j8520K792K1519r322j3101R047n982q699K0281K517k2850L895
$$ y = [15095, 1405, -18887, -5484, -3277, -9319, 8811, 7733, -19100, -11395, 6190, -8249, -10778, 1748, -10747, -12111, 12091, 4717, -16546, -4415, -230, -13827, 2057, 13302, -8516, -8668, 9936, 1298, -3317, 7954, -6164, -14530, 13441, 18432, -4206, -464, 5709, -5681, 5676, 16293, -8160, -12146, 14901, 12529, -1250, 6219, -2391, -14748, 5969, 13091, -8561, -3765, 8565, -5224, -3635, 10161, -7998, -18549, 2167, 2821, -7583, 6459, 3057, -19844, -8098, 8961, -6145, -10043, -841, -9535, -4133, 16346, 259, -21642, -5076, 4910, -4072, 4877, 4994, -13116, -1159, 18919, 445, -11830, 2372, -198, -2357, 16025, 10066, -9807, 1674, 9815, -3674, 3033, 10656, -7864, -5072, 16447, 7125, -5976, 3071, -2911, -11610, 8671, 11188, -11662, -7767]
447g767J3755q579O6M822j8613p69K5576m222j7271Q541P26j1373J2726M764k0081
462a7699L986J8229r033l793J1808j1917j0018J7387K976j1455J0129J317j5419
475a3502J2359J4431j9795p613J5843j036p34J2967j1642j6274J8349R914j7173
488c906N68O836q551R380J2881j9732j0186J7725j384j0340J1131j339j3591J1593
502A085Q259j6971k08J0233j2041j85J7329o853j2784R672q22q453J2585N34j9533
517a8153Q363J8905j0407o985P066q471j312J8488m921j6125J1943Q869j0512
530c252M476L994j4620M275J7516q951o028J2721o031j0933J4705L075j5331O640
544B256P971r896N692R844j7222o863J6387q10q546Q049m732r803J5600N348k1232
$$ y = [-7767, 5988, -2591, -2525, 2297, -16316, -17085, 8491, 4269, -13002, -4461, -3735, -15108, -2382, 2382, -17699, -13713, 4516, -4517, -8310, 3498, -8419, -18437, -1050, 1926, -9529, 600, 1917, -13502, -1143, 13288, -6507, -14120, 1723, 687, -47, 12920, 1278, -14996, 3353, 13267, -3906, -3338, 3498, -5053, 4327, 17208, -2524, -12710, 5015, 3631, -6709, 4422, 3083, -10508, 1085, 9344, -7627, -7835, 2398, -9643, -9828, 7501, 648, -12136, -2464, -3286, -11739, 846, 1380, -18153, -9790, 9115, -1292, -8277, -1211, -9682, -10994, 7494, 2573, -13552, -1609, 7260, -3252, 1224, 5218, -9402, -5127, 12389, 3438, -2590, 10131, 4100, -6833, 7872, 10947, -4384, 2256, 10227, 331, 6023, 15867, -1355, -8218, 8169, 7359, -1187, 6862, 2130, -7673, 7927, 13275, -7957]
559g957p61J3144o049n37J0008j1251p539J5401k178j3873Q619M077j1288Q239
573a945Q981j4103r10J0802j0275k933J7279m404j3409J0877N422r429N199K210
587C362j3516P285J6609j0624p537J0212l625n048J2462l998j4794J2412J0325
600A3525j2428J54P861j1266r28J2370o732o296J1488l393j0879J0718L252j5905
614h459L106R280q111K346R696j3594p179J5638q71j2584O204K037p143J0087
628D53M992j6897P83J3139p890l541J1525n360p175J3350%j3111P652N464j0723
643g339N253J1726r594l855R901o557m190J3473l537j2732J0928Q387j0584J102
657B382M541j1502L297J4128r963q932J1195K85p375P459k038j3120Q663R020
$$ y = [-7957, -8718, 4426, -1623, -2160, 7848, -3403, -10942, 4459, 2281, -11592, -2973, 1104, -10184, -1945, 7036, -7067, -7977, 2825, -7450, -10383, 6896, 2492, -10917, -40, 5382, -4047, 1152, 3362, -10154, -2869, 13740, 3116, -4421, 5791, 2166, -2882, 9580, 5582, -9212, 3200, 13525, 1097, 1251, 9112, -2154, -3082, 9288, 2556, -3740, 7748, 4355, -6524, 4194, 7446, -8459, -5353, 3927, -4184, -1838, 7858, -5736, -12915, 2723, 1852, -10732, -4528, -2491, -9634, 453, 5445, -11452, -10669, 2470, -5420, -8961, 2564, -2796, -9971, 3379, 3379, -9732, -2080, 3384, -7339, -2086, 9640, 46, -3809, 6092, -465, -4655, 8818, 5281, -7451, 3477, 11864, 1280, 2382, 6923, -4579, -1282, 12846, 2883, -6049, 5146, 5431, -1944, 5515, 3477, -9643, -980, 8040]
671H040j1466o41Q883r389m264J1951m639r248R680J257r316Q693M478j5427J113
686a0295J1341n852j086Q577q300n258J5019R0j3762M874O205o723P108O295j3147
701d914q47J4324n460o800R198k069o456J0866K427j1961M564N978j0374L127
715A603J2092r533o814J0705j781o139Q073l535j2749J0388J0250j1389l357N490
729C304o053J671R577j0323r168J3015K988r756M391J079j0878O462R678j0857
743d870l110J0594m972m578R958k959r697P868M264p375O621M461j3285J367J3551
758G838n929o831P448k237k996J1834j270j4090M585R302o239O41M626r628O99
773b247J3108o164j0037Q192J72p427Q425L644j1889Q79P940o699l69P335q715
$$ y = [8040, -3426, -4067, 4816, -4573, -8837, 3114, -1525, -10773, -1093, 164, -9152, -459, 4019, -11408, -10295, 1046, -4806, -5892, 2685, -5615, -10873, 4146, 4236, -9526, -4652, 1553, -5170, 1938, 8233, -4914, -5761, 8563, 3103, -3697, 5501, 3432, -3024, 7842, 10269, -1692, 2872, 8850, -1524, 1603, 13695, 4162, -2652, 8053, 6272, 133, 8206, 4671, -8078, 2310, 12560, 1171, -2186, 3304, -2749, -1078, 8499, -1824, -10992, 2023, 5011, -4745, -354, 725, -10153, -3691, 5987, -4870, -7980, 2614, -2358, -6936, 3022, 63, -9634, -1766, 2498, -4877, 1744, 6205, -7080, -5713, 7838, 1909, -4922, 2526, 289, -2707, 9127, 7857, -6233, -1648, 7654, 1415, 2056, 6682, -2946, -2247, 10861, 4697, -5340, 2852, 3024, -4403, 4022, 7666, -4223, -3344, 4596, -2103, -2472, 4863, -3852]
788c852n404J2492P19r003L550m70p952R323P665j4036l136J1873j766l086N316
803B233o576n975J3141L137j1319L010N409o991L731Q056j0124l313J1826k237
817D008n594Q394j587j0259O876P118p734J712M229q286K034J1685q212r695Q184
832B873K204n140O819j456j1723O041R532q811l796N984m818j311J0006n299j0074
847h969Q020K443p410M822L626j0548J768J0315o154m049O312m450m497J1536
861B765M97j0815M328N077n538L946M524j0931p9J3014k726p463N593j065n105
876c978R212K130j1069K813P775n835n7O311p656m261J0828r65p515O177k73q565
892d928O941N496r857j573P257m488p30Q005o880q158R474L123p858L212J531
$$ y = [-3852, -9256, 3236, 3955, -5048, -1498, -1968, -9920, -597, 7068, -6968, -10104, 1769, 3, -3083, 2233, -4343, -10318, 2823, 5960, -5359, -2349, 3060, -3931, -200, 7856, -2268, -5581, 6245, 4008, -1586, 6808, 5221, -5038, 1838, 8956, 1222, 2934, 7163, -1123, 911, 12596, 4384, -5311, 2873, 5077, -63, 6756, 5300, -6423, -382, 9150, 339, -3457, 2527, -2291, -3602, 6404, 1105, -8969, -949, 1494, -5916, -1094, 2532, -8016, -6248, 4067, -2087, -6136, 176, -4274, -8771, 2765, 3262, -7553, -3225, 1852, -3686, 260, 4784, -6147, -6226, 6788, 4062, -3401, 2192, 1127, -3978, 5234, 7364, -3705, -892, 6883, 1048, 991, 7302, -354, -4615, 6213, 5248, -2267, 3910, 3637, -4928, 2013, 7509, -2348, -3921, 3336, -1152, -1882, 6123, -757, -8915, 559, 3682, -4176, -964, 567]
907E67p729M924Q231r738l880Q658k444k983P570l345q301Q400M936q652J826
922a960N020o954J627R149n351n511P472j569m569Q073p6r601M652P016o466j48
938H04N096p344j458J0882l110q333N360J480n256N165J552j0119K694Q194n806
953a99k769O230n191m617R280n33q774N044L532p239L545N169p932j867P882l019
969a458k964P122l816o501Q729L508r203K563M997o423K629P624p819m119R004
984C873o02m904N489n06p257P486M580r320L24O922o049r50Q252m454o512P512
1000C884Q74p304O063J488r072K906O998o095j672N382n392k068R162k684r247
1015f777N584L802n993K977L218q368J606Q608n138m227O406k087m363P226N34
$$ y = [567, -7162, -2238, 5993, -3745, -7625, 1033, -1411, -4394, 3176, -169, -8470, -70, 4866, -3786, -1960, 3060, -3894, -2267, 6882, 1531, -3980, 3492, 1923, -2646, 5427, 5351, -4250, 402, 7418, 952, 804, 5900, -1444, -2902, 7980, 4870, -3463, 1897, 3377, -1879, 3286, 4838, -5281, -2587, 5607, -199, -2968, 3262, -1929, -6546, 2734, 2201, -6573, -1529, 2003, -5236, -1691, 3478, -4454, -6321, 1561, -1458, -4422, 2700, -1116, -7617, 1112, 4620, -4583, -2020, 2977, -3446, -817, 6807, -1012, -5131, 3873, 3271, -1633, 3856, 3350, -3907, 3579, 8159, -1161, -837, 6085, 36, -914, 7338, 2884, -3628, 3884, 4758, -2546, 3517, 5005, -4067, -1161, 5837, -258, -1930, 3452, -1940, -4008, 5154, 2470, -6777, -1193, 2609, -3384, -407, 2811, -5557, -3951, 4657, -481, -4708, 1698, -389, -4752, 2474, 3008]
1030C008q059M557M197p044K598O699p006k819Q316j594m312N489k146o576Q353
1045C661L727r134O53N724m725P39O049o793m511R255P8p316L597J600o453M416
1061E67M529q012n81O710m880k860P835l099o841N793K387n811L995J983p954
1076f239K398Q867o101m177N727k051j829P298j856q879O161N388o132J420L646
1091C641n877O82Q589m519n431O965q12n072O397J546q116K681N307m956L86N031
1107F442o459k975R087r05o754L513K68n356O188L125r961k7Q052l773k636M273
1123B102m344l760Q079M68q094L713K861n798L221M849p663j540P602k845k898
1138d047O556k532o970O614M397o349P47L196n216L245P832p212n487P630M85
$$ y = [3008, -5051, -494, 3703, -3341, -743, 5956, -1050, -3869, 4447, 2853, -1459, 4030, 1884, -4692, 3661, 7388, -1746, -1093, 4631, -94, 645, 6694, -99, -4610, 4645, 4723, -2593, 1004, 2604, -3849, 567, 5096, -2916, -3497, 3213, -1667, -4527, 3308, 209, -6632, -839, 1548, -4263, -268, 1715, -6239, -3841, 5026, -1075, -5252, 475, -1576, -3405, 3893, 2037, -6842, -681, 4707, -1425, -5, 3641, -2236, -1554, 7035, 2516, -2915, 4050, 3238, -1834, 4563, 6109, -2007, 674, 5981, 1025, 1411, 6442, -17, -2992, 6095, 5190, -1564, 1949, 2217, -3139, 3049, 6174, -3787, -3814, 4238, 465, -2171, 2102, -2242, -6002, 2077, 2545, -5549, -1836, 1025, -4773, -1552, 3297, -4366, -5906, 1696, -1149, -4047, 2509, -23, -6993, -379, 4018, -2331, -1584, 1612, -3604, -359, 7473, 261, -5226, 2404, 2889]
1153B889l313M814j887o951O516N872p697j797N140m014K39O857m629n908O425
1168B556J001n522M192J223p798K516P253n272l071M799m458k257Q612j177q895
1183f298M029L801m317K779K454q530Q89Q906l196m438M573j708l533P330O22
1198C363q424L122N461m493R77M898o334k093Q479j691m239M386j007n159O531
1213C777L405q488n44N752k865K28M776n985m657Q188J335o646K153P78n073N146
1229A280M407q148k389O684k772k188N447l432n430O745J879o446K298K475o135
1244e725K033P535n435l705N626j735k911O618j153q096N681N561m998k48L376
1259B424n438J006Q285m007n632N601J160l997M589J74p145L220O119n087r35
$$ y = [2889, -424, 4390, 2503, -4448, 2068, 7940, 243, -1554, 3586, -428, -189, 6668, 2039, -3869, 2556, 3557, -1965, 2227, 3450, -4348, -1832, 5421, 149, -2922, 1877, -2581, -4838, 3774, 2597, -6298, -2269, 1532, -2785, -6, 2448, -6082, -5193, 3713, 517, -3921, 652, -1056, -4589, 2741, 3363, -5061, -1939, 3522, -971, 6, 4904, -1430, -3523, 4956, 3265, -974, 3412, 2405, -2754, 3777, 7182, -1306, -1850, 3902, 1037, 1265, 6041, 56, -4601, 3587, 4922, -1724, 429, 1207, -3866, 1280, 5687, -2461, -4850, 1834, -938, -3126, 2321, -1111, -6541, 204, 2083, -4363, -2065, 410, -5725, -3692, 3843, -1592, -5297, 329, -1406, -4317, 2301, 1148, -6948, -1267, 4294, -704, -952, 2424, -3014, -2008, 6277, 2270, -3362, 2239, 3399, -598, 3991, 4165, -2980, 240, 6359, 1272, 337]
1274C37M498m514k675P603j443o971M255J527m468L734K598q037m67O707k852
1289a68k522M401l726l743P995M57q260J739L608m077K847M117o522j973P241
1304A414k055m015M900j225m638O285L312p122J022M375m843J164O303m485m316
1319c924O836O11m381L956k88o164M755N213n753j449M599l604r45O132l633n959
1335c998O216K358n650K762J511o546K311N641n045k972N510k161l564N856j074
1350A155o939L903L466n027K479L146o662L1O798k640m375M506q73l519O822Q22
1366C093p879K158M971l945P65M390m853k221P846j345n445M126M36m674N043
1381B466L129o478Q7M813l773q75N329l523m585O746Q32n291K907M08n401K990
$$ y = [337, 4835, 321, -2354, 5249, 3806, -3165, 1090, 2617, -1851, 1883, 4481, -3556, -4023, 2684, -168, -2690, 1711, -2015, -5758, 2237, 2694, -5566, -3827, -219, -4296, -1449, 2668, -3854, -5827, 1414, -641, -4656, 244, -981, -5619, 666, 3978, -3144, -2122, 2253, -2590, -1426, 4877, 392, -3924, 2912, 3523, -858, 3098, 2810, -3354, 1401, 6614, 861, -588, 4011, 407, -538, 5594, 1961, -3998, 2218, 4576, -1074, 1688, 3199, -3347, -1036, 4605, -440, -3412, 2098, -63, -3627, 2229, 1155, -5784, -1881, 1585, -3442, -963, 2183, -4479, -4448, 2350, -290, -4665, -159, -1032, -4551, 2271, 3093, -4786, -2628, 2343, -1602, -837, 3553, -1300, -3521, 4325, 2980, -2465, 1661, 2097, -2577, 2466, 5595, -883, -796, 4017, 244, -631, 4698, 1175, -3410, 3336, 4168, -1123, 1784, 2192, -3209, -219]
1397b19M857n911k254N686k254k356N014l135n387N639K931n676J681K851n541
1412d074J130N757m587k986N510r72l159N240j89o386L111M225m188Q70L875m837
1428a660l68O570k577m919M325M95l731N201J490o973J591N375l782j658M379
1443C758l546k210O803q71n851K828J265m768L502L486n999r36N480k981k648
1458b688M779l210m280N660K571n691J368J968m374K081M559n619k351O397j166
1473Dk845L879j586m911M826L815n956J166L662l459L32N181m158l840N749K27
1489B086l337M097N49o575L206M809m835p12L751l031p19O067k538n822L725J760
1505B481l787L011J649o614K114N872m116l622M022k029k125N889j33o626K421
$$ y = [-219, 4638, -1273, -3527, 2159, -95, -2451, 2563, -572, -5959, -320, 2611, -3065, -1384, 1467, -4074, -2944, 2813, -1774, -4760, 750, -222, -3381, 1859, 1670, -4716, -1605, 2620, -1568, -698, 3177, -1660, -2028, 4542, 1965, -2954, 1371, 1866, -1865, 3336, 4826, -2147, -556, 4819, 1037, -621, 3758, 212, -1998, 4805, 3934, -1917, 911, 2176, -2592, 910, 4396, -1603, -2539, 2941, -40, -2688, 2091, -1119, -5399, 261, 2832, -2859, -1491, 477, -3897, -1816, 2743, -2876, -5227, 1170, 4, -2841, 1038, -548, -5459, -633, 3182, -2774, -1608, 2054, -1405, -1073, 4108, -50, -3890, 1859, 2086, -1251, 2846, 3395, -3180, 26, 4835, 0, -712, 3039, 8, -711, 5356, 2818, -3004, 721, 2481, -1306, 1705, 3354, -3260, -1146, 4726, 610, -3012, 1010, -1019, -3144, 2745, 2612, -4014, -1593]
1520a593K931l837J478L004n929o1O786k131l785L519j638l512N951J764o242
1535c295Q17M531k680L27L598n377j983O720L1l972K806M4m166L741L461o338
1551a735p2N030k352p85L940l760m049N370J383m532K415J407n105K742M444n314
1567i73k792M358j287j443N068k374n723M115L216m554Q05J702l894J716N936
1582C876l974m403M161k29k314M370j3n497L055M240l876j215L650m126K16O329
1598D250j962m599L998L9l589L746J780o038J514N251k867j291K879l646j823
1613b358N827k50n506K613K275l432K320K142o123q00N901j343k712L248j751
1628E1l668M868J120n739J540L215l388J590L375m991k594N428m51k707L435p71
$$ y = [-1593, 1338, -2499, -1021, 1983, -3946, -4007, 2779, 648, -3137, 382, -1256, -4768, 1183, 2947, -3295, -2478, 2053, -627, -300, 3298, -2079, -4062, 2658, 2689, -1283, 1523, 1567, -2599, 1142, 4603, -1735, -1807, 3223, 871, 86, 4026, 266, -3783, 1587, 2970, -1562, 853, 2260, -2845, -103, 4341, -973, -3765, 593, -694, -2137, 2931, 557, -5166, -1051, 2165, -2389, -1584, 118, -3776, -2060, 3876, -98, -4501, -340, -569, -2883, 1487, 1474, -4023, -968, 3272, -604, -1819, 1831, -2295, -2079, 4250, 2288, -2311, 1687, 1726, -1863, 1883, 3663, -2375, -861, 4390, 1523, 232, 3111, -535, -2358, 3469, 3219, -2287, 326, 2601, -831, 1489, 3631, -2492, -3292, 2609, 1266, -1446, 1802, 51, -3617, 1251, 2371, -3368, -1828, 1387, -2001, -411, 2964, -2027, -4621, 807, 356, -2351, 1084, 313]
1644C13l939M340L135n599l54L130k446Q95M670l786l804N445Q37m196K273P02
1660A616m136L321L992m678j623L971k825j394M820j300m654M432J657m552J724
1675C71J602n231R48N558k944k825L302j852j584M468p44n836K948L753l377O85
1691g58J885m222m21N363j662l679L943N14l041L263Q94n016J488L720k970P7
1707f22M207l316k725N045j02m042K292R49l208L086L158n585m82L664j695j056
1723d32L339k294l030M914O77n234J230K366l996J402M232m033j638M013k006
1738d90k701L983n94m292L535K292l752J014J979m272J97N312k486l522M114L78
1754F95k580L098k90n183L348L329k962k27L370k895j161M383j694l368L499J270
$$ y = [313, -3626, 714, 3849, -1750, -2104, 1026, -1420, -525, 4145, 359, -3445, 2000, 2837, -1359, 914, 1616, -2520, 801, 4793, 115, -1508, 2463, -362, -1756, 3064, 1764, -2890, 1542, 3199, -1353, 371, 1973, -3258, -2310, 3248, 304, -2521, 781, -1071, -2655, 1813, 1069, -4767, -1819, 1934, -1443, -758, 1127, -3095, -3516, 1847, 185, -3494, 449, 963, -2078, 1185, 2079, -2937, -1449, 2271, -699, -622, 3585, 269, -2456, 2589, 2487, -1555, 737, 1686, -1522, 1564, 4722, -863, -1345, 2319, 624, -432, 2907, 613, -2417, 2497, 3174, -2060, -830, 1536, -2460, -1058, 3174, -859, -2497, 1516, -490, -3191, 792, 198, -4094, -559, 1733, -2019, -1005, 974, -3298, -3101, 2211, -275, -3797, 317, 695, -1885, 1213, 923, -4260, -912, 2417, -545, -772, 2598, -297, -1458, 2925, 1231, -2137, 1362, 2632]
1770B632l225K431K110m684j23L704k723l28L643k399k759N098q5m877J462J797
1786A674l033K432K685n075r30M463j743k558K573o75k441L776J116m185O43K566
1802A288l853P14L910k610k086M012o10k703L447j027m177L439L435l474j53K171
1818A723k310m92M556k628l539M101J308k844K013L55m050J878L414l807m52L695
1834B921k236j838M062j079m406K360J613k925K656J491m685l3M416k507k138
1849b328K434r86j963M555Q0n537J406L014k301j65L024l303n94M742j165l804
1865b891L015l75k799L453J901l532M10L180k946n3L481k944k107M601R04l145
1881A53J503j84l289L041K964m060j302L971j189j278K198k012l105M224J615
$$ y = [2632, -593, 1838, 3948, -736, -859, 2845, 122, -206, 3437, 1038, -1721, 3377, 3292, -1585, -123, 1674, -1359, 1073, 3758, -1317, -2247, 2216, 473, -2085, 488, -187, -2628, 1148, 2264, -1921, -1278, 1288, -2565, -1851, 2059, -551, -2637, 1375, 765, -1938, 1509, 482, -3695, -256, 3179, -295, -448, 1723, -587, -1079, 3477, 849, -2690, 1411, 2719, -125, 1888, 2243, -1807, 71, 3485, -322, -774, 2921, 685, -1153, 2909, 1830, -2576, -216, 1397, -1528, 1128, 2619, -2066, -2099, 2317, -190, -2328, 106, -880, -2843, 1712, 1792, -3745, -2339, 675, -1626, -1791, 1233, -2070, -2664, 2078, 913, -2891, 124, -251, -3050, 403, 2304, -1228, -818, 2362, -584, -637, 2844, -100, -2207, 2394, 3298, 153, 1656, 1472, -1817, 1224, 4188, 128, -1174, 2797, 1608, 330, 2528, 516, -2589, 1635, 3250]
1896C250m057J216J667l345Q01L170l573j904L607r52j312L242j046m370K106
1911a500K514k434M67J734k941N72M447k633l768K856O68j644K941J76m184J935
1927g94L600l128r11L025k427l04M347r69l684K275P83k758K362J969m214K83
1943e45M106j927j491K081k211k149M589Q04m023P81J757k140J044J337l980P7
1959a890L879p02k527J954q82l133L452J207l745R29K385k531L62K759k811k282
1975c576L502Q0j606K363k92l705K950K998l711j201K783j277N17L095k191l223
1991b494L570J076l024J730P75k542J357L444l677j339K579q91j344K902n61l432
2007a871K304J668k674O86J127l385P49L943j622k911K166n73k016L331l48l895
$$ y = [3250, -807, 409, 2076, -1269, -468, 2702, -871, -2775, 832, -120, -1432, 1810, 764, -3606, -1500, 1014, -1420, -953, 781, -2160, -1588, 2859, 226, -3542, -686, -18, -1662, 1279, 1455, -2729, -794, 2806, -322, -1233, 1792, -635, -939, 3408, 2439, -1245, 1030, 1813, -945, 1417, 3386, -828, -545, 3561, 1634, 143, 2224, 13, -2136, 2453, 3257, -766, 15, 1772, -368, 676, 2013, -1967, -1890, 1989, 1287, -1240, 714, -168, -3301, 151, 1358, -2387, -1458, 927, -1604, -1242, 1517, -1294, -3576, -74, 6, -1600, 763, 471, -3234, -284, 2714, -997, -2198, 585, -692, -175, 2920, 729, -2494, 1076, 2152, -872, 858, 1633, -909, 448, 3892, 215, -1124, 1455, 564, -780, 2122, 1561, -1871, 433, 2101, -573, 113, 1240, -2145, -1396, 2547, 925, -1986, 180, -393, -2409, 922, 574, -3321]
2023c321K356K708k438q26J980k718k84L946j210k329K442K50k398J767J366l532
2039b241Q06L137j348o51L052k586k292L894K85l014J772J241k400K011J842l742
2055b34j113L693r57j324K257j043k216K791L66l372J125J848k258K77K884k822
2071i8j300K482q72j917K547l37k978K377J865k679l77J641k273L58L128j425
2087A42k543K642M68k269J744j58j986J478K595k326n33K409j935j071K899k25
2103A331k558K411M50k335K013J030l352O2L391j543q43K116j529j578K882j45
2119A803l427J496K169k653Q12J992k850j066L037j350k002K723k17k476K223
2134B14J301l113O2K185k622N64K919j827j970K865M6k333K078n37k252K580K130
$$ y = [-3321, -965, 1743, -695, -1521, 459, -2259, -2543, 1403, 193, -2136, 306, 556, -1842, -75, 1291, -2241, -1435, 1702, 354, -297, 2755, 169, -2123, 1771, 2056, -958, 814, 2055, -345, 1666, 3508, -234, -1347, 2346, 1389, 65, 2322, 1279, -937, 1854, 2220, -1152, -27, 1821, -437, -160, 2724, -98, -1398, 1084, 212, -1705, 842, 505, -2473, -96, 1769, -910, -1287, 354, -1919, -1561, 1567, 142, -2401, 241, 709, -1560, 184, 26, -1960, -482, 2113, -213, -746, 1663, -272, -1343, 1556, 1331, -1227, 1184, 1634, -701, 1312, 2342, -1010, -948, 2443, 900, 57, 2173, 644, -934, 1948, 1803, -1624, -128, 2041, -612, 200, 2192, -658, -1724, 1313, -37, -2039, 684, 467, -2009, 214, 1515, -1598, -1536, 649, -1973, -1409, 1510, -317, -2287, 578, 624, -1709, 369, -168, -2420, 160, 2290]
2151B290k838n30K336j676n05K764j468j780K824N03k317R77J249l142J047K860
2167B594k081q12K273j422j556K877l38l106J364K064k040J041J100l473j47L325
2183A663j621k150K832n95j507K261n9l331J158K251k045K75J966k096r59K804
2199H47p08k076K066K2k126K413J402l195J48K263j444k19K289j496j830L157
2215A513N17k847R80O71j864J620K070k845p66K842j115j540K142q28k217K479
2231H12Q74k202O58J026k350L66K759k342j417K170k8j331J874j001k872J840
2247a164K359j944k79J436j916j25K792j479k394K332N93j488J884M60l026J032
2263i27K577k421q5J833j419n63K645m64k403J043J054j618J745J160k648k96
$$ y = [2290, -548, -1078, 1258, -418, -923, 1841, 373, -1407, 1417, 1920, -397, 580, 1829, -1313, -266, 2594, 513, -299, 1974, 552, -1004, 1873, 1535, -1571, -207, 1857, -183, 858, 1958, -1515, -1662, 1663, 42, -2108, 724, 129, -1378, 883, 824, -2507, -1349, 902, -1143, -868, 1098, -998, -1957, 847, 139, -1937, 129, 151, -1975, 438, 1840, -1355, -1207, 1056, -388, -607, 1682, 186, -1644, 1513, 2030, -817, 163, 834, -1030, 590, 2660, -185, -951, 1891, 776, -764, 1378, 550, -1667, 812, 1686, -516, 142, 1168, -1182, -816, 1943, -399, -1816, 354, 326, -1005, 869, -132, -3004, -1164, 1195, -749, -1028, 408, -1508, -1633, 1159, -320, -2714, -382, 211, -1277, 607, 1067, -1959, -927, 1650, -771, -856, 977, -442, -1005, 1640, 1176, -1227, -184, 870, -748, 997, 2157, -491, -787]
2279g87K733j082j878J843r60j116K947K62k709L40J621k126L22K173k666p13
2295a796L169m83j977J282l33k122K347J438k506J01J641j672L15K168k577j134
2311b139K713M55j712J365J24k498J617K392k672o46K721j121l12J914j664j952
2327a415K431O81j594R43Q76k392R18K242k261j428K172l74j021K085k43l037
2343a417J468J675k226M64R99j978M62K416j560k087J600r0j033J795K62k740
2359a990Q25K233j734k87J043j202p48L132q39j672J004P54k081J639R64k500
2375a459m4K799q35q89J299j393j067K782M00k459Q65J323j879P93J342k362q17
2392a601K739l83j332J529l79k420K556Q60k685N00J310j857L39K166k049j690
$$ y = [-787, 1946, 864, -1014, 829, -131, -1247, 1700, 1962, -747, -407, 1214, -912, -590, 1583, -1083, -1796, 1373, 890, -1087, 195, -138, -2260, 87, 1525, -981, -880, 761, -911, -596, 1572, -1005, -2139, 574, 1029, -683, 682, 806, -1692, -75, 2317, -355, -1001, 1720, 599, 287, 2201, 537, -1415, 1016, 1697, 103, 1046, 1922, -470, 448, 2690, 429, -999, 1173, 799, -222, 1863, 1620, -1417, 51, 1726, -500, -36, 963, -1015, -553, 1863, 303, -1784, -184, -274, -1307, 488, 750, -1990, -1165, 1068, -666, -953, 90, -1112, -1860, 1272, 433, -1239, -235, 519, -1562, 77, 1041, -1459, -1503, 1296, 461, -428, 871, -522, -1589, 1193, 1593, -866, -1, 1322, -557, 236, 1578, -784, -1601, 1138, 755, -577, 952, 573, -1847, 709, 1569, -1116, -616, 694, -1163, -824, 1342, -707, -2397]
2408b397K245M84j990J794j1k179R51J961k300n23J719j303J47K417j419k011
2424b415K209L94j889J381Q87k415J362K080j866o39J440q84q17K343Nk298J302
2441A80J249k119R11Q16k306L58K864j134j569J800o60j422K156k5k831J131J701
2458A100j441p9J608k019p39K401k97j711J102N34k167J807P85k524M17J922j498
2475g99m1K125j801r47J848M79k180J208R13k049J573J701k430o11J826q46n17
2492e48K116o34j943K234P72k488R25R13k154Q23K332j890r50J744p16j299K111
2509A348j95k348J437J354j875k53J360j956m4K285r94j615J606J4j662J504M75
2526D41k565O09K146j478n6J519j527o49K312o10j791J395N28j489J170J215k099
$$ y = [-2397, -152, 332, -1658, 136, 125, -2054, -1103, 858, -1442, -1965, -246, -1549, -1402, 1015, -404, -2415, -206, 188, -1701, -320, 567, -1848, -486, 1594, -272, -911, 529, -355, -1172, 1171, 1176, -1122, 180, 1429, -690, 221, 1037, -1269, -911, 1953, 819, -750, 1050, 390, -1032, 1124, 1099, -1732, -601, 1100, -341, -420, 1188, -831, -1570, 831, 534, -1177, -75, 459, -1708, 99, 884, -1640, -1223, 699, -799, -840, 1285, -516, -1463, 385, 864, -1316, -108, 805, -1244, 329, 2030, -400, -1011, 815, -31, -548, 1568, 934, -1009, 1225, 1997, -491, 434, 1347, -807, 16, 2348, 458, -492, 1252, 536, -763, 1348, 1153, -1195, 242, 1596, -279, -532, 828, -1128, -1172, 1113, 119, -1496, 110, 124, -1538, -34, 441, -2124, -1515, 631, -847, -903, 616, -911, -1560, 752, 142, -1649, -254, 274, -1215, -45, 1170, -929]
2543i29r6J848q88o15K055j201j621K575L34k502R37J139j703Q29J590j484j000
2560g32J827o46j092J433j57j818J667J042k261K93J079j743N7K435j763j420
2576a799J794N5j401J654K7k349J263J800j805n37J243j223j21J937n31k126J670
2593d49Q05j351Q14R06j997N71J924j287q81J935j075j200K353J65k191Q74J240
2610A156j639J246J056k331l44K065m42j169J246n92r29J660N36k696P96J138
2626G57j422J12J846k018o89J818o9j430Q52j48j494J602J244k121m24J518r56
2643a022j10J576j000j702K225P61j883R05M17j582R14J938k102n74J662m13p99
2660g89J861o61j930J775J028j176J61R00k118O92J793j140j482J800l17j232
$$ y = [-929, -1025, 823, -65, -680, 1375, 174, -1447, 1128, 1462, -1040, -103, 1036, -667, 162, 1752, 268, -732, 1095, 449, -643, 790, 633, -1185, 482, 1524, -737, -444, 635, -1108, -1051, 1384, -379, -1799, -5, 50, -1351, 303, 330, -2019, -756, 1044, -761, -1298, -55, -1278, -1399, 538, 7, -2119, -449, 356, -995, -181, 725, -1272, -701, 1223, -64, -945, 990, -85, -1285, 1068, 1233, -958, -84, 1156, -483, 763, 1819, -512, -856, 1209, 767, -402, 844, 252, -677, 983, 1519, -1177, -381, 757, -665, -553, 1293, -725, -1414, 404, 335, -1095, -243, -391, -1885, -283, 961, -1160, -1584, -66, -1022, -1132, 444, -556, -2258, -33, 728, -1155, -250, 167, -1415, -501, 1437, -665, -1239, 423, 10, -789, 1072, 411, -1519, 256, 1284, 108, 269, 1169, -949, -257, 1536, 396, -1086, 714, 397, -835]
2676h35K147l74k358R50J505j473K23J287k072l37K400r13k011J425J10j065J533
2693A42P53k361K66J622j254j41J477j620p42K528m51j556R35N14j250J114J100
2710A076k215J63J816o23p96J664r31j327K147P81k478O75J140j331O94J355j981
2727a71l32J760l83j232J405m01j827J706J180k209q4J419j226J38J638j207j935
2744a761J984N76j639J076p7j831J032J914j905n49J551j069l58K121p73k223
2760a931J832P30j439O75J023k060M14K230j531p87J307k07j063J936l6j737O97
2777E3R17j314L30J502j752m86K224p51j384J294l31j218J849M31k286M13J159
2794F50j181J2J292j092j174K197j96j960J314L08j794Q40J838k184p5J571j233
$$ y = [-835, 1312, 938, -1420, -470, 1035, -438, -215, 1072, -1000, -1337, 1063, 150, -1861, -436, -326, -1391, 142, 895, -1466, -1200, 422, -832, -973, 504, -1116, -1858, 670, 219, -1337, -402, 112, -1138, -24, 1076, -1139, -976, 840, 217, -579, 1085, 154, -1173, 974, 1755, -723, -48, 1092, -239, 455, 1810, -171, -503, 1257, 874, -358, 1047, 646, -1181, 525, 1705, -504, -588, 831, -395, -257, 1381, 174, -1761, 223, 799, -840, 236, 159, -1672, -640, 1274, -631, -1180, 371, -698, -1056, 1065, 292, -1931, -99, 631, -808, -133, 890, -1170, -756, 1474, -57, -844, 463, 256, -807, 1129, 1093, -644, 53, 970, -344, -14, 1488, -264, -750, 1474, 723, -661, 633, 302, -916, 933, 1364, -922, -509, 650, -531, -519, 773, -319, -1493, 704, 508, -1452, -138, 170, -1624, -784, 1054, -1130, -1205, 366, -867]
2811h67m8J357r19j626J854Q85j679Q52N73j424M85J875j956p08K381p21j091
2828g77J656o92j250J184J116j491K11R72j785N90K139j320j245J290j32j198
2844g32J425L79k215P70J439j136o17J375j344l49J939m53j614J159N41j590O04
2861d19J191k147M56J791j331q49J874j430q77K244j17j724J216O44j372R29J021
2878A100j858l14K011n47j137J438m57j286J861M77j835P74O61j131l9J670j557
2895a69q86J734j22q53J236n22j518J222J172j465l47J165j317l77K340j270j550
2912a527J620J41j375J030M58j564M74J406j457n03J658q74m55J745n65j514J170
2929a32O37j342Q37N71j579J97K002j103q65J287n33p40J814L8k003Q96J228j282
$$ y = [-867, -915, 442, -477, -2103, -249, 636, -1043, -191, 382, -1042, -557, 1318, -638, -1346, 1035, 314, -777, 879, 187, -1063, 121, 1237, -254, -43, 929, -856, -266, 1873, 553, -692, 598, 466, -732, 693, 1072, -1143, -373, 1066, -70, -687, 688, -656, -1005, 934, 481, -1133, 26, 567, -1023, -419, 772, -1375, -919, 872, -459, -1308, 566, -864, -1741, 503, 386, -1338, -122, 522, -850, 79, 1100, -758, -1072, 939, 392, -745, 693, 236, -1050, 811, 1288, -547, 227, 888, -243, -282, 1388, -169, -1055, 679, 557, -296, 940, 418, -1100, 122, 1294, -171, -518, 647, -670, -1047, 1293, 23, -1527, 93, 234, -1141, -111, 347, -1217, -743, 663, -794, -1297, 361, -513, -968, 777, 212, -1302, -132, 505, -837, 0, 571, -1008, -811, 1191, 88, -777, 510, -23, -763, 1051, 1089, -914, -18, 1210, -72]
2947g2P2J285j658o3J734n57j202R24j22j198J248P71k047K53J392j132j76J325
2965G77j181r81J973k06j541R53N78j844R93J530j826k76J201o31l65J446q87
2982b87j201J511K66r43M81Q97j535K79J969j244j356J918m71p41J309K5k068
2999a191J196J446j528L78Q96j651J55J863r62j065R94r9r78J493J87k064N60
3016c70J287q17m56J418j440m02J883m65j701R00L70j135J022J024j858l40J465
3033C85n39o03J615j158j150J898O23k231P29R24j186P91J092j779n01J720r6
3050E34j127J349l67j518J482Q71j444R3J236j214k33J792j110j051J651k25r99
3067b80R58N3j508Q10J214j455k37P77r55j52J657j027j158J365K87j352R88L17
$$ y = [-72, 0, 1285, -373, -436, 1298, 741, -461, 463, 341, -857, 391, 1162, -885, -632, 760, -372, -548, 777, -404, -1385, 588, 382, -1159, -206, 372, -1472, -479, 1051, -775, -1051, 150, -481, -846, 600, -287, -1488, 23, 289, -654, -173, 724, -811, -532, 1437, 193, -1163, 755, 284, -457, 852, 877, -1191, 5, 1451, -77, 301, 1197, -454, -299, 1564, 602, -463, 531, 432, -546, 947, 1134, -930, -370, 917, 100, -356, 1062, -378, -780, 1103, 638, -1063, -163, 207, -928, 94, 1118, -740, -1080, 385, -154, -757, 858, -300, -1450, 448, 1071, -1160, -431, 493, -693, 98, 1190, -589, -1090, 630, 534, -593, 756, 389, -1129, 353, 1224, -220, -127, 1109, -105, -338, 1454, 344, -707, 944, 719, -280, 678, 731, -777, 33, 1247, -208, -445, 332, -623, -775, 882, -145, -1303, 62, 349, -1003, -15, 302]
3085C02j416N02J201j029n29J442j031n52J564K2j478M86R85j121J051M61j868
3102a008M05J584m66j231J031o8j065J853k5k002O13J234q14j50J520j720m21
3119g30J735l74j180J361m11j117J081N95j677Q4J491q56k57J085r90j328K026
3136E38J4j478O25M06j250N86J513j900l08J544n62n22J555q31j310J040J071
3153G31j370L92P41j323M31J803j706m88J159K6r31J173M4j413J150P31j104m6
3171@Q81j328j57J955o48j404J468k05q57Q21L56j760P83J176r18o32J084j037
3189d22n54J872j74j703P45O03r58M87P33j496J61J412q05o81J152n13p28J286
3207D17k5j245L13J081r47l1J300r85n05J419m67j014J152j66q15J172O57j472
$$ y = [302, -1114, -612, 589, -440, -969, 473, -558, -1110, 454, 476, -1002, -516, 469, -652, 399, 860, -1008, -603, 981, 515, -716, 315, 247, -818, 1035, 1010, -992, -379, 855, 41, -109, 1411, -309, -730, 1005, 631, -549, 812, 401, -716, 365, 960, -717, -633, 858, 2, -255, 830, -160, -1488, 538, 552, -926, -301, 105, -1145, -559, 954, -946, -1254, 290, -272, -794, 761, -70, -1380, -340, 731, -639, -247, 494, -829, -398, 1405, -301, -789, 370, 396, -535, 638, 682, -731, 419, 1150, 46, 0, 881, -447, -604, 1351, 703, -701, 767, 562, -295, 526, 882, -878, -95, 1081, 163, -469, 615, -422, -976, 896, 722, -981, -236, 367, -591, -104, 629, -867, -706, 706, -99, -780, 372, -141, -869, 417, 392, -853, -540, 541, -406, -437, 863, -122, -627, 792, 325, -689, 463, 297, -518, 654, 1311, -161]
3225a61K8R21j048L08J163r37r03J198K58j358O87M78j149L91J447j566k29J322
3243H50j094l02J317j087j082J413N02j136M27P66j469J65J798j482m48J377o98
3260a83o75J085rj297P97Q02j022O61O30j124k42J668o99j143J392k38q52J482
3278A033J65j821M77J048p15j98J233r44q24J359J16j574J040J71j211J140N06
3295A001j182j83J348j274j31J073p21q29J168l2r29N12O71j515L72J318j063
3312c96n94J083j97n02J133k72j606J324Q71j101N8P34j305K52J652j044q95J501
3330F96l19p69J151k88j423J034O13q18K46J170j375j87J463m92j039M78M87j011
3348c83P48M55j285L18R45r33k82R25n27p44J591m26j475J069K19j208P18P90
$$ y = [-161, -133, 788, -260, 48, 1211, 274, -629, 569, 827, -531, 156, 634, -515, -124, 1323, -243, -472, 850, -244, -546, 771, -316, -1398, 15, 517, -619, -192, 574, -895, -730, 1068, -414, -862, 515, -183, -858, 227, 218, -1079, -282, 520, -502, 159, 789, -335, -577, 1091, 392, -751, 641, 403, -449, 1033, 1198, -623, -146, 902, 187, -11, 1222, 278, -546, 813, 929, -645, 395, 566, -645, 495, 1001, -181, -364, 984, -290, -421, 652, -69, -898, 270, 238, -691, -179, 492, -1023, -651, 667, -396, -990, 93, -104, -606, 527, 255, -1351, -27, 844, -257, -199, 535, -770, -518, 1134, 90, -805, 696, 377, -392, 759, 471, -952, 82, 695, -123, 123, 1293, -82, -269, 1194, 702, -337, 141, 628, -383, 365, 820, -465, -147, 798, -135, -417, 508, -19, -763, 828, 402, -1073, -4, 215, -993, -275, 515]
3366E15j182j18J142m70p09J015j83j230J502K11j373M85Q78j066J63J196j019
3383b43n12J676l48q69N83K99j338J097N51p92j34P55r85L6J240p62q84J326J84
3402H80j081Q64J8j464O87J077j198j47Q48o53l48J538r84r92M26Q07p94K75N92
3421C51j254L21J260p11j026J406l80j043J642k50j421Q86N73o44j18Q90q66j11
3439d95J491o00q10N93k31m21J235K68j378K48J001q50O9M96r22qJ337rj178N85
3459D21N10j642R82P49j230j38Q78m61k54P46p39n06J169K7j000N03K03q96N10
3478a68P68j227l99J228l56m92J087p17n59J045M36j248K47J053j119J29R95q21
3496a18n47Q83L7q87J363l44r84M89J177j004l65O71m44j26Q15j23r81Q38J41
$$ y = [515, -667, -785, 357, -113, -822, 193, 10, -1220, 282, 493, -880, -395, 483, -583, -420, 776, -243, -755, 921, 573, -296, 287, 586, -752, 345, 896, 104, -30, 725, -260, -224, 1016, 254, -630, 696, 880, -201, 663, 681, -783, -96, 981, -217, -364, 484, -169, -517, 1021, 37, -955, -529, 278, -516, -241, 351, -903, -582, 678, -33, -1059, 347, -33, -1076, 566, 316, -1105, -219, 354, -290, -408, 482, -384, -495, 996, 396, -414, 179, -52, -473, 762, 1030, -348, -100, 901, 51, 120, 616, -306, -314, 1023, 1014, -164, 421, 931, -711, 271, 1020, -210, -348, 530, 69, -185, 561, -178, -684, 485, 512, -488, 15, 218, -678, -168, 600, -627, -1026, 202, -154, -646, 441, -276, -835, 210, 646, -602, -355, 698, -421, -292, 703, -118, -665, 218, 255, -632, 731, 387, -597, -108, 1069, 65, -300, 371, -73, -199, 616, 493, -488, 350, 491]
3515D91r23N34M32q83L65P60m70q24P63m55o06J258k70p85M61N29r65N11O02j397
3535h72j04J409o01m22P94j91p55O17N91j147k2J153p18J20R25j148m65J459l86
3554B37p63P32m4n47O63N68j382O4J182o23l59R96l77j082J164j8o46N66j5q69
3574e53L23J205j236l37R69n72m01J052k84j298R42P36j035j77Q59p63J08J164
3592G02r60m06P22l77k16P86oj010O64K93n71L77N51r85k31J175P3r40J040l19
3612C62q77J016J91r68K03R40p78J7N39o02l45Q88k14q94P15N7o04P76M21j001
3632a58n28J188k91o03J003m22p65L46O92j125M02M41o94K0J127q81m27P03N2
3651H0m03M43k20p47J186J82p44J44M49o72j7Q81n04p70R02M96j100O59L10j148
$$ y = [491, -432, 102, 534, -349, 16, 776, 306, -518, 245, -210, -816, 442, 172, -613, -152, 377, -588, -77, 525, -872, -976, 433, -168, -590, 204, 13, -742, -125, 466, -681, -703, 450, -268, -148, 777, -371, -836, 623, 237, -526, 206, 162, -385, 278, 846, -536, -472, 710, 87, -272, 724, 347, -735, 429, 411, -235, 331, 316, -553, -230, 975, -261, -598, 371, -201, -602, 450, 166, -1132, -190, 546, -489, -666, 193, -570, -462, 702, -258, -664, 58, -319, -535, 251, 245, -765, -101, 192, -379, -2, 549, -436, -667, 508, 581, -359, 681, 362, -515, 501, 692, -276, -73, 867, 89, 106, 645, 43, -302, 586, 372, -522, 193, 250, -354, 422, 843, -158, -686, 502, 211, -392, 611, 189, -576, -230, 462, -663, -261, 180, -514, -494, 633, -248, -675, 28, 80, -323, 120, -100, -847, 339, 521, -223, -79, 370, -302, -319, 562, 58, -712, 190, 686, -414, 245, 555, -593]
3671e93P28O40p46r0P18o58q4P95l30j054J016N97j174O69j59o20J80O89m26l08
3691b10K24L3p50P50K1q06O57J27n82N23P32r08p25J355n43o89Q66p1q58J374
3711E20J52j237M32M26p25K95O72o09l95R71r9j057Q36J79o81N54N53p26k5P11
3731G47p01k00J032p14o66R31R5n47K70J98q06L00P22n62m57O92N4r51R16k59
3751I4j248R98O30r16L3O98j084L08J177p86p47Q91k72n29R99L4q57q5O91l79
3771c50M36M37q19j16R67k55q72P69K09n67O50J27j125L17P83n11m18O34l55j53
3791b12R91j51q10K05N57r77O13O9m81j16N74j64l34O62n68m22M86N16p08M45
3811A75r9o30LJ240q21n55R60l47l03M39J08j047R12Q76j157K28N06q85J70O47
$$ y = [-593, 135, 775, 29, -61, 657, -1, -85, 710, 380, -674, 342, 939, -235, 434, 275, -345, -165, 524, 98, -210, 14, 47, -703, 47, 68, -738, -81, 46, -536, -13, 719, -189, -914, 441, -102, -791, 75, 4, -854, 520, 672, -565, -133, 293, -432, -137, 535, -74, -469, 502, 403, -654, 182, 361, -320, 234, 787, 61, 36, 747, 46, -154, 878, 164, -502, 429, 524, -23, 247, 445, -361, -61, 661, 99, -358, 334, 388, -563, 353, 94, -1154, -156, 474, -442, -409, 289, -795, -487, 690, -96, -843, 48, -224, -753, 246, 280, -577, -662, 29, -350, 86, 523, -296, -412, 555, 300, -572, 197, 406, -161, 489, 616, -509, -192, 591, 80, -338, 296, -59, -212, 779, 628, -182, 23, 580, -397, 216, 285, -196, -312, 262, 98, -236, 426, -142, -564, -78, 438, -270, 175, 76, -554, -551, 689, -132, -687, 273, -74, -377, 62, 170, -877, 35, 911, -246, -18, 488, -397, -227, 420]
3831D20l61n26R61k22n13N70K52j102P97N25r69R1P32p49J9Q01l32j037M93O68
3851E18o46J12O01p26q1J233j149l03P22n73o69P80N71q84L63J87l3k26J51m42
3871d94k81J222m9p29M59O6p57N82L58o95j27R11m75m0O07o36k87N09J97p49N74
3892A66J53m66K63P10j084M7Q03n13k38R63l27n17J58J80l93J64L72p48L78P73
3912H44q64m45P58j18n12N55Q5q35Q57n0m52q2N61q13K92P63p82m49R66n15l22
3933e58Q11L6q24L40P79n30k81M73m11l31O74J75q43O21L24p77P11J36q60L54
3953A9P83q82J12K75n02k96R18l19k50M08L27o43J3P73p27p22Q68L4l91L02j77
3974g7n77N98M42r55K07N03o43O2Q75o27k89K93J82m07O91k08p81Q79J88n14l98
$$ y = [420, 59, -467, 494, 272, -241, 329, 581, -521, 276, 801, -168, -77, 655, -94, -75, 726, 394, -643, -150, 518, -128, -16, 585, -141, -222, 1011, -138, -441, 281, -292, -961, -181, 390, -494, -131, 56, 23, -203, -52, -494, -775, 447, 398, -331, 128, 194, -563, 19, 377, -318, -445, 466, -9, -49, 558, -78, -365, 144, 341, -408, 166, 319, -147, 116, 826, -258, -211, 592, 79, -159, 804, 477, -40, 118, 298, -95, 69, 441, -307, 71, 844, -20, -465, 293, 175, -337, 218, 303, -532, 325, 275, -177, -259, 302, -511, -219, 544, -238, -687, 279, -236, -558, 253, 289, -535, -195, 584, 54, -227, 246, -165, -496, 178, 353, -490, 131, 455, -322, 389, 525, -335, 19, 802, -80, 32, 307, -195, -491, 427, 108, -142, 266, 593, -50, -37, 736, 9, -713, 155, 189, -202, 100, -77, -654, -56, 386, -569, -362, 141, -502, -440, 435, -192, -481, -188, -6, -413, 278, 70, -711, 168, 356, -158, -556]
3995e56J061j003O4R09l22n53P13J70q08M59M10n54n0O50m88l4J15k7k50K85r1
4016A00m11N29J93m83K80L24n28k86N95j36k46N49j19j040P26m4m62K5O95k65
4036dm03Q17p92o53J028K38n63L44j2o20M71N58q96L01L71m39r2Q94n98n97R95
4057C48r0o38O67O5n73M11K43m19j59N23Mp55Q99o0j004O30K41p16P38K10j072
4078e07L49J184j023m82O63j44m10M87l8n96M94N23q69P5L54n57L52N52l66m33
4098c92M89j74k58L22J74p23J20P46o01j70P12o16J6O16K0j032O98K15n41O86
4118C07J96n94k84O65m16j87R58n59n94R47J1l30m07O62o43J44P13o97j76P16
4138D32j51o87N67k88m93Q44K38p61J62K27m50j9P80k55p28P66l7k54N09m62m40
$$ y = [-556, 505, -498, -434, 475, 153, -400, 313, 483, -325, 134, 544, -10, -60, 590, 102, 68, 183, 156, -94, 191, 100, -311, 218, 411, -72, 208, 532, 4, -282, 313, 177, -69, 480, 361, -679, 47, 3, -459, -434, 261, -4, -407, 410, -382, -1035, -7, 231, -332, 12, 0, -620, -149, 409, -487, -186, 185, -254, -346, 548, -50, -647, 348, 258, -380, 287, 352, -221, 190, 433, 14, -145, 378, 382, -373, 526, 466, -538, 92, 333, -383, 355, 565, -507, -158, 1026, 3, -479, 184, 40, -370, 117, 79, -517, -23, 500, -369, -294, 60, -497, -145, 407, 41, -392, 97, -77, -335, -13, 161, -562, -442, 304, -297, -467, 245, -371, -355, 261, 281, -751, -53, 162, -379, 307, 503, -91, -375, 290, -126, -313, 645, 86, -508, 439, 450, 120, -287, 375, -268, -124, 589, -108, -284, 432, 281, -406, 161, -127, -620, 224, 462, -299, -137, 90, -360, -379, 401, 146, -582, 184, 147, -107, 402, -60, -500]
4159e00M99O71r75K69L86n94j67R88o43l53P37K84q93N26M17n76j08O23m41k92
4179a42M07J36o77L99M31j068M21P52q26L84N81q91k01P67k35o43M59K67q70Q88
4199C39q8q93K13L51j6J67M97q99j01O09J11p97J65M17r12R69K73n92j74Q10l38
4220A11l25M97k59n75Q37J56n80J38M96r65N92O84j070O2N88k65j69M90k23o48
4240d28O86K55m88K6J66m83K00M89p63k6N54n0k47M51r5n75M03M93p91k23P54
4261C08p71L62K97r4p94N72K89o77O80Q7r40M49O82l01l78O43q33J64R03l53m71
4282a76K67K44m82K46L45l68j97O39k15m30O42m97m55Q03j3n74K31M66n16J7K66
4303B43o35M7O95j33m35N81l22q01O64O47j227Q02K26n40l2N53k53n29N17K9m57
$$ y = [-500, -1, 670, -305, -36, 350, -244, -411, 577, -66, -419, 318, 602, -291, 235, 652, 76, -32, 591, 150, -142, 265, 401, -276, 123, 554, -514, -93, 659, -167, 217, 798, -93, -294, 473, 238, -405, 54, 321, -549, 339, 251, -642, -429, -78, -94, 73, 570, -329, -430, 179, 290, -507, -342, 75, -837, 132, 405, -187, -361, 449, 111, -214, 283, 24, -551, 286, 442, -138, 0, 496, -469, 123, 807, -263, -201, 387, 122, -47, 443, 220, -428, 258, 513, 25, 51, 217, -266, -66, 423, -340, -366, 188, 138, -109, 342, 247, -328, 75, 568, -223, -446, 308, -463, -101, 196, 102, -692, -120, 169, -508, 172, 259, -681, -232, 450, 149, -229, 414, -419, -255, 648, 295, -176, 91, 335, -147, 99, 444, 76, -121, 518, 303, -127, 515, 18, -437, 366, 353, -221, 10, 476, -40, -23, 243, -392, -345, 350, 217, -218, 363, 41, -760, -96, 551, -676, 126, 352, -188, -220, 333, 80, -449, 68, 97, -360]
4324c60O71k18m62K65P00p35j28N74l84k01O37l53k99L05K59m55L3O49p31M44
4344B11J44l31m94R12m94k34O24J48q15N51J88p29L95R9l41R0L83k31n74N40l7
4365Em30M88N06q52n4O53q67J27N67m97l01J004k28n89P09M18j273P56L29p77
4385c06k3Q32k95o62O71O3r15P15J42m43K73K49n22K05L67l40k50O64k74o7P03
4406G87o92j79k05N81l89K61N0k65P0J26k03m03Q91m51m75P13J4p36L94M87n89
4427b13p5K43m68L4J097o35o84Q22k09j75K52L15p24J79L82l82J4O22n59j53O93
4448C76J48p65K62K55l49L85L09j002Q7O34R5q13Q24m29k60M12P1m45J17M61m75
4469a02K40N28p99l30Q83o04j3N82j39r19O45O88j139J63M72n76K56L15j37n02
$$ y = [-360, 311, 93, -369, -104, 596, -139, -267, 307, -77, -278, 359, 6, -293, 12, 271, -184, -151, 498, -233, 211, 355, 24, -470, 442, -52, -286, 338, 486, -329, 222, 410, -319, 76, 175, -166, -76, 307, 76, -498, 42, 5, -425, 63, 569, -283, -337, 316, -551, -424, 143, -354, -655, 349, 121, -468, 241, 659, -614, 142, 471, -306, -329, 503, 208, -454, 217, 280, -635, 80, 222, -221, 52, 301, -221, -16, 351, 11, -239, 425, 151, 84, 787, 95, -84, -289, 292, -97, 164, 214, -51, 19, 145, -58, -461, 430, -21, -496, 217, 231, -505, -111, 376, -213, -288, -45, -513, -479, 618, -17, -701, 121, -88, -263, -11, 304, -420, -241, 141, -241, -227, 395, -164, -317, 376, 524, -241, 21, 276, -73, 312, 621, -381, -294, 340, 435, -378, 446, 17, -243, 169, 240, -205, -88, 373, -102, 138, 666, -133, -463, 420, -184, -197, 385, 246, -673, -28, 660, -479, -316, 156, -420, -164, 151, 14, -488]
4489d88M99P5n66L87L48m81P0O71m56j42K33K6m46Q49l68l73N19k36l1K01J32
4510D23m36m11J121m62j35L11j49l71L32K58n87P6M73l50l0L42l48j65O05k61
4530B36o39K73J73l99N14K21j004J35N27q1l71Q59o69k05N85P6o95P36k44m35
4550d07N60J72p09K27N46m31n24P07n7n19N93J16m03L70M4o94K71N89k51k59Q92
4571H33r10j30O58J2o98K58J89m31J46L36l92k45O23l60m17N90K5k31N58l29l45
4592b60O4L62m74K38Q7l04L7K83L66q75L91L23o29P19j88o34J05Q44k28m81L27
4613G3j46l43R01j31o15K72P4m07L68K88m08J2O41l40l89N15O7q09O47K96o73
4634a07j7K36k38j13N98n57j97N32R3l45L40j81k62J34K19l93k48N82j15k19M50
$$ y = [-488, 11, 86, -480, -93, 255, -226, -156, 515, 59, -83, 150, 176, -270, 579, 211, -162, 357, 121, 90, 291, 423, -13, -424, 697, 235, 100, 411, 262, -109, 223, 481, -106, -30, 443, 93, 63, 405, 57, -108, 497, 236, -403, -130, 43, -356, 158, 379, -625, -490, 37, -44, -415, 444, -225, -430, 155, 231, -464, 272, 28, -407, 153, 325, -384, -157, 389, -42, -566, 141, 84, -435, 158, 274, -129, 241, 285, -409, -138, 451, 200, -59, 833, -77, -207, 451, 463, -235, 23, 212, -219, -73, 263, -129, -374, 249, -111, -528, 62, 87, -144, 414, 85, -260, -196, 166, -308, -70, 17, -287, -250, 33, 399, -476, -85, 238, -391, 328, 140, -494, -389, 455, 227, -254, 73, -73, -416, 485, 354, -261, 11, 85, -322, 46, 334, -74, -62, 579, 239, -150, 365, 432, -377, 270, 566, -107, -124, 112, -126, -239, 359, -198, -395, 137, 230, -115, 225, 44, -218, -84, 135, -258, -506, 76, -39, -258, 192]
4655A92k14m46L62L34o49K37M59o28O4N77k78l17N96j66m05O70k66m88J00M86
4675B20m26K65M65o39O0K96O4n47O38j76m78K67L55k92k31L30k44Q4L69k83k98
4696b01K69Q5l75N9J83l53L54L70n97j34L52n9m89L64q0m85J277n43n3j01N39
4717C82o77K57K01o11J83L78J18m48P04m96m29L28L32n47K53K07l46M51J41o00
4737b19j08N36p1l65M33j61m39K86O71n73j27L52m20J72m8M18q49N35j50k63N40
4758A50p5j40r2L54l38K2L66m20j53Q34n67k30m3L41j84L53J44o56J6P86m28k73
4780b33M97n77N6O46P8o94L16J06m39M09J70l19j26M89k10k48L22k00n9K89J43
4801D16k77m55Q49o18n4O22o11J72K51p7m93L11j53l73M72L08k48k69K74k63l48
$$ y = [192, -22, -468, -106, 228, -421, -184, 275, -353, -289, 288, 10, -307, 289, 123, -282, 388, 122, -366, -266, 220, -206, 59, 524, -115, -55, 241, 305, -242, 396, 220, -258, 9, 364, 72, -159, 171, -73, 11, 380, 97, -201, 68, 153, -222, -163, 20, -333, 21, 391, -206, -340, 12, -47, -536, -172, -252, -737, 540, -3, -56, -157, 382, -295, -38, 163, -448, -265, 113, 231, -217, 487, -9, -438, -110, 222, -325, -72, 135, -211, 240, 381, -219, -327, 209, 138, -227, 206, 45, -394, -108, 563, -10, -137, 215, -205, -33, -81, 337, -512, 23, -127, -390, 150, 75, -65, -157, 197, -141, -119, 247, -173, -326, 508, -59, -289, -332, 9, -175, 178, 322, -334, -318, 468, 40, -233, 264, -313, -257, 389, 467, -227, 89, 195, -244, 165, 335, 16, -110, 379, 169, -79, 243, 43, -16, 273, 416, 139, -316, 533, -85, -139, 483, -128, 44, 295, 218, -275, 36, -117, -490, -18, 290, 42, -227, 47, -216, -564]
4822e64N45J16n64N26O8l46K47Q5n62K81O46k61n79N10k51j51M74O0m81n7M27
4843A69l46K98J89k56j15L34j41j46M10k47l69M83R6l21J09J07j89j5K66o02P6
4864b10O15l15j81L08l91k20J09N30p88K71N88n37o2N90o62LM07j49k68M35q5
4885a2k68J43M67n03J37K32j66l42N18k02j94K33L01m74R0K33j3q9O31q43J31
4906A0K71l66R5L48q0l52K14J76n28J07K14l8j66M33J80q09O68m30k77L96J83
4927B49p84P37j6m10J07K05q2l44M32K25o02K47k3l09L83K43n65K73N00n66j52
4948b52K75n7m59Q09J6m19R3M55n41J19L81m67L6J21k6j59J45M1n47M28L33n65
$$ y = [-564, -19, 97, -467, 59, 127, -219, 28, 113, -449, -168, 478, 217, -362, 148, -103, -254, 220, 280, -201, -258, 169, -177, 121, 310, 54, -61, 273, 132, -14, 396, 149, -220, 263, 359, 38, 147, 254, 65, 50, 316, -286, -210, 405, 90, -91, 217, -174, -394, -285, 245, -543, -272, 316, -221, -283, 307, -355, -352, 55, -94, -362, 73, -12, -280, -137, 330, -173, -36, 196, 30, -312, 206, 4, -190, 43, 344, -130, -40, 193, 180, 91, 722, -121, 10, 281, -85, 10, 358, 278, -74, 140, 316, -212, -105, 109, 71, -95, 338, 518, -291, 377, -53, -330, 66, 249, -535, 202, 186, -224, -117, 88, 6, -338, 94, 319, -283, -36, -59, -368, 15, 258, -307, -34, 466, -100, -252, 23, -34, -493, 316, 332, -87, 6, 461, -80, 39, 420, -47, -11, 110, 84, -75, 70, 111, -436, -8, 325, -240]
$$ [...]
8191B33
##END NTUPLES=NMR FID
##END=
