##TITLE=1H_CG-1117-61
 DMSO, 32 sc, 
 26.8.2019
##JCAMPDX= 6.0         $$ Bruker NMR JCAMP-DX V2.0
##DATA TYPE= NMR FID
##DATA CLASS= NTUPLES
##ORIGIN= UXNMR, Bruker Analytische Messtechnik GmbH
##OWNER= root
$$ XWIN-NMR		Version 3.5
$$ Mon Aug 26 13:49:41 2019 Russian Standard Time (UT+4h)  she@DPX200
##.OBSERVE FREQUENCY= 200.13155
##.OBSERVE NUCLEUS= ^1H
##.DELAY= (6, 6)
##.ACQUISITION MODE= SIMULTANEOUS
##.ACQUISITION SCHEME= undefined
##.AVERAGES= 32
##.DIGITISER RES= 18
##SPECTROMETER/DATA SYSTEM= spect
##.PULSE SEQUENCE= zg30
##.SOLVENT NAME= DMSO
##.SHIFT REFERENCE= (INTERNAL, DMSO, 0, 15.7039)
##AUDIT TRAIL= $$ (NUMBER, WHEN, WHO, WHERE, WHAT)
$$ ##TITLE= Audit trail, XWIN-NMR		Version 3.5
$$ ##JCAMPDX= 5.01
$$ ##ORIGIN= Bruker BioSpin GmbH
$$ ##OWNER= she
$$ F:/spectra/data/she/nmr/H-F/1/audita.txt
$$ ##AUDIT TRAIL=  $$ (NUMBER, WHEN, WHO, WHERE, WHAT)
(   1,<2019-08-26 13:48:29.79 +0400>,<she>,<DPX200>,
      <continue with go, POWCHK disabled, PULCHK disabled
       configuration hash MD5:
       00 E9 B6 7A A2 85 ED C7 34 08 36 98 17 FE 4E 26
       data hash MD5: 16K
       01 71 62 BB B0 EF 60 B2 AE CF 37 09 CD D6 F4 6F>)
$$ ##END=
$$ 
$$ hash MD5
$$ 8A E4 A6 41 3D FB DA EC E2 B3 D8 65 E7 1C F4 E6
##$RELAX= 
##$RELAX= 
##$RELAX= 
##$RELAX= 
##$RELAX= 
##$RELAX= 
$$ Bruker specific parameters
$$ --------------------------
##$DU= <F:/spectra>
##$EXPNO= 1
##$NAME= <H-F>
##$PROCNO= 1
##$TYPE= <nmr>
##$USER= <she>
##$AMP= (0..31)
100 100 100 100 100 100 100 100 100 100 100 100 100 100 100 100 100 100 
100 100 100 100 100 100 100 100 100 100 100 100 100 100 
##$AQSEQ= 0
##$AQ_mod= 1
##$AUNM= <au_zg>
##$AUTOPOS= <>
##$BF1= 200.13
##$BF2= 200.13
##$BF3= 200.13
##$BF4= 200.13
##$BF5= 200.13
##$BF6= 200.13
##$BF7= 200.13
##$BF8= 200.13
##$BYTORDA= 1
##$CFDGTYP= 0
##$CFRGTYP= 5
##$CHEMSTR= <none>
##$CNST= (0..31)
1 1 145 1 1 1 1 1 1 1 1 1 1 1 1 1 1 1 1 1 1 1 1 1 1 1 1 1 1 1 1 1 
##$CPDPRG= <>
##$CPDPRG1= <>
##$CPDPRG2= <>
##$CPDPRG3= <>
##$CPDPRG4= <mlev>
##$CPDPRG5= <mlev>
##$CPDPRG6= <mlev>
##$CPDPRG7= <mlev>
##$CPDPRG8= <mlev>
##$CPDPRGB= <>
##$CPDPRGT= <>
##$D= (0..31)
0 1.2 0 0 0 0 0 0 0 0 0 0.03 0 0 0 0 0 0 0 0 0 0 0 0 0 0 0 0 0 0 0 0 
##$DATE= 1566812746
##$DBL= (0..7)
120 120 120 120 120 120 120 120 
##$DBP= (0..7)
150 150 150 150 150 150 150 150 
##$DBP07= 0
##$DBPNAM0= <>
##$DBPNAM1= <>
##$DBPNAM2= <>
##$DBPNAM3= <>
##$DBPNAM4= <>
##$DBPNAM5= <>
##$DBPNAM6= <>
##$DBPNAM7= <>
##$DBPOAL= (0..7)
0.5 0.5 0.5 0.5 0.5 0.5 0.5 0.5 
##$DBPOFFS= (0..7)
0 0 0 0 0 0 0 0 
##$DE= 6
##$DECBNUC= <off>
##$DECIM= 24
##$DECNUC= <off>
##$DECSTAT= 4
##$DIGMOD= 1
##$DIGTYP= 9
##$DL= (0..7)
0 120 120 120 120 120 120 120 
##$DP= (0..7)
150 150 150 150 150 150 150 150 
##$DP07= 0
##$DPNAME0= <>
##$DPNAME1= <>
##$DPNAME2= <>
##$DPNAME3= <>
##$DPNAME4= <>
##$DPNAME5= <>
##$DPNAME6= <>
##$DPNAME7= <>
##$DPOAL= (0..7)
0.5 0.5 0.5 0.5 0.5 0.5 0.5 0.5 
##$DPOFFS= (0..7)
0 0 0 0 0 0 0 0 
##$DQDMODE= 0
##$DR= 18
##$DS= 0
##$DSLIST= <SSSSSSSSSSSSSSS>
##$DSPFIRM= 0
$$ [...]
##$SUBNAM2= <"">
##$SUBNAM3= <"">
##$SUBNAM4= <"">
##$SUBNAM5= <"">
##$SUBNAM6= <"">
##$SUBNAM7= <"">
##$SUBNAM8= <"">
##$SUBNAM9= <"">
##$SW= 24.9336996594482
##$SWIBOX= (0..15)
0 0 2 0 0 0 0 0 0 0 0 0 0 0 0 0 
##$SW_h= 4990.01996007984
##$TD= 16384
##$TD0= 1
##$TE= 0
##$TE2= 300
##$TE3= 300
##$TEG= 300
##$TL= (0..7)
0 120 120 120 120 120 120 120 
##$TP= (0..7)
150 150 150 150 150 150 150 150 
##$TP07= 0
##$TPNAME0= <>
##$TPNAME1= <>
##$TPNAME2= <>
##$TPNAME3= <>
##$TPNAME4= <>
##$TPNAME5= <>
##$TPNAME6= <>
##$TPNAME7= <>
##$TPOAL= (0..7)
0.5 0.5 0.5 0.5 0.5 0.5 0.5 0.5 
##$TPOFFS= (0..7)
0 0 0 0 0 0 0 0 
##$TUNHIN= 0
##$TUNHOUT= 0
##$TUNXOUT= 0
##$USERA1= <user>
##$USERA2= <user>
##$USERA3= <user>
##$USERA4= <user>
##$USERA5= <user>
##$V9= 5
##$VALIST= <valist>
##$VCLIST= <CCCCCCCCCCCCCCC>
##$VD= 0
##$VDLIST= <DDDDDDDDDDDDDDD>
##$VPLIST= <PPPPPPPPPPPPPPP>
##$VTLIST= <TTTTTTTTTTTTTTT>
##$WBST= 1024
##$WBSW= 4
##$XGAIN= (0..3)
0 0 0 0 
##$XL= 0
##$YL= 0
##$YMAX_a= 394055
##$YMIN_a= -498086
##$ZGOPTNS= <>
##$ZL1= 120
##$ZL2= 120
##$ZL3= 120
##$ZL4= 120
##$ABSF1= 10
##$ABSF2= 0
##$ABSG= 5
##$ABSL= 3
##$ALPHA= 0
##$AQORDER= 0
##$ASSFAC= 0
##$ASSFACI= 0
##$ASSFACX= 0
##$ASSWID= 0
##$AUNMP= <proc_1d>
##$AZFE= 0.1
##$AZFW= 0.1
##$BCFW= 1
##$BC_mod= 2
##$BYTORDP= 1
##$COROFFS= 0
##$CY= 11.3945322036743
##$DATMOD= 1
##$DC= 2
##$DFILT= <>
##$DTYPP= 0
##$F1P= 20.1720416913024
##$F2P= 0.152960286110954
##$FCOR= 0.5
##$FTSIZE= 0
##$FT_mod= 4
##$GAMMA= 1
##$GB= 0.15
##$INTBC= 1
##$INTSCL= 1
##$ISEN= 128
##$LB= 0.24
##$LEV0= 0
##$LPBIN= 0
##$MAXI= 10000
##$MC2= 0
##$MEAN= 0
##$ME_mod= 0
##$MI= 1.114404
##$NCOEF= 0
##$NC_proc= 0
##$NLEV= 6
##$NOISF1= 3.799351
##$NOISF2= 2.8
##$NSP= 1
##$NTH_PI= 0
##$NZP= 0
##$OFFSET= 15.70392
##$PC= 1
##$PHC0= -9210.676
##$PHC1= 6.200963
##$PH_mod= 1
##$PKNL= yes
##$PPARMOD= 0
##$PSCAL= 0
##$PSIGN= 0
##$REVERSE= no
##$SF= 200.130013532006
##$SI= 16384
##$SIGF1= 3
##$SIGF2= 2
##$SINO= 400
##$SIOLD= 16384
##$SREGLST= <1H.CDCl3>
##$SSB= 0
##$STSI= 0
##$STSR= 0
##$SW_p= 3612.71676300578
##$SYMM= 0
##$S_DEV= 0
##$TDeff= 0
##$TDoff= 0
##$TI= <>
##$TILT= no
##$TM1= 0
##$TM2= 0
##$TOPLEV= 0
##$USERP1= <user>
##$USERP2= <user>
##$USERP3= <user>
##$USERP4= <user>
##$USERP5= <user>
##$WDW= 1
##$XDIM= 8192
##$YMAX_p= 0
##$YMIN_p= 0
$$ End of Bruker specific parameters
$$ ---------------------------------
##NTUPLES= NMR FID
##VAR_NAME=  TIME,          FID/REAL,        FID/IMAG
##SYMBOL=    X,             R,               I
##VAR_TYPE=  INDEPENDENT,   DEPENDENT,       DEPENDENT
##VAR_FORM=  AFFN,          ASDF,            ASDF
##VAR_DIM=   8192,          8192,            8192
##UNITS=     SECONDS,       ARBITRARY UNITS, ARBITRARY UNITS
##FACTOR=    0.0002004,     1,               1
##FIRST=     0,             0,               0
##LAST=      1.6414764,     0,               0
##MIN=       0,             -498086,         0
##MAX=       1.6414764,     394055,          0
$$ Real data points
##PAGE= N=1
##DATA TABLE= (X++(R..R)), XYDATA
$$ [...]
3389f091j527O328P982J51p321p053N85Q557N915j215q904o125L313R465L977
3404H037l652r335m164O491Q982K138o546r540r34Q548P988m26r626o615K907
3419e747Q840N245l586r307m470N640R133K903o121j0027j090P598Q516m4q074
3434e91p333J269Q919O752l841q784m828L896R192M205n837q693k579P328P715
3449F790O70p726p539J517P705O176j785p098o393L244Q153L737l758o735l453
3464f495L605Q336K164n821p670j275O454P102P56o816p792J839P257N133j461
3479E316q370m355L439P674M537m516q079l324N759Q286J480o033p673p24O726
3494A43P828r70q562o506K230Q841M971k749q793n327N770Q564L437n920r951
$$ plain form
3389 -6091 -7618 -1290 6692 6843 -478 -7531 -6946 1611 7526 6311 -2593 -8718 -5405 4060 8037
3404 8037 4385 -4950 -9114 -2623 6359 8497 1951 -7589 -8523 25 8013 7587 -2039 -8654 -5747
3419 -5747 3093 8338 4752 -4555 -9025 -3385 5748 8651 2530 -7497 -8587 -989 7527 7483 -591
3434 -591 -7924 -6655 2264 9016 5175 -3609 -8437 -4541 4651 8856 3019 -5674 -8253 -925 6790
3449 6790 7460 -266 -7805 -6288 1417 7593 5808 -1290 -7683 -4439 3714 7451 3693 -3042 -6495
3464 -6495 -2890 5446 7610 1789 -5881 -7156 -702 6400 7156 340 -7452 -5613 1644 6777 5316
3479 5316 -3054 -7409 -3970 3704 8241 3725 -4354 -7678 -1919 6367 7847 1814 -5859 -6583 143
3494 143 7971 7001 -1561 -8067 -5837 3004 7975 5226 -3567 -8894 -3124 5440 8877 2957 -6994
3509f994j192P213R258p80q209p158J289Q968P097l436r225n124L934Q958L845
3524H444m934r161k468O559Q848R14p806p638N87Q362O176j934q439n316K906
3539d900Q120N159m397r519k450N323P639K491n900p201j145N966P835q18o872
3554f69n890P99P358N940k563p928m301K566P976L986m125p331l108N141Q009
3569E860J351n921p526n20O992O765n95p700n908J832P454O017l156q114n140
3584h309M810P922L594n443q311k022O273Q468J002q326o858M39P814O624j823
3599E854q874n317L961Q076M455m254r217k966O088Q394J172o585o968q13P404
3614D10O867j537p850n343K472P684N111m177q030l036M857P986K045n337p976
$$ plain form
3509 -6994 -8186 -973 8285 7505 -704 -7862 -6573 2395 9492 6056 -3169 -8293 -4359 4599 8444
3524 8444 3510 -5651 -8119 -1560 7288 8202 396 -7242 -6655 1707 7883 5949 -2490 -7806 -4900
3539 -4900 3220 8379 3982 -5537 -7987 -2664 4975 7466 1566 -5635 -6780 -814 7021 6203 -669
3554 -669 -6559 -5760 1598 7538 4975 -2953 -7254 -4688 3288 7274 3149 -4182 -7290 -2149 5860
3569 5860 7211 1290 -6236 -6756 236 7001 6406 -1294 -7202 -5370 2084 8101 4945 -3169 -8309
3584 -8309 -3499 4423 8017 2574 -5737 -7759 -1486 6982 7984 -342 -7200 -6761 1053 7677 5854
3599 5854 -3020 -8337 -4376 3700 8155 3901 -5316 -8282 -2194 6200 7372 787 -6181 -6994 410
3614 410 7277 5740 -2110 -7453 -4981 2703 7814 3637 -4393 -7429 -2572 5414 7459 2122 -5854
3629e854j645P294O930o67o424o691J261P670N248l273o351m267L184P178L248
3644F841m364p626j410N076O705K115o586o633m95O642N722j293n712n625K279
3659d364O809M375l178o696l580L479P409K976m927o843k466O099O890P55o970
3674b32o656P26P588N592j942o794n494L645P287L867m504p364l457N271Q673
3689F206J187o745o822o25P288O789j661p500n889K996P800L970l458q173l014
3704g651N623P149K757o157p254j685O601P105m86p635n889K034P564N572l864
3719C784p022m039M183P750K119m169p510k257O308N934J195o446n113l11O698
3734A104M927n68o714n038J799O169M976k958p546k672L868O720K678n010o899
$$ plain form
3629 -5854 -7499 -205 6725 6058 -366 -7057 -5796 1874 7122 3849 -2502 -6769 -3585 3593 6841
3644 6841 2477 -5149 -6559 -1483 5222 7337 751 -5882 -6377 265 5987 4694 -1018 -6643 -4364
3659 -4364 2445 6820 3642 -3054 -6634 -3155 4254 7230 2303 -4540 -7006 -907 5983 6738 -232
3674 -232 -6888 -6162 1426 7018 5076 -1718 -7212 -3567 3720 7587 3083 -4281 -7738 -2467 6206
3689 6206 7393 648 -6174 -6799 489 7278 5617 -1883 -7772 -4776 3024 6994 3536 -4637 -7651
3704 -7651 -2028 5121 7878 1721 -5533 -7218 -617 6488 6002 -1633 -7522 -5488 2076 7648 3784
3719 3784 -3238 -7277 -3094 4656 6775 2606 -4904 -7161 -853 5081 6276 -170 -5283 -5594 1104
3734 1104 6031 5463 -1251 -6289 -4490 1679 6655 3697 -3849 -6521 -2653 4067 6745 1735 -5164
3749e164j291N485O079Q08o085o251M44O801N801j981o680n027L084P958L254
3764G235m229p365l052N543O245K761o333o441n25O367N927l51p174o740L359
3779d773P460N013l826p402m094M116Q996J725n583p114j159N685O529M69o889
3794h47o544J524P313N167j869p319m172L371P371K632m167p386j855N559O747
3809E525P54n603o250O23N628O070k075o268m940K578O294M271l135o514l226
3824f268L930O520J962m135o305j492N205N430J03n313n050MO484N152k350n105
3840a228n151K536O779K795l244n962k710L870O510J694m435o723n73O370N239
3855E767m20o250n386J324O869M487k035o726l834L509P048K190m334p009j168
$$ plain form
3749 -5164 -6455 -970 5109 5917 -168 -6419 -5975 826 6627 4646 -2034 -7061 -3977 3981 7235
3764 7235 3006 -4359 -7411 -1868 4377 7138 805 -5636 -6161 206 6133 5782 -1392 -8132 -4773
3779 -4773 2687 7700 3874 -3528 -7622 -3506 5490 7215 1632 -5482 -6641 -956 5573 6042 -847
3794 -847 -7391 -5867 1446 6613 4744 -2575 -6747 -3376 3995 6627 2460 -4926 -6781 -1222 5525
3809 5525 6279 676 -5574 -4951 677 6747 4672 -1596 -6536 -3958 2336 6607 3472 -3042 -6268
3824 -6268 -2338 4182 6144 2009 -4296 -5788 -583 4847 4950 -363 -5413 -5409 1075 6227 3877 -1228
3840 -1228 -6379 -3843 2936 5731 2487 -3475 -6185 -2315 4195 5889 1454 -5269 -5842 528 5767
3855 5767 5347 -903 -6289 -4965 1904 6391 4356 -2370 -6204 -2695 4353 6543 2209 -4800 -5968
3870e968M590P018O22o626o146R72P392L879j478o541m286L328P433K276l635
3885B830p510j733M703O448J114n010o533J078M954N485j082o537m104K280N898
3900B281L205k165o908k739M494N742J630m402n594p84M759O131n33o078m963
3915e924J469N655M427j718o170l057K090O316K682l415n898k070L964N628J409
3930E388m300o040q51O020N449o90o324m614J452N861N101k790o782l474L714
3945b880O475K749m445o763q44M915O112K89n807n542N2P173M525j901o067m599
3961f558K421P090L934m016p404k203M973O399K045o243o180o37O740N565j278
3976D648o835m195J902O944L932l960n867l027L894O475K307n072n831j015N150
$$ plain form
3870 -5968 -1378 5640 6262 -364 -6510 -5538 1854 5733 4255 -2286 -6572 -3244 4189 6465 2830
3885 2830 -4680 -6413 -1710 4738 5852 842 -5691 -4613 341 5826 4744 -1793 -5897 -3617 2281
3900 2281 5486 3321 -3587 -6326 -1832 3910 5540 1138 -4456 -5240 -481 5650 5117 -961 -5924
3915 -5924 -4455 1200 5627 3909 -2261 -5318 -3228 3088 5770 2355 -3543 -5613 -1649 3979 5388
3930 5388 1088 -4952 -5803 217 5666 4976 -1348 -5962 -4510 1351 6452 3662 -3120 -6594 -2880
3945 -2880 3595 6344 1899 -4864 -5708 -793 5319 5608 -199 -5741 -5689 1484 6009 4108 -1959 -6558
3961 -6558 -4137 2953 6887 2871 -4533 -6736 -1763 4636 6681 438 -5742 -6379 361 5926 4648
3976 4648 -2187 -6382 -4480 2464 6396 2436 -3431 -6458 -2564 3911 6218 1146 -4685 -5700 -550
3991e50N850q45n278n224J731N903L902j631o618l870M121N550K916l625n773
4006c441k725M543N826J000m573n687n35N486N374p58n815m326J985N076M812
4021F242k954o249l165L490O085K624m096n931j551M961N488N38n065n848N41
4036d890N698N058j600o493l394J897O112M506l690p009k821M515O721R10l916
4051A604o499p30O286M544j43o195m684R63P302L884k629o181l612M339N571K341
4067F161m582o129p80M896N883L85o548m727J106N926L931j792o191k831K625
4082b667N943K367l135n864k087L824N529J203m890m788J8M577M824r86m775m667
4098e574K046N983K583j934n589k927L137O217R27l200n662j406M543N047P78
$$ plain form
3991 -550 5300 4455 -823 -6047 -4316 1587 5489 3858 -2760 -6630 -2509 3041 5957 2332 -3441
4006 -3441 -6166 -1623 4203 5203 630 -5057 -5592 -106 5268 4510 -1305 -5631 -3646 1430 6242
4021 6242 3288 -2961 -6126 -2636 3449 6073 1977 -3954 -5505 -544 4944 5482 417 -5431 -4890
4036 -4890 808 5866 4266 -2227 -5621 -3724 2388 6894 3204 -3805 -6626 -2111 4610 5520 1604
4051 1604 -4895 -5625 661 5205 5062 -1133 -5817 -4854 2448 6332 3703 -2478 -6090 -1751 3820 6161
4067 6161 1579 -4550 -5330 -434 5449 5834 -714 -5441 -4335 1591 5522 3730 -2461 -5292 -2667
4082 -2667 3276 5643 2508 -3356 -5443 -1619 3910 5113 223 -4565 -4547 30 4854 3868 -907 -5574
4098 -5574 -3528 2455 5038 3104 -2485 -5412 -2275 3942 4869 1669 -3993 -5399 -856 4191 4969
4113D969n060n041K99N578M247r23o293l166K206N920K628k345o235k552L935
4128a833N442J793m911n042q21N581M589p16n709m112J985N180M345l346n623
4143c198l034L788O104K083m032n980j064M637N543k80n446m642Q74N564M411
4158E328j763n640l928L469N307L206m065m695k670M365M412K001n060n373Q04
4173d302M444N147j851n153l231J647N299K586k613m624l109L624N828J117l416
4188A393n372o57L199O004J13m867m800Q09M898M356j258n412l772K496N543K868
4204E541l216n502k073L834N313J119m331m233j236N019M856j167n028m249J176
4219d177N671L789k055o062l253M459M964K054l639n259k452M868N875o79m561
$$ plain form
4113 4969 -91 -5132 -4833 745 4992 4069 -2224 -5390 -3184 2736 5364 3019 -3216 -5768 -1833
4128 -1833 3609 5402 491 -4551 -5372 209 4798 4082 -1627 -5739 -3754 1426 5771 2425 -3198
4143 -3198 -6232 -2444 3660 5743 1711 -4269 -5333 -696 4847 4567 -879 -5521 -4647 917 5328
4158 5328 3565 -2075 -6003 -2534 2773 5979 1914 -2781 -5451 -1086 3326 5327 267 -5106 -4302
4173 -4302 142 5289 3438 -1715 -4946 -3299 2000 4586 1973 -2651 -5760 -2136 3692 4809 1393
4188 1393 -3979 -4636 -1437 4567 4680 -187 -4987 -4178 720 5076 3818 -1594 -5366 -2870 2673 5541
4204 5541 2325 -3177 -5250 -1416 3897 5016 685 -3548 -4784 235 5091 3924 -1104 -5353 -4177
4219 -4177 1494 5283 3228 -2834 -6087 -1628 3336 5390 1751 -3508 -5960 -1092 4783 4104 -457
4234d57m627RO309M686j745o469l401K299N663K750l027o161j341M331N211P15
4250D745l889n033q59N755M303j086n689l526J259O029L082k905n276k027K996
4265b121N437J478l511m935j283M162M954j92l796m735P80N618K595p39m749m227
4281e264K338N767J925k403n057k561K884N983J082m298m381k82L819L927L60
4296C839m793m359K147M730M024k901m803l762K799O136K252m110m534j888M169
4311a054N282J67m484m239L90L494N625j148n455l852K259N571K734k966n591
4326c267k839M863N310Q79m291m975q82N464M585o82n328m406J735O523K533k409
4342B813n236k517K795N548J457l393n276j115M413M651l7m653l825Q51M785L127
$$ plain form
4234 -457 -5084 -5075 1234 5920 4175 -2294 -5695 -3396 2267 5017 1990 -4171 -5512 -1181 4030 4745
4250 4745 856 -4177 -5036 719 5022 3936 -1753 -5279 -4020 2009 5091 2186 -3090 -5117 -2121
4265 -2121 3316 4794 1283 -3652 -4935 -773 4181 3989 193 -4542 -3762 1856 4451 3712 -1037 -5264
4281 -5264 -2926 2841 4766 2363 -2694 -5255 -2371 3612 4694 396 -3985 -4267 -448 3479 3839
4296 3839 -954 -5313 -3166 1564 5588 2687 -2116 -5878 -3079 3057 5309 1199 -3335 -5223 -1054
4311 -1054 4228 4395 -89 -4328 -3938 -444 5181 4033 -1422 -5274 -3015 2556 5290 2324 -3267
4326 -3267 -6106 -1243 4067 4946 655 -4320 -5202 262 4847 4165 -1163 -5569 -3834 2689 5222 2813
4342 2813 -2423 -4940 -2145 3403 4860 1467 -3809 -4924 -511 4140 4103 -550 -4375 -3524 1261 4388
4358D388j735m538k666J914M524K410k179n127j622L881M494Q28l933m756P4M733
4374F90L172k85m454k752N42M992L350k288m822k636K060M911K043k835n099q33
4390d244L466M153J042m450m152K28M797L172n8n337m121K463M931L425l445n396
4406c526j578L476N067J019m037m277k26L830M627l63m908l718J416M515L565
4421D882k360n041k582L424N234J749l970m991j519M807N485r25m853m212J611
4436c261M294L905j735m876l370K411N093J796k372m998k215M664L652J109l235
4451H62m388k15L749M723j537m328l445J103N257K827k188n005k276K549M186
4466A874K349k785m729q70L714M098J35l330m184j32L925M445j528m081l396J535
$$ plain form
4358 4388 2653 -1885 -4551 -2637 1887 4297 2118 -3009 -4631 -750 3744 4572 639 -4117 -4043 690
4374 690 3862 3577 -877 -3629 -3087 1905 5255 2967 -1855 -4491 -2431 2480 4523 1688 -3411 -4244
4390 -4244 -778 3375 4417 -33 -4185 -3957 840 4012 3954 -1383 -5504 -3041 1890 5315 1870 -3526
4406 -3526 -5104 -1628 3439 4458 421 -3856 -4082 -252 4375 4012 -896 -4614 -3198 1317 4882
4421 4882 2522 -2519 -5101 -1677 3557 5306 1336 -3655 -5174 -367 5118 4193 -660 -4872 -3261
4436 -3261 1033 4938 3203 -1673 -5043 -2632 2461 4257 1885 -3113 -5328 -664 2988 4097 862
4451 862 -3526 -3741 8 4731 3194 -1134 -4579 -3476 1781 4608 2420 -2585 -4861 -2312 1874
4466 1874 4223 1438 -3291 -4161 -447 3651 3786 456 -3728 -3860 65 4510 2982 -1099 -4495 -2960
4482b960N010K502k006n123j903L082M913J971l978n752K51M361L915q2m463m468
4498d730J538M907L260k057n059l465L302N749J109l657m041q60L219M361J048
4513D624m393m794J520L806M386k139m867l018J662N706K058k628m705j721L701
4528h02M608K33l196l690q97L824M237j087m008l406J851M043K300j605m702j463
4544c760J952M970J561l665m256j568M438L397J198m783l603P55L589L822j272
4559B775l499l138J384M128K548k656m927m83K365M291K106l684l757j441L604
4574c84M206m79m093l131J70M986L448j854m275k710K417M368J719k594m674j375
4590d255L367M571k54l318l613N14M138L680j308n113k641J849N208J929l055
$$ plain form
4482 -2960 2050 4552 2546 -2577 -4480 -1398 3515 5486 1508 -4244 -3993 368 4283 4201 -262 -4730
4498 -4730 -3192 1715 4975 2918 -2141 -5606 -2304 3445 4554 897 -3144 -4004 -785 3576 4624
4513 4624 231 -4563 -3043 763 5149 3010 -1857 -4875 -3213 2493 4551 1923 -2782 -4503 -802
4528 -802 3806 4039 843 -2847 -3744 80 4317 3230 -778 -4184 -2333 1710 4010 2405 -2297 -3760
4544 -3760 -1808 3162 4723 1058 -3198 -4766 -328 3069 4267 -516 -4119 -3364 225 4047 2775
4559 2775 -724 -3862 -2478 1650 4198 1542 -3385 -3868 -1503 2788 4894 1210 -2547 -3988 -384
4574 -384 3822 3343 -750 -3881 -3711 1275 4723 2869 -1406 -4116 -1699 2669 4388 1794 -2880 -4255
4590 -4255 -888 3683 3429 111 -3502 -2988 1150 4830 3522 -1591 -4232 -2383 2825 4754 1699
4605A699m624j150L565M826l97l139l940m83L873M275j133m262l423J758M040
4620A485K585k081m078j378K510L755J079k987l845o52L560L348J22l746l117
4635c440M88M220K653j584l841k481K625L736J709k278l429k113K839L741R86
4650C831l101l425j442M319L089M12l770l860J191M125K966j484m250k268J475
4665b192M895J513k156n012o40K791M407R4l466l678J44L816M376j811m219l327
4681d465J866M744K181k324m829j836L477L785J612l209m886K18M092K249N03
4696C178l829m224K481M098L002k380m583k034K868M369J061k581m187m33L184
4711a0L314l03l746k974R86L828L620j694m131k932K252M464J490k164m030j958
$$ plain form
4605 1699 -2925 -4075 -510 4316 3919 780 -3160 -3643 230 4505 3372 -890 -4313 -2555 1485
4620 1485 4070 1989 -2089 -3467 -957 2798 3877 890 -2955 -3607 -47 3301 3423 -323 -3440
4635 -3440 -2952 1268 3921 2337 -1504 -3985 -1360 2376 4085 1807 -1622 -3735 -896 2845 3831
4650 3831 730 -2695 -4137 182 3271 3683 -87 -3947 -2756 1369 4335 2851 -1399 -3667 -2192
4665 -2192 2703 4216 2060 -2952 -3592 -801 3606 3700 234 -3444 -3300 516 4892 3081 -1138 -4465
4681 -4465 -2599 2145 4326 2002 -2827 -4663 -1186 2599 4211 1002 -3884 -3666 426 2675 3178
4696 3178 -651 -4875 -2394 1704 4706 2326 -2257 -4291 -1423 2946 4007 1426 -2761 -3194 -10
4711 -10 3304 3001 -745 -3719 -2733 1095 4715 3021 -1110 -4042 -1790 2674 4164 2000 -2030 -3988
4727c988K847L995J146l915l025RL148L213K57n178j844J251K584L174j419m124
4743a869j523K803L029J539k054l870j644L018L578O75l341l392n63L925L305
4758C616m35m070l049K231L358K255j947m795j532L085M035R40k481m142o40L881
4774C10K940K47l920l178J06N147K109r28n213j990K678M344J065k315m146j311
4790d055L566L835k45l332l180L21M252J939r18l422j803J035L922J668j950l651
4806b018j412K236L979Q47l561l303K57L330K835k80l630l073J372L864J524o74
4822B293l392j785J533L673J075k296k706j551K288L055R96l095k552j94K844
4837A86K543Q3l703l191K013L305K407j447m370r93J321M071J109l002l815q7
$$ plain form
4727 -3988 -1141 2854 4000 85 -2940 -2931 217 3430 3687 -1491 -3335 -2084 500 3674 2255 -1869
4743 -1869 -3392 -589 2440 3979 1925 -1945 -3589 -571 3007 3682 341 -3051 -3614 311 3616
4758 3616 3181 -889 -3938 -1707 1651 3906 1959 -2836 -4368 -1283 2752 3692 1211 -2931 -3571 310
4774 310 3250 3497 -423 -3601 -3495 1652 3761 2833 -2380 -4370 -1692 2652 3717 1402 -2744 -4055
4790 -4055 -489 3346 3101 -231 -3411 -3090 1162 3101 2183 -1239 -3042 -2007 1915 3583 1633 -2018
4806 -2018 -3430 -1194 2785 3632 71 -3232 -2975 355 3190 2910 -720 -3793 -2421 1443 2967 2293
4822 2293 -1099 -2884 -1351 2322 3397 1101 -1605 -3156 -868 2187 3183 88 -2464 -2658 186
4837 186 2729 2812 -891 -4082 -2069 1236 3643 2196 -2174 -3167 -1846 2225 3334 332 -3483 -3570
4853c570L133L614r97k154l865J683K766L280j152m226j978J864L939J967l020
4868A284l828j175M142K684L74l108l915R75K864L426o20m272k158J910K749K580
4884C912k524l630j538L284L290O91l553l298J80L440K901O7l771k778K83M642
4900A598J397j127l605j443J916L167J185k627k803r45L373K768j73k927k459
4915b705R4L084K518n09l570k273J556L089K045j421l687r56J588L872N70k490
4931H05l449k09L247K990o18l177k562K17L661K263r52l584j921J756L189J491
4947C147j669l715j221K210M196K20l156l506M02L850L095j109m382j839J553
4962a924L072K778k546l376j215K490L387P86l263m125J064K186M071p85l312
$$ plain form
4853 -3570 -437 3177 2180 26 -3839 -2156 610 3890 2738 -1488 -3466 -1602 2337 4304 1284
4868 1284 -2544 -3719 423 3107 3481 373 -3542 -2567 297 3723 3103 -1169 -3327 -1417 1332 3912
4884 3912 1388 -2242 -3780 -496 2794 3485 -68 -3366 -3186 254 3155 3222 -549 -3327 -3044 1598
4900 1598 2995 1868 -1737 -3180 -1264 1903 3088 461 -2342 -3287 86 2854 2681 -246 -2705
4915 -2705 -2611 473 2991 2482 -1088 -3361 -1805 1284 3329 1908 -1779 -2735 -1147 2725 3295 805
4931 805 -2644 -2853 394 3384 2766 -411 -2973 -2756 905 3168 2216 -1368 -3289 -1533 1656 3147
4947 3147 1478 -2237 -3458 -1248 2948 3168 12 -3494 -3092 758 3853 2744 -1638 -3477 -1924
4962 -1924 1148 3926 1380 -1996 -3211 -721 2666 3452 189 -3936 -2872 -686 3385 2600 -712
4977g12k486j5M467K576k139l142j990J595M500Q98k839l165k19K630L182n8l457
4994c74k528N47L258K565j312k910k070J218K874J643j979k257k531K412L657
5009B213J183k937l260m43L423K979p4l807k737J509K982J761n46l541k042J404
5025a933L789J391k029l329p27J861L728M11l260k085j237L156L626j330l017
5040i85k262J273L606J985k122l945j347K634M002P9k331l745M05L112K725n66
5056B518l159k172O91L883J383j320l742j289J254L861J267k394l463q90L084
5071d88L549K85l759k623O22L873J225p73l552j017Q30L529J870k791k772p73
5087b765J780K662J666k932k655j016L084K467j51k720k397N51K727K402p97l490
$$ plain form
4977 -712 -3198 -3213 1254 3830 1691 -1451 -3441 -1846 2654 3552 713 -2452 -2671 -41 3141 3083 -374
4994 -374 -2902 -2355 903 3468 2156 -754 -2824 -1606 1268 2911 932 -1325 -3856 -1444 2213
5009 2213 3396 459 -2801 -3244 179 3158 3084 -723 -3460 -1951 1031 2792 2246 -1295 -3337 -1933
5025 -1933 1856 3247 1218 -2111 -2838 -977 2751 3162 -98 -2183 -3420 -264 3362 2032 -985
5040 -985 -3247 -1974 1632 3617 1495 -2450 -3797 -1163 2839 2918 587 -3158 -2753 359 3084 2518
5056 2518 -641 -2813 -2122 1761 3144 1824 -1918 -3207 -1953 1908 3175 781 -2682 -3572 -488
5071 -488 3061 3346 -413 -3036 -2414 1459 2684 1911 -1641 -2658 -1828 1701 3571 780 -1992 -2765
5087 -2765 -985 1677 3343 411 -2244 -3260 -176 2291 2140 -580 -2977 -2426 301 2703 1906 -1584
5103a584j359J939K469J228k241k545k96K028K535R23l448k194M60K594K102l79
5119B232l466j597O61L647J694j279l463k394J995M134P99k161l659L32K306K696
5135B477K29l934k633J504L493K487j297m201j780J906L523J510k306l026j508
5150c556L005L122q9k211k966K05K736L711j355l272k388J230L622J518k160m005
5166b853K57K070L181jj915k978J08L116J210O7k641k145M76K977J944j707k488
5183a322j684J932K833J068k045k696r26K209K719M22k675k406K87K791K851j185
5199B173l267j475J444K019K267j723k439j669J211L833K25j465l151j169L017
5214a69K743N42l252k699J30L788K250q55l383k442K161L813M01k338k949q19
$$ plain form
5103 -1584 -2943 -1004 1465 2693 452 -2093 -2389 -361 2174 3097 -351 -2545 -2085 509 2611 2232
5119 2232 -1234 -2831 -2170 1477 3171 1892 -1571 -3965 -1970 2164 2963 802 -2857 -2525 -219 2477
5135 2477 2706 -1228 -3861 -2357 1136 3623 2326 -1875 -3655 -1749 1774 3284 978 -2048 -3556
5150 -3556 -551 2571 2482 271 -2695 -2490 246 3957 2602 -670 -3058 -1828 1794 3312 1152 -2853
5166 -2853 -2596 -526 2655 2654 739 -2239 -2131 985 2195 2262 -379 -2524 -2048 929 2873 1166 -1322
5183 -1322 -3006 -1074 1759 2827 782 -1914 -2840 -631 2088 2510 -165 -2571 -2284 507 3358 2173
5199 2173 -1094 -2569 -1125 894 3161 1438 -1001 -2670 -1459 2374 2599 1134 -2017 -3186 -169
5214 -169 2574 3116 -136 -2835 -2705 1083 3333 2478 -905 -3347 -1186 2627 3028 690 -2259 -3078
5230c078K853K904J8k721l120J062K737J797L06l485k086R72L176J289j352l539
5246b267r82K704L999k24k985k697L18K720K243q02k811j941J086L345J451j970
5262A187k488p95J081L049L50j499k573j036K309K744oj917k780k79L430K420
5278C197j285k604k195J325L132J049j584k898m79J739K172J134k072k579o34
5293b582K023K103N10k007k703L92K761K069q14l171j334J309L182J684k244l282
5309b104q01K619K593M50k591l268P86K763K765j136l251j378J185K543J566j151
5325A590l231j192J838K946P81k098k726n04L190K178j60l346j899Q26L202J183
5341B578j125l501q53J827L072L84k576j687n15K271K285n1j569k976O71K262
$$ plain form
5230 -3078 -225 2679 2697 -24 -3144 -2082 655 2452 2758 -727 -2813 -1841 1335 2624 1272 -2267
5246 -2267 -3249 -545 3454 3230 245 -2452 -2134 586 2829 2027 -784 -2725 -1639 1706 3157 1187
5262 1187 -1301 -2096 -1015 2034 2384 885 -1688 -2724 -415 2329 2323 406 -2374 -2653 777 3197
5278 3197 1912 -692 -2887 -1562 1570 2619 1035 -1863 -2342 -603 1569 2703 631 -1948 -2582
5293 -2582 -559 1544 2054 47 -2656 -2264 497 2566 1752 -1419 -2753 -1444 1738 3422 1178 -2104
5309 -2104 -2905 -286 2307 2757 166 -3102 -2316 447 3212 2076 -1175 -2553 -1368 1175 2741 1590
5325 1590 -1641 -2833 -995 1951 2732 634 -2092 -2596 594 2772 2612 -734 -2633 -1807 1395 2578
5341 2578 1453 -2048 -2901 -1074 1998 2382 -194 -1881 -2396 -125 2160 2109 540 -2436 -1765 497
5357D97J615l30l044j030p8L239J975k366j757j257J152L152P03k173k446m5K181
5374a2K517r91k075k117O49K767J600q15k436j790R55L102J170j282l435m45K501
5391a37K071Q83k454k966l99L526K419j042k683j699M43L574Q85j566k579j124
5407b848K079K996J039k803l124J24K443K223O44l127k962J127L295J756q87l274
5423a299j595J552L646M00j952k718n65K349K123O35l363j894Q47K456J676o55
5439A643k320j789P94K477J514r70k715j571K216K258Q48k490j590p33K442L391
5455C405j043l072j819P81K597J746j482k381p69J421K037J076j532k451j076
5470b562J960J893R46k062j919o50K253K871o58l241j565J473K407J244o26k703
$$ plain form
5357 497 2112 1782 -1262 -2292 -2370 869 2844 478 -1279 -2536 -1384 1768 2471 298 -2148 -2193 -12
5374 -12 2505 1514 -561 -2678 -2029 738 2338 1523 -913 -2703 -1748 1354 2524 1242 -2193 -2638 -137
5391 -137 1934 2817 363 -2603 -3002 524 2943 1901 -782 -2481 -2038 1536 2421 855 -1724 -2848
5407 -2848 -769 2227 3266 463 -2661 -2537 -94 2129 2773 -354 -3316 -2189 1106 2862 1975 -1299
5423 -1299 -2894 -1342 2304 2704 752 -1966 -2531 -182 1941 2576 -787 -2681 -1834 622 2298 1643
5439 1643 -677 -2466 -1672 805 2319 1349 -1366 -2937 -721 1537 2385 -105 -1695 -2428 14 3405
5455 3405 2362 -710 -2529 -1748 849 2595 1113 -1268 -2037 -616 1421 2497 965 -1486 -2562
5470 -2562 -602 1291 2237 175 -1744 -2394 -141 2730 2072 -1169 -2734 -1261 1146 2390 1764 -939
5486i39k084J833L305O08j754k892k34K182J990L75k221l314J398K840J748j680
5502A161k242j486J234K413J692k021l193P9J673K951K32l243j927M88K891J780
5518B482j084k035k102J647K628M20j762j610m35O63L200Nj668k267m4K299J711
5535B048L20k975j886M33K287J772p11k546j351J047L312q7r13k395O7J335J571
5552A328J081k611j521K94J384K047m07j820k022Q82K298J637j824j786j372J639
5568g73K325M38j314k314o21K327K970j027k669j349L50K449J500j185k342j252
5584b487J665K232J233j468k910l31J529K504O40k511k170l59L035K232j416k330
5600i12j492J578K215J059j108k815p07J406L020L8k175k107m62K816J897m54
$$ plain form
5486 -939 -3023 -1190 2115 2723 969 -1923 -2157 25 2015 2390 169 -3145 -1747 1093 2841 1161
5502 1161 -1081 -2567 -1333 1080 2772 751 -2442 -2363 -690 2261 2493 -750 -2677 -2189 702 2482
5518 2482 1398 -637 -2739 -1092 1536 1956 194 -1416 -1851 -1188 2012 2017 349 -1918 -1962 337 2048
5535 2048 2368 -607 -2493 -2060 227 1999 1288 -1258 -2609 -1562 1750 1663 750 -1645 -1578 -243 1328
5552 1328 2409 -202 -1723 -1429 -45 2002 1595 -225 -2247 -1365 933 2570 746 -1040 -2412 -773
5568 -773 1552 1990 676 -1638 -2259 68 3038 2011 -658 -2007 -1657 792 2292 1107 -1235 -2487
5584 -2487 -822 1410 2643 1175 -1735 -2066 -537 1967 2607 96 -2074 -2433 602 2834 1418 -912
5600 -912 -2404 -826 1389 2448 1340 -1475 -2182 -776 2244 2282 107 -2000 -2462 354 2251 1797
5616A797k107k163O18K278K238j197l020p51J352L022m6j195k356q21K152J619
5632A420N33j784k466M55J350K630o93k202j393O44K066J671j334k522l62J182
5648h05J637J349j707k707K64J910J660L68k275j885M03K445J551j308j960j261
5664b321J292K314Q15j551j784p06J086L014l09j671k608j53K874K021o29k412
5680g28j438K39K876J437j370k114j403J442K528Q88k562j816j88K367J864K81
5696B303k269k341P21K556J403j620j694j191J004K455Q45j505k553K43R62K181
5712A500J175k844j256l75K407J869r68k472j431J480K056L37o61j749q05J176
5728e61K174n13j337j083K23Q14J820Q20k430j155n92K167J374J44k883j216J821
$$ plain form
5616 1797 -310 -2473 -1855 423 2661 1464 -1556 -2307 -955 2067 2021 826 -1530 -2351 -199 1420
5632 1420 1953 169 -2297 -1842 -492 2138 1445 -757 -2150 -1506 560 2231 897 -1625 -1987 -805
5648 -805 832 2181 474 -2233 -1969 -59 1601 1969 -306 -2191 -1788 657 2208 900 -1060 -2321
5664 -2321 -1029 1285 2100 549 -1235 -1941 -855 2159 1850 179 -2429 -2582 292 2313 1684 -728
5680 -728 -2166 -1927 949 2386 1016 -1098 -2501 -1059 1469 2357 -205 -2021 -2209 158 2022 2303
5696 2303 34 -2307 -1586 970 2373 753 -941 -2132 -1128 1327 2172 667 -1886 -1643 -681 1500
5712 1500 2675 -169 -1425 -1800 607 2476 1508 -964 -2395 -915 1141 1478 817 -932 -1737 -561
5728 -561 1613 1100 -237 -1320 -1097 -283 1537 2357 -73 -1228 -1820 347 1721 1865 -1018 -2234 -413
5745d13J432Q79p16l031k85J287K574J81k547p37K10J262J636k47j603j800N74
5762a344K228J205p69k290j531J976K000J98r09k622k26K272J699O6j417k237
5778a701J73K140J109j253r87k070J354K965mo74k567q68K296J896k51j345k378
5795b165L24K371J516j166j950j170J392J307J080q43k557K79J537J352l1j440
5811a64j984j32K222J402j68j789j612O23K259Q82q89j761n21O05J540Q82j201
5828A94j897q89K099J765P15k229j489N02J767J426q33j644j300O66J966J261
5844B080j435j507j462J081K735K16j850j391l82J859K017l22j912k023R39J763
5860D06J832r62j507k216O79L133R77j599k067j006K309J625J96k181j478R8J915
$$ plain form
5745 -413 1019 1898 1182 -1849 -2134 -847 1727 1908 -639 -1376 -1166 96 1732 1485 -118 -1918 -1344
5762 -1344 884 2089 1320 -970 -2501 -525 1475 1673 764 -1858 -2084 188 1887 1953 536 -1701
5778 -1701 -1528 612 1721 468 -519 -2589 -1235 1730 1726 1052 -1515 -2383 -87 1809 1558 213 -2165
5795 -2165 -1841 530 2046 880 -1070 -2240 -848 459 1539 696 -1861 -1582 -45 1307 1276 -164
5811 -164 -2148 -2280 -58 1344 1176 -613 -2225 -1602 657 1539 650 -1111 -1632 -1027 513 1395 194
5828 194 -1703 -2592 -493 1272 1987 -242 -1731 -1229 538 1964 1131 -513 -1813 -1147 819 2080
5844 2080 645 -862 -2324 -1243 1492 1708 -142 -1533 -1915 -56 1961 1639 -273 -2296 -1357 406
5860 406 2238 1276 -231 -2447 -1768 1365 2342 743 -1324 -2330 -21 1604 1800 -381 -1859 -1761 154
5877A54K189r87k609r53P21K554J263j063k988n45J732K290M89k550j166j26J664
5894F9K124j188j668j469R46K310P50j350j173j607J417J502Q73j054k520M08
5910a630K045J645l47j783j865J15K150J842p12j938j653R63K207O97p51k534
5926a549p47J220K101N80j297k030m44J867K152j91j466k582O66K064J104j62
5942A286j757j293R48K017J252j830k048l55J607K445q40j606j536J6K134J553
5958A993n83j955j795J671R86K391j333k269q37J463K116M30j305k681J10J452
5974a46J610L34k101j369L31K555J438k015j748o56N43K279O20j468j662J70J067
5991b18J408O64k442j124r6K444J256j045j429m79K90J758J204j526k216n99J069
$$ plain form
5877 154 2343 1356 -1253 -2206 -1485 1069 2332 1269 -1719 -2264 -532 1758 2247 -303 -1469 -1595 69
5894 69 2193 1005 -663 -2132 -1186 1124 1874 524 -649 -2256 -839 663 1536 482 -2038 -1630
5910 -1630 415 2060 1713 -70 -1935 -1820 330 2172 1460 -478 -2131 -1168 1039 1736 985 -1549
5926 -1549 -2296 -1076 1025 1605 308 -1722 -2166 -299 1853 1662 196 -2386 -1720 344 1448 1286
5942 1286 -471 -1764 -816 1201 2453 623 -1425 -1780 -173 2272 1432 -174 -1710 -1694 440 1993
5958 1993 1410 -545 -2340 -669 317 2708 1375 -894 -1731 -268 1848 2278 973 -1708 -1598 -146
5974 -146 1464 1798 -303 -1672 -1341 1214 2652 637 -1111 -1767 -1224 1055 1675 207 -1455 -1285 -218
5991 -218 1190 1854 -588 -1712 -1808 636 1892 847 -582 -1061 -771 987 2191 665 -1551 -2150 -1081
6008a081J916J145j551j465p94K308R95j13j850q33O26P42K027j278j008j387
6024a601L21K019Q64j382j512p1O71J720R94j739j766J87J609J968m88k586j139
6041a931O64J981R35o59k198p39J143K530N6j288k508J41J834J870J72k303j608
6058a908N45J627J700l10k567j021P96K311R32j649j803l74K034J138J57j847
6074b39j421O92J599R34k4k003j697J432J151J523j064j851j040J725J144L12
6090A173j207j529j13K111J494m32j697j175O7K155M60n29j846p94J376J441N75
6107A530r98j971J60R44J770J46j115k154J58J706J851r09j864r58M54J628J349
6124A727j160j757m75Q43J558Q38r72k159J91J523J601j98k569q94R24J760J233
$$ plain form
6008 -1081 835 1980 429 -1036 -1830 478 1473 1360 -490 -1323 -697 45 2072 794 -214 -1601
6024 -1601 -1280 739 1603 221 -1291 -1362 -691 1029 2023 284 -1482 -1295 314 2282 1794 -792 -1931
6041 -1931 -1267 714 1649 990 -1208 -1947 -804 1726 1782 494 -2014 -1873 -39 1831 2003 -300 -1908
6058 -1908 -1363 264 1964 1654 -913 -1934 -1138 1173 2105 456 -1347 -1721 313 1451 1608 -239
6074 -239 -1660 -968 631 1565 1541 -462 -2159 -727 424 1947 883 -968 -2008 -283 861 1173
6090 1173 -34 -1563 -1676 435 1929 1497 -200 -1375 -1308 847 1307 778 -1068 -1862 -486 955 1530
6107 1530 532 -1439 -1279 -335 1435 1581 466 -1688 -1530 176 2027 1118 -746 -1704 -1250 378 1727
6124 1727 567 -1190 -1665 -822 736 1574 602 -1557 -1366 157 1758 1560 -1009 -1903 -979 781 2014
6141B014k58k605q70R67K128R95k582j289k80J582K092kj568j597R8J412J276
6158A513n62j279j971J384K259Q49j342j283r66J302J807j68j824j630L83J257
6174b71K183r41r90j779R90J498J128j472j274mL96J636R74j097k101l90J508
6191fJ117L03j138j520n9J741J012p08j202j558R16J983R39j013j892o32J361
6208c56J309J278j682j816J29J174J668j87k156q39J62J670J410q07j732j431
6224b206J134K162P67j200j733p71J228K468J09k335j822J078J140K242j028j239
6240fj586M41K122Q49p07j887j095J336J517M74j268j137j664K804J529o05j446
6257c29j342N21J412J860j340j270j082J390R43O85o83j979l40J303K006q54j333
$$ plain form
6141 2014 1756 -849 -1719 -752 1376 2371 -211 -1500 -1780 -198 1894 1892 324 -1273 -1175 237 1513
6158 1513 951 -328 -2299 -915 1344 2193 851 -432 -1398 -96 1711 1543 -281 -1911 -1528 -271
6174 -271 1912 971 -19 -1798 -808 690 1818 346 -928 -932 -536 1100 2074 977 -1124 -1514 -6
6191 -6 1111 1414 276 -1244 -1303 438 1450 742 -460 -2018 -1102 881 1820 807 -1085 -1717 -356
6208 -356 953 2231 549 -1267 -1138 36 1704 1517 -639 -1478 -1316 354 1764 957 -775 -2206
6224 -2206 -1072 1090 1857 657 -1076 -1847 -619 1849 1958 -377 -2199 -1121 19 2261 1233 -6
6240 -6 -1592 -1151 971 1820 1113 -774 -1869 -533 984 1458 190 -947 -2611 193 1722 1117 -329
6257 -329 -1671 -1150 262 2122 782 -488 -1570 -180 763 1448 765 -1214 -1554 -251 1755 901 -432
6274d32l45p42J769J441q54j776o03L17K447k26l70j908N94J32J567Q05j799n60
6292e43r94J710J507m97j248j452L7J410J677m17k566l39Q04J821J120j713j462
6309a145j19J114P67N90j158j633j9J733J975q32j520j648P58J685J231j411j352
6326i84j600J720K046K47p74j551o76J298K468q72k318o92Q99J147J402j112j117
6343d69j629J383J445J158j898j358q5J209K300j044r93j431J70J100J560k06
6359A212j256j669J074J515N70k61j884q69J032J802j47k76j771n24J496J041
6375A085k18j387o94K1K142J107q95k030n93N53J690P05j137j256n45J386J676
6392A610n38p32j930L33J100R80L79j942o76P78J525J003j703r74r88J530O88
$$ plain form
6274 -432 -777 -1519 250 1691 837 -939 -1542 -1225 1222 996 626 -1282 -688 -556 1011 1816 17 -543
6292 -543 -1537 173 1680 1183 -65 -1517 -1480 -70 1607 1190 -1376 -1715 -911 910 2030 317 -1145
6309 -1145 -1264 -150 617 1207 49 -1584 -1603 130 2105 1273 -247 -1895 -1137 548 1779 368 -984
6326 -984 -2584 -864 1182 1429 655 -896 -1572 -274 2194 1322 -996 -1688 -789 358 1760 648 -469
6343 -469 -2098 -715 730 1888 -10 -1368 -1453 -244 2056 1012 19 -1412 -1242 -142 1418 1212
6359 1212 -44 -1713 -639 876 1446 1185 -699 -1568 -536 1266 1119 843 -928 -1452 44 1085
6375 1085 867 -520 -1214 -1193 949 2056 1161 -869 -1462 -909 781 1486 349 -907 -1452 -66 1610
6392 1610 1072 340 -1590 -1257 -157 823 1202 -740 -1416 -638 887 1890 187 -787 -1775 -245 443
6409D43J348j261j858K03Q92J809m27j053k110J005J432J209q62j770r18J122
6425g96J766K03j120j310j14J397Q31N71j014k008J35J876J266p48j576j241J420
6442d62J671M60j373j484j79P80J841q95m53j367k01J577J371K35j854q63j86
6459a382J564J276p07j124j248J013J761K84j161j186j24Q32J356L8j231j245
6475a284J44O76J859m54q94j097j83K736M92q83j879n45R62J151J126j808j283
6492a164m21J491K066o51j728j145PK070J109r82j433j96M75J405O64n72k398
6509a403m21J290J329O15j918r56K36J852P39p08q70j470J115J257P98r71r52
6526d38j260J219J745L19j036k176m8J597R85R2j441j646J271J243L30k92r27
$$ plain form
6409 443 1791 530 -1328 -1125 -233 1576 1149 96 -2014 -1009 423 1632 770 -1000 -1918 -796
6425 -796 970 1173 53 -1257 -1371 26 857 1428 414 -1594 -1459 417 1683 935 -641 -1882 -462
6442 -462 1209 1669 296 -1188 -1367 -587 1254 359 -94 -1461 -1662 -85 1286 1521 -333 -1196 -1382
6459 -1382 182 1458 751 -373 -1621 -608 1153 1437 276 -910 -1034 -202 1154 1192 -39 -1284
6475 -1284 -1140 -464 1395 941 47 -1050 -1233 1503 1995 1112 -767 -1312 -350 801 1927 119 -1164
6492 -1164 -1585 -94 1972 1321 -407 -1552 -1545 525 1634 652 -781 -977 -502 903 1567 995 -1403
6509 -1403 -1824 -534 795 1410 -508 -1464 -1228 624 1363 655 -215 -1685 -570 687 1485 514 -438
6526 -438 -1698 -479 1266 1585 549 -1627 -1675 -78 907 999 -442 -2088 -817 426 756 464 -463
6543d63j472R03K205K44o64j583p10J274R83O09j390k094J170N68J816j53j937
6560f94o49Q4J567J206n87j777m93J093J238P76j823j334n1J221J452L59j722
6577a34j302M06J468J143J6k442m71J102J100O00j027j558k83J113J512J85q57
6594E71j550k85J058J679l37j137k251J246K049J17m40k071l23J133J654N42j414
6611B41j091k27J209J398k57j382j752K78K190J578j080k080j72L98J184M90l86
6628E39j393m99J079J393P5q84j902O49J609L13Q8j464j434J88K802O02r24j712
6646h75q95J752K81J554j585j666j28J582J062K75j402j348j10K164M01l38j187
6663d63j567Q84J746P72j533j020M51M99J670k40j152n90p39J365J196m32j291
$$ plain form
6543 -463 -1935 -1032 1173 1417 753 -830 -1540 -266 717 1326 -64 -2158 -988 -420 1396 1243 -694
6560 -694 -1343 -1259 308 1514 927 -850 -1343 -250 988 1764 -59 -1393 -1444 -223 1229 1588 -134
6577 -134 -1436 -1030 438 1581 1597 -845 -1316 -214 886 1486 459 -1099 -1382 -269 1243 1428 571
6594 571 -979 -1264 -206 1473 1136 -1 -2252 -1006 1043 1160 720 -1351 -1674 -541 1113 1655 241
6611 241 -850 -1077 132 1530 1273 -109 -1861 -1583 607 2185 1105 -975 -1147 -749 435 925 539
6628 539 -854 -1353 -274 1119 1194 310 -1592 -943 666 979 1067 -397 -1831 -1643 1159 1761 837 -875
6646 -875 -1770 -18 263 1817 232 -1434 -1562 20 1082 1357 -45 -1393 -1503 661 1062 724 -463
6663 -463 -2030 -1146 600 1372 -161 -1181 -730 -231 1439 1199 47 -543 -1282 83 1279 847 -444
6680d44r88N31J411K26k95j118j207J348J181N86p53j619K30R94J099k15j715
6697g48j17M28J363O05o99j452j091J284J243L52p07j110l12J120N59R08j498
6714A28j252j53J130Q79O92j892o49L40J556J010j205j262n24M72J608K78j467
6731c11q87J01J038J017P19j781j530J000J333M56l11j315j062J210P09N97j134
6748a51n96m09J034R64L77o77j148J50M54J674n20j968r15P48J582O87nj785j165
6767a669J304J645m23j54j761k92J052J791j8j445j460K11K098P58m58j790j256
6784a867J257J392N75j286o37n89R07J682n35p02j798J57K295M0N0r48j268Q25
6802d50P70J426j124j089r49Q58J902j78j243j304R51N66J174r26k14j287L41
$$ plain form
6680 -444 -1432 -901 510 736 441 -677 -1884 -536 645 1231 478 -1141 -911 83 1182 967 -748
6697 -748 -865 -437 926 1531 832 -620 -1711 -427 816 1168 461 -649 -961 159 718 1626 128
6714 128 -1124 -1277 -147 732 1424 -468 -1117 -777 779 1789 584 -678 -1202 -730 878 1156 -311
6731 -311 -1198 -1097 -59 958 1677 -104 -1634 -634 699 1155 844 -471 -1533 -323 386 983 -151
6748 -151 -747 -1156 -122 842 1219 542 -606 -456 -2 1672 1152 -816 -1731 -983 599 1286 1281 -504 -1669
6767 -1669 -365 1280 857 703 -1058 -1350 -298 1493 1475 30 -1430 -1219 879 1637 1179 -611 -1867
6784 -1867 -610 782 1357 71 -566 -1155 -248 1434 899 197 -1601 -1444 851 891 941 -7 -1275 -450
6802 -450 320 1746 622 -467 -1416 -558 1344 1166 -77 -1381 -430 136 1310 384 170 -1117 -776
6819g76Q80R07M7j871l0L9J277P28k77j473m82m7K366n17q85o94m38J799L22p4
6839H01q74j698Q02J585P96q14r93j052R82J094J66j029m43m85J273J066K78j639
6857a84j416P95J359J003r74p78j254M97J210J038j078j087m99Q37J693J83j243
6874A02r88j64R68J690j263q63j117J114R67J034o08j212k77M3J223O2n90j061
6892i40n02J073J666l60j471o90Q52M18J584j206o41p02Q07Q89M71q97j652j56
6910a457J019J215K03j098r79k7J236R78k00j342o33J41J455P74o39o32j523Q61
6928f48J410K5l96j852L81O03J953k63j478q97O87P59P59j52j262o78L1J963K19
6947A164n10j698j85J000J857r7j478q89m74R20J995q49r92q07L35J382O50n87
$$ plain form
6819 -776 104 1011 1058 -813 -843 -804 473 1201 924 -549 -1031 -1078 1288 771 -114 -808 -1246 553 875 801
6839 801 -73 -1771 -969 616 1412 598 -395 -1447 -465 629 795 -234 -677 -1162 111 1177 1455 -184
6857 -184 -1600 -805 554 1557 583 -195 -1449 -952 258 1296 218 -869 -1368 -531 1162 1345 102
6874 102 -886 -1050 -82 1608 345 -518 -1635 -521 446 1480 872 -340 -617 -574 649 711 121 -940
6892 -940 -1442 -369 1297 937 -534 -1224 -372 46 1630 424 -217 -919 -112 777 1248 351 -1301 -1457
6910 -1457 -438 777 980 -118 -1097 -1124 112 1090 890 -452 -1085 -944 511 1285 646 14 -1509 -648
6928 -648 762 787 391 -1461 -1080 -477 1476 1213 -265 -1162 -475 284 1043 891 -371 -1049 -1018 945 1164
6947 1164 654 -1044 -1229 -229 1628 1531 53 -836 -1310 -390 1605 756 -236 -1043 -708 674 1324 737
6965G37j495q60O49K026n05p6j746J47J222L45K16p88j433L83J428J056l10j165
6983a69p98Q94P83R38r38j507o13J575J157j055l21j173K02R24J351q38r82J71
7001c99N28J81P02j77j610k49N18J041P46j330p46m69J512Q86l97p60r76K57Q82
7020A40Q85m55j122n65J38J790K35l03j464l43J93J764L07j004j324n4J796L38
7038I52L17j624m99R0J593J94l53j612QJ87J405J134j668j110K65Q71J258m62
7056I46j154j653J535Q78N63l62j615p35J054J156o1j62j015o11N69J274P53j148
7074B12j684K13J261Q98J75p19j283Q60P67J86N8j059j157J90J481R87r95q90
7092d99l74O72Q63O32j516o50N88L70J033j184l41p86J079P33K22m19q67l19Q25
$$ plain form
6965 737 -758 -1618 -969 1057 552 476 -1270 -1123 99 444 660 -128 -1561 -1178 250 1306 996 -169
6983 -169 -967 -73 710 1648 710 -797 -1410 165 1322 267 -54 -1227 -1025 -101 1250 412 -570 -399
7001 -399 129 310 1012 835 -775 -1024 -506 535 1281 -49 -795 -1264 248 1134 737 -23 -999 -742 140
7020 140 1025 570 -552 -1117 -979 811 1046 743 -721 -1064 -871 893 1200 196 -1128 -1182 614 952
7038 952 1269 -355 -854 -764 829 1023 670 -942 -934 -747 658 1792 124 -986 -721 150 1408 946
7056 946 -208 -1861 -326 552 1115 753 -862 -1597 -543 613 552 390 -625 -1236 -667 607 1360 212
7074 212 -1472 -1259 2 900 1075 356 -927 -67 700 886 944 -115 -1272 -1082 399 1386 391 -499
7092 -499 -873 -201 662 1294 -222 -872 -284 86 1119 -65 -406 -1192 -113 620 842 423 -444 -763 62
7111F2O57j23j074p01N24M52J091L11j533j132P84J016P57k63r83j117L77J045
7129A50M57m55q75o79J578J000k24r78j409M25J358M82o5j083p58N92J534j87
7147H63m69j695K53R22J290K1j578p64Q06R3J245N2j477m86n5J248Q27n73q38
7166c15n03L06J246P09j632m07k72P72J752n37j777n14K78J515R88q20j666p64
7184a641O59J539N59j240r76J78J249Q38q39m13r94M52N96Q28J71j043j044N43
7202e78J019K32oj097p62Q49J308r0l71j264M6R35R44j32j067r93K09J107R45
7221A234l09r24j093N52J236L68o76j527k88R87J102O10q85j529N41O00J53M77
7239F29j127K0l0J244N89l54j788l03J045O71N61j014j129K32N37J183N7j516
$$ plain form
7111 62 719 596 -478 -1179 -655 -203 888 1199 -334 -1466 -682 334 1091 828 -155 -1272 -895 150
7129 150 607 152 -723 -1402 176 1176 952 -26 -1435 -1010 348 830 765 -318 -1076 -484 1050 863
7147 863 394 -1301 -1048 -126 1164 1185 -393 -1157 -351 -258 987 1039 -438 -924 -979 269 1096 523 -315
7166 -315 -818 -512 734 1443 -189 -596 -868 -96 1656 1119 -658 -1172 -894 621 1609 789 -877 -1641
7184 -1641 -982 557 1116 -124 -1100 -922 327 1165 326 -87 -1081 -629 -33 795 966 -77 -1121 -578
7202 -578 441 673 667 -430 -1192 -343 965 875 504 -760 -714 221 1165 1033 -34 -1027 -818 289 1234
7221 1234 925 1 -1092 -540 696 1064 388 -1139 -1427 -440 662 1272 387 -1142 -601 -1 152 629
7239 629 -498 -478 -508 736 1325 971 -817 -1120 -75 596 1157 143 -986 -754 -217 966 1023 -493
7257d93k97L11R75R88r36j240l1L74J164j62l12p25m36J90J575l23q04m39J42
7276d79O45P61J87j578n38k54J519P23n83p85k44L16R63n4j1j022m04O99J151
7295A012k73j296k94Q07K26R56l36q00m58k17O60Q87K24k156K37O56N47N67j497
7314e48j44k81J061J145p55j096l28k12J632N42o43j631L97R98J74P95p88j028
7332g10k48Q88O61J36q66p29K57J067R76l99j166k74J03O33N36j070q69q4J274
7351A16Q59L3j344j64r5K44J340j94j348l41L23J250J91k88q18p59L44J677p8
7370I48o87l34j504J543N78L44q75q66N5J109P34q94k98j039J951K1q8n79p80
7389f61L68L30N58K84m53j423O3J117J166l02j299q9M9k09J344m98r83j22N47
$$ plain form
7257 -493 -790 -479 496 1484 548 -692 -723 -349 815 653 341 -384 -820 -630 945 622 -182 -621 -479
7276 -479 166 927 1114 -464 -1002 -1256 263 986 403 -382 -626 -310 653 599 588 -434 -838 -139 1012
7295 1012 739 -557 -851 -44 182 1138 802 2 -456 -673 -13 874 1098 -1058 -821 -165 382 949 -548
7314 -548 -692 -973 88 1233 478 -618 -946 -1158 474 1016 373 -1258 -861 137 311 1106 318 -710
7332 -710 -958 -70 591 727 -139 -868 -611 456 1432 1033 -133 -407 -304 329 865 -205 -1074 -1158 116
7351 116 975 1008 -336 -500 -595 -351 989 795 -553 -894 -571 679 870 582 -236 -995 -651 1026 948
7370 948 261 -73 -1577 -34 544 888 13 -853 -798 311 1045 151 -147 -1186 765 786 698 119 -661
7389 -661 -293 37 595 879 426 -997 -934 183 1349 1047 -252 -341 -292 -501 843 345 -638 -760 -213
7408b13N55M47n93j136N5J543N92n21j181o20m7J417Q83p66j093j93Q32N45K98
7427H04n86p66K82J42J151M58j513j379O68J000N04J07p56o40L03Q95J27k70j074
7446e43Q6M5J193No10n37m74Q51P34n40k30o61K43Q43L38l27r48m22J11J140Q84
7467A181j091q98k69Q02R55K23q45j079M43J310m8K07j054o32Q00J65L33k57r39
7486f93o33P68J037N53q37r80l96J607j61O27j415q43J130K03R42o29j040m59
7504a219J019N32M31m52j494O57M52R10l45j45j173j35Q45R47n23q11l57O32P05
7523D76Q81p65j489J39J94J350N58q87o50o95K57J556L34j652m46P85L12J080
7541A338n58j170J66K17L65K66q93o45L65J6J481J93j309j429P51R95O07l38n83
$$ plain form
7408 -213 342 789 196 -940 -885 658 1250 729 -452 -1072 -1119 298 1181 415 -678 -871 -39 506 804
7427 804 218 -548 -266 -124 1027 1485 -28 -1407 -739 261 765 872 116 -524 -221 674 801 531 -543
7446 -543 -457 -412 781 786 176 -361 -835 16 750 210 -20 -681 -438 405 743 416 -532 -954 -843 297 1181
7467 1181 90 -808 -1077 -275 680 903 58 -1021 -578 732 684 891 -163 -795 5 170 503 246 -693
7486 -693 -1326 -558 479 1032 195 -785 -1181 426 265 892 -523 -1366 -236 -33 909 280 -760 -1219
7504 -1219 -200 332 763 311 -1183 -526 -74 836 491 346 -827 -962 -117 830 307 -504 -861 -229 476
7523 476 1357 592 -897 -758 -564 786 1344 457 -193 -888 -631 925 1259 -393 -839 -54 258 1338
7541 1338 780 -390 -224 -7 358 624 -269 -914 -549 -533 948 1141 -168 -1597 -846 149 756 418 -165
7560a65o55j18P32O11J59j199q73J122J336M67j450o22j09P03M65K81p67r7p50
7579i29J218Q61j040k29q98N47O55J032j469q37M0O06J575j50p59j066M15Q11
7597C83N84m70o51m93K45J316M3n16j110k42J40J673m38k61j015M65P0J921q32
7616H12j276m18N00L11N07J88p24o04j05P72O69j77q61j59K87R02K86q71p17M01
7636b77J13Q56n19n96p50R16P69J37l12r06J07j17Q87L80p82k81O6K30O82R6p82
7657h3n94OR59M92o03q35q10P79J145O82r78r41k6Q76N53l0n21o33L9M28J197
7678A102n94j029j0l17Q66P71j16p55q38M81J148n2l39q82j33Q56M56l46o38r8
7698d67M1L06J051P8j336o16K72J283l66m79L78p86Q8J560p90l07o32L66J214
$$ plain form
7560 -165 -820 -938 -206 405 564 -635 -1508 -386 950 1417 -33 -655 -764 -61 404 685 -82 -179 -929
7579 -929 289 1150 110 -119 -1017 -470 185 1217 -252 -1089 -1049 -443 1132 982 223 -843 -428 383
7597 383 967 497 -154 -647 -402 914 957 441 -669 -911 -771 902 464 203 -812 -347 -277 1644 812
7616 812 -464 -882 -382 -71 436 624 -100 -704 -809 -37 632 455 -406 -565 -278 624 910 39 -678 -277
7636 -277 -164 692 173 -423 -1173 -257 512 649 337 -569 -462 -579 308 688 -94 -375 -309 -79 603 699 -83
7657 -83 -677 -671 288 780 177 -658 -1468 -689 456 1138 160 -781 -807 69 622 592 71 -562 -523 -95 1102
7678 1102 508 -521 -531 -848 18 789 673 -82 -920 -439 709 657 318 -564 -697 159 615 269 -369 -467
7698 -467 -426 -120 931 1009 -327 -943 -671 612 246 -233 145 -641 -553 1007 217 -90 -722 -356 858
7717H58K32o20n73o60M89L92J288j141q23K02k76J019Q4k13j092k31J293L27M91
7736A046q84j239O37J257J43p59m79p90P89N84N79L08k146M02m7R92K65m77m35
7755b54j157J681K94j30n10M9l65J124J79n9j000k91l6J276K84j328n12K28N51
7774B4J10N72j098k9L69O59L48r44q98Q49k90J490J9o85j111j3N38O18N4r61o26
7795a005M02R61P28m37p53l43N68j28O93n07r51j14P16M80P79k11j263m81Q10
7814e6R45k63q09k9j53J65P31J47j458K10N33K03K01k43l37k15J40J276n69l08
7834A11n51n96J757p69R12j693q2L84M18O35j71p82l4M53Q35m63m28l02j50L44
7854a72Q06K95q77j063K95K32O56K71m25o00N95K39K30n44n45n47Q19J295p5j296
$$ plain form
7717 858 1090 470 -103 -763 -274 118 1406 265 -558 -356 -632 387 471 258 -834 -1065 228 555 1046
7736 1046 162 -1077 -440 817 960 201 -278 -1068 -279 305 884 1192 -954 -552 -599 393 658 181 -254
7755 -254 -1411 270 564 434 -76 -27 -392 732 911 852 -148 -439 -475 801 1085 -243 -755 -527 24
7774 24 134 706 -392 -421 -52 607 955 11 -887 -38 -328 1162 1181 496 -615 -628 -90 528 582 -379 -1005
7795 -1005 -603 358 1086 649 -104 -447 121 -7 686 179 -772 -886 -170 310 1089 878 -385 -866 -56
7814 -56 889 626 -183 -212 -365 -200 531 678 -780 -570 -37 166 367 124 -213 -428 -288 988 419 111
7834 111 -440 -1036 721 -48 864 -829 -911 -527 -109 526 355 -427 -461 -8 827 364 -64 -366 -516 -172
7854 -172 634 929 52 -1011 -716 -484 172 443 18 -582 13 252 482 -62 -607 -1154 -335 960 885 -411
7874d11K2j31O29O56l58q29m31O15K45N80k55j019k50K18R28N22q18r68K62M08
7894c85K83O09J4r25O7L2R58j15o31p99J023J82J97k48l82j93N5R67p56M95p37
7915b89p49Q46P54j49j56j071N00R35k22p45N19p32L91l38J340j097o65R7N97
7934b34O72J59o87l38K05N48N32p54p13j43L76J208k32n24l41n38J86J474q4o68
7954A04r24J64N90J295j49j797PJ35R42M88m71o30j7K02J109m58q77m85L46J87
7974b39J157r18Lo14j97J284J94L3r74n43J91J150O00m51j041k32M85R23J79r35
7994E5m71K17n33J222M46j135l66J26O37L02J84j371o8K09R81N8M61j640m03P01
8014c88J288l27j059n04K01J221N14o85o24l13K22P29J005j336m44L08l39R25
$$ plain form
7874 -411 -389 -520 109 765 407 -422 -853 -238 7 587 332 -687 -937 -719 209 731 -87 -1055 -793 -385
7894 -385 -102 507 521 -404 -337 -305 653 538 -93 -892 131 313 510 262 -120 -313 -258 709 -47 448 -289
7915 -289 -1038 -192 562 413 257 -814 -314 621 399 -346 173 -559 -168 -506 834 -263 -928 -831 -234
7934 -234 438 597 -90 -428 -223 325 857 103 -610 -753 -377 831 599 75 -266 -804 -618 856 772 104
7954 104 -820 -656 -66 1229 1080 -717 -710 -575 367 855 384 -246 -263 -61 1048 590 -287 -772 -426 -239
7974 -239 918 0 3 -611 -808 476 670 703 -271 -814 -623 527 1127 676 -365 -597 -112 811 990 55
7994 55 -416 -199 -732 490 936 -199 -565 -439 198 500 684 -687 -755 -546 435 493 954 -686 -1089 -388
8014 -388 900 573 -486 -990 -789 432 946 261 -363 -676 -454 275 1280 -56 -500 -192 -531 394
8032C94R8j13r24k26Q91Q20o63o04l81M19J112N25j062k44n96RP47N56m50m80
8052a72m89J128K58l32K17j519O63P1Q95J40j355J06j65M44K87l06J47l86K4J163
8072H19j09j390M84o00R10O04p85m62m1O90J90J2k25J64j145K27J257M39j093
8091e4p1k41K83R11j14m88r07n0R75k99k49M52k00o24J006N31q56j68p76L59Q34
8112B54L79o47r21K21N28P38O34j586l26K08M40Q06k14j406M19J161M82n09l02
8131C59q18j68m2J239n26m45p9m2Q72J06J49j009O0J89J023n57k96l59j109J114
8151c39O13M66p42r87oJ453k33j08m51j60pM80R7m68j65j75L5P56N18J2j467L46
8173e32J127K2O8r05l45k38J073r3j09j33k87j82O21P84r55j07j054J348
$$ plain form
8032 394 492 379 -545 -771 120 940 277 -327 -708 -289 823 1348 286 42 -554 -545 202 758 308 -172
8052 -172 -661 467 725 393 610 -909 -246 -175 720 860 -495 -389 -554 -110 177 -129 18 -368 -344 819
8072 819 710 -680 -196 -796 114 718 -67 -529 -570 120 310 322 97 261 -884 -657 600 1039 -54
8091 -54 -125 -366 -83 828 714 226 -681 -731 244 -55 -304 148 -52 -676 330 861 5 -163 -939 -580 254
8112 254 633 -14 -935 -714 -186 552 1186 -400 -726 -518 -78 728 514 -892 -473 688 1170 661 359
8131 359 -459 -627 -669 570 44 -401 -480 -522 350 456 605 -404 -344 -155 868 311 15 -344 -1453 -339
8151 -339 274 740 -2 -989 -995 458 225 117 -334 -494 -501 -21 76 -392 -557 -732 -697 59 577 589 -878 -532
8173 -532 595 617 685 -220 -565 -803 270 177 68 -65 -352 -534 87 871 -84 -191 -1245 103
8191A03
$$ Imaginary data points
##PAGE= N=2
##DATA TABLE= (X++(I..I)), XYDATA
0@%%%%%%%%%%%%l1O3o4O4o4O7r8J27j29J55j86K07k41K80l15L57m12M63n20N87
32C10o53P24q14R12j010J127j252J379j528J694j876K078k304K556k839L163l530
49a863L965m479N084n836O787q022R719j2195J6163k3571M2020j65970l59888
62d98086K74008M30465J49001k97760l35273j0556L19952K37261q3575k82718
72i7281j63658P9083K35923J61988m9733k08256j70932J8332K14494J97855n2761
83A65054k74908j68787J51212L12708J07749k47548l37282k9501L06998K69565
93B55260o7791k82334j60310J24838K31812N9331j54751j68972k0606J05725J28781
104E0983O1564n7721j37648j06410L0373J70499J48903o3303k29226j16038J59466
$$ plain form
0 0 0 0 0 0 0 0 0 0 0 0 0 0 -31 32 -32 32 -32 35 -63 64 -65 90 -96 111 -130 150 -165 192 -220 243 -277 310
32 310 -343 381 -433 479 -531 596 -656 723 -805 889 -987 1091 -1213 1343 -1496 1667 -1863
49 -1863 2102 -2377 2707 -3129 3658 -4364 5355 -6840 9323 -14248 27772 -138198 -498086
62 -498086 -224078 206387 355388 57628 -277645 -288201 31751 269012 185437 -97281
72 -97281 -260939 -181856 54067 216055 166322 -41934 -212866 -194534 19960 217815 165054
83 165054 -109854 -278641 -127429 185279 293028 45480 -291802 -321303 -14305 255260
93 255260 187469 -94865 -255175 -130337 101475 160806 6055 -162917 -183523 -77798 50983
104 50983 112547 54826 -82822 -189232 -158859 11640 160543 97240 -131986 -248024 -88558
115h8558K55405M2079k44806k56499M8782L03746K01327j15396k63047j08884
125b25851J39948K09140M0002j50353j55886q812J27571J52836M7132j18291j88662
136a31226p0135J37932K23178O8734j94702k51947Q250K74799K08092j21692l23568
147a72285j45768K19749L34089M8845k76738k59111M0177K53846J61726j02311
157A02219k26010q5656J30127J83139O1502j01145j70111q2717Q7185J77051R4842
168A70426q9329j95998q7040J46544K21995K0796k15348j99952N8347K65333J68177
179B63951j27876k62678q2887J65273J91671O760j58284j22928M4831J41110P4388
190A33331m0869r4437q1301j1525Q0104J10869L7826r0647j44058l8478J36010
$$ plain form
115 -88558 166847 208926 -35880 -292379 -243597 60149 261476 146080 -116967 -225851
125 -225851 -85903 123237 163239 12886 -143000 -151812 -24241 128595 175727 57436 -131226
136 -131226 -201361 -63429 159749 228483 33781 -218166 -209916 64883 272975 151283 -172285
147 -172285 -318053 -98304 235785 284630 7892 -251219 -211042 42804 204530 102219
157 102219 -123791 -209447 -79320 103819 165321 64176 -105935 -188652 -101467 75584 170426
168 170426 81097 -114901 -201941 -55397 166598 187394 -27954 -227906 -169559 95774 263951
179 263951 136075 -126603 -209490 -44217 147454 154214 -4070 -126998 -82167 58943 133331
190 133331 92462 -1975 -83276 -94801 -14697 96172 133998 43351 -100707 -139185 -3175
201c175J59131k8102j95361j28325R8803K22366Q4058j59747k19096k5675J71694
212b3429J54437j9631j45570j03674M4280J29519P4589m2362j15710r6510J5673
223a28388J40730J35013k0898j71388j44541N6465K16821J25311j36358k41010
233a68243m6307K13868K28258k7858k60087j87978J02178K54328J09172j34041
243H3290j99184m4658J42924J60051M80j43583j34372n605J27203J47703K0720
254A54969j40599j60132j1151J56760J61428k8499k03983j40459J03510K28807
264A20651Q2925j64113k25580k7740J97337J83414l5927j81826j07614O7061J43697
275E2285N8822p8437j15289l5931N7483R7987O7997k7886j12073r2168L1791J33021
$$ plain form
201 -3175 155956 127854 -67507 -195832 -97029 125337 209395 49648 -169448 -195123 -23429
212 -23429 131008 111377 -34193 -137867 -93587 35932 110521 68159 -47551 -144061 -128388
223 -128388 12342 147355 126457 -44931 -189472 -133007 83814 209125 72767 -168243
233 -168243 -214550 -682 227576 199718 -60369 -248347 -146169 108159 217331 83290
243 83290 -115894 -160552 -17628 142423 142903 -680 -135052 -140657 -13454 134249 154969
254 154969 14370 -145762 -156913 -153 161275 132776 -71207 -211666 -108156 120651
264 120651 203576 39463 -186117 -213857 -16520 166894 130967 -50859 -158473 -91412 52285
275 52285 111107 32670 -82619 -118550 -61067 36920 104917 77031 -35042 -127210 -95419 37602
287C7602R7640n5568j63351p1270J19932J72934J7349j60490j56415K6412J80097
298D4872J24276o2992j56377p3037O4395J17976M9248o4862j06193m2078N8740
309d6032J12812O7918o1572j52402q2959Q9428J73291O3697j30074j86680j3460
320a66033J87121J62686o3558k16487j17444J15992K17670O8607j50261j82413
330a44120j4211J43416J31927j2466j32493j04238L3809J30071R6808k7295j34474
341c3266j15404L3736J59282J13492o0118j69582q9280J05253J85456L8991j59712
352H848j67979K3014J82513J32918o3430j78599q3411R0959J36382L2952q4442
363B9725r9412j3373P7334Q2246J0041o4711q7793l6968O1807J10606M0119q0747
$$ plain form
287 37602 135242 79674 -83677 -154947 -35015 137919 155268 -5222 -161637 -135225 44872
298 44872 169148 106156 -50221 -123258 -58863 59113 108361 43499 -62694 -104772 -46032
309 -46032 66780 134698 73126 -79276 -162235 -72807 100484 164181 34107 -152573 -166033
320 -166033 21088 183774 120216 -96271 -213715 -97723 119947 188554 38293 -144120
330 -144120 -158331 -14915 117012 104546 -27947 -132185 -98376 31695 128503 101208 -33266
341 -33266 -148670 -114934 44348 157840 97722 -71860 -161140 -55887 129569 168560 8848
352 8848 -159131 -136117 46396 179314 115884 -62715 -146126 -55167 81215 114167 29725
363 29725 -69687 -83060 -5726 76520 86561 21850 -65943 -102911 -41104 69502 109621 28874
375B8874j17498k4720J05124J16906j7979j38859r0883O2606J41428O4201q3416
386D5784j33674l4710R1408J00711J1743p0695p6050q747O7840P7089R104p0546
398I257r1266j9957R3944J22313Q608j23460j20023K2182J47126J04276p1560
409H1440j68515n6631J24726J57127J1145j45408j38119K3744J46676R8500m7632
420H7053j25634o8190N1991J14532N3292o6089j16364n1057P0635J29590N4646
431A34405r3219j45719l2115J18482J35223l786j45408j17841N6970J65203P6959
442A49154r6590j54226m1751J12314J33609O164j10759r1011J7544R2487O9935
453H6870k1982q7790o1496K4523Q4625P0797j5044r6925q0436K9256J08823O8542
$$ plain form
375 28874 -88624 -113344 -8220 108686 90707 -48152 -139035 -76429 64999 129200 45784
386 45784 -87890 -122600 -31192 69519 81262 10567 -65483 -74230 -6390 70699 79803 9257
398 9257 -82009 -101966 -8022 114291 122899 -561 -120584 -98402 48724 153000 81440
409 81440 -87075 -143706 -18980 138147 149292 3884 -134235 -110491 36185 134685 87053
420 87053 -38581 -106771 -54780 59752 113044 46955 -69409 -120466 -49831 79759 134405
431 134405 41186 -104533 -136648 -18166 117057 113271 -32137 -149978 -93008 72195 149154
442 149154 52564 -101662 -143413 -31099 102510 108674 -2085 -93096 -75552 16935 86870
453 86870 64888 -22902 -84398 -59875 24750 95547 80503 -16422 -96858 -67602 41221 109763
465A09763m9345j14613m9267Q2267J17000J2661j04363j01322Q316J03108Q5751
476I9956k3272r5378o0086K5607P3512N2253k3152p9575n4802K8686Q8680O3698
488I6127l4077j13454p1854O0132J29130N1448q5901j29546k1810J17962J19662
499A17819k2471j37522r3147N2959J38425P3213o8528j27189m6309P7164J07743
510G2157L0438p6763j04601j7393R4288J05845N904j04116j11901P236J27579
521B8673J06234l7204j37949q0759O7360J40906M9154j03727j33148q995J19080
532I625J11517j4490j18711q9208L3370J04693N8212m0220q9338m8506M3925R1839
544E2708M0766n1082r1693m3081N4904J01993L6882p2289r9536j4733Q3928R0025
$$ plain form
465 109763 60418 -54195 -103462 -21195 95805 108466 4103 -97219 -88903 14205 99956
476 99956 76684 -18694 -78780 -53173 20339 72592 49440 -30135 -84937 -56251 32429 96127
488 96127 62050 -51404 -123258 -63126 66004 117452 31551 -97995 -119805 -1843 117819
499 117819 95348 -42174 -135321 -82362 56063 129276 60748 -66441 -112750 -35586 72157
510 72157 102595 25832 -78769 -96162 -1874 103971 109875 5759 -106142 -98906 28673
521 28673 134907 97703 -40246 -121005 -53645 87261 136415 32688 -100460 -109455 9625
532 9625 121142 106652 -12059 -101267 -67897 36796 95008 54788 -34550 -83056 -39131 52708
544 52708 93474 42392 -49301 -92382 -37478 64515 101397 29108 -70428 -85161 -1233 88792
556H8792o681r7515p3934L4992J00352N5328m1492r1244m5223M4639Q1967L2276
568H2257m0309o8889l0647M3689P8021K8190n6242q4957k6539O7685R8771J7093
580A08123r1871r5514P560J01569Q2367l2981j14130o2629O2626J12411L5875
591A13406p8021j06543k3144Q2849R5630N719q3901q1938M144Q7888P9029k2437
603G2681j02326p2246L7795J10540O6746n5486j22094m5540Q1737J13906J7707
614A03420r5675j02684J1108J11935Q2082m0380j09795n9669N0457J03845M4583
625I9227n9130r0024k3697N9627P8025J5209o7617p8594l695P3141P4411j512
637G5371p9942p4401J5194Q8545N7907l3382q6144m5595M5850Q6554K6403o1997
$$ plain form
556 88792 82111 -15404 -89338 -54346 46006 101334 59842 -31402 -76625 -31986 49981 82257
568 82257 41948 -26941 -57588 -13899 64122 92312 36070 -48887 -75426 -7741 91030 108123
580 108123 16252 -79262 -71702 29867 112234 79253 -34877 -97506 -34880 77531 113406
591 113406 35385 -71158 -94302 -11453 84177 89896 5995 -75943 -71799 16089 95118 72681
603 72681 -29645 -101891 -64096 46444 113190 57704 -64390 -109930 -28193 85713 103420
614 103420 7745 -94939 -83831 28104 110186 69806 -39989 -99658 -49201 54644 99227
625 99227 40097 -49927 -73624 -13997 64028 79237 11620 -66974 -70669 2472 76883 75371
637 75371 -4571 -78972 -63778 24767 82674 49292 -36852 -82447 -36597 49957 76360 14363
649A4363p7811j2363O0494P0263R034o1716o1789j817N5573N5467j630o1965n9016
662g2913J1272P4252N8611j8859q1821n9429L4379R2819M5369n2537q9482k8846
674h7185O4925Q9939J0924q1651p8761R749Q5356P2571j7487r0830o3907L1725
686e4632Q8100N0914m1273r0963m1625O0920R8069K4916p4213r5928j3652Q7453
698a914R2533j0838r9914p4775L2122J01693N9062n3033j03561l5434O8739R3829
710F8509J8679p4239q6968o010P9058P2443q954p5564o1295J8805Q2405N6327
722H3196l3577q5736m5737M0943Q5940L7671n2913q3042j8000O2248P3681O480
734G1154o6419o6934Q453P2140N4775j6882o8657n0841K0887O9929M3634k6697
$$ plain form
649 14363 -63448 -75811 -15317 54946 63980 2264 -59525 -61342 -5769 49698 48068 -13897 -72913
662 -72913 -61641 12611 71222 52363 -29458 -88887 -54508 38311 83680 31143 -58339 -87185
674 -87185 -22260 67679 78603 -3048 -81809 -72060 13296 85867 68380 -22450 -86357 -54632
686 -54632 33468 84382 43109 -47854 -89479 -28559 69510 94426 20213 -75715 -89367 -1914
698 -1914 90619 79781 -20133 -94908 -62786 38907 97969 44936 -58625 -94059 -25320 68509
710 68509 87188 12949 -74019 -80029 -971 71472 62518 -13046 -74341 -55536 26869 83196
722 83196 49619 -36117 -81854 -40911 45029 82700 29787 -53255 -71255 -9007 64674 71154
734 71154 4735 -62199 -53746 18394 73169 56287 -12370 -63211 -42324 27605 71239 44542
746D4542o4806l7011L1591O9850L3024m6570p3855k5519N1275P5419J9140o2296
758A4784p5145l002P1467O5422j0943p6868o1524K5582Q3392M7006l8965q2651
770d1445m0727M7602Q6008K9934n8563p9992j6663O6310P7936K343q1795p4380
782h3432J7626Q8348O6401k9595r3415n3419M9117R3247L3338o1726q7580j8285
794g9375P4005Q2152k596p9851o9039J4798Q2436O1835k7096q4113m7684L8439
806c6089P7969L4323m8048p9999k2112O0013P4257J0275o3202o9912r29O9358
818E904N9269j6241p0191m8093K3735O9527M1582l5032o8146k8934L8885O4607
830C6872K4019m2911o4802j5893M8188N8118Q696n0885n6871M37O1224N4546r655
$$ plain form
746 44542 -20264 -57275 -25684 44166 77190 30620 -43235 -68754 -17479 57940 77080 14784
758 14784 -60361 -63363 8104 73526 62583 -14285 -75809 -50227 33165 80171 41206 -41445
770 -41445 -82172 -34570 51438 81372 22809 -57183 -73846 -7536 70400 72743 -9052 -83432
782 -83432 -65806 22542 88943 59348 -34067 -87486 -38369 54878 88216 26490 -61090 -79375
794 -79375 -5370 76782 74186 -5665 -74704 -59906 22530 84365 57269 -26844 -74528 -36089
806 -36089 41880 76203 28155 -51844 -73956 -13943 60314 70589 7387 -62525 -63454 5904
818 5904 65173 48932 -21259 -69352 -45617 23910 65492 30460 -37686 -66620 -27735 36872
830 36872 60891 17980 -46822 -62715 -14527 43591 52287 1402 -55469 -55032 6192 60738 51083
843E1083o2451n1413J5881O8593M4803k9188o9180l4069L8528P1127K7503m9757
855B1460p1005j3570N6420O6667N959o5195o6128O682P1456N6760j8987p4604
867b4085m9978L3514Q1083L7942n0395q0355k6109N6322P8862J2226o9416p0116
879g0505O050P4001O1635j7908q0388n2342L5264P9970L6630m3009p8759k7003
891g6364N5711P4719J2467o0223o5137K87O5645O0593j3968p1808m9446K3715
903d3809P0942M1525l0953p1547k8101M2862O4299J7098m5398o2639j1319N4149
915b891N6016j627n4040n0529N890N7517M6442j5719n8762l8769K0940N7890L4509
928E6867l0489o2714k5054L7229N9271K1741m1395o1055j2377N0547N6162J515
$$ plain form
843 51083 -11368 -62781 -46900 21693 66496 37308 -31872 -65941 -27413 43714 71217 21460
855 21460 -49545 -63115 -6695 59972 65931 736 -65392 -58710 12746 69506 50519 -24085
867 -24085 -74063 -40549 40534 78476 28081 -52274 -78383 -22061 56801 69027 -389 -70505
879 -70505 -64455 9546 71181 53273 -27115 -79457 -44193 35777 72407 29398 -49361 -76364
891 -76364 -20653 54066 66533 6310 -58827 -58540 7105 67698 53730 -18078 -67524 -43809
903 -43809 27133 68658 37705 -33842 -61943 -19081 45218 62316 16918 -45721 -57040 -2891
915 -2891 53125 51498 -2542 -53071 -47181 10336 56778 41059 -17703 -56472 -35532 22358 56867
928 56867 26378 -36336 -61390 -24161 35110 56851 15456 -45599 -57976 -7429 48733 50248
940E0248n3908n4311M959O3145N0674j8015o3766m2534K5415O9030L6908l8168
952B9677o9646k3847M4755O7551J6589n6623o6624j191O6266N8809r712o8575
964a2571n5071K3048P4355M0879l6557p3011l0807M5384P3854J8635n6829o7434
976e6125m444O0882O1283n990o9639n3236K0114O9063M1781k9060o8725l3093
988f7189M1142O8162J9656m6884o2236j1929N2176N7579o79n5951m9434J0297
1000d5290N6986M4860j6979o0594l5923K6345N6909K7680k9712n7797k2225L8350
1012a7390N4875J4001m0292n1551q773M6355N0497k551m9475m5372O817N2444
1024I585M2843j4984n7086l4874K2843N7144L1066l1094o0287k3334M0240N6721
$$ plain form
940 50248 -3660 -57971 -53012 10133 60807 42792 -20974 -63508 -38093 30937 67845 29677
952 29677 -39969 -63816 -19061 48490 65079 8456 -58168 -59359 6907 65716 56004 -12571
964 -12571 -67642 -44594 29761 70640 34083 -38928 -69735 -24351 49503 68138 11309 -56125
976 -56125 -60569 313 61596 55606 -14033 -67269 -47155 21908 63689 34629 -34096 -67189
988 -67189 -26047 42115 61771 14887 -47349 -59278 -7102 50477 49798 -6153 -55587 -45290
1000 -45290 11696 56556 39577 -21017 -56940 -30595 26314 53994 24282 -33515 -55740 -17390
1012 -17390 37485 51486 11194 -40357 -49130 -2775 47722 45171 -4304 -49676 -42859 9585
1024 9585 52428 37444 -19642 -54516 -31673 25471 56537 25443 -34844 -58178 -17938 38783
1036C8783J4453m4690n8602o203N4978N4021n710n7541m8963J3861O3198M2660
1048F0245k8208o6074l0737L5716O4893K4012m6137o4360r557N4116N8037N39
1060E2485o0161n4788J3000O5293M3828k3865o3736l5741L4120O5882K4836m3509
1072A7644o1239j3714M7336N7619M773n6022n1360R454N7295M3001j5568n9450
1084b0231l6573K6928N7235K5758l1826n5054j9363L7030N3648J0320m2229m7998
1096d2355k359M4464M5025m268m9385l9311J1928M8535L5056j6939n0270k9580
1108d9459K5101N0850K1687k8054n0387j8374L6312M9716J0175m0248m6900m466
1120d4047M5616M6156m395m9237m0006J2590N1613L6513k0649n6984k9053L0823
$$ plain form
1036 38783 53236 8546 -50056 -56259 -1281 52740 47030 -10511 -59474 -45613 17585 60245
1048 60245 32037 -34037 -64774 -29058 35835 59847 13710 -50650 -60207 -6091 51946 52485
1060 52485 -7676 -62464 -49464 15829 59657 35792 -27944 -63685 -29565 36317 61153 17644
1072 17644 -43595 -57309 -9973 47646 52419 -3603 -54963 -45509 11786 54787 39219 -20231
1084 -20231 -56804 -29876 27359 53117 21291 -33763 -53126 -16096 37552 47872 5643 -42355
1096 -42355 -44714 -250 44775 40507 -8878 -48189 -36261 12274 47330 30391 -19879 -49459
1108 -49459 -24358 26492 48179 20125 -30262 -48636 -12324 37392 47567 7319 -39581 -44047
1120 -44047 1569 47725 43330 -5907 -45913 -33323 18290 54803 34154 -22830 -51883 -21060
1132b1060N5364K2207l6343n7243j3893M6534N3935J892n0147n0184N689N7818
1144A4569M4091j9379n9443l4367K6589O0575K7369l6839o0036j5312M3178N5188
1156D6183O590m9355n3212N303N5355M3595j3747n5597l7436K1361N8915K7509
1168E5464l1948n4616j9123L7071N3679J0302m3870m8092n86M4751M2932n481
1180D0483m7584l7967J4712M8145K9605j9061m8692k5633K5272M9448J8069l0535
1192A6262m5522j3966L3502M5506O091l9423m0673n2M1031L9197p266m6390l3943
1205d5646J4764M5058K9470j7726m8459k5694K6792M7700J7416l0500m7981j3016
1217d7822L7295M8731M365m3569m3683J936M7686M1618j2916n3185l3169K2728
$$ plain form
1132 -21060 34304 56511 20168 -37075 -50968 -4434 49501 51393 1246 -48938 -43249 14569
1144 14569 58660 39281 -20162 -54529 -27940 32635 60004 23165 -36871 -52183 -9005 46183
1156 46183 52773 3418 -49794 -44491 10864 54459 40712 -14885 -52321 -30960 27955 55464
1168 55464 23516 -31100 -50223 -13152 40527 50829 6959 -41133 -41719 3032 45964 40483
1180 40483 -7101 -45068 -30356 17789 47394 28333 -20359 -45992 -20720 28728 46797 16262
1192 16262 -29260 -43226 -9724 35782 41873 2450 -38223 -38275 2756 41953 34687 -11703 -45646
1205 -45646 -30882 14176 43646 25920 -22539 -48233 -21441 26259 43675 13175 -34806 -47822
1217 -47822 -10527 38204 42569 -1000 -44683 -42747 4939 46557 33641 -19544 -52713 -29985
1229b9985N1830K7254k9077n5232j8387L9224N1658Q842m1258m9853j496M9139
1241B659M3855j0661n0176l6543J6509N4134L1610k7130n4356k1194L2579N0289
1253C1575J6295l9689n0441k894M4656M2112m975m6201l8534J3088N0190K9358
1265D4540j9218m6587k4257K3623M6165J7744l1216m2927q732L2649M1381N708
1277C8873l8496l7946K193L9740L3623o532m0994l0991J4258M2934K3808j9012
1289B1458m1889k0666K4983M3768J3822k9617m0217r328L1528L9109N002l7243
1301G10l6415L437L8837L4607p931m4521l1749J6930M5719K4984k2026m6720k0312
1314d4450L0512M7718R456l5603m3598l181M2008M1102o008m6470l4887J3322
$$ plain form
1229 -29985 21845 49099 20022 -35210 -53597 -14373 37285 46127 4869 -44984 -46480 2659
1241 2659 46514 35853 -14323 -50866 -34357 19777 51387 24257 -30099 -51293 -18714 31575
1253 31575 47870 8181 -42260 -45154 -498 41614 36639 -9562 -48096 -35008 15182 44540
1265 44540 25322 -21265 -45522 -21899 24266 42010 10794 -32133 -40865 -8216 33165 38873
1277 38873 377 -37569 -35376 4364 37987 31455 -9539 -40530 -26272 16662 40470 21458
1289 21458 -20431 -41097 -16114 27654 41476 11859 -28358 -37686 -6158 32951 37953 710
1301 710 -35705 -32268 6569 41176 33245 -11276 -43025 -26095 19624 44608 22582 -24138 -44450
1314 -44450 -13938 33780 43236 7633 -35965 -39146 2862 43964 37956 -8514 -43401 -30079
1326c0079M5598L0963j9273m9288k2465K8664M6188J5496l2791m7919p988M0814
1338b080M3083k194m2888l7507Q342M6587L1922j9249m6124k3146K4543M5194
1350B6483J6802l0556m4196q446L4123L8708K519l4539l5928M632L7541K9317
1362C6460r441l8866k7355J4857M1504K2347k0590l9227j6738K3434L8751J1929
1374C7065k9636l6576m213L1602L2733L47l4574l1704N881L5992K8027r365l6261
1387a0682k5422J3763L8467K0386k1267l8223j6708K5533M1373J1577l1903l9287
1399c2393m238L4545L7187k612l9631l3100J0530M2359K6906j6775m3566k3003
1411d3791K5032M4951J4210k8706m1014j0599L3346M0529Q62l8298l6084O693
$$ plain form
1326 -30079 15519 46482 27209 -22079 -44544 -15880 30308 45804 13013 -34906 -42894 -2080
1338 -2080 41003 38809 -4079 -41586 -33244 13343 45265 26016 -20108 -43254 -18711 26483
1350 26483 43285 12729 -31467 -39913 -5790 32918 35437 898 -35030 -30398 7143 36460
1362 36460 27019 -11847 -39202 -24345 17159 39506 18916 -20311 -37049 -13615 25136 37065
1374 37065 7429 -29147 -33360 -1758 30975 31322 -3252 -34956 -29075 6917 34944 25579 -10682
1387 -10682 -36104 -22341 16126 36512 15245 -22978 -39686 -14153 27220 38797 6894 -32393
1399 -32393 -36631 -2086 35101 32489 -7142 -40242 -29712 12647 39553 22778 -20788 -43791
1411 -43791 -18759 26192 40402 11696 -29318 -39917 -6571 33958 34820 -3478 -39562 -32869
1423c2869M2085L3111j2720m6187k6046K0883M3456J9357k6769m3607j1598L4607
1435f297L9006L053l6193l5290K682L9496L1796j0970l9117k5246J3186L8174
1447A4280K2431k0249l8278j3847K4639L6114J1064k8404l6990m960L1498L2124
1459B9422o10l2614k9202O471L5513K5198j2722l4559k0136J5559L4866J7493
1471C4679k0078l5313j2354K1295L4605R776k6004l2966l584L0576L1100r58l3969
1484c195l1176O782L7356K6477j2490l7697k2514J8955L9897J4866k4874l8103
1496b5716r387K8229L7469M271l5262l4180K862L6437L0674p355l8521k7133J5968
1509b1644M0075J9636k1937m1035j4982K8565M0640P786l3255l4981n80L5266
$$ plain form
1423 -32869 9216 42327 29607 -16580 -42626 -21743 21713 41070 14301 -29306 -40904 -6297
1435 -6297 32709 35762 -431 -35721 -33039 6457 38253 27283 -11834 -37080 -23894 14280
1447 14280 36711 16462 -21816 -35663 -11024 25090 36154 7750 -29240 -34200 -2702 29422
1459 29422 28812 -3802 -33004 -26533 8980 34178 21456 -13103 -33239 -17680 17186 34679
1471 34679 14601 -20712 -33066 -11771 22834 32610 6606 -26360 -29944 632 31732 30774 -3195
1484 -3195 -34371 -27589 9767 36244 23754 -13943 -36457 -17502 22395 37261 12387 -25716
1496 -25716 -35103 -6874 30595 34866 -396 -34576 -31714 4723 35397 28042 -10479 -37612 -21644
1509 -21644 18431 38067 16130 -24905 -39887 -11322 29318 37104 3849 -31132 -31712 3554
1521C554L1940p306l8131k5341J3532L7006K1644j8349l8527j5792K4069L5543
1533B3842J0281k5321l4032m993K9231L0534k505l1602k6791N820L4132K5582
1545C4178j1746l4088j9354J5104L2729J4457k0046l2154q156K2371K9880N055
1557B8230k3730k9399k013K8030K6493k967k7634k4028M028L1212K1604j1579
1569A8247l1806j7178J5362L4261J5382k0718l4841r672K3823L1162N980k8063
1581A939l1248J987L2394K6541p229l3445k4905J3201L6279J9406j8818l5023
1593a8921j4937K1994L4542R992k8007l3805p13L1415L1037l506l6193k7898J1092
1606b3908L5655K1348j4797l6875j5840K2171L6471Q263k6709l2488m211K9623
$$ plain form
1521 3554 35494 28188 -9943 -35284 -21752 15254 36898 18549 -19978 -35770 -11701 23842
1533 23842 34123 8802 -25230 -30223 -992 29542 27037 -4565 -31356 -25536 8596 34178
1545 34178 22432 -11656 -31010 -15906 16823 31280 11234 -20920 -29076 -6705 23175 28230
1557 28230 4500 -24899 -26912 1118 27611 24644 -2990 -27018 -22990 8222 29826 18247
1569 18247 -13559 -30737 -15375 18886 34268 13550 -21291 -30963 -7140 24022 30002 1939
1581 1939 -29309 -27322 5072 31613 24384 -9061 -33966 -20765 15514 34920 16102 -18921
1593 -18921 -33858 -11864 22678 32670 4663 -29142 -29855 1560 32597 29091 -7102 -35000 -23908
1606 -23908 11747 33095 18298 -18577 -34417 -12246 24225 32488 5779 -26709 -30920 -1297
1618a297K9989j529l2032k5787O284L1523K3330j1414l3335j7450J7673L1283
1630A7238J2502j9869l2570r173K4504K9436L622k4341k6061m82K7471K4829o949
1643B0157k8507j9853Q285K9139J9352j2735l0515j3997J5866K8666J2162j7742
1655A0278k9631p867K3457K7620K832k5390k8429M56L0105K5688o058k8514k2838
1668b8291R137L2156J8961j6620l3490j3282J9640L2899J0847k5468l2048m117
1680b9676K8529K9743j010l1223k7325P261L3802K2085j3422l4053j8340J8016
1692a5613L6878J3251k3723l3129o971K5644L1293J289l0949k7122N928L2733
1704I509K3396r577l2957k0364J5998L2871J3401j8332l1238j0192K2455K9788
$$ plain form
1618 -1297 28692 27163 -4869 -30656 -24372 7151 30481 19067 -14268 -31718 -14045 17238
1630 17238 29740 9871 -22699 -31872 -7368 22068 25690 1349 -24712 -25194 2277 27106 20157
1643 20157 -8350 -28203 -19918 9221 28573 15838 -14677 -28674 -12808 15858 28020 10278
1655 10278 -19353 -27220 -3763 23857 26689 1299 -27130 -26674 3431 29119 23061 -5453 -28291
1668 -28291 -19154 13002 31963 15343 -18147 -31429 -11789 21110 31957 6489 -25559 -29676
1680 -29676 -1147 28596 27586 -3637 -30962 -23701 10101 32186 18764 -15289 -33629 -15613
1692 -15613 21265 34516 10793 -22336 -29307 -3663 27630 28919 -2030 -29152 -23224 9509
1704 9509 32905 23328 -9629 -29993 -13995 18876 32277 13945 -17293 -27485 -5030 24758
1716B4758M320k6108k6249R33K6746K5282n311k8751k1559R552K7261J6661j2126
1729A5409k8019j3254J6895K7516Q830j7904k6878p303K0722K6549K319k2443
1741B439k3455m12K4694K2874n736k6571j8934R320K7537J7028j2124k9771j3626
1754b6737J6525K7567J0095j8156k8676n140K4161K6862j037k6096k4953M159
1766b1426K8134K3146r225l0974j6984J2478L0987J4392j9561l0804p607K2870
1778d574K9009L137k6295k9283K832K9550K3593p934k9666j8890J2061L1600J3751
1791B8891j8670l0057r029K0429K9705N100k4802k6195M58K5271K2995m316k7826
1804h046j8472R721K7398J5850j3672k7373j2787J6724K7949P814j9207k3329
$$ plain form
1716 24758 29078 2970 -23279 -22346 4400 29682 24371 -4380 -25939 -16387 10874 27535 15409
1729 15409 -12610 -25864 -8969 18547 27377 9473 -17405 -24708 -3986 22563 24882 2439
1741 2439 -21016 -21428 3266 26140 20404 -6167 -25101 -15781 11756 28784 16660 -13111 -26737
1754 -26737 -10212 17355 27450 9294 -19382 -24522 -361 26501 25464 -632 -25585 -21426
1766 -21426 6708 29854 20629 -10345 -27329 -14851 16136 30528 10967 -19837 -27444 -4574
1778 -4574 24435 27572 1277 -28006 -25174 4376 27969 20035 -9631 -28521 -16460 15140 28891
1791 28891 10221 -19836 -28865 -8436 21269 26369 1567 -24628 -24170 1101 24096 19780 -8046
1804 -8046 -26518 -16797 10601 26451 12779 -14594 -27381 -10657 17292 25106 5899 -17430
1816a7430m359J9949K3165k71k3232k0338L764K3073J9446o022k4832j6109R646
1829a3550K4273J2389j1152k4963j0459J6355K3506O124j8100k3576m614K1829
1841a938K3786Q9k3558k0891L320K4298J9243q468k6632j5906J3245K7463J3167
1854B7218j6403k8287q835K0994K6256M098k3075k4958L0K8058K2391o913k7652
1867g078k0308J1674K9453J7137j6214l0378j0536J9919K8165N939k3487k7282
1879b2996N55K6072K3908m860k7956k0900Q680K8756J7172j3764k7548j3273J7199
1892h955K7789P329k0740k5222l403K2257K3682qk4596k1573N016K4306J6978
1905B2860p519k3907j5661J3013K4821R741j4058k3093r638J6674K3522N857j8507
$$ plain form
1816 -17430 -21789 -1840 21325 21054 -2178 -22516 -18752 4321 23767 17745 -7087 -23196 -13550
1829 -13550 10723 23112 11960 -13003 -23462 -7107 16399 22523 4423 -19153 -23767 -1938
1841 -1938 21848 21937 -1621 -22512 -19192 5106 24349 15881 -10751 -26657 -13412 14051 27218
1854 27218 10815 -17472 -26307 -5313 20943 25041 1966 -22992 -22962 5096 27487 20574 -7078
1867 -7078 -27386 -15712 13741 30878 14664 -15714 -26250 -6331 21834 27773 4286 -22996
1879 -22996 -22441 3631 27539 22679 -5277 -26177 -17497 11259 28431 14667 -12881 -26154 -8955
1892 -8955 18834 26163 5423 -19799 -23202 -945 22737 22729 -1867 -23440 -18424 5882 22860
1905 22860 15341 -8566 -24227 -11214 13607 23348 9290 -13803 -23441 -6767 16755 22612 4105
1918D105k1029k312J9260K0782o00k3367j8154M506K3383J7292o828k5081j5150
1931b3193J0632K5423J0886j3766k4251q610J7506K4657L825k0529k3262k332
1943b3014K4068K2965k992k5922j9796P306K5902J6656j1407k8634j2028J6633
1955a0263K7668Q736k0447k7324m466K3929K4772j490k5269k1355O366K7409J7318
1968B5584j1098k7647j3523J3797K7677J1041j8260k5736n787K0464K3724J328
1980B1564k2518k1855L829K5494J7565p672k4998j5247J0617K5352J1329j4981
1992H479k2365o601J5614K1750L363j8343k0027k73J8606J8280j410k0197j7824
2005b0948N274K1160J3393o731k0739j2784J0950K1750Q767j3816k0604p110J4919
$$ plain form
1918 4105 -16924 -19236 24 20806 20206 -3161 -21315 -16809 6574 23866 17038 -8043 -23193
1931 -23193 -12561 12862 23748 9982 -14269 -22879 -5373 19284 23109 2580 -20682 -23014
1943 -23014 1054 24019 21027 -4895 -24691 -17385 8517 25173 13766 -14868 -26896 -10263
1955 -10263 17405 26141 5694 -21630 -26096 -2167 22605 21115 -4154 -25509 -19143 8266 25584
1968 25584 14486 -13161 -26684 -12887 14790 25831 7571 -18165 -23952 -3488 20236 21564
1980 21564 -954 -22809 -18980 6514 24079 16407 -8591 -23838 -13221 12131 23460 8479
1992 8479 -13886 -20487 -4873 16877 20240 1897 -18130 -18403 203 18483 17073 -3124 -20948
2005 -20948 -15674 5486 18879 12148 -8591 -21375 -10425 11325 20092 6276 -14328 -21438 -6519
2018f519K2282L221j7461j8846o58J8106J8789k878k1089j6426P239K1370J5213
2031B2343q827k4205j2010J2604K4186R152j6309k3194m811J9154K2864o17k2749
2044b419j9975M590K4270J8550q427k6322j3345J2473K3916R950j6238k4273n280
2057b2530J9120K3665O48k1996k0231K169K3040J8837o990k4656j3857R509K4631
2070A1359J1546j5412k4678o141J8273K2092L469j8515k1540O80K1817J6278m852
2083A4376j9720j4073O793K1729J1555j0363k0388r534J1075K1891P181j3911
2095F611j9814m628J5371J9013K184j8520j8127K075K0749J5336m976j9831j4975
2108a9532P691K0121J1090j0284j9691q567J1477K0629P109j5629k0245l973J5864
$$ plain form
2018 -6519 15763 18984 1523 -17323 -17981 125 18914 16036 -5053 -21479 -14240 7130 22343
2031 22343 13516 -10689 -22699 -10095 14091 23243 6934 -16260 -21071 -1917 20947 20330 -2419
2044 -2419 -22394 -17804 6466 25016 16589 -9733 -23078 -10605 13311 23261 7023 -17250 -22530
2057 -22530 -3410 20255 20903 -1093 -21324 -19155 3885 22722 15732 -8924 -22781 -13272 11359
2070 11359 22905 7493 -17185 -23326 -5053 17039 20508 1993 -19547 -18867 2950 19228 14376
2083 14376 -5344 -19417 -12624 9105 20660 10297 -10091 -19625 -8550 13341 20522 6611
2095 6611 -13203 -17831 -2460 16553 18737 217 -17910 -15835 4914 20250 15274 -4557 -19532
2108 -19532 -11841 8280 19370 9086 -10605 -19172 -7695 12934 20043 4414 -15831 -19804 -3940
2121c940K1335J748k0378j9620K968K1621J7392o678k3690j4444J2211K4468J0297
2134B3290j5328k4774o690J7907K3763J790j9601j9265O47K2093J8666n291k4097
2147f890j5349Q295K4163J3868j1434k6308r377J6199K3940M804j8293k2339j213
2160a9934K2442J9257m840k2957j6100P638K2623J2497j0107k1893q035J1620
2172g789J9959O092j4386j9736l080J5492J7442K125j7288j7237J092J9187J5282
2185A7155m515j9384j3072O820K1006J0521j1400j9689o512J2010J8967N421j3299
2198D029j8180j468J3967J4928J311j5381j6191J125J8096J5454l356j9173j4901
2211a9740O488K2151J1884j1225k1760r115J4997K1304M895j8518k0457Q61J9985
$$ plain form
2121 -3940 17395 19143 -1235 -20855 -17887 3734 21126 14448 -9242 -23686 -11475 12993 23290
2134 23290 7962 -16812 -23502 -5595 18168 19958 357 -18908 -18261 3832 22498 17207 -6890
2147 -6890 -22239 -13944 10219 24087 12653 -13655 -23032 -6833 17107 21911 3618 -18721 -19934
2160 -19934 2508 21765 16925 -6032 -22132 -14494 8129 20626 10519 -11374 -19409 -7789
2172 -7789 12170 18262 3876 -15860 -18940 -3448 13994 16119 -1169 -18406 -17314 1873 17155
2185 17155 12640 -6744 -19816 -12996 8010 18531 7131 -12558 -19070 -7060 11907 17328 4029
2198 4029 -14151 -15619 -1652 13276 14587 -794 -16985 -15860 2236 17690 14334 -4839 -19740
2211 -19740 -13252 8899 20783 9558 -12202 -21317 -6320 14984 19879 1361 -19096 -18235 1750
2224A750J7090l131k0969j5691P187K0606J0854q157k1175j0326J3131K1922O832
2237A9923j5976k0087m499J7990K0209j11k1809j6785N305K2391J4364r747k2683
2250a1515r826J4317K1629N085j5441j8967k465J6996J5914j307j5605j4179K283
2263a3081J7241J3723n639j6394j1862O025J8258J0282r361j9683p033J2807J7823
2276A3106L941j4464j7700N25J6538J4386l534j5353j2801M208J6259R875n994
2289H992j5011q109N764J5879Q773q552j7945o622J0693J8163O157j4353j9039
2302a5210j959J8319J6854k656j8894j4997O685K1185J0968j1040j9720p823J1880
2315f408J9915N173j4022j7038k897J5483J6618N31j7586j7572K828J9736J5642
$$ plain form
2224 1750 18840 15709 -5260 -20951 -13764 6842 17696 9539 -11636 -21962 -8831 13091 19923
2237 19923 3947 -16140 -20639 -2649 17560 17449 -4360 -21145 -15840 6551 20915 11168 -11515
2250 -11515 -21341 -7024 14605 19690 4249 -14718 -17183 -187 15727 14420 -1185 -15364 -13081
2263 -13081 4160 17883 12244 -4150 -16012 -9987 8271 18553 9192 -10491 -17524 -4717 13106
2276 13106 17047 2583 -15117 -14592 1946 16332 12798 -2555 -15356 -11148 5111 14986 8992
2289 8992 -6019 -14128 -8364 7515 16288 7736 -10209 -16831 -6138 12025 18182 3829 -15210
2302 -15210 -17169 1150 18004 15348 -3546 -18543 -11858 9327 20295 9255 -10465 -18288 -6408
2315 -6408 13507 18680 4658 -12380 -15277 206 16824 17355 -231 -17803 -14975 4761 20403
2328B0403o024k1936j3140J0634K3941P865j5290k1948l817J7927K0172j604k1295
2341d112j4676M931J8727J2860o812j8018j0454Q608J6859Q339j0157j8077n848
2354a7830J2303J7936M314j3290j8028j984J6412J7272l455j7735j3053O011J8185
2367G058J1531r803j8045o250J0290J6177M598j0156j4913l188J0617J2957K726
2380A3599j1097j3850l004J4765J4851q21j5540j5230K676J8987J3609r003k0279
2393a0337q740J1086J9933N585j4003j8796j339J5802J4602k7j5195j4815K465
2406a3779J5897J3161l989j6439j2625N995K0485J0901j0869k0328p716J3287
2418f019K1159M700j9322j8641K811K0193J5059o257k0425j1737J0229J9476P076
$$ plain form
2328 20403 14379 -7557 -20697 -10063 13878 21743 6453 -15495 -19312 -1385 18787 17183 -4112
2341 -4112 -18788 -13857 4870 17730 10918 -7100 -17554 -8946 7913 16252 6095 -11982 -17830
2354 -17830 -5527 12409 16723 3433 -14595 -16579 -167 17105 13650 -4085 -17138 -11127 7058
2367 7058 18589 8786 -9259 -15509 -5219 10958 15556 5400 -9513 -12701 -2084 10873 13599
2380 13599 2502 -11348 -14352 413 15264 14443 -1097 -16327 -13651 5336 18945 9942 -10337
2393 -10337 -19077 -7991 11942 17527 3524 -15272 -16611 -809 13793 13766 -1429 -16244 -13779
2406 -13779 2118 15279 11290 -5149 -17774 -11779 8706 19607 8738 -11590 -19306 -6019
2418 -6019 15140 19840 518 -18123 -15312 4881 19940 13683 -6742 -18479 -8250 11226 18302
2431A8302j0952j7426n374J2042J6151K261j1926j4498j885J3198J4994J13j6276
2444a276j4433L391J6703J3066o205j9081r336J0628J8341M237j3011j5651j371
2457a3998J3990J2756j571j2570j0542J940J1943J0448l344j0930r613L092J1899
2470C500J0719l683j6341q903P610J6548P909j0530j8138l873J4630J5289j60
2483A4577j4995j3737L125J7440R357n880j5431q634O972J4919P674p994j5106
2496g713o299Q325J5957O175j2838j8091k371J6475J6693o38j9226j5439O367
2509a2623K0724J0504j1669j9253o020J3782J8205J572j5507j3841P81J4827J2900
2522A4382l618j3467j1548M238J4566J0277n295j5397r778P862J7182Q011j0958
$$ plain form
2431 18302 7350 -10076 -15450 -3408 12743 15004 3078 -11420 -13305 -107 14887 15000 -1276
2444 -1276 -15709 -12318 4385 17451 11246 -7835 -17171 -6543 11798 16035 3024 -12627 -13998
2457 -13998 -8 12748 11177 -1393 -11935 -9995 1948 12396 9052 -1878 -11491 -8399 3500
2470 3500 14219 10536 -5805 -14708 -7098 9450 17359 6829 -11309 -15182 -552 14737 14577
2483 14577 -418 -14155 -11030 6410 15767 9887 -5544 -14178 -7206 7713 15387 7393 -7713
2496 -7713 -14012 -5687 10270 16445 3607 -14484 -16855 -380 16313 15675 -3551 -18990 -12623
2509 -12623 8101 18605 6936 -12317 -18337 -4555 13650 15222 -285 -14126 -13345 1482 14382
2522 14382 10764 -2703 -14251 -10013 4553 14830 9535 -5862 -15640 -7778 9404 17415 6457
2535F457j7902m026J4193J6403m34j6968j2619M365J6951Q770o625j5275n623
2548a2333P036J2244M431o395j1505m962P043J1649M613p199j3558n503J1526
2561b913J5112J875j3920j4208Q79J5616J2751m549j7830r084R159J6373N688
2574A4949j0090j5714l311J1950J3332M64r630j2894j517J2127J2843M66j3391
2587d16j3124R79J6595J3718o059j9625r594R842J9441P218j4995j8313r00J6256
2601A023J6079l435j7242j1884N505J6684P941p003j4299p696P521J4999N948
2614A4141q442j4843m909J0167J5919L479j4121j6704Q30J6917J3387l955j8021
2627f155j0722J0096J6479M957j0844j4422k187J0816J2620K01j0035r845m74
$$ plain form
2535 6457 -11445 -15471 -1278 15125 14691 -2277 -14896 -10531 6420 15190 8565 -6710 -12333
2548 -12333 -5297 6947 11378 4983 -6522 -11484 -4441 7208 11821 4622 -8936 -14439 -2913
2561 -2913 12199 14074 154 -14054 -13175 2441 15192 10643 -7187 -16271 -7112 9261 14949
2574 14949 4859 -10855 -14166 -2216 11116 11580 1950 -10944 -12461 -334 12509 12975 -416
2587 -416 -13540 -12561 4034 17752 11693 -7932 -17526 -7684 11757 18975 3980 -14333 -15233 1023
2601 1023 17102 13667 -3575 -15459 -9954 6730 14671 7668 -6631 -14327 -6806 8193 14141
2614 14141 5699 -9144 -14053 -3886 12033 15512 1391 -15313 -14483 2434 15821 11866 -6155
2627 -6155 -16877 -6781 9698 14655 3811 -10611 -12798 -1982 10638 10839 804 -9041 -9515
2640i515R364R906M11r483j0394J30J0915J0627m24j5165r950N408J6377P447
2654A5654q083j6463m979J1378J4401R11j2836j1087J029J2641R863k977j1614
2667b162q333K059J1400Q972l728j2683r496N453J4760Q305p666j7830o405J3792
2681c562J6735K091j5932j5030K269J7609J2727q166j6877p010R180J5107N203
2694A4344j0317j3798k267R927J2166K272j0776j2312n23J2320J2045j022j4299
2707b240j2063L983J7251R848r178j6539o176J1495J6046J608j4196j2678J996
2720a0843J3559Q788l401j2515p669N119J0775N550m263r824o432M281J1282O219
2734A0626n997j1471o471P981J5035K879j1702j2977n6J2508J1976k350j5239
$$ plain form
2640 -9515 -151 9755 10166 683 -9711 -9581 1334 11961 11537 -3628 -13578 -8170 8207 15654
2654 15654 7571 -8892 -13871 -2493 11908 12819 -17 -11104 -10075 2566 12429 9452 -2162
2667 -2162 -10495 -8436 2964 11936 8208 -4475 -13971 -8518 6242 14547 6881 -10949 -17354 -3562
2681 -3562 13173 15264 -668 -15698 -13429 4180 16907 8741 -8136 -15146 -5966 9141 14344
2694 14344 4027 -9771 -12038 -2111 10055 12327 1551 -10761 -11284 1036 13081 12059 -2240
2707 -2240 -14303 -10320 6931 16779 7601 -8938 -15114 -3619 12427 14035 -161 -12839 -10843
2720 -10843 2716 11504 8103 -4412 -12081 -6962 3813 9363 5100 -4724 -11156 -6875 4407 10626
2734 10626 4629 -6842 -13313 -5332 9703 12582 880 -12097 -12153 355 12331 9981 -5258
2747e258p861O022J2710N087n262j1777m852O947J0916L715o284j0260n673P480
2761d350J3144L395j0741j3109r41J3065J4179k527j6828j2026P981J6413P493
2774A5148j0618j5784l699J2743J3568n96j1472j1853J232J2750R902k850j2425
2787c954q089K270J2242R070n002j4215p657Q469J5730O105j1917j6667j097J4404
2801c08J3366k514j5165j0937O113J5915P210r416j2555l654Q208J1264K448q458
2815A517r720j561P271J0340K954r451j1029r69J0818J0770j559j1918j0680N032
2829h185J3425P595o667j4124n311R312J2120K318r976r708q17Q665R330O80q987
2844c30r042M8R495R587n97j1020j0546K484J3935Q930n617j5624p147R556J5875
$$ plain form
2747 -5258 -13119 -7097 5613 10700 5438 -6339 -11191 -4244 6672 10387 4103 -6157 -11830 -4350
2761 -4350 8794 12189 1448 -11661 -12602 463 14642 12115 -4713 -16739 -8758 7655 15148
2774 15148 4530 -11254 -14953 -2210 11358 10762 -710 -12563 -11331 1419 11321 8471 -3954
2787 -3954 -12043 -9773 2469 11539 6537 -7678 -15335 -6866 8864 14969 3052 -13615 -14712 -308
2801 -308 13058 10544 -4621 -15558 -9445 6470 13680 4264 -8291 -11945 -3737 7527 9975 1517
2815 1517 -8203 -9764 -2493 7847 10801 1350 -9679 -10648 170 10940 9381 -2537 -13217 -8185
2829 -8185 5240 12835 6168 -7956 -13267 -3955 8165 10483 507 -9201 -10018 -1353 7977 8657 -330
2844 -330 -9372 -9324 171 9758 9161 -1859 -12405 -9921 4014 12944 7327 -8297 -15444 -5888 9987
2859I987L533j1750j3638o30J3999J1337k620j4852p683N324J2330P025n598j2548
2873e784n425O576J2080M636p392j3226m141J0022J3325J436j2802j2486J328
2886a1853J5579J0962o127j6036o789R072J3543M161j0084j3054q29J0660R933
2899I138o11r773q392R01R710Q311k334r544q262K480J1684P522m836j1860o528
2914a2394P152J2902M179r117j2260j007J0630R995j121j1343q074L112J0613
2927C267O126l503q455o798L267R751N507l858j0226o067N195J2584M344p967
2941C167j3018j770R957J2947q74j3708j0354M380J3292P885o461j2827n392P691
2955e085J2591K182p763j0558k131Q555J0243Q50r547j0284K9J2064R727j829
$$ plain form
2859 9987 13520 1770 -11868 -12498 1501 12838 10218 -4634 -12317 -6993 5337 12362 6764 -5784
2873 -5784 -11209 -4633 7447 12083 4691 -8535 -12676 -2654 10671 12107 -695 -13181 -11853
2886 -11853 3726 14688 8561 -7475 -14264 -5192 8351 12512 2428 -10626 -11455 -795 9138
2899 9138 8527 -1246 -9638 -8737 973 9284 6950 -2594 -10856 -8376 3308 10830 5994 -5866 -12394
2914 -12394 -5242 7660 11839 2722 -9538 -10545 85 10080 8959 -2384 -10458 -7346 3267
2927 3267 9393 5890 -2565 -9363 -6096 3655 9162 5304 -4922 -10989 -5794 6790 11134 3167
2941 3167 -9851 -11621 -1664 11283 10409 -3299 -13653 -9273 4019 11904 5443 -7384 -12776 -5085
2955 -5085 7506 9688 1925 -8633 -10764 -2209 8034 8884 -663 -10947 -10918 1146 10873 9044
2969I044j3296r988O768J3474P069p569j5410l842J1960J3086l98j3098r282K533
2983h949J2784P103m985j0137o824N252J0295N911o072j0211l855N946J0372L689
2997A0319p425j1594k144J0011J0229K67j1325j0071K810J2978P090n737j0626
3010e218n287O285R594L624p082r605p45N683Q814J655o802q529q55P153Q955
3025G640J088r151j0132J493J1521Q265l086j2475p520O874J3426M078r068j1062
3039h109k171R836J0419m7j0569r480J790J0924P480j821j1354p760L966J2254
3053E358O105n697j2414o142Q484J3376L274j0889j2717K77J2051J1133l148j4093
3067e042p733O566J1257O071p715j1451l311Q400J0633J072p063r795j699R797
$$ plain form
2969 9044 -4252 -14240 -7472 6002 13071 5502 -9908 -13750 -1790 11296 10898 -2200 -11482 -8949
2983 -8949 3835 10938 5953 -4184 -11008 -5756 4539 10450 4378 -5833 -9688 -3742 6630 10319
2997 10319 2894 -8700 -10844 -833 9396 9663 -1662 -11733 -8923 4055 11145 5408 -5218
3010 -5218 -10505 -4220 5374 8998 1916 -7689 -8434 -2751 6063 7718 916 -7613 -8468 -1315 7640
3025 7640 8728 -423 -10555 -9062 2459 10724 7638 -4837 -12357 -5483 7943 12021 2953 -8109
3039 -8109 -10280 -444 9975 9928 -641 -10121 -8331 2593 10073 8252 -3102 -10862 -6896 5358
3053 5358 11463 5766 -6648 -12790 -4306 9070 12344 1455 -11262 -10985 1066 12199 9051 -5042
3067 -5042 -12775 -6209 5048 11119 3404 -8047 -11358 -2958 7675 8747 1684 -8111 -9810 -13
3081a3R081m85r574r466J947J1077P806l084j1559o191N923J0434M668o979j1268
3096g683j802Q129Q968P83q575p985J054Q465O935j776p862p283J645R251O321
3111H585l291r074o203M647J0194N388o872j1254k727Q747J0421P28r680j0135
3125a0526J001J1187Q066k857j0891o956N171J0332N709o339q993n776O862J0414
3139F404L746q101j0269j576R583J0436k50j1111j0490L598J2151Q474o917j1763
3153f085n919Q563J2390J469q755j0430p13R547R599j702r873p474J807R595P556
3168I575l118j0485o065N556R593N262o301j0869l489Q165R502Q00q733q217L64
3183h460J0310P588l194r453n488L494R782M548n203q312l743N319Q275K461m571
$$ plain form
3081 -13 9068 8583 -991 -10457 -8510 2567 10373 7289 -4270 -10461 -4538 5896 10564 3585 -7683
3096 -7683 -9485 -1356 7612 8395 -180 -8165 -7111 1354 8289 6513 -1349 -8632 -6987 2264 8585
3111 8585 5294 -3780 -9983 -5336 4858 10246 3374 -7880 -10607 -1860 8561 9289 -391 -10526
3125 -10526 -9525 1662 9728 6871 -4020 -10976 -5805 4527 10236 3897 -5096 -10872 -4010 6404
3139 6404 10150 2049 -8220 -9796 -213 10223 9973 -1138 -11628 -8030 4121 12595 5678 -6085
3153 -6085 -12004 -3441 8949 10418 1663 -8767 -9480 67 9666 7964 -1909 -9383 -7576 2019 9575
3168 9575 6457 -4028 -10093 -4537 5056 10318 4017 -6852 -10341 -2176 7326 8126 -607 -8824 -8460
3183 -8460 1850 9438 6244 -3209 -8697 -5203 4579 9127 3924 -4388 -8131 -2812 5463 7924 3353
3198C353q189l648P480Q351Q64p771q611J07J0060Q179l369r735o646M697R514
3213D636N845o116j0491k539O180Q936K084o794r486m50Q337Q683m88q862q908
3228i433K340J0200P206m215j0423o718O080J1556M624q072j1100j451R047J0039
3242I680n69j1072p963L173R696P075l457j0202n478M796J0064L747o387r608
3256f505k643P366R863R05q756q542M47Q648Q760k258j0203o677M692J0005M454
3271I556n682r337l488O702R063N66o086p780j012P771P271j119p018o046j87
3286f826Q133P029k035r254n839M349Q456N061m800r574l252N702R084J701p784
3301A51p419o66Q548P913j563q636o731J802R654N848l124r409m963M052J0451
$$ plain form
3198 3353 -4836 -8484 -1004 7347 8211 440 -8171 -8064 1996 10175 6806 -2929 -9575 -4878 4636
3213 4636 10481 4365 -6126 -8665 -2485 6451 8535 1741 -7745 -8195 142 8825 8337 -525 -9433
3228 -9433 -7093 3107 10313 6098 -4325 -11043 -4963 6593 11217 3145 -7955 -9406 -359 9680
3242 9680 9111 -1961 -9924 -6751 2945 10020 6563 -3639 -9117 -4321 5743 9490 3103 -6505
3256 -6505 -9148 -1782 8081 8986 230 -8312 -7865 783 9543 7285 -2918 -9595 -4903 5102 9556
3271 9556 3874 -5463 -8951 -2249 6814 7380 1294 -6486 -7498 273 7544 6425 -593 -6639 -6826
3286 -6826 1307 8336 6301 -2953 -8792 -4443 4013 9074 4274 -5300 -8552 -2850 6234 7935 151
3301 151 -7268 -7934 614 8527 6964 -1672 -8403 -6601 3053 8901 5777 -3632 -8595 -4543 5908
3316E908L509o553r567k885R000R063Q55r563q871O61J0753P513k834j0912n916
3331i839M897J0339M430o312j0600k420P658Q885J330q732q572L58R269Q030k146
3346F575r077p564M219R459O114n414r865m360O839R876J588p438p993k89P120
3361b10P721k38q244p368K732Q071N557k419q655n057M038Q497L288m310q217
3376d814l408O382P934J473o556p754p47P409Q291j753p246p360K328Q450N231
3391G860k957r108m574N032Q042L810n211r297j800O361Q331J048p118p966J7
3406g530Q029P673j576q780p055L276J0345M931n325r559l136O617R401Q64o901
3421A274r930M87R461P324j744q562p482L697J0045N304n574r464l465N702R416
$$ plain form
3316 5908 9417 2864 -6703 -9588 -588 8475 9330 -233 -9104 -8443 2310 9823 6989 -3923 -9839
3331 -9839 -4942 5397 9827 3515 -7085 -9505 -1847 7038 8368 -364 -8936 -8578 691 8721 6575
3346 6575 -2502 -10066 -5847 3612 9726 4312 -5553 -9913 -3074 6802 8390 952 -7041 -7330 -210
3361 -210 7511 7273 -971 -8339 -5607 2464 8021 5602 -3053 -8110 -4072 4425 7713 3403 -4814
3376 -4814 -8222 -1840 6094 7567 1011 -6743 -7490 -81 8210 6457 -789 -8149 -5821 2629 7860
3391 7860 4903 -4205 -8779 -3747 4295 8105 2894 -6403 -8203 -1842 6489 7537 419 -7547 -7530
3406 -7530 499 8172 6596 -2184 -9239 -5963 4382 9313 3988 -5571 -8707 -2090 7311 8175 1274
3421 1274 -8656 -8169 1292 8616 6872 -1690 -9172 -5475 4570 9874 4300 -5164 -8629 -2927 6489
3436F489K147o450r091p32Q158P266m4q194q033K679Q388N504l257q374m453M801
3452c196Q128K972n566p849k304N996Q053Q04p044o001o2O762O411j285p306n318
3468f805J750P524N220l473q234l907M826Q791J645n252p375j200N907P126M93
3483G036o730o753N4P298O923j370q730n878L604P901N118m266r238l512N919
3498b624R147J822o596q722r05Q029P056p81q547o690K508R144N882m504r525
3513e306l576N489Q742K811n941q798j099P270P309m2p992p515J487R934N405
3528H178l070q397n026L781R696K940n735q659r41N851P753R95p809p356K114
3543e685O890O334k322p519n590K814Q126M496l776p718l875N297P345K499o257
$$ plain form
3436 6489 8636 2186 -6905 -7637 521 7787 7743 -451 -8484 -5805 2583 8087 4830 -3544 -7997 -3196
3452 -3196 4932 7904 2338 -5511 -7815 -1819 6234 7038 -6 -6007 -6069 693 7104 5819 -1487 -6805
3468 -6805 -5055 2469 7689 4216 -4018 -7925 -3099 5692 7337 2085 -5290 -6490 -583 6543 7036
3483 7036 306 -6447 -6393 905 7828 6458 -2272 -8150 -4546 3355 8473 4207 -5031 -8543 -2624
3498 -2624 6523 8345 1749 -6973 -7878 151 7207 6426 -2121 -8811 -6303 2841 8723 4219 -5306
3513 -5306 -8882 -3393 5349 8160 2219 -6579 -7678 -408 6901 6859 -1133 -8648 -7161 2773 8178
3528 8178 5108 -3289 -8315 -4534 5162 8102 2367 -6292 -7233 -1382 6371 7366 -443 -7799 -5685
3543 -5685 1205 7539 5217 -2302 -7892 -5078 3048 7544 3768 -3950 -7825 -2528 4817 7316 1059
3558A059p039r67N814P055K85p155n812J189O863N959j913p746m800L296P358
3573C446L770m257p506k751M815P284K347n482p806j270P262O784J50p429o282
3588f925R39P884N918k451q789m597M586P934L029m893q426j845P078P602J09
3603G153p083p644J180Q549N939l206p524n300L216R305L082m959q241j750N770
3618a513P682J243o429p540m7P593O378j979p170n776L035P625M076l496p720
3633d038l010M461P656J668n432o364o84N264N740K61o770n229J281P282M855
3648F941k476o980m415K897P451L479l757p417k637M780P273J780o128o010q33
3663f052N814O487m16o933n885K313O917M290k134p947l878M468P127K482m710
$$ plain form
3558 1059 -5980 -6947 -1133 5922 6207 -948 -6760 -5571 1292 7251 5338 -2408 -7208 -3912 3446
3573 3446 7216 2959 -4547 -7298 -2483 4801 7148 1666 -6140 -7410 -148 6636 6786 -643 -6925
3588 -6925 -5986 1898 7816 5365 -3424 -8021 -3435 4499 7528 2635 -5791 -7636 -558 7044 7153
3603 7153 70 -7574 -6394 2155 8094 4888 -2636 -7936 -4720 4585 7667 2708 -5533 -7283 -1513
3618 -1513 6169 7412 983 -6557 -6604 989 7367 5388 -1782 -7558 -4523 3102 7178 3682 -4038
3633 -4038 -7048 -2587 5069 6737 1305 -5059 -5743 -479 5261 5522 -1248 -6477 -5196 2086 6941
3648 6941 4465 -2515 -6930 -4033 3418 6897 3140 -4277 -6914 -2134 5139 6919 791 -5219 -6052
3663 -6052 -238 6249 5833 -1100 -6985 -4672 2245 6535 4401 -3546 -7424 -2956 4171 6653 1943
3678A943o281k413M943P919P29o822o969J164P063O261k013q888m060K794Q146
3693C516M203m337q342k246N351P490J154o072o622p2P483N824j977p465m886
3708f998K198P758M358l807q151j672M015P236K448o129p945L86O670N431M01
3723F199o800n608R62P501M486k927o696l982L635P091L326m890p287j426M603
3738a813O619J318n754o253Q20N715N353j079o313n086J792O685M161j666p738
3753c239m082M287P720J892m663o559j553M748P114N51o487o218J454N725N402
3768F092j248o938n170L120P949L284l822q201k108N129P696M79n945o271p4N653
3784c75P175r95p525n461K191P321N213l217q721l076N339P091K084m589q104
$$ plain form
3678 1943 -4338 -6751 -1808 6111 6840 18 -6951 -5787 1276 7537 5524 -3364 -7424 -4630 3516
3693 3516 7719 3382 -4960 -7206 -1855 5635 6789 717 -5905 -5977 1506 7330 5353 -2112 -6998
3708 -6998 -4800 2958 7316 3509 -4642 -6314 -2299 4937 7385 1256 -6689 -6303 367 5798 6199
3723 6199 -601 -6209 -5247 2254 6740 3813 -2883 -6865 -3230 3861 7187 2297 -4990 -6416 -1813
3738 -1813 4806 6124 370 -5883 -5063 652 6005 4926 -1387 -6473 -4681 2004 6165 4499 -3239
3753 -3239 -7321 -3034 4686 6578 1915 -4644 -6197 -1449 5665 6216 -271 -6489 -5035 690 6092
3768 6092 4844 -2094 -7264 -4144 3805 7089 3267 -4934 -7042 -1913 5783 6262 317 -5954 -6028 -375
3784 -375 6800 5805 -1720 -7181 -4990 2331 7544 4327 -4394 -7470 -2131 4960 7044 2455 -5649
3799e649j012O114P085q18o192o115R53P769M954k291p545l746L591O836K775
3814F709m260o148k547M776O412Q79n164o186q4O347N422j635n556m927J028P500
3830B566M597l831o172l581L426O757K538m383o113j451M570N652Q18m941o339
$$ plain form
3799 -5649 -6661 -547 6538 5720 -472 -6587 -5634 2135 7089 4798 -2747 -6493 -2902 3934 6709
3814 6709 2449 -3699 -6246 -1470 4942 5821 657 -5529 -5613 734 6156 4521 -1035 -5962 -4934 2566
3830 2566 7163 3332 -2840 -6421 -2995 3762 6300 1917 -4196 -5647 -1077 4575 5393 452 -5887
$$ [...]
8191E52
##END NTUPLES=NMR FID
##END=
