##TITLE=1H_CG-1117-6
 CDCl3, 8 sc, 
 21.8.2019
##JCAMPDX= 6.0         $$ Bruker NMR JCAMP-DX V2.0
##DATA TYPE= NMR FID
##DATA CLASS= NTUPLES
##ORIGIN= UXNMR, Bruker Analytische Messtechnik GmbH
##OWNER= root
$$ XWIN-NMR		Version 3.5
$$ Wed Aug 21 15:02:39 2019 Russian Standard Time (UT+4h)  she@DPX200
##.OBSERVE FREQUENCY= 200.13155
##.OBSERVE NUCLEUS= ^1H
##.DELAY= (6, 6)
##.ACQUISITION MODE= SIMULTANEOUS
##.ACQUISITION SCHEME= undefined
##.AVERAGES= 8
##.DIGITISER RES= 18
##SPECTROMETER/DATA SYSTEM= spect
##.PULSE SEQUENCE= zg30
##.SOLVENT NAME= CDCl3
##.SHIFT REFERENCE= (INTERNAL, CDCl3, 0, 15.7039)
##AUDIT TRAIL= $$ (NUMBER, WHEN, WHO, WHERE, WHAT)
$$ ##TITLE= Audit trail, XWIN-NMR		Version 3.5
$$ ##JCAMPDX= 5.01
$$ ##ORIGIN= Bruker BioSpin GmbH
$$ ##OWNER= she
$$ F:/spectra/data/she/nmr/H-F/1/audita.txt
$$ ##AUDIT TRAIL=  $$ (NUMBER, WHEN, WHO, WHERE, WHAT)
(   1,<2019-08-21 15:01:17.06 +0400>,<she>,<DPX200>,
      <created by zg, POWCHK disabled, PULCHK disabled
       configuration hash MD5:
       00 E9 B6 7A A2 85 ED C7 34 08 36 98 17 FE 4E 26
       data hash MD5: 16K
       24 B9 DC B9 0B 47 DE A2 CA 4B 9A C1 79 F3 35 72>)
$$ ##END=
$$ 
$$ hash MD5
$$ DD 19 09 A3 7E B1 70 CB E8 B6 3A 5D 6F AA CD B0
##$RELAX= 
##$RELAX= 
##$RELAX= 
##$RELAX= 
##$RELAX= 
##$RELAX= 
$$ Bruker specific parameters
$$ --------------------------
##$DU= <F:/spectra>
##$EXPNO= 1
##$NAME= <H-F>
##$PROCNO= 1
##$TYPE= <nmr>
##$USER= <she>
##$AMP= (0..31)
100 100 100 100 100 100 100 100 100 100 100 100 100 100 100 100 100 100 
100 100 100 100 100 100 100 100 100 100 100 100 100 100 
##$AQSEQ= 0
##$AQ_mod= 1
##$AUNM= <au_zg>
##$AUTOPOS= <>
##$BF1= 200.13
##$BF2= 200.13
##$BF3= 200.13
##$BF4= 200.13
##$BF5= 200.13
##$BF6= 200.13
##$BF7= 200.13
##$BF8= 200.13
##$BYTORDA= 1
##$CFDGTYP= 0
##$CFRGTYP= 5
##$CHEMSTR= <none>
##$CNST= (0..31)
1 1 145 1 1 1 1 1 1 1 1 1 1 1 1 1 1 1 1 1 1 1 1 1 1 1 1 1 1 1 1 1 
##$CPDPRG= <>
##$CPDPRG1= <>
##$CPDPRG2= <>
##$CPDPRG3= <>
##$CPDPRG4= <mlev>
##$CPDPRG5= <mlev>
##$CPDPRG6= <mlev>
##$CPDPRG7= <mlev>
##$CPDPRG8= <mlev>
##$CPDPRGB= <>
##$CPDPRGT= <>
##$D= (0..31)
0 1.2 0 0 0 0 0 0 0 0 0 0.03 0 0 0 0 0 0 0 0 0 0 0 0 0 0 0 0 0 0 0 0 
##$DATE= 1566385276
##$DBL= (0..7)
120 120 120 120 120 120 120 120 
##$DBP= (0..7)
150 150 150 150 150 150 150 150 
##$DBP07= 0
##$DBPNAM0= <>
##$DBPNAM1= <>
##$DBPNAM2= <>
##$DBPNAM3= <>
##$DBPNAM4= <>
##$DBPNAM5= <>
##$DBPNAM6= <>
##$DBPNAM7= <>
##$DBPOAL= (0..7)
0.5 0.5 0.5 0.5 0.5 0.5 0.5 0.5 
##$DBPOFFS= (0..7)
0 0 0 0 0 0 0 0 
##$DE= 6
##$DECBNUC= <off>
##$DECIM= 24
##$DECNUC= <off>
##$DECSTAT= 4
##$DIGMOD= 1
##$DIGTYP= 9
##$DL= (0..7)
0 120 120 120 120 120 120 120 
##$DP= (0..7)
150 150 150 150 150 150 150 150 
##$DP07= 0
##$DPNAME0= <>
##$DPNAME1= <>
##$DPNAME2= <>
##$DPNAME3= <>
##$DPNAME4= <>
##$DPNAME5= <>
##$DPNAME6= <>
##$DPNAME7= <>
##$DPOAL= (0..7)
0.5 0.5 0.5 0.5 0.5 0.5 0.5 0.5 
##$DPOFFS= (0..7)
0 0 0 0 0 0 0 0 
##$DQDMODE= 0
##$DR= 18
##$DS= 0
##$DSLIST= <SSSSSSSSSSSSSSS>
##$DSPFIRM= 0
$$ [...]
##$SUBNAM2= <"">
##$SUBNAM3= <"">
##$SUBNAM4= <"">
##$SUBNAM5= <"">
##$SUBNAM6= <"">
##$SUBNAM7= <"">
##$SUBNAM8= <"">
##$SUBNAM9= <"">
##$SW= 24.9336996594482
##$SWIBOX= (0..15)
0 0 2 0 0 0 0 0 0 0 0 0 0 0 0 0 
##$SW_h= 4990.01996007984
##$TD= 16384
##$TD0= 1
##$TE= 0
##$TE2= 300
##$TE3= 300
##$TEG= 300
##$TL= (0..7)
0 120 120 120 120 120 120 120 
##$TP= (0..7)
150 150 150 150 150 150 150 150 
##$TP07= 0
##$TPNAME0= <>
##$TPNAME1= <>
##$TPNAME2= <>
##$TPNAME3= <>
##$TPNAME4= <>
##$TPNAME5= <>
##$TPNAME6= <>
##$TPNAME7= <>
##$TPOAL= (0..7)
0.5 0.5 0.5 0.5 0.5 0.5 0.5 0.5 
##$TPOFFS= (0..7)
0 0 0 0 0 0 0 0 
##$TUNHIN= 0
##$TUNHOUT= 0
##$TUNXOUT= 0
##$USERA1= <user>
##$USERA2= <user>
##$USERA3= <user>
##$USERA4= <user>
##$USERA5= <user>
##$V9= 5
##$VALIST= <valist>
##$VCLIST= <CCCCCCCCCCCCCCC>
##$VD= 0
##$VDLIST= <DDDDDDDDDDDDDDD>
##$VPLIST= <PPPPPPPPPPPPPPP>
##$VTLIST= <TTTTTTTTTTTTTTT>
##$WBST= 1024
##$WBSW= 4
##$XGAIN= (0..3)
0 0 0 0 
##$XL= 0
##$YL= 0
##$YMAX_a= 50279
##$YMIN_a= -81330
##$ZGOPTNS= <>
##$ZL1= 120
##$ZL2= 120
##$ZL3= 120
##$ZL4= 120
##$ABSF1= 10
##$ABSF2= 0
##$ABSG= 5
##$ABSL= 3
##$ALPHA= 0
##$AQORDER= 0
##$ASSFAC= 0
##$ASSFACI= 0
##$ASSFACX= 0
##$ASSWID= 0
##$AUNMP= <proc_1d>
##$AZFE= 0.1
##$AZFW= 0.1
##$BCFW= 1
##$BC_mod= 2
##$BYTORDP= 1
##$COROFFS= 0
##$CY= 11.3945322036743
##$DATMOD= 1
##$DC= 2
##$DFILT= <>
##$DTYPP= 0
##$F1P= 20.1720416913024
##$F2P= 0.152960286110954
##$FCOR= 0.5
##$FTSIZE= 0
##$FT_mod= 4
##$GAMMA= 1
##$GB= 0.15
##$INTBC= 1
##$INTSCL= 1
##$ISEN= 128
##$LB= 0.24
##$LEV0= 0
##$LPBIN= 0
##$MAXI= 10000
##$MC2= 0
##$MEAN= 0
##$ME_mod= 0
##$MI= 1.114404
##$NCOEF= 0
##$NC_proc= 0
##$NLEV= 6
##$NOISF1= 3.799351
##$NOISF2= 2.8
##$NSP= 1
##$NTH_PI= 0
##$NZP= 0
##$OFFSET= 15.70392
##$PC= 1
##$PHC0= -9212.008
##$PHC1= 15.20096
##$PH_mod= 1
##$PKNL= yes
##$PPARMOD= 0
##$PSCAL= 0
##$PSIGN= 0
##$REVERSE= no
##$SF= 200.130013532006
##$SI= 16384
##$SIGF1= 3
##$SIGF2= 2
##$SINO= 400
##$SIOLD= 16384
##$SREGLST= <1H.CDCl3>
##$SSB= 0
##$STSI= 0
##$STSR= 0
##$SW_p= 3612.71676300578
##$SYMM= 0
##$S_DEV= 0
##$TDeff= 0
##$TDoff= 0
##$TI= <>
##$TILT= no
##$TM1= 0
##$TM2= 0
##$TOPLEV= 0
##$USERP1= <user>
##$USERP2= <user>
##$USERP3= <user>
##$USERP4= <user>
##$USERP5= <user>
##$WDW= 1
##$XDIM= 8192
##$YMAX_p= 0
##$YMIN_p= 0
$$ End of Bruker specific parameters
$$ ---------------------------------
##NTUPLES= NMR FID
##VAR_NAME=  TIME,          FID/REAL,        FID/IMAG
##SYMBOL=    X,             R,               I
##VAR_TYPE=  INDEPENDENT,   DEPENDENT,       DEPENDENT
##VAR_FORM=  AFFN,          ASDF,            ASDF
##VAR_DIM=   8192,          8192,            8192
##UNITS=     SECONDS,       ARBITRARY UNITS, ARBITRARY UNITS
##FACTOR=    0.0002004,     1,               1
##FIRST=     0,             0,               0
##LAST=      1.6414764,     0,               0
##MIN=       0,             -81330,          0
##MAX=       1.6414764,     50279,           0
$$ Real data points
##PAGE= N=1
##DATA TABLE= (X++(R..R)), XYDATA
$$ plain form
0 0 0 0 0 0 0 0 0 0 0 -7 8 -8 8 -8 15 -16 17 -24 25 -32 36 -41 49 -57 64 -73 85 -96 109 -122 138 -156 173
33 173 -196 219 -244 270 -302 335 -371 409 -454 501 -556 616 -682 760 -846 943 -1059 1194
51 1194 -1355 1554 -1802 2124 -2566 3203 -4219 6087 -10717 50279 37980 -26833 16696 19812
65 19812 21623 26626 9532 -8216 34849 44323 15745 12019 5761 -28142 1420 45997 14668
78 14668 -22670 -2361 1586 -2041 16204 -1322 -33231 -1829 27358 8578 4420 -2235 -43519
91 -43519 -31563 25954 16569 -22627 -8018 11781 17139 29364 386 -46385 -19677 23630 7913
104 7913 2623 19778 -1160 -7870 28688 24081 -12511 -7844 1593 3842 33238 30036 -22858 -23418
118 -23418 16852 12182 4744 18521 -2477 -17027 22632 28667 -15949 -29903 -22110 -15397 20319
$$ packed form
0@%%%%%%%%%pJ5j6J6j6K3l1L3m1M9n7O8p7R0j06J21j37J58j81K05k31K60k94L29
33A73l69M15m63N14n72O37p06P80q63R55j057J172j298J442j606J789k002K253
51A194k549K909l356L926m690N769p422J0306j6804O0996j2299o4813M3529L116
65A9812J811N003j7094j7748M3065R474k8578l726o258l3903K9562M4577l1329
78A4668l7338K0309L947l627J8245j7526l1909L1402K9187j8780m158o655m1284
91d3519J1956N7517r385l9196J4609J9799N358J2225k8978m6771K6708M3307j5717
104G913n290J7155k0938o710L6558m607l6592M667R437K249K9396l202n2894n60
118b3418M0270m670p438J3777k0998j4550L9659O035m4616j3954P793O713L5716
$$ plain form
131 20319 32110 -17363 -28338 13832 9667 -19021 -15195 -24101 -33675 4377 22622 -6407 -12602
144 -12602 -8245 -24604 -5589 23253 -9507 -34951 -268 15003 1347 5112 -10465 -33369
156 -33369 1772 37088 15408 1542 6407 -7767 2713 31469 1597 -32695 2393 35759
168 35759 27891 26577 13745 -14125 2936 27905 4725 -6071 13769 5514 4448 37172 25973
181 25973 -17645 -12018 10883 10881 21229 16284 -20192 -13310 24682 11975 -13674 -4702 -6602 -3690
195 -3690 32697 28741 -19758 -24006 -774 -2659 3248 7973 -17013 -10029 32278 25124 -8099 -4835
209 -4835 -7761 -18795 10075 27657 -1068 -7218 10124 6217 12561 23792 -8910 -25045 18392
222 18392 35710 9838 3175 -2672 -15500 11094 32278 1221 -11421 13794 16371 14133 20787
$$ packed form
131B0319J1791m9473j0975M2170m165k8688L826q906r574L8052J8245k9029o195
144a2602M357j6359J9015K8842l2760k5444L4683J5271j3656L765j5577k2904
156c3369L5141L5316k1680j3866M865j4174J0480K8756k9872l4292L5088L3366
168C5759p868j314j2832k7870J7061K4969k3180j0796J9840q255j066L2724j1199
181B5973m3618N627K2901kJ0348m945l6476O882L7992j2707k5649Q972j900K912
195c690L6387l956m8499m248K3232j885N907M725k4986O984M2307p154l3223L264
209d835k926j1034K8870J7582k8725o150J7342l907O344J1231l2702j6135M3437
222A8392J7318k5872o663n847j2828K6594K1184l1057j2642K5215K577k238O654
$$ plain form
235 20787 -8962 -34093 368 23842 3850 3435 9320 -6917 2328 21716 -4304 -24655 -7395
248 -7395 -3656 -919 23364 8847 -30151 -14789 14379 3557 -4122 -3805 -18140 -3720 27552
261 27552 5297 -28368 -15885 -3721 -1954 19098 14876 -18116 -8896 18447 4868 -9399 -5847
274 -5847 -17040 -8961 27016 22275 -7226 -2109 1362 -9588 7502 15996 -15286 -17763 13996
287 13996 16349 6551 4093 -18086 -22576 17207 25149 -8676 -11104 1425 -4711 4674 10788 -20107
301 -20107 -26403 8372 15147 4143 7516 -8261 -25606 -537 12939 -12252 -14666 1301 -3335
314 -3335 5778 22412 -4268 -28127 -7550 4739 1378 11170 -150 -22209 1148 26487 1185
327 1185 -17360 -6178 -4048 7511 27109 5129 -22598 -3950 9439 -2005 3806 4000 -14141
$$ packed form
235B0787k9749k5131L4461K3474j9992m15N885j6237R245J9388k6020k0351J7260
248g395L739K737K4283j4517l8998J5362K9168j0822p679L17j4335J4420L1272
261B7552k2255l3665J2483J2164J767K1052m222l2992R220K7343j3579j4267L552
274e847j1193Q079L5977m741k9501N117L471j0950J7090Q494l1282k477L1759
287A3996K353r798k458k2179m490L9783P942l3825k428J2529o136R385O114l0895
301b0107o296L4775O775j1004L373j5777j7345K5069J3476k5191k414J5967m636
314c335R113J6634k6680k3859K0577J2289l361R792j1320k2059K3357K5339k5302
327A185j8545J1182K130J1559J9598k1980k7727J8648J3389j1444N811J94j8141
$$ plain form
340 -14141 867 27538 9935 -10921 -6350 -11795 -9267 17049 12962 -14150 -5458 9779 1997
353 1997 4630 2433 -24684 -18689 19006 16615 -5958 -6494 -10448 -11005 12637 9937 -20656 -13392
367 -13392 11098 6427 3893 5119 -17731 -21988 8359 12412 -3519 1588 623 -8785 9906 16308
381 16308 -13593 -19713 1550 4387 8612 18879 -3720 -20924 4139 15441 -2328 -4615 -3895
394 -3895 -9849 11743 26005 -5840 -22921 -3197 1888 623 11411 -1131 -17814 2493 14448
407 14448 -5189 -9692 -6512 -17677 -3121 21606 4760 -16804 -6748 -4273 -6754 6661 -1317
420 -1317 -24029 -7332 17621 6739 -3524 -5463 -19530 -10522 18183 8729 -14687 -4758 5370
433 5370 1910 9630 3111 -21027 -10356 16167 10663 2433 6887 -6349 -10520 12630 11927 -10160
$$ packed form
340a4141J5008K6671j7603k0856M571n445K528K6316m087k7112Q692J5237p782
353A997K633k197k7117N995L7695k391k2573n36l954n57K3642k700l0593P264
367a3392K4490m671k534J226k2850m257L0347M053j5931N107r65r408J8691O402
381A6308k9901o120K1263K837M225J0267k2599j7204K5063J1302j7769k287P20
394c895n954K1592J4262l1845j7081J9724N085j265J0788j2542j6683K0307J1955
407A4448j9637m503L180j1165J4556K4727j6846k1564J0056K475k481J3415p978
420a317k2712J6697K4953j0882j0263j939j4067R008K8705r454k3416R929J0128
433E370l460P720o519k4138J0671K6523n504q230M454j3236m171K3150p03k2087
$$ plain form
447 -10160 -5812 3915 1852 14280 15949 -13487 -18993 5941 8758 1530 5227 -6113 -12595 11692
461 11692 16257 -12402 -16925 -4370 -3371 7617 15199 -8679 -19349 2595 4713 -7319 -2387
474 -2387 -6464 -15717 5163 19000 -2485 -11737 -4888 -9446 -889 16680 77 -17181 1612
487 1612 12544 3370 3980 -2618 -17123 2299 25551 9669 -4878 1273 -1637 1751 17322 4174
501 4174 -15451 2196 18462 10305 9178 5355 -13161 -6090 16059 7518 -4601 2525 -406 -1441
515 -1441 15412 9352 -17114 -12357 5493 4171 6205 5097 -14931 -14347 10297 6765 -11097 -7325
529 -7325 -5246 -5215 11748 10608 -16442 -17931 -479 -1497 -664 5406 -8199 -11604 10582 11736 -6947
544 -6947 -6963 -6099 -10742 6493 18023 -2671 -11004 3031 3738 3134 9435 -5299 -16121 7050 19159
$$ packed form
447a0160M348R727k063J2428J669k9436n506K4934K817p228L697j1340o482K4287
461A1692M565k8659m523J2555R99J0988P582k3878j0670K1944K118j2032M932
474b387m077r253K0880J3837k1485r252O849m558Q557J7569j6603j7258J8793
487A612J0932r174O10o598j4505J9422K3252j5882j4547O151k910L388J5571j3148
501D174j9625J7647J6266q157j127l823j8516P071K2149q541j2119P126k931j035
515a441J6853o060k6466M757J7850j322K034j108k0028N84K4644l532j7862L772
529g325K079L1J6963j140k7050j489J7452j018Q33O070j3605l405K2186J154j8683
544f947j6Q64m643J7235J1530k0694q333J4035P07o04O301j4734j0822K3171J2109
$$ plain form
559 19159 1877 -4155 -4214 -10901 3338 17884 -690 -12638 2137 5277 402 4640 -6841 -22025
573 -22025 -4594 11839 828 -3387 -1509 -12095 -7640 9171 -3722 -20690 -10143 -2372 -2574
586 -2574 7108 -288 -21855 -12523 6936 411 -6719 -3942 -11952 -7596 11580 3320 -17329 -9682
600 -9682 1220 595 9591 9362 -10584 -8458 9489 4353 -3883 763 -4640 -4433 17092 18155 -2241
615 -2241 -3992 2675 -536 8267 12760 -5921 -9483 11623 14062 4112 3795 -3949 -8756 11327 17894
630 17894 -2330 -7362 1297 -1241 3238 10541 -5201 -12550 6507 12673 2666 3067 -3634 -15192
644 -15192 -808 12037 -1778 -7200 2035 584 4866 14776 -348 -16628 -2832 8338 3172
657 3172 4706 1947 -10197 1208 17876 5620 -6555 596 1732 3946 15633 5890 -12537
$$ packed form
559A9159j7282o032n9o687J4239J4546j8574j1948J4775L140m875M238j1481j5184
573b2025J7431J6433j1011m215J878j0586M455J6811j2893j6968J0547P771k02
586b574R682p396k1567R332J9459o525p130K777q010M356J9176q260k0649P647
600i682J0902o25Q996k29j9946K126J7947n136q236M646n403K07K1525J063k0396
615b241j751O667l211Q803M493j8681l562K1106K439r950l17p744m807K0083O567
630A7894k0224n032Q659k538M479P303j5742p349J9057O166j0007M01o701j1558
644a5192J4384J2845j3815n422R235j451M282R910j5124j6280J3796J1170n166
657C172J534k759j2144J1405J6668j2256j2175P151J136K214J1687r743j8427
$$ plain form
670 -12537 -3200 9705 4467 6499 7301 -4632 -517 16479 8406 -7172 -4167 -4298 -3295 11801
684 11801 11036 -7899 -5413 7499 3436 1479 1270 -13102 -12207 8662 8302 -6777 -6136 -4695 -6632
699 -6632 5670 7636 -11239 -12527 1629 365 -2393 -244 -11655 -15944 3729 10145 -2394 -3406
713 -3406 -2706 -8832 910 7986 -9143 -15813 -892 3571 3516 8395 -2494 -13670 1262 10912 -1729
728 -1729 -5436 -2847 -6951 2615 13910 -665 -12178 -36 4821 2097 7823 838 -12785 -2985
742 -2985 8841 -415 -4385 -1444 -6415 90 15108 5744 -10727 -5560 -280 -3251 3228 641
756 641 -13232 -5509 11235 5817 -2654 -1819 -8395 -6819 8520 4950 -11617 -7050 1350 -729 4864
771 4864 5321 -9402 -7895 8708 6896 -1822 -1002 -6776 -9337 6767 9871 -4821 -4438 4360 2860
$$ packed form
670a2537R337J2905n238K032Q02j1933M115J6996q073j5578L005j31J003J5096
684A1801p65j8935K486J2912m063j957k09j4372Q95K0869l60j5079O41J441j937
699f632J2302J966j8875j288J4156j264k758K149j1411m289J9673O416j2539j012
713c406P00o126R742P076j7129o670J4921M463n5M879j0889j1176J4932R650j2641
728a729l707K589m104R566J1295j4575j1513J2142M857k724N726o985j3623R800
742b985J1826r256l970K941m971O505J5018r364j6471N167N280k971O479k587
756F41j3873P723J6744n418q471Q35o576J576J5339l570j6567M567Q400k079N593
771D864M57j4723J507J6603j812q718Q20n774k561J6104L104j4692L83Q798j500
$$ plain form
786 2860 6772 8788 -7474 -12601 3663 7104 864 2659 -1206 -5719 8117 13595 -2803 -8016
800 -8016 -80 -687 2500 9330 -3400 -11892 2350 8319 1291 2501 -347 -8779 1219 11168 -2150
815 -2150 -10578 -3692 -3294 468 10648 2103 -11109 -772 7134 -314 -1619 -3365 -12470 -4244 11328
830 11328 3955 -6572 -1214 -776 -568 8585 2918 -12411 -5860 5733 1685 975 1602 -7847 -4613
845 -4613 11135 7882 -4277 -1956 -1785 -3572 5961 5149 -10066 -8081 5630 5315 3703 4920 -6284
860 -6284 -8602 6247 6172 -6624 -5177 -2508 -3637 6229 9692 -5744 -9233 2502 2457 -359 2508
875 2508 -6654 -12106 2101 7831 -3260 -4251 -1410 -4594 3281 9936 -3942 -12136 -2337 851 -1112
890 -1112 3308 -2494 -10251 2363 11218 978 -4146 -2410 -7193 -1318 8553 -806 -10676 -1519 3956
$$ packed form
786B860L912K016j6262n127J6264L441o240J795l865m513J3836N478j6398n213
800h016P936o07L187O830j2730q492J4242N969p028J210k848q432R998R949j3318
815b150q428O886L98L762J0180q545j3212J0337P906p448j305j746r105Q226J5572
830A1328p373j0527N358M38K08R153n667j5329O551J1593m048p10O27r449L234
845d613J5748l253j2159K321J71j787R533q12j5215J985J3711l15j612J217j1204
860f284k318J4849p5j2796J447K669j129R866L463j5436l489J1735m5k816K867
875B508r162n452J4207N730j1091r91K841l184P875O655j3878q194R799L188j963
890a112M420n802p757J2614Q855j0240n124J736m783N875R871r359r870R157N475
$$ plain form
905 3956 1432 5145 598 -11027 -3045 8278 625 -4689 -2355 -6908 -3178 9454 4053 -9017
919 -9017 -3563 2857 133 3406 614 -12026 -8239 6332 3259 -3086 -640 -4147 -4090 7946 5653
934 5653 -9015 -7321 4 -1498 2539 4318 -7293 -7447 6733 6153 -1503 -372 -3802 -6800 4809
949 4809 7323 -5489 -6901 738 295 3746 7945 -3708 -9270 2967 5767 -2092 -1523 -3483 -7836
964 -7836 2658 10178 -1720 -6586 -31 -1304 35 5512 -3969 -12474 -1255 5367 -484 -559 -1066
979 -1066 -8197 -453 9192 -247 -8658 -3083 -2746 -1759 5907 50 -10682 -1936 7137 1770 614
994 614 212 -8063 -3706 8708 2772 -6866 -1771 132 519 8055 5139 -7578 -4044 5397 2026
1009 2026 478 1370 -6483 -4890 8240 6467 -4115 -1947 -354 -2421 4655 5058 -8126 -8448 2244
$$ packed form
905C956k524L713m547j1625P982J1323p653n314K334m553L730J2632n401j3070
919i017N454O420k724L273k792j2640L787J4571l073o345K446l507N7J2036k293
934E653j4668J694P325j502M037J779j1611j54J4180n80p656J131l430k998J1609
949D809K514j2812j412P639m43L451M199j1653n562J2237K800p859N69j960m353
964g836J0494P520j1898m866O555j273J339N477r481q505J1219O622n851p5n07
979a066p131P744R645r439q411N575L37R87P666n857j0732Q746R073n367j156
994F14m02q275M357J2414n936r638N095J903L87P536k916j2717L534R441l371
1009B026j548Q92p853J593J3130j773j0582K168J593k067P076M03j3184l22J0692
$$ plain form
1024 2244 1619 -755 1887 -5617 -7566 4695 5759 -5289 -6061 -3528 -5814 899 5540 -6079 -9341
1039 -9341 1045 2125 -517 1860 -4575 -10210 513 6365 -2824 -4870 -1687 -4203 1943 8947
1053 8947 -1094 -8296 478 3271 460 3642 -652 -8544 68 9517 2093 -2217 539 -2824 231
1068 231 9049 1544 -8573 -2134 3095 474 3417 1457 -8196 -2844 7322 1703 -3997 -2107 -5446
1083 -5446 -4307 5551 1857 -9029 -4716 1569 -888 1749 1137 -9247 -7659 3892 1871 -4542
1097 -4542 -2073 -4053 -4894 5603 5538 -6307 -5381 1210 -308 2183 4182 -4984 -6745 4981 6214
1112 6214 -147 840 -448 -3449 6028 9244 -1745 -4440 2188 1632 3527 7319 -1326 -6224 4058
1127 4058 7746 642 252 -1015 -5474 2307 8682 -610 -5848 27 -125 181 5255 -1605 -9522 -1516
$$ packed form
1024B244o25k374K642p504j949J2261J064j1048p72K533k286O713M641j1619l262
1039i341J0386J080k642K377o435n635J0723N852r189k046L183k516O146P004
1053H947j0041p202Q774K793k811L182m294p892Q612R449p424m310K756l363L055
1068B31Q818p505j0117O439N229k621K943j960r653N352J0166n619n700J890l339
1083e446J139R858l694j0886M313O285k457K637o12j0384J588J1551k021o413
1097d542K469j980q41J0497o5j1845R26O591j518K491J999r166j761J1726J233
1112F214o361R87j288l001R477L216j0989k695O628n56J895L792q645m898J0282
1127D058L688p104l90j267m459P781O375r292n238N875j52L06N074o860p917Q006
$$ plain form
1143 -1516 5026 -843 -1863 -2337 -8101 -2380 6895 77 -7331 -2428 -1425 -2004 4052 -388 -9812
1158 -9812 -3453 4610 912 -367 295 -5744 -3220 7482 2943 -5403 -1464 426 -185 6203 4579
1173 4579 -6048 -3650 5420 3224 1444 2832 -3483 -3539 6669 6161 -3650 -2583 202 -1398 4401
1188 4401 5941 -5252 -6224 2697 2056 -759 1061 -4288 -7130 3012 5477 -4110 -5322 -2506 -4719
1203 -4719 492 4743 -4445 -8479 113 1262 -2060 66 -4067 -8786 277 6132 -1643 -4140 -1244
1218 -1244 -3925 -272 5878 -1346 -8052 6 3742 672 3305 120 -6824 -106 8172 1980 -2095
1233 -2095 1101 -1277 179 7666 2564 -6367 -427 4705 1934 4309 2902 -5880 -2665 6455 2409
1248 2409 -2713 -240 -2121 -1768 6718 4276 -6150 -4081 1503 -600 1109 1934 -5936 -5750 4227
$$ packed form
1143a516O542n869j020m74n764N721R275o818p408M903J003n79O056m440r424
1158i812O359Q063l698j279O62o039K524J0702m539q346L939J890o11O388j624
1173D579j0627K398R070k196j780J388o315n6J0208n08r811J067K785j600N799
1188D401J540j1193r72Q921o41k815J820n349k842J0142K465r587j212K816k213
1203d719N211M251r188m034Q592J149l322K126m133m719R063N855p775k497K896
1218a244k681L653O150p224o706Q058L736l070K633l185o944O718Q278o192m075
1233b095L196k378J456P487n102q931N940N132k771K375j407q782L215R120m046
1248B409n122K473j881L53Q486k442j0426K069N584k103J709Q25p870J86R977
$$ plain form
1263 4227 2951 -3731 -1930 -2887 -4045 3896 4795 -5125 -5431 857 -661 854 3373 -3749 -5759 4330
1279 4330 5669 -875 -520 -1667 -4498 2908 7159 -1454 -3500 2890 2759 2697 5852 -1325 -6364 2775
1295 2775 6796 1013 718 632 -3559 1814 8281 244 -4359 1173 1182 731 4953 156 -7771 -1371 4730
1312 4730 465 -209 771 -4714 -1267 6543 241 -6919 -2961 -1302 -1367 4286 1804 -6671 -2584 4322
1328 4322 108 -1837 -219 -4837 -3213 5912 3030 -4535 -1887 360 -896 3834 4197 -4628 -3481
1343 -3481 4281 2211 -478 1095 -3212 -3839 5895 7224 -1728 -1345 784 -1356 2432 4225 -4530
1358 -4530 -5564 3563 3929 708 2050 -1884 -5570 2547 5180 -2966 -3946 -503 -2137 876 4515
1373 4515 -2906 -6974 460 2458 -412 1593 -1749 -6812 -966 4730 -1838 -4517 -567 -1577 982
$$ packed form
1263D227j276o682J801r57j158P941Q99r920l06O288j518J515K519p122k010J0089
1279D330J339o544L55j147k831P406M251q613k046O390j31o2L155p177n039R139
1295B775M021n783k95q6m191N373O467q037m603N532Rm51M222m797p927O400O101
1312D730m265o74R80n485L447P810o302p160L958J659o5N653k482q475M087O906
1328D322m214j945J618m618J624R125k882p565K648K247j256M730L63q825J147
1343c481P762k070k689J573m307o27R734J329q952L83K129k140L788J793q755
1358d530j034R127L66l221J342l934l686Q117K633q146r80L443j634L013L639
1373D515p421m068P434J998k870K005l342n063N846N696o568k679L950j010K559
$$ plain form
1388 982 6637 214 -7296 -1418 2151 -652 1517 516 -4761 336 7587 1827 -2390 96 -1653
1403 -1653 -829 5826 2731 -5181 -904 3455 559 1890 2707 -3994 -2080 6700 3314 -2556 -1190
1418 -1190 -2897 -3385 4457 3592 -4400 -2265 3408 1229 927 1390 -5980 -6023 3299 3217 -2632 -375 -598
1435 -598 -2514 3213 4484 -4174 -4445 1414 460 1008 3419 -2485 -5667 2745 4921 150 573 1050
1451 1050 -2617 2779 5919 -2400 -5306 678 1716 2048 5852 1058 -3823 2416 5508 -702 -1371
1466 -1371 -590 -3538 933 6844 346 -4000 542 518 -659 3102 364 -6384 -1721 3824 -399 -1519
1482 -1519 -551 -4688 -1723 5834 2205 -4739 -1552 -597 -1898 1912 528 -6716 -2121 5358 2704
1497 2704 -122 1365 -2828 -3060 3973 2446 -4016 -1199 1775 180 3934 4763 -2923 -3373 3631 2754
$$ packed form
1388I82N655o423p510N878L569k803K169j001n277N097P251n760m217K486j749
1403a653Q24O655l095p912M277M359k896J331Q17o701J914Q780l386n870J366
1418a190j707m88P842q65p992K135N673k179l02M63p370m3R322q2n849K257k23
1435e98j916N727J271q658k71N859r54N48K411n904l182Q412K176m771M23M77
1451A050l667N396L140q319k906N984J038L32L804m794m881O239L092o210o69
1466a371P81k948M471N911o498m346M542k4j177L761k738o748M663N545m223j120
1482a519R68m137K965P557l629o944L187R55j301L810j384p244M595P479k654
1497B704k826J487m193k32P033j527o462K817K974j595L754Q29p686m50P004q77
$$ plain form
1513 2754 735 2073 -1762 -3835 3381 4667 -2397 -1917 1400 205 3283 4572 -3571 -6229 708
1528 708 1094 -1774 325 -1271 -3580 2577 5259 -2288 -4193 -1445 -3224 -1257 3243 -2009 -5317
1543 -5317 370 2540 -755 1143 -825 -5254 360 5561 -129 -3283 -977 -1838 143 5770 1479
1558 1479 -3650 1493 5039 1342 1418 397 -4578 -712 6333 2677 -446 2512 1147 503 4779 2202
1574 2202 -4942 -1647 2823 878 2035 2485 -3463 -2564 4602 2296 -2159 -730 -1353 -2425 3201 2058
1590 2058 -5757 -4384 1280 478 781 2185 -3524 -4125 2840 1537 -3859 -2762 -1357 -2763 2899 5377
1606 5377 -1523 -2771 1697 183 21 2490 -1299 -4272 2756 5433 410 188 671 -2043 2566 6846
1622 6846 153 -3191 1372 1897 622 2776 -231 -4294 1984 6320 1111 -282 208 -3315 -1519
$$ packed form
1513B754k019J338l835k073P216J286p064M80L317j195L078J289q143k658O937
1528G08L86k868K099j596k309O157K682p547j905K748j779J967M500n252l308
1543e317N687K170l295J898j968m429N614N201n690l154K306q61J981N627m291
1558A479n129N143L546l697P6j021m975L866P045l656l123K958j365o44M276k577
1574B202p144L295M470j945J157M50n948Q99P166k306m455J429o23j072N626j143
1590B058p815J373N664q02L03J404n709o01O965j303n396J097J405j406N662K478
1606E377o900j248M468j514j62K469l789k973P028K677n023k22M83k714M609M280
1622F846o693l344M563N25j275K154l007m063O278M336n209j393M90l523J796
$$ plain form
1637 -1519 3601 -1098 -4589 -15 1282 -68 3008 314 -6570 -3111 2017 -939 -1945 -845 -3796
1652 -3796 -2509 4042 739 -5528 -2191 534 -485 2176 869 -5618 -3430 3021 573 -1414 1512
1667 1512 -590 -913 5098 3370 -3013 -1877 326 -860 2538 4478 -1204 -1338 4231 3616 353 1176
1683 1176 -1570 -3149 3699 5306 -1514 -1907 1131 10 1692 3923 -1907 -3566 2338 2687 -992
1698 -992 -464 -2399 -5004 686 3804 -1299 -2142 692 -1492 -877 2495 -2477 -6115 -597 2078 393
1714 393 1691 190 -4129 -610 4380 -29 -2895 27 -199 761 5059 1032 -4396 162 3949 1614
1730 1614 1671 2294 -1881 140 5229 1472 -2411 785 779 829 5306 4171 -2417 -809 2550 228 703
1747 703 1569 -2643 -1650 5277 3550 -1189 -569 -985 -1907 2604 3015 -3531 -2700 2115 695 -578 910
$$ packed form
1637a519N120m699l491M574J297j350L076k694o884L459N128k956j006J100k951
1652c796J287O551l303o267L337K725j019K661j307o487K188O451k448j987K926
1667A512k102l23O011j728o383J136K203j186L398J940n682j34N569o15l263Q23
1683A176k746j579O848J607o820l93L038j121J682K231n830j659N904L49l679
1698i92N28j935k605N690L118n103q43K834k184O15L372m972l638N518K675j685
1714C93J298j501m319L519M990m409k866K922k26R60M298m027n428M558L787k335
1730A614N7O23m175K021N089l757l883L196oN0M477j135o588J608L359k322M75
1747G03Q66m212R93O927j727m739O20m16r22M511M11o546Q31M815j420j273J488
$$ plain form
1764 910 -2922 -3135 2879 2910 -1804 -1112 -959 -3035 537 2493 -2279 -2856 1748 1189 851 2796 -1302
1781 -1302 -4975 797 3502 -478 -359 401 -1254 2308 4899 -1131 -3687 825 1787 1015 3020 170
1797 170 -3928 548 3474 -647 -1048 997 -1071 316 4003 -63 -4174 -1074 -261 -1200 2163 1181
1813 1181 -3553 -1249 2930 95 -2179 -1866 -3872 -2107 3744 1144 -4058 -2012 442 -1374 455
1828 455 51 -4649 -2434 2957 732 -1741 -365 -2369 -2832 2395 2531 -2228 -667 1232 -523 1141
1844 1141 1962 -3214 -3712 2538 2972 764 1741 -641 -2687 2188 3510 -1830 -1987 1298 679 2144
1860 2144 3537 -1790 -3516 1809 2515 -570 724 248 -2102 1414 3711 -1567 -2491 234 -445 388
1876 388 3730 134 -3705 -87 1400 -873 202 -251 -2938 378 5227 738 -2725 -909 -988 -394
$$ packed form
1764I10l832k13O014L1m714O92J53k076L572J956m772n77M604n59l38J945m098
1781a302l673N772K705l980J19P60j655L562K591o030k556M512R62p72K005k850
1797A70m098M476K926m121m01K045k068J387L687m066m111L100Q13r39L363r82
1813A181m734K304M179k835k274L13k006J765N851k600n202K046K454j816J829
1828D55m04m700K215N391k225k473J376k004m63N227J36m759J561J899j755J664
1844A141Q21n176m98O250M34k208R77k382k046M875J322n340j57L285o19J465
1860B144J393n327j726N325P06l085J294m76k350L516K297n278r24K725o79Q33
1876C88L342l596l839L618J487k273J075m53k687L316M849m489l463J816p9N94
$$ plain form
1892 -394 3475 724 -3343 438 3514 486 -5 376 -2434 -587 3918 1815 -1083 711 52 -1226
1908 -1226 2623 2123 -3160 -1074 2744 1556 1373 1492 -2875 -2957 2588 2170 -1667 -183 -10 -788 2160
1925 2160 1993 -3732 -3694 1588 685 128 1369 -1895 -3098 1397 1391 -2475 -1331 -428 -1816 1466 3003
1942 3003 -1790 -3557 -223 -420 -342 1596 -1110 -3621 1212 2904 -1282 -1974 -1014 -2438 944 3812
1958 3812 -929 -3281 154 703 -594 725 -1314 -3121 690 3500 28 -1260 -195 -2191 -1283
1973 -1283 2629 50 -2739 -99 735 -409 993 -226 -4407 -1972 2636 907 -1054 -89 -2091
1988 -2091 -1946 2692 618 -4058 -1661 1253 -115 967 846 -3328 -2439 2001 321 -1167 879 -394
2004 -394 -1279 2198 2414 -2728 -1901 381 -700 1335 2787 -1390 -2338 1824 1543 -1004 -202 -1126 -2099
$$ packed form
1892c94L869k751m067L781L076l028m91L81k810J847M505k103k898J794o59j278
1908a226L849n00n283K086L818j188j83J19m367q2N545m18l837J484J73p78K948
1925B160j67n725L8N282r03n57J241l264j203M495ol866J144R03j388L282J537
1942C003m793j767L334j97P8J938k706k511M833J692m186o92R60j424L382K868
1958C812m741k352L435N49j297J319k039j807L811K810l472j288J065j996R08
1973a283L912k579k789K640Q34j144J402j219m181K435M608j729j961R65k002
1988b091J45M638k074m676K397K914j368J082j21m174Q89M440j680j488K046j273
2004c94q85L477K16n142Q27K282j081K035J452m177r48M162k81k547Q02r24r73
$$ plain form
2021 -2099 2438 3748 -1732 -2531 331 -351 295 1988 -1389 -2923 1565 1838 -1443 -704 -1061 -2894
2037 -2894 319 3174 -478 -1882 261 -1205 -1140 1605 -1095 -4320 -327 2234 474 705 -519 -3037
2053 -3037 -660 2758 -220 -2630 -89 324 -13 2377 -127 -3618 -706 2235 277 -288 884 -1942
2069 -1942 -1010 2148 117 -1956 -282 -129 -733 2570 1886 -2890 -2482 276 -255 -789 472 -2415 -2180
2086 -2180 2813 1780 -2504 -1942 -1123 -1573 884 1244 -2774 -2631 894 20 -1044 -153 -1770 -2400 1572
2103 1572 2055 -1383 -1198 -774 -2549 -10 2305 -1123 -2145 840 1307 225 1020 -1452 -3574 553
2119 553 2759 -129 -430 479 -567 879 2638 -1308 -3406 323 1264 -15 944 41 -2769 -78
2135 -78 2087 -119 -911 671 -1282 -646 2302 -137 -3739 -1661 85 -639 1454 1159 -3074 -1415
$$ packed form
2021b099M537J310n480p99K862o82O46J693l377j534M488K73l281P39l57j833
2037b894L213K855l652j404K143j466O5K745k700l225L993K561j760K31j224k518
2053c037K377L418k978k410K541M13l37K390k504l491K912K941j958n65J172k826
2069a942R32L158k031k073J674J53o04L303o84m776M08K758n31n34J261k887K35
2086b180M993j033m284N62Q19m50K457L60m018J43L525q74j064Q91j617o30L972
2103A572M83l438J85M24j775K539K315l428j022K985M67j082P95k472k122M127
2119E53K206k888l01R09j046J446J759l946k098L729R41j279R59r03k810K691
2135g8K165k206p92J582j953O36K948k439l602K078J746p24K093k95m233J659
$$ plain form
2151 -1415 2042 -433 -2617 -1552 -2048 -1044 2836 949 -2868 -1160 909 -649 -4 685 -2498 -1172
2167 -1172 2191 940 -1442 -70 -1188 -1527 1737 2255 -1204 -923 601 -923 198 1181 -2206 -2513
2183 -2513 2112 2215 279 50 -943 -2483 597 1501 -2107 -2213 471 511 144 1367 -1803 -3302 220
2200 220 992 -1060 -561 -547 -2255 -249 1430 -1418 -2443 -282 -251 -268 1888 -829 -3507 -1281 881
2217 881 -634 -322 -314 -1981 617 3156 288 -2729 -997 -475 -976 1420 446 -2298 194 2392 233
2234 233 -100 493 -1757 -921 2545 1033 -1485 -255 -298 -582 2062 1808 -1744 -749 1956 771 -62
2251 -62 -399 -2362 -2254 1735 1800 -1375 -464 449 -485 810 866 -2812 -2748 507 469 -101 674 -659 -2027
2270 -2027 1016 1406 -1615 -1005 -126 -1215 145 1835 -1625 -2491 38 704 430 1561 -223 -2503
$$ packed form
2151a415L457k475k184J065m96J004L880j887l817J708K069j558O45O89l183J326
2167a172L363j251k382J372j118l39L264N18l459K81J524j524J121R83l387l07
2183b513M625J03j936k29r93j540L080R04l608j06K684M0l67J223l170j499L522
2200B20P72k052M99J4j708K006J679k848j025K161L1j7K156k717k678K226K162
2217H81j515L12Qj667K598K539k868l017J732N22n01K396r74k744K492K198k159
2234B33l33N93k250Q36L466j512k518J230m3k84K644k54l552R95K705j185q33
2251f2l37j963J08L989O5l175R11R13r34J295N6l678O4L255l8n70P75j333j368
2270b027L043L90l021O10Q79j089J360J690l460q66K529O66k74J131j784k280
$$ plain form
2286 -2503 717 1968 -1045 -1919 -325 -476 1108 2883 31 -1807 599 854 -449 78 -133 -2293
2302 -2293 437 2743 365 -755 54 -1035 -272 2315 448 -2448 -540 599 -580 413 5 -2713
2318 -2713 -621 2715 844 -943 -429 -1460 -1611 1200 -222 -2485 -773 1325 325 752 731 -2384
2334 -2384 -2140 943 741 -1419 149 -562 -1397 1513 2121 -1711 -1514 178 -102 797 1555 -1263 -2338
2351 -2338 1165 1526 -441 391 211 -672 2145 2536 -1329 -2007 145 -627 260 1708 -461 -1331 1443
2368 1443 1853 -508 -428 -368 -2196 233 2284 -322 -1871 -19 98 -229 1441 -469 -2983 -161 1520
2385 1520 -582 -783 -1079 -2409 -561 2240 279 -2004 -20 357 -998 589 -542 -3066 -910 1387
2401 1387 119 47 601 -996 -816 1924 232 -1897 -378 -14 -425 1226 1484 -1729 -1296 1397 997
$$ packed form
2286b503L220J251l013q74J594j51J584J775k852j838K406K55j303N27k11k160
2302b293K730K306k378j120Q09j089P63K587j867k896J908J139j179R93m08k718
2318b713K092L336j871j787N14j031j51K811j422k263J712K098j000M27k1l115
2334b384K44L083k02k160J568p11q35K910O08l832J97J692k80Q99P58k818j075
2351b338L503L61j967Q32j80q83K817L91l865o78K152p72Q87J448k169q70K774
2368A443M10k361Q0O0j828K429K051k606j549J852J17l27J670j910k514K822J681
2385A520k102k01k96j330J848K801j961k283J984L77j355J587j131k524K156K297
2401A387j268p2N54j597J80K740j692k129J519L64m11J651K58l213M33K693m00
$$ plain form
2418 997 56 617 -1192 -1535 1317 995 -2036 -971 369 -333 1386 2016 -1288 -1530 680 -122 -979
2435 -979 -45 -1088 -1692 1322 2091 -683 -973 -406 -1424 48 1540 -1104 -2111 430 961 -88 601
2452 601 -319 -2173 822 2278 -482 -1297 -64 -848 -80 1604 -263 -1849 1047 1580 260 833 71
2469 71 -1714 -205 1834 86 -635 751 -226 341 2194 881 -2163 -421 662 -14 916 370 -1740
2486 -1740 -482 2104 355 -1529 80 -398 -724 1566 718 -2308 -1118 579 -405 400 808 -1296
2502 -1296 -1237 1477 635 -993 -639 -1026 -1775 1217 1743 -1149 -1294 475 -153 184 605 -1629 -1913 1255
2520 1255 1283 -986 -171 -496 -1111 797 1959 -936 -1588 426 250 -29 642 -1061 -2686 394 1360
2537 1360 -332 -122 17 -1568 -759 1489 -905 -1892 -204 -183 -77 1186 107 -2516 -502 1325 -3
$$ packed form
2418I97r41N61j809l43K852l22l031J065J340p02J719O30l304k42K210q02q57
2435i79R34j043o04L014P69k774k90N67j018J472J492k644j007K541N31j049O89
2452F01r20j854K995J456k760q15J233p84P68J684j867j586K896N33j320N73p62
2469G1j785J509K039j748p21J386r77N67J853j313l044J742J083o76R30n46k110
2486a740J258K586j749j884J609m78l26K290q48l026J190J697r84Q05M08k104
2502a296N9K714q42j628L54l87p49K992N26k892j45J769o28L37M21k234k84L168
2520A255K8k269Q15l25o15J908J162k895o52K014j76k79O71j703j625L080R66
2537A360j692K10J39j585Q09K248k394r87J688K1J06J263j079k623K014J827j328
$$ plain form
2554 -3 -784 -212 -1290 -231 1882 -11 -2015 -298 -29 -88 1044 440 -2104 -414 1223 -16 -605
2571 -605 199 -984 -556 2268 962 -1236 -552 89 -912 975 1083 -1580 -1036 1628 868 -348 -14
2588 -14 -1147 -1483 1898 1066 -1354 -858 416 -766 306 924 -1275 -1805 929 1030 -348 209 -684
2605 -684 -2081 461 1538 -1039 -748 430 -513 143 1482 -894 -1942 364 945 -157 515 -315 -1890
2622 -1890 437 2066 -444 -999 1 -151 249 2018 -42 -1914 114 1001 -277 531 90 -1565
2638 -1565 124 1840 50 -1505 -323 -1126 -601 1473 419 -1918 -803 700 -328 -159 -71 -2011
2654 -2011 -1007 1429 372 -1332 -507 -477 -1002 918 868 -1764 -1052 521 -316 96 357 -1163 -1277 1071
2672 1071 1138 -733 16 -98 -881 806 1028 -1469 -1144 871 384 472 1160 -735 -1432 1048 1298 -519
$$ packed form
2554cp81N72j078J059K113j893k004J717K69n9J132o04k544J690J637j239n89
2571f05Q04j183M28K824j306k198O84O41j001J887J08k663N44K664p60j216L34
2588a4j133l36L381q32k420M96J274j182J072O18k199n30K734J01j378N57q93
2605f84j397K542J077k577K91J178r43O56J339k376j048K306N81j102O72q30j575
2622a890K327J629k510n55J000j52M00J769k060j872K028Q87j278Q08m41j655
2638a565J689J716j790j555J182q03N25K074j054k337J115J503j028J69Q8j940
2654b011J004K436j057j704Q25L0n25J920n0k632P12J573q37M12K61j520j14K348
2672A071O7j871P49j14p83J687K22k497L25K015m87Q8O88j895o97K480K50j817
$$ plain form
2690 -519 -459 -29 -896 813 1952 -816 -1489 -8 212 -385 872 -484 -2008 -83 1281 -894 -572
2707 -572 -242 -1572 -112 1394 -543 -2014 -120 -185 -581 909 -344 -2227 -183 1482 157 -418
2723 -418 103 -1053 -517 1815 273 -1178 44 472 -206 953 548 -1513 -200 1631 575 -175 422
2740 422 -696 -893 1524 737 -1312 -181 764 -429 1123 1232 -1604 -1103 1277 545 -329 311 -1018
2757 -1018 -1468 779 995 -1464 -1071 -75 -476 112 907 -1425 -1788 362 -134 -595 -124 -764 -1950 101
2775 101 1078 -903 -1342 -183 -913 -192 949 -831 -1866 712 603 -407 295 -174 -1433 119 1756
2792 1756 -411 -924 359 -527 35 1282 92 -1566 399 1332 5 120 270 -1273 -256 1517
2808 1517 312 -736 -173 -76 -76 1428 650 -1685 -546 574 -102 -85 47 -1334 -749 1201 245 -1030
$$ packed form
2690e19O0M30q67J709J139k768o73J481K20n97J257j356j524J925J364k175L22
2707e72L30j330J460J506j937j471J894o5l96J490j253j883K044J665j325n75
2723d18N21j156N36K332j542j451J222M28o78J159m05k061J313J831j056p50N97
2740D22j118j97K417p87k049J131R45j193J552J09k836N01K380p32q74O40j329
2757a018m50K247K16k459L93R96m01N88P95k332l63K150m96m61M71o40j186K051
2775A01R77j981m39J159p30P21J141j780j035K578j09j010P02m69j259J552J637
2792A756k167n13J283q86N62J247j190j658J965R33j327J15J50j543J017J773
2808A517j205j048N63R7%J504p78k335J139J120o76J7J32j381N85J950r56j275
$$ plain form
2826 -1030 -82 -567 -866 884 561 -1784 -1173 802 108 40 1154 -572 -1335 990 1019 -976 -6 -109
2844 -109 -431 1143 1931 -375 -391 989 355 191 1237 -129 -1109 1164 1573 -146 17 670 -218 938
2862 938 2012 -397 -1127 987 309 -370 995 -52 -1642 341 1847 -410 -632 336 -1262 -83
2878 -83 1339 -490 -1619 -241 168 -359 797 128 -1862 -80 1313 -286 -800 11 -1067 -454 1522
2895 1522 418 -1338 11 289 -275 417 474 -1344 -816 1445 287 -398 525 -286 -293 1623 1335 -945
2913 -945 -308 373 -370 667 820 -990 -442 1508 1008 -243 213 -278 -1202 878 1133 -1391 -1015 328
2931 328 -574 162 1110 -852 -1376 434 639 -914 -136 -618 -1418 248 968 -639 -853 296 -276 13
2949 13 1027 -600 -1856 230 1132 -110 570 337 -880 592 1773 -53 -997 466 -312 220 1353
$$ packed form
2826a030R48m85k99J750l23k345O11J975o94o8J114j726p63K325K9j995R70j03
2844a09l22J574P88k306j6J380o34j64J046j366r80K273M09j719J63O53q88J156
2862I38J074k409p30K114o78o79J365j047j590J983J506k257k22R68j598J179
2878h3J422j829j129J378M09n27J156o69j990J782J393j599n14Q11j078O13J976
2895A522j104j756J349K78n64O92N7j818N28K261j158o85R23q11pJ916k88k280
2913i45O37O81p43J037J53j810N48J950n00j251M56m91r24K080K55k524L76J343
2931C28r02P36R48j962n24J810K05j553P78m82q00J666P20j607k14J149n72K89
2949A3J014j627j256K086R02j242O80k33j217J472J181j826r44J463p78N32J133
$$ plain form
2966 1353 314 -1210 353 1230 168 308 437 -1061 -294 1593 318 -782 344 -245 -216 1389 709
2983 709 -1100 -240 775 -160 -125 100 -1303 -915 1599 573 -720 -67 45 -536 679 988 -1184 -696
3001 -696 678 181 -85 1037 -594 -941 1696 938 -226 -232 202 -875 577 1273 -664 -836 1128 756
3019 756 379 1012 -251 -932 694 1357 -571 -154 334 -182 504 2042 -16 -575 666 398 -177 846
3037 846 -157 -1331 248 1458 -72 -53 649 -475 288 1469 -155 -1485 296 429 16 751 143
3054 143 -1066 -118 1597 323 -614 289 -627 -232 1495 477 -1437 133 1119 5 903 745 -860
3071 -860 -103 1123 297 107 230 -492 -218 1578 1016 -1135 -230 509 -156 415 947 -1160 -1083 1318 750
3090 750 -382 357 76 -804 813 987 -1275 -754 -61 -613 -44 886 -406 -1157 312 244 -538 -12 -357
$$ packed form
2966A353j039j524J563Q77j062J40J29j498P67J887j275j100J126n89K9J605o80
2983G09j809Q60J015r35L5K25j403L88K514j026j293O53J12n81J215L09k172M88
3001f96J374m97k66J122j631l47K637p58j164oM34j077J452O96j937j72J964l72
3019G56l77O33j263o81J626O63j928M17M88n16O86J538k058n59J241k68n75J023
3037H46j003j174J579J210j530J9P02j124P63J181j624j330J781J33m13P35o08
3054A43j209R48J715j274r37R03r16L95J727j018j914J570R86j114Q98j58j605
3071h60P57J226q26j90J23p22K74J796n62k151R05P39o65N71N32k107P7K401n68
3090G50j132P39k81q80J617J74k262N21O93n52N69R30j292p51J469o8p82N26l45
$$ plain form
3109 -357 -1297 146 1023 -689 -798 176 111 482 1059 -178 -1237 441 1269 -292 148 385 -814 468
3127 468 1584 172 -451 415 -125 267 1282 96 -1164 -4 860 27 391 539 -932 17 1362
3144 1362 157 -1068 -300 -24 -465 1301 686 -1140 -229 1147 -277 -51 613 -1221 -541 1276 424
3161 424 -852 -90 357 -358 794 911 -932 -578 654 56 206 517 -367 -720 1265 1566 -222 284
3179 284 266 -258 523 1334 -514 -835 696 777 341 859 52 -806 882 1444 -331 -124 280 -455 269
3198 269 1390 -219 -853 499 493 109 370 -85 -1424 -331 779 -584 -747 384 -292 -58 790 43
3216 43 -1304 2 303 -367 -15 -133 -1245 -13 1273 107 -418 9 -464 -319 1342 448 -916 -124
3234 -124 407 -113 831 903 -854 -143 1546 595 -325 -19 -545 -616 1291 535 -740 -33 358 -70 311
$$ packed form
3109c57r40J443Q77j712j09R74o5L71N77j237j059J678Q28j561M40K37j199J282
3127D68J116j412o23Q66n40L92J015j186j260J160Q64q33L64J48j471R49J345
3144A362j205j225P68K76m41J766o15j826R11J376j424K26O64j834O80J817q52
3161D24j276P62M47p15J152J17j843L54J232n98J50L11q84l53J985L01j788N06
3179B84j8n24P81Q11j848l21J531Q1m36N18q07q58J688N62j775K07M04p35P24
3198B69J121j609o34J352ol84K61m55j339J093J110j363j63J131o76K34Q48p47
3216D3j347J306L01o70L52j18j112J232J286j166n25M27m73J45J661q94j364P92
3234a24N31n20R44P2j757P11J689r51r20L06n26p1J907p56j275P07L91m28L81
$$ plain form
3253 311 636 -849 -903 748 244 -627 357 -404 -777 756 681 -634 -644 264 -31 -179 541 -619 -1048
3272 -1048 469 390 -433 136 182 -872 294 1201 -644 -742 155 32 229 1199 -75 -973 613 1280 -214
3291 -214 113 375 -570 350 1644 277 -402 648 55 222 1285 675 -484 123 1051 -108 125 438
3309 438 -956 612 1560 246 -485 -318 134 -636 649 457 -1077 -55 599 262 -144 295 -558 -607
3327 -607 626 395 -1086 -5 96 -632 773 346 -766 -821 888 73 -188 533 -587 -775 861 517
3345 517 -536 -21 274 -189 761 949 -560 -921 455 514 -281 511 -114 -495 737 1069 -558 -87 92
3364 92 -586 -446 1057 -445 -1000 443 127 -118 144 -441 -921 -37 889 -314 -552 -177 -934 28 991
3383 991 -448 -1289 -59 241 147 358 -88 -1400 -378 1023 172 -393 90 -225 -418 607 297 -946
$$ packed form
3253C11L25j485n4J651n04q71R84p61l73J533p5j315j0R08k95j48P20j160m29
3272a048J517p9q23N69M6j054J166R07j845r8Q97j23J97R70j274q98J586O67j494
3291b14L27K62r45R20J294j367o79J050n93J67J063o10j159O07R28j159K33L13
3309D38j394J568R48j314p31J67M52p70J285j92j534J022O54l37m06M39q53m9
3327f07J233k31j481J081J01p28J405m27j112n5J709q15k61P21j120j88J636l44
3345E17j053N15K95m63R50J88j509l61J376N9p95P92o25l81J232L32j627M71J79
3364I2o78J40J503j502n55J443l16k45K62n85m80Q84R26j203k38L75p57R62R63
3383I91j439q41J230L00r4K11m46j312J022J401q51n65M83l15j93J025l10j243
$$ plain form
3401 -946 162 201 204 637 496 -1055 -388 969 490 -117 108 -157 -522 894 906 -698 -463 667 60
3420 60 408 747 -758 -732 829 540 -307 444 28 -324 726 1467 -526 -266 336 -590 174 761 -202
3439 -202 -1091 258 721 -277 33 76 -814 451 794 -54 -594 371 152 -28 792 -255 -995 525 864
3458 864 53 315 295 -532 -2 1176 -29 -523 876 425 -151 941 49 -1052 56 735 349 278 212
3477 212 -609 -147 701 93 -1099 -74 -34 -157 770 536 -1055 -462 351 -479 40 31 -348 -473 644 252
3497 252 -458 -62 6 -584 143 503 -755 -982 534 -141 -310 307 -258 -899 793 984 -712 -483 126
3516 126 -490 170 894 -590 -838 250 376 195 663 -30 -848 162 886 -404 -97 104 -584 -129 901
3535 901 -300 -1053 233 234 -169 229 56 -1123 -158 763 -174 -411 -92 -457 -20 676 117 -1118 -315
$$ packed form
3401i46J108L9LM33j41j551O67J357m79o07K25k65l65J416J2j604K35J130o07
3420F0L48L39j505K6J561k89q47P51m16l52J050P41j993K60O02r26P64N87r63
3439b02q89J349M63r98L10M3q90J265L43q48n40R65k19j80Q20j047p40J520L39
3458H64q11K62k0q27N30J178j205m94J399m51n76J092q92j101J108O79l86p1o6
3477B12q21M62Q48o08j192J025M0j23R27k34j591N93Q13q30N19rl79j25J117l92
3497B52p10L96O8n90P27L60j258k27J516o75j69O17n65o41J692J91j696K29O09
3516A26o16O60P24j484k48J088J26j81M68o93q18J010P24j290L07K01o88M55J030
3535I01j201p53J286Jm03L98j73j179R65R21r37k37L19l65M37O96n59j235Q03
$$ plain form
3554 -315 213 -222 429 324 -707 33 869 -135 -602 -14 -296 -355 647 457 -728 -156 318 -151 107
3573 107 361 -555 -121 1213 226 -337 -40 -63 -187 959 759 -571 -277 709 -53 147 282 -620 -776
3592 -776 536 515 -316 439 -5 -589 470 646 -694 -283 204 -74 161 639 -269 -976 309 426 156
3611 156 254 57 -587 108 747 -626 -799 330 442 113 807 299 -924 207 835 -389 75 329 -627
3630 -627 98 1123 -18 -483 471 15 -268 440 433 -935 -441 754 -17 -66 341 -837 -74 1119 277
3649 277 -804 168 -200 -337 533 339 -832 -253 951 317 -270 137 -521 -509 441 370 -658 -47 520
3668 520 -174 698 804 -870 -19 569 192 -160 143 -316 -659 695 911 -405 -4 229 -7 651 528
3687 528 -582 -787 236 382 -29 459 111 -551 437 462 -410 -222 -63 -516 -50 557 -61 -621 12 175
$$ packed form
3554c15N28m35O51j05j031P40Q36j004m67N88k82n9J002j90j185N72M74m69K58
3573A07K54r16M34J334r87n63K97k3j24J146k00j330K94R86p62K00J35r02j56
3592g76J312k1q31P55m44n84J059J76j340M11M87k78K35M78r08p07J285J17k70
3611A56R8j97o44O95O39j373j73J129J12l29O94n08j223J131O28j224M64K54r56
3630f27P25J025j141m65R54m56k83P08pj368M94J195p71m9M07j178P63J193q42
3649B77j081R72l68j37Q70j94j171N79J204o34n87M07o58J2R50p1j028O11N67
3668E20o94Q72J06j674Q51N88l77l52L03m59l43J354K16j316M01K33k36O58j23
3687E28j110k05J023J46m11M88l48o62R88K5q72J88J59m53M66O07o18n60O33J63
$$ plain form
3707 175 8 254 -59 -849 117 983 -550 -729 269 -258 -78 930 -46 -949 45 489 -311 193 122 -487
3727 -487 -61 1030 264 53 174 -205 -414 679 295 -703 -35 369 -47 86 417 -502 -297 519 303
3746 303 -486 152 -165 -306 485 272 -582 -67 542 137 194 365 -476 -711 540 427 -433 -283 100 -189
3766 -189 483 776 -268 -499 279 79 -356 685 -329 -831 237 537 52 -119 -8 -363 318 716 -194
3785 -194 -716 270 61 -21 134 -221 -576 448 769 86 -399 -246 -534 -330 1021 115 -4 321 336 -172
3805 -172 706 -61 -653 -212 627 -291 -326 -17 -451 -50 826 189 -568 132 480 -428 169 204 -738 -532 567
3826 567 143 -259 477 90 -514 296 21 -773 -130 141 -554 61 684 -775 -605 557 164 -266 133
3845 133 -259 -510 551 756 -554 -174 91 152 259 481 -341 -406 489 123 -228 24 -60 -585 441 670
$$ packed form
3707A75j67K46l13p90R66Q66j533j79R98n27J80J008r76r03R94M44q00N04p1o09
3727d87M26J091p66k11J21l79k09J093l84r98O68M04m16J33L31r19K05Q16k16
3746C03p89O38l17j41P91k13q54N15O09m05N7J71q41k35J251j13q60J50L83k89
3766a89O72K93j044k31P78k00m35J041j014n02J068L00m85j71J11l55O81L98r10
3785a94n22R86k09q2J55l55l55J024L21o83m85J53k88K04J351r06j19L25J5n08
3805a72Q78p67n92M41Q39r18l5L09m34M01Q76o37p57P00L48r08N97L5r42K06J099
3826E67m24m02P36l87o04Q10k75p94O43K71o95O15O23j459J70J162l93m30L99
3845A33l92k51J061K05j310L80K65O1J07K22q22o5Q95l66l51K52q4n25J026K29
$$ plain form
3865 670 -122 -191 297 -259 -227 544 -15 -531 61 562 219 465 234 -962 -61 611 -62 -617 286 -2
3885 -2 -218 635 -159 -1137 -224 665 -198 -92 121 -658 -444 448 -360 -387 115 65 203 897 433 -899 -126
3906 -126 221 288 133 376 -412 -11 760 391 -403 -117 372 -599 326 616 -608 -283 232 206 85 544
3926 544 -167 -508 514 356 -182 -213 -182 -695 54 469 -435 -579 475 95 -5 308 -622 -882 241 509
3946 509 -536 221 36 -469 25 523 -296 -679 -43 118 -176 145 11 -632 8 337 -41 87 -46 -458
3966 -458 -129 574 78 -628 143 247 359 632 635 -506 -364 719 -206 -557 285 -547 -13 774 295 -1000
3986 -1000 45 329 -413 346 -28 -571 -304 509 223 -223 135 -341 -421 465 290 -362 -287 62 -356 76
4006 76 255 -466 -133 480 260 -38 104 -251 -657 580 548 -316 -136 257 -2 81 571 -397 -346 233 642
$$ packed form
3865F70p92o9M88n56L2P71n59n16N92N01l43K46k31j196R01O72o73n55R03k88
3885bk16Q53p94r78R13Q89q63J06K13p79K14Q92q08k7N02n0J38O94m64j332P73
3906a26L47O7j55K43p88M01P71l69p94K86M89r71R25K90j224L25N15k6j21M59
3926E44p11l41J022j58n38l1L1n13P49M15r04j44J054l80j00L13r30k60J123K68
3946E09j045P57j85n05M94M98q19l83O36J61k94L21j34o43O40L29l78J28j33m12
3966d58L29P03m96p06P71J04J12K73Lj141J42J083r25l51Q42q32N34P87m79j295
3986a000J045K84p42P59l74n43K67Q13k86m46L58m76q0Q86j75o52P5L49m18M32
4006G6J79p21L33O13k20k98J42l55m06J237l2q64J80L93k59Q3M90r68N1N79M09
$$ plain form
4027 642 -365 288 409 -270 377 719 -344 -326 207 -224 13 699 -279 -690 -119 529 -274 -31 -25 -557
4047 -557 387 777 58 -904 -168 -248 -197 391 222 -905 144 750 -343 -108 29 -477 -229 670 24 -364
4067 -364 -114 -223 -302 632 301 -859 113 521 74 154 39 -241 -571 579 331 -564 176 254 -62 110
4087 110 379 -719 -201 624 261 -212 635 174 -619 564 286 -599 -180 -230 -368 473 447 -440 -435 140 6
4108 6 194 404 -338 -653 274 209 -57 -252 98 -448 61 665 151 -629 225 215 -249 360 99 -409 272
4129 272 499 -212 -216 381 -238 -175 716 -197 -484 294 415 -167 514 -33 -688 -189 757 218 -285 285 -238
4150 -238 -272 502 44 -580 94 249 -59 194 305 -840 -220 643 -150 -263 373 -315 -404 267 36 -433
4170 -433 69 80 21 -235 436 -595 -713 511 -38 -233 83 120 -502 455 378 -569 -358 -30 -60 151 618
$$ packed form
4027F42j007O53J21o79O47L42j063J8N33m31K37O86r78m11N71O48q03K43On32
4047e57R44L90p19r62P36q0N1N88j69j127J049O06j093K35J37n06K48Q99o46l88
4067c64K50j09p9R34l31j160R72M08m47Q0j15k80l30J150k48q95P40P8l16J72
4087A10K69j098N18Q25l63m73Q47m61p93J183k78q85M19n0j38Q41k6q87NN75j34
4108FJ88K10p42l15R27o5k66j95L50n46N09O04n14p80Q54j0m64O09k61n08O81
4129B72K27p11mN97o19O3Q91r13k87P78J21n82O81n47o55M99R46n39n03N70n23
4150b38l4P74m58o24O74J55l08K53J11j145O20Q63p93j13O36o88q9O71k31m69
4170d33N02J1n9k56O71j031j18J224n49j95L16L7o22R57p7r47K11L28l0K11M67
$$ plain form
4191 618 -80 -192 422 96 -293 75 4 -668 231 718 -347 -417 135 -103 -70 440 -63 -612 118 366 -2
4212 -2 34 25 -541 46 766 -158 -513 206 60 -288 200 156 -498 171 665 -10 -43 245 -406 -520 505 73
4234 73 -349 233 52 -239 361 299 -355 -445 339 -168 89 453 -220 -279 553 209 -437 51 227 244 177 565
4256 565 -479 -522 437 8 -83 295 -165 -438 -11 19 -414 -240 -175 -300 260 545 -228 -215 190 -213 -131 217
4278 217 -457 -513 386 727 -54 -136 255 -616 156 499 -375 -394 101 103 219 162 299 -425 253 440 -57 64
4300 64 229 -494 -134 435 -169 -415 4 232 -167 495 163 -530 -301 637 32 -310 -116 -337 -410 459 400
4321 400 -744 0 372 -124 -41 125 -608 -555 435 -253 -438 126 -62 -431 232 456 -697 -237 -65 -536
4341 -536 340 310 -537 -748 610 168 -246 410 -90 -479 104 378 146 -134 448 22 -498 663 -234 -586
$$ packed form
4191F18o98j12O14l26l89L68p1o72Q99M87j065p0N52k38L3N10n03n49P30K48l68
4212bL6rn66N87P20r24l55P19j46l48M88m4o54O69M94o75l3K88o51j14J025m32
4234G3m22N82j81k91O00o2o54r0P84n07K57L64o73n9Q32l44o46M88J76J7o7L88
4256E65j044m3R59m29r1L78m60k73M27L0m33J74O5j25N60K85p73J3M05m03Q2L48
4278B17o74n6Q99L41p81q2L91q71P72L43q74j9M95KJ16n7J37p24O78J87m97J21
4300F4J65p23L60N69o04k46M19K28l99O62l32o93K29R38o05l42J94k21p3Q69n9
4321D00j144P44L72m96Q3J66p33N3R90o88j85N64j88l69O63K24j153M60J72m71
4341e36Q76l0q47k11J358m42m14O56n00l89N83K74k32k80N82m26n20J161q97l52
$$ plain form
4361 -586 225 309 -157 352 -47 -436 43 513 -172 -272 300 -99 -274 628 179 -480 90 298 -200 -204 223
4382 223 -494 53 868 -220 -551 -158 -103 -409 120 -116 -618 -377 225 -249 8 370 -367 248 685 587
4402 587 -401 112 -100 -355 729 527 -342 356 688 -107 -86 402 -316 -37 771 474 326 253 257 -134 -264
4423 -264 392 -568 -410 368 2 -84 448 -80 -582 430 295 -396 -50 100 -568 -21 648 -335 -301 559
4443 559 130 -120 -14 -187 -646 150 256 -290 -253 225 -181 -148 400 -137 -278 306 420 -330 46 227 -384
4464 -384 197 518 413 35 304 0 14 432 259 -586 312 337 120 379 319 -474 -456 440 108 -435 -86
4485 -86 -196 -409 379 389 -247 69 202 -429 205 152 -374 -384 373 -191 25 6 -251 -514 346 345 -494 -315
4507 -315 210 -39 -158 183 -399 -172 533 -111 197 437 155 -436 411 646 -347 -117 338 238 142 796
$$ packed form
4361e86Q11Q4m66N09l99l89M79M70o85j00N72l99j75R02m49o59N70K08m98mM27
4382B23p17N47Q15j088l31L93N5l06N29k36n02K41O02m74K57L62p37O15M37r8
4402E87r88N13k12k55J084k02q69O98L32p95K1M88p18K79Q08k97j48p3Ml91j30
4423b64O56r60J58P78l66q6N32n28n02J012j35o91L46J50o68N47O69r83L4Q60
4443E59m29k50J06j73m59P96J06n46L7M78m06L3N48n37j41N84J14p50L76J81o11
4464c84N81L21j05l78K69l04J4M18j73q45Q98K5k17K59o0p93J8Q96l32n43L49
4485h6j10k13P88J0o36L16J33o31O34n3n26j0P57n64K16j9k57k63Q60jq39J79
4507c15N25k49j19L41n82K27P05o44L08K40k82n91Q47K35r93K30M55j00r6O54
$$ plain form
4527 796 295 -167 323 121 124 103 263 -583 155 474 -123 -250 85 290 -59 571 4 -730 210 584 -379
4548 -379 -240 44 -370 -164 699 213 -521 156 -240 -369 -22 149 -578 -60 477 159 -167 308 -143 -454
4568 -454 252 30 -327 439 214 -88 354 514 -365 -288 752 312 186 52 -131 -389 294 116 -570 35
4588 35 238 -107 472 413 -114 -268 295 -147 -131 84 47 -447 -48 223 -265 -510 184 -395 65 255 -644
4609 -644 -574 -2 91 -307 169 -337 -479 219 465 -357 -135 226 -79 93 387 29 -617 547 286 -63
4629 -63 -142 1 -435 261 827 -146 13 184 -136 31 646 286 -475 -26 333 -173 256 515 -144 267 523
4650 523 161 -277 111 53 -211 277 411 -493 -20 124 -86 280 393 -309 -355 461 -3 -436 199 -180 -309
4671 -309 402 402 -284 -168 641 291 56 395 73 -423 569 247 -251 191 135 -216 474 745 -298 -346 564
$$ packed form
4527G96n01m62M90k02Lk1J60q46P38L19n97j27L35K05l49O30n67p34R40L74r63
4548c79J39K84m14K06Q63m86p34O77l96j29L47J71p27N18N37l18l26M75m51l11
4568d54P06k22l57P66k25l02M42J60q79P7J040m40j26j34j83k58O83j78o86O05
4588C5K03l45N79n9n27j54N63m42J6K15l7m94L99K71m88k45O94n79M60J90q99
4609f44P0N72R3l98M76n06j42O98K46q22K22L61l05J72K94l58o46J164k61l49
4629f3p9J43m36O96N66r73J59J71l20J67O15l60p61M49L59n06M29K59o59M11K56
4650E23l62m38L88n8k64M88J34r04M73J44k10L66J13p02m6Q16m64m33O35l79j29
4671c09P11%o86J16Q09l50k35L39l22m96R92l22m98M42n6l51O90K71j043m8R10
$$ plain form
4692 564 -342 -34 546 182 -194 650 509 -150 63 408 -399 101 736 -119 -536 139 -34 -75 458 -76
4712 -76 -748 114 199 -349 0 56 -489 -58 501 -31 -651 347 -20 -101 45 44 -550 -271 237 -95 -193 216
4734 216 -19 -135 557 414 -520 201 -66 -307 308 332 -453 10 405 -1 -204 208 -29 -228 226 76
4754 76 -232 -136 150 -157 60 352 -410 -372 112 48 -558 305 -79 -378 297 515 -602 215 225 32 102 347
4776 347 -369 -658 68 156 -3 308 -337 -284 258 546 -330 -298 202 -13 -470 426 -116 -438 46 93 15 587
4798 587 211 -440 82 551 180 -395 303 12 -42 786 211 -564 102 129 -90 110 -12 -432 -314 368 415
4819 415 -145 14 1 -312 149 47 -540 -199 38 -194 -95 130 -536 -477 488 -55 -411 9 65 6 -19 97
4841 97 -131 -271 241 11 135 334 124 -406 101 768 -226 17 199 -422 391 733 -243 -337 317 149 -173
$$ packed form
4692E64r06L08N80l64l76Q44j41o59K13L45q07N00O35q55m17O75j73m1N33n34
4712g6o72Q62Q5n48L49N6n45M31N59n32o20R98l67q1J46jn94K79N08l32r8M09
4734B16k35j16O92j43r34P21k67k41O15K4p85M63L95m06k03M12k37j99M54j50
4754G6l08R6K86l07K17K92p62L8M84o4o06Q63l84k99O75K18j117Q17J0j93P0K45
4776C47p16k89P26Q8j59L11o45N3N42K88q76L2N00k15m57Q96n42l22M84M7p8N72
4798E87l76o51N22M69l71n75O98k91n4Q28n75p75O66K7k19K00j22m20J18O82M7
4819D15n60J59j3l13M61j02n87L41K37k32R9K25o66N9R65n43l56M20N6n9k5J16
4841I7k28j40N12k30J24J99k10n30N07O67r94K43J82o21Q13L42r76r4O54j68l22
$$ plain form
4862 -173 500 -191 -390 267 406 -129 -253 281 -210 273 763 -175 -425 63 -23 -348 503 18 -431 161
4882 161 276 -207 -426 89 -444 -403 401 -132 -522 114 -150 -142 191 283 -429 -95 184 10 -9 323 -315 1
4904 1 675 340 -663 -138 166 -274 225 111 -330 -368 659 215 -174 170 -426 -99 216 476 -305 -265 189
4925 189 -207 246 497 -356 -244 320 -210 -148 -100 -201 -345 219 103 -461 56 276 -180 -152 397 -527 -689
4946 -689 25 163 -232 -170 15 -429 58 469 -224 -283 255 -200 -13 439 162 -653 178 360 -43 305 206
4967 206 -329 -14 378 264 -180 222 -124 -164 374 99 -395 -72 142 163 185 303 -137 -268 800 327 -348
4988 -348 143 -225 -226 306 -8 -356 -184 168 -305 164 342 -414 -402 -37 72 -363 -212 -120 -283 59 606
5009 606 -135 -409 538 -191 47 119 -22 -432 377 507 -94 -50 1 -223 110 510 -400 65 151 74 50 347
$$ packed form
4862a73O73o91j99O57J39n35j24N34m91M83M90r38k50M88q6l25Q51m85m49N92
4882A61J15m83k19N15n33M1Q04n33l90O36k64QL33R2p12L34K79j74j9L32o38L16
4904AO74l35j003N25L04m40M99j14m41l8J027m44l89L44n96L27L15K60p81M0M54
4925A89l96M53K51q53J12N64n30O2M8j01j44N64j16n64N17K20m56K8N49r24j62
4946f89P14J38l95O2J85m44M87M11o93n9N38m55J87M52k77q15Q31J82m03L48r9
4967B06n35L15L92j14m44M02l46m0N38k75m94L23K14K1K2J18m40j31J068m73o75
4988c48M91l68jN32l14l48J72L52m73M69J78p56J2L65J09m35J51R2j63L42N47
5009F06p41k74R47p29K38P2j41m10Q09J30o01M4N1k24L33M00r10M65Q6p7k4K97
$$ plain form
5031 347 236 -221 298 136 -306 -208 -66 -107 142 754 -92 -243 -208 61 -413 126 321 -488 84 335 -292
5052 -292 -308 -141 -113 -227 -82 314 -504 -101 154 -78 167 -9 -471 -311 403 -247 -47 496 -170 140 353
5073 353 434 -620 152 160 -180 374 352 -343 -153 555 317 -101 5 -25 -283 371 252 -335 120 48 67 112
5095 112 343 -430 -237 91 72 -61 347 -227 -599 77 467 -186 -261 259 -59 -180 294 278 -357 -132 353
5116 353 3 -36 458 -146 81 488 -234 -542 382 -156 -14 289 271 -469 446 347 -99 84 428 -488 -29
5137 -29 386 -84 -282 321 -39 -252 373 198 -315 221 393 185 -286 288 -363 -409 409 -53 -111 -362 238
5158 238 -405 330 73 -520 -597 200 -164 -107 162 -287 -295 445 134 -741 -376 90 -200 150 180 -501 -658 125
5180 125 148 2 189 -409 -474 12 371 -302 -291 129 -237 -189 529 -70 -443 -14 -138 -343 128 113 -298 327
$$ packed form
5031C47j11m57N19j62m42R8J42m1K49O12q46j51L5K69m74N39J95q09N72K51o27
5052b92j6J67K8j14J45L96q18M03K55k32K45j76m62J60P14o50K00N43o66L10K13
5073C53Q1j054P72Ql40N54k2o95J90P08k38m18J06l0k58O54j19n87M55p2J9M5
5095A12K31p73J93L28j9j33M08n74l72O76L90o53p5N20l18j21M74j6o35K25M85
5116C53l50l9M94o04K27M07p22l08R24n38J42L03j8p40R15r9m46J83L44r16M59
5137b9M15m70j98O03l60k13O25j75n13N36J72k08m71N74o51m6Q18m62n8k51O00
5158B38o43P35k57n93p7P97l64N7K69m49qP40l11q75L65M66k90L50L0o81j57P83
5180A25K3j46J87n98o5M86L59o73J1M20l66M8P18n99l73M29j24k05M71j5m11O25
$$ plain form
5202 327 279 -560 27 179 -392 -78 140 110 -398 -22 4 -52 404 -252 -429 -357 353 -22 -96 596 -268 -267 489
5225 489 86 -377 142 354 -338 -254 369 -489 159 426 57 100 395 -315 407 658 566 -404 199 324 50
5246 50 235 433 -359 8 513 509 124 452 78 -112 210 200 -351 184 235 -161 327 484 -163 -57 603 175
5268 175 90 240 23 -417 84 110 -184 -11 725 86 -76 325 -217 -380 206 -49 -380 92 -209 -145 -168
5289 -168 267 -245 -210 31 -46 -63 107 61 -289 38 157 -163 5 131 -29 -257 602 -13 -225 34 321
5310 321 -33 559 282 -474 -183 195 -188 6 140 -332 -293 328 24 -405 451 -14 -208 56 216 -592
5330 -592 -457 199 -393 -282 183 -259 -263 216 19 -153 -3 -4 -379 233 193 -558 -513 511 -49 -45 288 92
5352 92 -582 208 226 -197 -196 204 -271 35 443 -254 -346 298 24 -106 445 -414 -306 144 333 -307 -47 353
$$ packed form
5202C27m8q39N87J52n71L14K18l0n08L76K6n6M56o56j77P2P10l75p4O92q64JP56
5225D89m03m63N19K12o92Q4O23q58O48K67l69M3K95p10P22K51r2r70O03J25k74
5246E0J85J98p92L67N05ml85L28l74j90L22j0n51N35N1l96M88J57o47J06O60m28
5268A75q5J50k17m40N01K6k94J73P36o39j62M01n42j63N86k55l31M72l01O4k3
5289a68M35n12L5K41p7j7J70m6l50L27J19l20J68J26j60k28Q59o15k12K59K87
5310C21l54N92k77p56K91L78l83J94J34m72L9O21l04m29Q56m65j94K64J60q08
5330e92J35O56n92J11M65m42mM79j97j72J50jl75O12m0p51M5J024n60ML33j96
5352I2o74P90J8m23JM00m75L06M08o97r2O44k74j30N51q59J08M50J89o40K60M00
$$ plain form
5374 353 182 63 640 -328 -413 -108 262 7 354 217 -347 -354 212 174 -311 249 -170 -189 248 264 -558 60
5396 60 326 -185 305 499 -357 -244 344 280 -234 159 12 -174 88 618 -235 150 636 -42 -113 234 -524
5417 -524 -384 132 362 -102 371 -290 -337 252 314 -447 -208 72 -145 -9 256 -395 -451 150 17 -154 -123
5438 -123 9 -206 48 439 -180 -351 68 -57 -111 466 21 -607 301 87 -443 -107 83 -475 -249 187
5458 187 -279 -55 112 75 -180 468 236 -135 20 275 -209 74 289 -285 74 99 79 -287 51 -40 -127 313
5480 313 -67 -237 -321 371 -40 -302 160 -610 -154 540 -125 -84 -218 -66 -117 171 317 -361 -280 87 -77
5501 -77 -53 8 -271 -194 68 208 -51 228 266 -414 -120 241 -355 -146 268 167 93 158 112 -137 48 263 -130
5524 -130 392 -89 -191 47 468 -107 -60 314 -58 14 211 175 -450 235 695 207 -128 -126 -266 137 211 -188
$$ packed form
5374C53j71j19N77r68q5L05L70k55L47j37n64pN66l8m85N60m19j9M37J6q22O18
5396F0K66n11M90J94q56J13N88o4n14L93j47j86K62N30q53L85M86o78p1L47p58
5417e24J40N16K30m64M73o61m7N89O2p61K39K80k17J36K65o51n6O01j33j71L1
5438a23J32k15K54L91o19j71M19j25n4N77m45o28R08k14n30L36J90n58K26M36
5458A87m66K24J67l7k55O48k32l71J55K55m84K83K15n74L59K5k0l66L38r1q7M40
5480C13l80j70q4O92m11k62M62p70M56O94o65M1j34J52n1K88J46o78Q1L67j64
5501g7K4O1k79P7K62J40k59K79L8o80K94L61n96K09M14j01p4O5m6k49J85K15l93
5524a30N22m81j02K38M21n75M7L74l72P2J97l6o25O85M60m88l35Kj40M03P4l99
$$ plain form
5546 -188 -209 -58 -185 -357 51 -281 -505 88 429 -171 -55 138 -140 -178 -135 -130 -361 -65 13 69 128 103 -234
5569 -234 -210 282 -188 -101 187 -162 -179 293 49 -225 -162 238 -135 330 156 -178 -148 244 -27 -408 110 332
5591 332 -219 326 397 -245 -46 156 -126 34 388 19 -119 211 273 -110 136 244 -434 -113 336 -23 -244
5612 -244 156 -170 -127 149 -80 -600 -230 100 -98 136 -141 95 -32 336 -233 -211 115 229 -260 227 167
5633 167 -308 133 376 0 66 281 -347 -91 522 94 -247 334 444 -267 231 274 -285 -103 533 376 -110
5654 -110 117 -6 -132 190 50 -576 -289 -77 -71 -44 127 -783 -279 130 -417 -40 115 73 -228 145 363
5675 363 -427 95 -55 -347 337 87 -443 -249 433 138 -289 104 -75 -220 227 648 -348 56 178 -63
5695 -63 -62 588 -23 -326 221 -45 58 -148 132 -718 392 486 -45 5 105 157 -300 342 -271 -282 -108 226
$$ packed form
5546a88k1J51j27j72M08l32k24N93L41o00J16J93k78l8M3Nk31K96P8N6N9k5l37
5569b34K4M92m70Q7K88l49j7M72k44k74O3M00l73M65j74l34L0L92k71l81N18K22
5591C32n51N45P1o42J99K02k82J60L54l69j38L30O2l83K46J08o78L21M49l59k21
5612b44M00l26M3K76k29n20L70L30j98K34k77K36j27L68n69K2L26J14m89M87o0
5633A67m75M41K43l76O6K15o28K56O13m28l41N81J10p11M98M3n59J82O36j57m86
5654a10K27j23j26L22j40o26K87K12OK7J71r10N04M09n47L77J55m2l01L73K18
5675C63p90N22j50k92O84k50n30J94O82k95m27L93j79j45M47M21r96M04J22k41
5695f3JO50o11l03N47k66J03k06K80q50J110R4n31N0J00N2m57O42o13j1J74L34
$$ plain form
5717 226 -108 263 199 -333 -271 318 -68 -212 225 -53 -212 233 133 -397 -3 385 -245 417 328 -421 111
5738 111 207 183 -421 -275 -316 -175 379 341 -39 -136 518 -93 -13 99 -510 -326 423 510 -433 110 -46 -360
5760 -360 260 317 -362 -73 190 -3 -432 180 -3 -331 79 -27 -79 -99 -88 -364 109 392 -464 -372 353 -158
5782 -158 -168 -115 -31 -603 100 494 -253 99 -43 5 -153 610 126 -170 -82 -91 -91 303 315 -228 176 285 145
5805 145 -255 174 171 -18 405 10 -334 -22 -28 98 125 89 -394 164 378 113 -192 101 25 -225 341 58
5827 58 -501 146 142 -71 100 317 -307 -293 25 -40 -143 375 81 -626 289 208 -168 111 4 -210 173 169 -575
5850 -575 -437 466 297 -351 284 278 -140 255 235 -124 234 298 137 85 554 219 -253 278 119 414 81 117
5872 117 -408 -64 431 -227 -317 31 -170 -50 415 108 -496 41 313 -562 202 -16 -443 -87 505 -284
$$ packed form
5717B26l34L71o4n32O2N89l86j44M37k78j59M45j00n30L94L88o30O62q9p49N32
5738A11R6k4o04J46m1J41N54l8l80r7O54o11Q0J12o09J84P49Q7r43N43j56l14
5760c60O20N7o79K89K63j93m29O12j83l28M10j06n2k0J1k76M73K83q56R2P25n11
5782a58j0N3Q4n72P03L94p47L52j42M8j58P63m84k96Q8r%L94J2n43M04J09j40
5805A45m00M29lj89M23l95l44L12oJ26K7l6m83N58K14k65l05K93p6k50N66k83
5827E8n59O47mk13J71K17o24J4L18o5j03N18k94p07R15q1l76K79j07k14L83mp44
5850e75J38R03j69o48O35om18L95k0l59L58O4j61n2M69l35m72N31j59K95l33L6
5872A17n25L44M95o58r0L48k01J20M65l07o04N37K72q75P64k18m27L56N92p89
$$ plain form
5892 -284 -478 126 -96 -493 62 -60 -256 -208 -24 -175 194 111 -21 -423 88 161 -393 189 87 -307 314
5913 314 324 -482 412 37 -93 -70 280 -45 -245 446 161 -284 38 210 -503 -22 368 -33 -219 193 245
5934 245 -193 -105 1 -327 206 72 -351 164 312 -192 261 185 -307 -197 -6 20 -163 128 30 -340 208
5955 208 96 -294 -265 244 -418 -234 412 144 -192 -182 216 17 225 -125 -244 68 549 146 -159 300 106
5976 106 -230 408 216 -38 9 366 141 141 377 -409 -270 115 50 26 175 -292 -468 306 121 -233 28 302
5998 302 -79 -38 254 -275 -331 315 -75 -332 163 -62 -405 97 60 -262 -125 536 7 85 100 -28 -214 89
6020 89 172 -73 79 144 119 379 465 -172 -42 237 -255 -155 366 152 -151 434 274 -345 -109 -130 -410 208
6042 208 415 14 -27 119 -163 -230 130 145 -89 195 133 -126 -25 -202 -495 -386 491 34 -367 129 -37
$$ packed form
5892b84j94O04k22l97N55j22j96M8J84j51L69q3j32m02N11P3n54N82j02l94O21
5913C14J0q06Q94l75j30K3L50l25k00O91k85m45L22J72p13M81L90m01j86M12N2
5934B45m38Q8J06l28N33j34m23N15J48n04M53p6m92J10J91K6j83K91r8l70N48
5955B08j12l90K9N09o62J84O46k68l36J0L98j99K08l50j19L12M81m03l05M59j94
5976A06l36O38j92k54M7L57k25%K36p86J39L85o5k4J49m67j76P74j85l54K61K74
5998C02l81M1K92n29n6O46l90k57M95k25l43N02l7l22J37O61n29P8J5j28j86L03
6020H9Q3k45J52O5k5K60Q6o37J30K79m92J00N21k14l03N85j60o19K36k1k80O18
6042B08K07m01m1J46k82o7L60J5k34K84o2k59J01j77k93J09Q77m57m01M96j66
$$ plain form
6063 -37 -79 313 -155 -412 -67 -124 -238 24 212 -236 -444 257 162 -214 195 -14 -251 155 152 -259 -179 237
6085 237 39 18 296 19 -13 243 -82 96 -49 -78 -181 69 266 -14 -88 143 63 -120 45 33 -160 -92
6107 -92 230 -123 -183 -25 -123 -391 224 -109 -272 -59 -127 -231 189 39 -323 -114 172 -164 -97 242 4 135
6129 135 68 -106 -132 219 104 -97 51 372 -382 112 93 -282 -147 -68 -267 -223 295 -49 -180 -146 233 -345
6151 -345 5 266 -347 -61 211 188 -59 163 242 -182 206 -62 -137 -85 -331 -140 -20 236 -199 -174 255 -73
6173 -73 -95 163 -221 -227 179 16 -362 -218 238 -173 84 349 -467 -13 303 -146 -6 482 56 -229 -52
6194 -52 318 5 -114 229 -253 84 515 -103 -370 92 -97 185 272 272 -59 134 473 110 -460 191 3
6215 3 -228 21 -20 -265 76 173 139 16 82 -281 -271 165 -61 -460 -48 -36 -169 308 154 -354 -277 248 -12
$$ packed form
6063c7m2L92m68k57L45n7j14K62J88m48k08P01r5l76M09k09k37M06lm11Q0M16
6085B37j98k1K78k77l2K56l25J78j45k9j03K50J97k80p4K31q0j83J65j2j93O8
6107i2L22l53o0J58r8k68O15l33j63K13o8j04M20j50l62K09K86l36O7L39k38J31
6129A35o7j74k6L51j15k01J48L21p54M94j9l75J35P9j99M4N18l44j31L4L79n78
6151c45L50K61o13K86K72k3k47K22P9m24L88k68p5N2k46J91J20K56m35K5M29l28
6173g3k2K58l84oM06j63l78J44M56m11K57K65q16M54L16m49J40M88m26k85J77
6194e2L70l13j19L43m82L37M31o18k67M62j89K82Q7%l31J93L39l63n70O51j88
6215Ck31K49m1k45L41R7l4j23O6l63J0M36k26l99M12J2j33M77j54n08P7N25k60
$$ plain form
6238 -12 -74 198 -215 -32 154 421 -135 95 280 -47 -61 311 -391 76 293 83 89 279 -114 -149 79 50
6260 50 -106 97 -240 -193 441 375 44 -328 -53 -200 -117 210 51 -168 36 76 -338 -281 278 -15 10 -9 243
6283 243 -231 -28 -173 -319 227 -525 -235 -365 303 -34 -148 262 89 -53 185 94 -230 351 -21 -158
6303 -158 476 294 -37 43 417 -24 -233 330 -419 -387 338 230 -27 134 171 -176 170 264 -63 -21 81 -47
6325 -47 -162 94 -56 -607 150 38 -322 -11 88 91 39 20 -293 -169 195 26 -148 252 -168 -132 268 102
6347 102 -261 -204 -140 -269 -115 133 -267 -136 72 32 -88 412 -206 -332 14 395 -84 158 276 -169 -198
6368 -198 251 -29 -129 0 245 -205 65 170 -258 -172 196 168 -30 -190 -164 -112 13 21 -692 -78 -97 -375
6390 -375 -65 -284 -278 -290 61 -120 -59 361 129 -425 176 298 -216 -21 -60 215 -101 84 -389 4 168 56
$$ packed form
6238a2o2K72m13J83J86K67n56K30J85l27j4L72p02M67K17k10OJ90l93l5K28k9
6260E0j56K03l37M7O34o6l31l72K75j47Q3L27j59k19K04M0m14N7N59k93K5j9K52
6283B43m74K03j45j46N46p52K90j30O68l37j14M10j73j42K38r1l24N81l72j37
6303a58O34j82l31Q0L74m41k09N63p49L2P25j08k57J61L7l47L46R4l27M2J02j28
6325d7j15K56j50n51P57j12l60L11R9Ln2j9l13J24L64j69j74M00m20L6M00j66
6347A02l63N7O4j29J54K48m00J31K08m0j20N00o18j26L46L81m79K42J18m45k9
6368a98M49k80j00J29K45m50K70J05m28Q6L68k8j98j60K6N2J25Qp13O14j9k78
6390c75L10k19Oj2L51j81O1M20k32n54O01J22n14J95l9K75l16J85m73L93J64j12
$$ plain form
6412 56 -282 137 197 -68 143 206 -129 -140 390 18 -57 285 -76 -199 313 -8 -50 -223 2 -106 12 25
6434 25 -274 -118 190 65 -275 119 218 -269 -45 74 -118 -10 7 183 68 -12 30 -220 392 -88 -91 89
6456 89 64 -162 -72 74 -400 -37 309 -97 -46 197 -217 -7 43 16 -302 242 125 -4 -24 210 -9 -46 311
6479 311 -88 -158 177 442 -233 2 111 -88 95 135 -223 -292 -4 4 -279 -76 5 -202 477 141 -388 -228
6501 -228 102 -101 206 266 -50 -104 139 32 -222 -4 -8 -262 40 88 -268 -177 412 64 82 309 3 -472
6523 -472 238 290 -49 119 152 -410 43 220 9 75 59 341 29 0 306 90 9 -3 42 73 240 -166 -52
6546 -52 42 -110 -260 -142 -182 -40 227 43 -284 123 -80 12 -50 -15 -301 -49 -27 -291 -118 42 133 -437 34
6569 34 -19 -295 78 126 -36 -121 288 -11 -84 385 -83 43 83 186 -139 -7 91 -202 -133 37 234 122 229
$$ packed form
6412E6l38M19O0k65K11O3l35j1N30l72p5L42l61j23N12l21m2j73K25j08J18J3
6434B5k99J56L08j25l40L94R9m87K24J19j92J08J7J76j15q0M2k50O12m80lJ80
6456H9k5k26R0J46m74L63L46m06N1K43m14K10N0k7l18N44j17j29k0K34k19l7L57
6479C11l99p0L35K65o75K35J09j99J83M0l58o9K88Qk83K03Q1k07O79l36n29J60
6501b28L30k03L07O0l16n4K43j07k54K18mk54L02M8l56R1N89l48J8K27l06m75
6523d72P10N2l39J68L3n62M53J77k11O6j6K82l12k9L06k16q1j2M5L1J67m06J14
6546e2R4j52j50J18m0J42K67j84l27M07k03R2o2L5k86K52K2k64J73J60R1n70M71
6569C4n3k76L73M8j62q5M09k99p3M69m68J26M0J03l25J32R8k93O9J70J97j12J07
$$ plain form
6592 229 57 26 125 305 -49 36 -64 -126 -24 -16 -46 -232 217 149 -372 -220 -233 -539 -82 273 -284 -315 -73
6615 -73 -284 -191 57 -39 -406 82 37 -236 275 154 -298 75 167 -391 -210 391 31 -298 219 264 -331 -77
6637 -77 28 -86 350 -10 -81 -222 193 118 -205 7 117 -308 248 -173 -364 14 61 -491 185 29 -199
6658 -199 -193 227 18 -348 288 -127 -320 109 -79 -5 -145 52 -193 -186 71 -226 -472 44 444 -242 -114 30
6680 30 -191 134 -16 -229 -162 -63 -229 21 126 -29 -362 90 331 -147 2 259 -37 -247 228 -164 -174
6701 -174 331 133 -13 225 -69 -121 -56 323 -16 -96 -3 -105 65 377 -232 9 -7 -191 116 236 305 -93
6723 -93 -132 225 116 228 203 -306 -103 -63 12 -182 39 276 38 12 30 6 -54 460 109 -333 363 -432 25
6746 25 22 178 -132 160 199 -180 212 249 267 -134 309 135 -188 28 223 217 106 336 -180 -84 81 188 -154
$$ packed form
6592B29j72l1R9J80l54Q5j00o2J02Ql0j86M49o8n21J52j3l06M57L55n57l1K42
6615g3k11R3K48r6l67M88m5k73N11j21m52L73R2n58J81O01l60l29N17M5n95K54
6637g7J05j14M36l60p1j41M15p5l23K12J10m25N56m21j91L78M7n52O76j56k28
6658a99OM20k09l66O36m15j93M29j88P4j40J97k45PK57k97k46N16M00o86J28J44
6680C0k21L25j50k13O7R9j66K50J05j55l33M52K41m78J49K57k96k10M75l92j0
6701a74N05j98j46K38k94n2O5L79l39q0R3j02J70L12o09K41j6j84L07J20O9l98
6723i3l9L57j09J12k5n09K03M0P5j94K21K37k38k6J8k4o0N14l51m42O96p95M57
6746B5lJ56l10K92L9l79L92L7J8m01M43j74l23K16J95oj11K30n16R6J65J07l42
$$ plain form
6769 -154 112 -304 -261 168 -36 90 -119 18 -155 95 -59 81 52 354 -208 -120 616 -359 -384 -121 72
6790 72 -35 207 206 -60 -96 308 22 -108 157 36 -50 289 17 -130 -71 -7 -130 225 23 -110 129 224 226
6813 226 -62 48 209 -82 138 38 -250 118 -17 90 8 -63 93 -283 120 35 -252 214 4 -66 133
6834 133 -53 -53 -197 89 -184 -155 15 -110 -97 -57 53 -193 57 11 -227 76 186 -93 -103 5 266 274 180
6857 180 223 -528 291 44 -19 -83 -108 -230 15 334 -38 126 -26 229 33 193 142 -302 -117 -171 -296 -216
6879 -216 172 350 -130 172 108 81 239 -60 -204 22 14 -308 -102 290 -48 76 7 -241 -212 101 212 -98
6901 -98 39 236 -265 -152 144 52 141 257 -24 -202 51 81 -383 -162 135 -82 310 185 -188 384 94
6922 94 131 -39 90 159 -307 647 -66 -384 14 150 -4 -121 -88 208 -74 378 -305 -206 266 305 -242 -78
$$ packed form
6769a54K66m16M3M29k04J26k09J37j73K50j54J40k9L02n62Q8P36r75k5K63J93
6790G2j07K42jk66l6M04k86j30K65j21q6L39k72j47N9O4j23L55k02j33K39R5K
6813B26k88J10J61k91K20j00k88L68j35J07q2p1J56l76M03q5k87M66k10p0J99
6834A33j86%j44K86k73K9J70j25J3M0J10k46K50m6k38L03J10k79j0J08K61Qr4
6857A80M3p51Q19k47o3o4k5j22K45L19l72J64j52K55j96J60n1m44J85n4j25Q0
6879b16L88J78m80L02o4k7J58k99j44K26ql22K06L92l38J24o9k48K9L13J11l10
6901i8J37J97n01J13K96r2Q9J16k81j78K53L0m64K21K97k17L92j25l73N72k90
6922I4L7j70J29O9m66R54p13l18L98J36j54j17L3K96k82M52o83R9M72L9n47J64
$$ plain form
6944 -78 -71 -63 283 362 -300 -12 14 -331 -209 -46 183 -69 355 -7 -280 -103 -120 -51 180 4 51 -62 35 87
6968 87 -82 464 71 -394 133 255 -157 438 136 31 58 58 192 -140 -81 -38 -109 232 223 -282 -169 132 -339
6991 -339 -35 222 -206 -91 -11 -65 -7 183 -269 -208 241 84 -261 202 -21 -30 -65 -63 143 -256 90 160 57
7014 57 7 -50 -79 322 192 189 -149 -151 0 57 -35 12 -193 38 303 -240 116 108 78 -6 -53 291 -423 89 165 161
7040 161 -45 -11 -449 131 415 -130 -55 53 -33 276 123 -55 -110 -10 -25 114 196 -129 28 326 67 306
7062 306 -200 37 -33 52 514 92 -185 -200 28 87 -297 199 -24 212 226 -29 -6 75 -106 -86 146 122 -179
7085 -179 70 303 110 -161 268 -218 -52 130 243 193 223 -102 -271 128 201 -71 -284 71 19 -27 161 -111
7107 -111 -135 26 137 120 -207 -139 -136 -207 44 -499 -81 -114 -56 -80 86 -64 -364 147 -5 -49 -105 48 -137 57
$$ packed form
6944g8PQL46P9o62K88K6l45J22J63K29k52M24l62k73J77j7O9K31j76M7j13R7N2
6968H7j69N46l93m65N27J22m12N95l02j05K7%J34l32N9M3p1L41rn05J13L01m71
6991c39L04K57m28J15Q0n4N8J90m52O1M49j57l45M63k23rl5KK06l99L46P0j03
7014E7n0n7k9M01j30ll38kJ51N7r2M7k05K31K65n43L56ql0q4m7L44p14N12P6m
7040A61k06L4m38N80K84n45P5J08q6L09j53j78n5J00j5J39Q2l25J57K98k59K39
7062C06n06K37p0Q5M62m22k77j5K28N9l84M96k23K36J4k55K3Q1j81K0K32k4l01
7085a79K49K33j93k71M29m86J66J82J13n0L0l25j69L99P3k72k13L55n2m6J88k72
7107a11k4J61J11j7l27O8Lp1K51n43M18l3N8k4J66j50l00N11j52m4n6J53j85J94
$$ plain form
7131 57 47 125 -46 -80 -121 -257 -50 192 -287 299 -76 66 -98 16 -286 -367 18 46 7 50 166 -270 118
7154 118 -78 -203 58 -202 -353 205 169 -222 275 349 126 -330 10 -80 -67 -8 82 -196 -134 178 -281 -69
7176 -69 347 34 -220 20 -342 53 -60 -66 -154 52 269 -172 -134 120 38 32 160 147 -95 215 141 -270 -161
7199 -161 240 -98 80 398 289 -86 146 142 -36 242 144 -117 -93 377 -100 57 -37 0 -46 -216 -222 -107 -53
7222 -53 210 -93 183 243 -119 140 -10 -347 -518 -160 128 -20 314 -227 -394 -246 189 -138 35 -139 -302
7243 -302 -71 18 135 -55 119 -86 -287 390 387 -513 -171 206 198 -109 265 -41 94 131 326 -64 279 265
7265 265 -282 369 268 31 -85 127 -400 -290 -73 -80 -128 -89 52 -171 -242 332 -195 98 449 -241 -171 -187
7287 -187 35 -93 199 -169 -118 229 222 158 -249 -141 74 -230 174 -149 109 149 -331 35 47 40 -276 226 149
$$ packed form
7131E7j0P8j71l4m1j36K07K42m79N86l75J42j64J14l02q1L85K8l9M3J16m36L88
7154A18j96j25K61k60j51N58l6l91M97P4k23m56L40r0J3N9R0k78O2L12m59K12
7176f9M16l13k54K40l62L95j13oq8K06K17m41L8K54q2oJ28j3k42L10p4m11J09
7199a61M01l38J78L18j09l75K32mj78K78r8k61K4M70m77J57r4L7m6j70oJ15N4
7222e3K63l03K76O0l62K59j50l37j71L58K88j48L34n41j67J48M35l27J73j74j63
7243c02K31Q9J17j90J74k05k01O77lr00L42L77ql07L74l06J35L7J95l90L43j4
7265B65n47O51j01k37j16K12n27J10K17pm8L9J41k23p1N74n27K93L51o90P0j6
7287a87K22j28K92l68N1L47po4m07J08K15l04M04l23K58M0m80L66J2pl16N02p7
$$ plain form
7310 149 200 -225 -5 -250 -50 322 142 -108 -126 202 -416 -5 263 135 13 96 -4 43 48 165 -464 146
7332 146 417 134 305 138 -158 -217 -339 -353 -208 -304 -94 -18 304 281 -90 140 -269 55 155 267 8 -209
7354 -209 403 -132 -41 -355 339 -91 280 110 -191 -110 287 -294 -1 201 115 120 60 148 -243 363 -39 -17 -82
7377 -82 96 -264 -232 101 34 145 109 48 113 77 188 -272 155 372 -189 102 37 9 -197 27 -123 -121 -41 48
7401 48 -453 171 -160 -219 70 347 -76 -143 -237 -423 148 -86 143 228 236 89 -43 36 -16 -202 -106 590 146
7424 146 40 257 -107 20 0 74 -69 -31 61 -6 -271 165 -12 -45 -105 -147 -318 72 112 -7 122 69 -194
7447 -194 0 49 11 -35 320 -93 -221 -64 -161 -58 -38 -30 -87 336 117 219 63 -1 -317 -129 15 -138 25
7470 25 40 -305 -12 87 254 44 70 206 -227 -188 226 -160 -64 -25 23 79 109 172 -173 -178 -26 9 60 284 -121
$$ packed form
7310A49N1m25K20k45K00L72j80k50j8L28o18M11K68j28j22Q3j00M7NJ17o29O10
7332A46K71k83J71j67k96n9j22j4J45r6K10P6L22k3l71K30m09L24J00J12k59k17
7354b09O12n35R1l14O94m30L71j70l01Q1L97n81K93K02q6No0Q8l91O06m02K2o5
7377h2J78l60L2L33o7J11l6o1O5l6J11m60M27K17n61K91o5k8k06K24j50KQ0Q9
7401D8n01O24l31n9K89K77m23o7r4j86N71k34K29Q5Qj47j32P9n2j86R6O96m44
7424A46j06K17l64J27k0P4j43L8R2o7k65M36j77l3o0m2j71L90M0j19J29n3k63
7447a94J94M9l8m6L55m13j28J57r7J03K0Qn7M23k19J02j56o4l16J88J44j53J63
7470B5J5l45K93R9J67k10K6J36m33L9M14l86R6L9M8N6L0O3l45nJ52L5N1K24m05
$$ plain form
7495 -121 47 6 -184 -256 507 283 -64 -98 87 -9 57 89 -86 83 -25 -225 -289 53 -30 -125 -15 -109 -248
7518 -248 29 63 -110 89 390 -161 48 -112 -59 65 72 124 -60 -61 99 -17 -10 -72 17 78 413 73 -332 24
7542 24 -270 -170 83 388 -119 62 134 -200 -244 153 173 -64 -27 -218 -60 58 -33 -76 -36 -48 -122 -67 240 -24
7566 -24 -33 67 -44 -253 62 -147 42 -48 151 -1 -190 374 -108 -155 -89 37 16 -30 -132 -182 -84 191 -229
7589 -229 -124 -108 -193 207 43 -141 -174 73 58 -51 163 28 57 -240 498 212 -123 154 -130 -328 289 135
7611 135 -213 171 20 -125 181 76 -151 266 136 143 -105 54 -58 -224 -178 106 74 33 -28 -18 68 -124 145
7634 145 333 207 -364 -295 117 20 251 295 447 82 -115 258 -21 395 121 -89 75 -120 87 -108 312
7655 312 118 226 87 212 10 52 -247 150 -98 7 105 -51 143 9 -159 -151 -43 -61 192 -101 -250 77
$$ packed form
7495a21J68m1j90p2P63k24l47l4J85r6O6L2j75J69j08k00o4L42q3r5J10r4j39
7518b48K77L4j73J99L01n51K09j60N3J24PN2j84jJ60j16Po2Q9O1L35l40m05L56
7542B4k94J00K53L05n07J81P2l34m4L97K0k37L7j91J58J18r1m3M0j2p4N5L07k64
7566b4rJ00j11k09L15k09J89r0J99j52j89N64m82m7O6J26k1m6j02n0R8K75m20
7589b29J05J6q5M00j64j84l3K47j5j09K14j35K9k97P38k86l35K77k84j98O17j54
7611A35l48L84j51j45L06j05k27M17j30Pk48J59j12j66M6K84l2m1o1J0Q6j92K69
7634A45J88j26n71O9M12r7K31M4J52l65j97L73k79M16k74k10J64j95K07j95M20
7655C12j94J08j39J25k02M2k99L97k48J05R8j56J94j34j68QJ08j8K53k93j49L27
$$ plain form
7677 77 246 -4 -109 2 129 -128 149 218 35 -206 116 99 -115 213 35 -39 25 20 -230 -64 -197 40
7699 40 -173 -7 -179 238 175 -139 -205 409 22 124 -5 280 -98 383 204 -232 -69 -28 75 -77 264
7720 264 -65 83 -88 157 -164 288 177 -64 -30 277 -74 -285 281 85 140 -139 -64 -271 -103 -23 -111 83
7742 83 175 -218 -83 229 -63 -29 -100 -203 -119 48 -118 -198 254 64 -99 258 66 25 -157 -65 235 -78 -146
7765 -146 12 55 -32 136 -227 361 135 253 -117 -89 25 -97 117 198 -38 156 14 -365 101 185 -250 73
7787 73 279 -8 45 283 -169 95 143 -64 -1 -286 43 -41 -181 -182 -61 -46 107 6 138 42 302 -127 26
7810 26 351 -183 -358 11 -2 -161 112 19 -276 147 97 -21 -93 -121 -319 123 -178 -192 91 -249 95 -60
7832 -60 348 -199 -196 86 -320 -17 99 53 -226 135 -217 -43 -128 342 -601 -167 -288 96 -89 -1 61 -110
$$ packed form
7677G7J69k50j05J11J27k57K77O9j83k41L22j7k14L28j78p4O4nk50J66j33K37
7699D0k13J66j72M17o3l14o6O14l87J02j29K85l78M81j79m36J63M1J03j52L41
7720B64l29J48j71K45l21M52j11k41L4L07l51k11N66j96N5k79P5k07J68Q0q8J94
7742H3R2l93J35L12k92L4p1j03Q4J67j66q0M52j90j63L57j92m1j82R2L00l13o8
7765a46J58M3q7J68l63N88k26J18l70K8J14j22K14Q1k36J94j42l79M66Q4m35L23
7787G3K06k87N3K38m52K64M8k07O3k85L29q4j40jJ21J5J53j01J32r6K60m29J53
7810B6L25n34j75L69j3j59K73r3k95M23n0j18p2k8j98M42l01j4K83l40L44j55
7832f0M08n47LK82m06L03J16m6k79L61l52J74q5M70r43M34j21L84j85Q8O2j71
$$ plain form
7854 -110 20 -223 -300 -75 71 -144 -33 33 -2 48 -81 397 -81 -91 242 -11 212 212 373 -300 64 301
7876 301 11 74 -116 -51 -7 237 32 -77 248 -28 -113 408 -60 -222 -119 -127 93 -298 -24 -161 151 317
7898 317 -368 -38 143 -172 -95 -14 78 -173 130 125 -107 92 -11 -11 -100 51 -231 140 -97 126 18 34 319
7921 319 -134 261 81 209 255 35 -44 -80 -22 -115 -529 -208 293 249 31 141 31 271 -33 -311 -100 40
7943 40 -39 -103 -55 -113 -203 78 188 -34 27 91 -184 -279 38 -177 -205 -173 -2 116 -27 83 22 -9 20 -110 74
7968 74 101 212 -12 212 91 148 -200 1 201 -185 69 -11 -165 310 166 -108 171 154 -153 165 139 128
7990 128 100 -235 -300 198 -5 -67 -157 391 -28 -231 478 80 -160 11 246 -159 -1 145 -143 -28 -66 -124
8012 -124 104 9 137 9 -8 98 -3 78 310 181 -48 -197 99 54 69 -282 18 187 -185 54 60 -240
$$ packed form
7854a10J30k43p7K25J46k15J11O6l5N0j29M78m78j0L33k53K23%J61o73L64K37
7876C01k90O3j90O5M4K44k05j09L25k76q5N21m68j62J03qK20l91K74j37L12J66
7898C17o85L30J81l15P7Q1R2k51L03nk32J99j03%q9J51k82L71k37K23j08J6K85
7921C19m53L95j80J28M6k20p9l6N8r3m14L21N01m4k18J10j10K40l04k78K11J40
7943D0p9o4M8n8r0K81J10k22O1O4k75r5L17k15k8L2J71J18j43J10o1l1K9j30J84
7968G4K7J11k24K24j21N7l48K01K00l86K54q0j54M75j44k74K79j7l07L18k6j1
7990A28k8l35o5M98k03o2r0N48m19k03P09l98k40J71K35m05J58J46k88J15l8n8
8012a24K28r5J28j28j7J06j01Q1K32j29k29j49K96m5J5l51L00J69l72K39Ol00
$$ plain form
8034 -240 52 43 575 -69 91 -95 -127 -217 57 -26 325 24 -152 -108 45 17 79 339 535 85 -95 -77 -284
8057 -284 -181 50 -74 -566 225 -47 -151 58 294 -285 -270 59 -5 -148 -85 1 -193 188 -18 224 43
8078 43 159 -360 -138 184 -174 -36 108 154 -59 -119 43 17 -201 156 -118 45 10 -205 -130 -161 -250 13 14
8101 14 -184 -276 62 -26 52 366 100 -225 -88 -59 32 -40 -5 188 -144 42 -72 29 -202 100 33 -228 112
8124 112 75 -65 6 -206 -52 52 416 -107 29 -98 0 62 111 30 -11 142 71 5 45 -59 67 -119 81
8147 81 -359 -13 319 -109 98 8 79 -19 -18 -133 -64 -3 -156 169 501 -15 -203 -259 -79 242 36 -28 126
8170 126 -135 64 153 10 -181 -85 120 86 200 66 -134 39 -192 -273 136 -116 -231 -91 313 -242 -16
$$ packed form
8034b40K92rN32o44J60j86l2r0K74q3L51l01j76M4J53k8O2K60J96m50j80J8k07
8057b84J03K31j24m92P91k72j04K09K36n79J5L29o4j43O3Q6j94L81k06K42j81
8078D3J16n19K22L22l58J38J44M6k13o0J62k6k18L57k74J63l5k15P5l1q9K63J
8101A4j98r2L38q8P8L14k66l25J37K9R1p2L5J93l32J86j14J01k31L02o7k61L40
8124A12l7j40P1k12J54J04L64n23J36j27R8O2M9q1m1J53p1o6M0j04J26j86K00
8147H1m40L46L32m28K07r0P1r8Jj15O9O1j53L25L32n16j88n6J80L21k06o4J54
8170A26k61J99Q9j43j91R6K05l4J14j34k00J73k31q1M09k52j15J40M04n55K26
8191a6
$$ Imaginary data points
##PAGE= N=2
##DATA TABLE= (X++(I..I)), XYDATA
$$ plain form
0 0 0 0 0 0 0 0 0 0 0 0 0 0 0 4 -8 8 -8 8 -8 8 -15 16 -16 20 -23 25 -29 32 -37 42 -48 53 -61 66 -75 84 -93
37 -93 102 -113 125 -138 154 -169 186 -208 230 -255 285 -320 362 -409 467 -542 636 -762 939 -1206
57 -1206 1657 -2553 4995 -23184 -81330 -22407 4138 -10826 -10344 -17580 -32817 254 12118 -27787
71 -27787 -38815 -26788 -42257 -20998 21854 -10047 -54192 -26238 -4632 -16202 -6557 -12199 -38331
84 -38331 -10950 22551 -5235 -25162 -19312 -37339 -23903 31686 22802 -26697 -12826 17081 9310
97 9310 3692 -15136 -47607 -16292 35623 16080 -9439 6755 -3523 -17548 11866 11233 -28544
110 -28544 -22884 2675 1185 10278 6651 -38421 -38071 12174 11492 -13644 -4219 -12756 -29335 1065
124 1065 10325 -35763 -45139 -13663 571 16737 20574 -26055 -40594 6498 9247 -27419 -21302
$$ packed form
0@%%%%%%%%%%%%%Mj2J6j6J6j6J6k3L1l2L6m3M8n4O1o9P9r0J01j14J27j41J59j77
37i3J95k15K38k63K92l23L55l94M38m85N40o05O82p71Q76j009J178j398J701k145
57a206K863m210P548k8179n8146N8923K6545j4964M82p236j5237L3071J1864l9905
71b7787j1028J2027j5469K1259M2852l1901m4145K7954K1606j1570R645n642k6132
84c8331K7381L3501k7786j9927N850j8027J3436N5589q884m9499J3871K9907p771
97I310n618j8828l2471L1315N1915j9543k5519J6194j0278j4025K9414o33l9777
110b8544N660K5559j490R093l627m5072L50N0245o82k5136R425q537j6579L0400
124A065R260m6088r376L1476J4234J6166L837m6629j4539M7092K749l6666O117
$$ plain form
137 -21302 -8445 -12685 15928 31910 -4981 -19484 -1407 -6506 2197 27695 1353 -26673 10481
150 10481 32185 5983 -133 -683 -13362 15561 47590 16063 -12179 413 -1510 393 23309
163 23309 3204 -29049 7562 43946 19520 -1527 -7814 -25095 -10476 19188 -1531 -20264
175 -20264 3239 5037 -6619 13489 5331 -36738 -27457 8807 5946 -715 -3846 -29441 -24043
188 -24043 16130 6354 -26749 -14472 101 -2389 17447 11928 -35378 -36155 3322 6774 -368
201 -368 5669 -9736 -8636 26724 17552 -24446 -20269 -3594 -9492 9764 26014 -5108 -17857
214 -17857 6196 6242 -1198 6518 -14189 -28364 12815 29978 -8191 -22480 -12511 -15821 1915
227 1915 21417 -9222 -27622 1455 7891 -8892 -8197 -24007 -40247 -3641 24074 -3702 -16664
$$ packed form
137b1302J2857m240K8613J5982l6891j4503J8077n099Q703K5498k6342k8026L7154
150A0481K1704k6202o116n50j2679K8923L2029l1527k8242J2592j923J903K2916
163B3309k0105l2253L6611L6384k4426k1047o287j7281J4619K9664k0719j8733
175b0264K3503J798j1656K0108q158m2069R281L6264k861o661l131k5595N398
188b4043M0173r776l3103J2277J4573k490J9836n519m7306p77L9477L452p142
201c68O037j5405J100L5360r172m1998M177J6675n898J9256J6250l1122j2749
214a7857K4053M6p440P716k0707j4175M1179J7163l8169j4289R969l310J7736
227A915J9502l0639j8400K9077O436j6783O95j5810j6240L6606K7715k7776j2962
$$ plain form
240 -16664 -4427 -14347 -13935 4228 -14648 -35003 -10497 4817 -1845 8469 -1413 -35746 -19201
253 -19201 17262 3899 -15021 -8155 -11649 -4297 20062 223 -34762 -15274 10978 6888 12338
266 12338 8635 -21651 -15856 15806 2609 -19385 -8659 -5298 -1744 24172 16701 -20487 -17658
279 -17658 -782 -9309 -1645 9599 -15587 -21045 13133 14830 -8867 -12450 -19065 -19862 14302 21339
293 21339 -18140 -24277 -484 -2745 -4354 2643 -17947 -23402 12732 20237 -4900 -8301 -11951 -23645
307 -23645 -851 17280 -8706 -15654 7349 6018 1888 11753 -8776 -30664 -4428 16647 4667
320 4667 3769 -496 -17861 24 24388 -1693 -24623 -4735 7211 7586 16094 -2860 -29473
333 -29473 -8401 14011 -1106 -4347 2400 -10427 -3013 19994 540 -26340 -14241 -5257 -4986
$$ packed form
240a6664J2237r920M12J8163j8876k0355K4506J5314o662J0314r882l4333J6545
253a9201L6463j3363j8920O866l494P352K4359j9839l4985J9488K6252m090N450
266A2338l703l0286N795L1662j3197k1994J0726L361L554K5916p471l7188K829
279a7658J6876q527P664J1244k5186n458L4178J697k3697l583o615p97L4164P037
293B1339l9479o137K3793k261j609O997k0590n455L6134P505k5137l401l650j1694
307b3645K2794J8131k5986o948K3003j331m130R865k0529k1888K6236K1075j1980
320D667q98m265j7365J7885K4364k6081k2930J9888J1946L75Q508j8954k6613
333b9473K1072K2412j5117l241O747j2827P414K3007j9454k6880J2099Q984K71
$$ plain form
346 -4986 13127 9935 -19569 -12897 9273 -533 -7956 -4834 -19835 -13993 21229 16803 -15514 -15490
360 -15490 -5950 -5814 9406 9136 -19094 -13492 16395 9381 -5959 -3535 -14180 -16504 13527 19290
374 19290 -5428 -5398 2058 -7101 2801 10876 -15046 -20800 7845 13066 4131 7285 -8740 -24417
388 -24417 929 16576 -6224 -12753 -2255 -4871 6129 15793 -13177 -30785 -3249 10046 -739
401 -739 2653 -3529 -18882 -2212 12838 -8194 -16883 -4226 -6523 742 20243 2838 -22646
414 -22646 -9289 4113 -1798 4658 2361 -16034 -2429 23112 8050 -11572 -7235 -8973 -2112
427 -2112 21984 12610 -15176 -5342 12217 4098 2761 751 -16039 -6128 22073 13501 -6021 -1621
441 -1621 -5484 -10558 8834 10953 -13003 -9808 7763 3632 4214 4961 -18072 -22262 7784 12941
$$ packed form
346d986J8113l192k9504O672K2170r806p423L122j5001N842L5222m426l2317K4
360a5490R540J36J5220k70k8230N602K9887p014j5340K424j0645k324L0031N763
374A9290k4718L0P456r159R902Q075k5922n754K8645N221q935L154j6025j5677
388b4417K5346J5647k2800o529J0498k616J1000R664k8970j7608K7536J3295j0785
401g39L392o182j5353J6670J5050k1032q689J2657k297P265J9501j7405k5484
414b2646J3357J3402n911O456k297j8395J3605K5541j5062j9622M337j738O861
427b112K4096r374k7786R834J7559q119j337k010j6790R911K8201q572j9522M400
441a621l863n074J9392K119k3956L195J7571m131N82P47k3033m190L0046N157
$$ plain form
455 12941 -4127 -3726 -6271 -12471 6433 11331 -16486 -20798 2171 6230 5800 9294 -10520 -21042
469 -21042 3728 11025 -6496 -3975 689 -6063 7810 19883 -3473 -16333 -1389 2199 4134
482 4134 16740 3488 -15255 2859 17938 2491 -3375 -1889 -9549 5318 25433 5735 -15579
495 -15579 -4621 1473 -339 9226 1084 -17168 -1156 17720 3105 -7549 -6280 -16246 -10191
508 -10191 12319 4051 -13831 -6023 -952 -6075 3703 415 -23217 -16486 7986 4861 -3867 -3952
522 -3952 -15701 -15057 8881 7257 -14818 -10214 1197 -885 6675 5739 -18016 -17973 6560 8147 236
537 236 4666 -3129 -9161 10094 11788 -10339 -10918 -276 -1574 8255 16731 -3974 -15318 2940
551 2940 6855 -837 1982 -5797 -14790 5599 17291 -4844 -15139 -6440 -6242 1496 13246 -4673
$$ packed form
455A2941j7068M01k545o200J8904M898k7817m312K2969M059m30L494j9814j0522
469b1042K4770P297j7521K521M664o752J3873J2073k3356j2860J4944L588J935
482D134J2606j3252j8743J8114J5079j5447n866J486p660J4867K0115j9698k1314
495a5579J0958O094j812R565q142j8252J6012J8876j4615j0654J269r966O055
508a0191K2510q268j7882P808N071n123R778l288k3632O731K4472l125q728q5
522c952j1749O44K3938j624k2075M604J1411k082P560r36k3755M3K4533J587p911
537B36M430p795o032J9255J694k2127n79J0642j298R829Q476k0705j1344J8258
551B940L915p692K819p779q993K0389J1692k2135j0295Q699J98P738J1750j7919
$$ plain form
565 -4673 -19326 -2016 5500 -5624 -5094 -8465 -18431 -1736 15881 877 -10384 -4150 -8392 -6549
579 -6549 8141 -1178 -17879 -4154 9725 4574 5425 1712 -14971 -6040 16596 8525 -5776 -127
593 -127 -320 1221 15741 8895 -11803 -2698 14248 10790 10043 9344 -7363 -6473 13553 10100 -3383
608 -3383 1923 3939 1969 16313 15514 -8149 -10585 3485 2134 3768 8525 -6484 -10878 10234
622 10234 13037 -4112 -5950 -5264 -7536 7217 13214 -9181 -15492 -53 1134 -584 5149 -5847
636 -5847 -13575 5699 12753 -3395 -7389 -6053 -12062 -142 14547 -207 -10222 2496 4881
649 4881 1845 6883 -3640 -17975 -2362 13560 3653 -1279 282 -7813 -28 15258 2151 -13465
663 -13465 -3208 3741 1075 5978 -1250 -17276 -7097 10568 2926 -3180 -389 -8397 -7219 7700
$$ packed form
565d673j4653J7310P516j1124N30l371r966J6695J7617j5004j1261O234m242J843
579f549J4690r319j6701J3725J3879n151Q51l713j6683Q931K2636q071j4301N649
593a27j93J541J4520o846k0698R105J6946l458p47o99j6707Q90K0026l453j3483
608c383N306K016j970J4344p99k3663k436J4070j351J634M757j5009m394K1112
622A0234K803j7149j838O86k272J4753N997k2395o311J5439J187j718N733j0996
636e847p728J9274P054j6148l994J336o009J1920J4689j4754j0015J2718K385
649D881l036N038j0523j4335J5613J5922r907m932J561q095P785J5286j3107j5616
663a3465J0257O949k666M903p228j6026J0179J7665p642o106K791q008J178J4919
$$ plain form
677 7700 -96 -17705 -11701 -2750 -3062 5820 4657 -14310 -12973 3692 -546 -8787 -7089 -12921 -11611
692 -11611 7893 7351 -11976 -11445 -2377 -3518 2577 5065 -12324 -14056 3691 4130 -4953 -2424 -6006
707 -6006 -9476 7982 13991 -3411 -7728 -965 -4191 527 8048 -6041 -12538 5226 11924 3861
721 3861 3704 -2902 -11937 1993 12532 -2192 -8904 -879 -198 3499 11278 -1735 -13908 134
735 134 8885 718 516 -2318 -12584 -3766 10351 248 -8192 -770 -969 439 11031 1525 -16271
750 -16271 -8318 3150 -486 1119 1424 -9167 -3426 13272 5896 -8295 -5125 -4561 -3482 8707
764 8707 6123 -10894 -6063 7051 4381 2971 3996 -7336 -6829 10001 7893 -6008 -4525 -2725
778 -2725 -4073 8614 11554 -4939 -6472 5607 4330 1204 2282 -9114 -12484 5497 10777 -1592
$$ packed form
677G700p796j7609O004Q951l12Q882j163j8967J337J6665m238q241J698n832J310
692a1611J9504n42j9327N31R068j141O095K488j7389j732J7747M39r083K529l582
707f006l470J7458O009j7402m317O763l226M718P521j4089o497J7764O698q063
721C861j57o606r035J3930J0539j4724o712Q025O81L697P779j3013j2173J4042
735A34Q751q167k02k834j0266Q818J4117j0103q440P422j99J408J0592r506j7796
750a6271P953J1468l636J605L05j0591N741J6698p376j4191L170N64J079J2189
764H707k584j7017M831J3114k670j410J025j1332N07J6830k108j3901J483J800
778b725j348J2687K940j6493j533J2079j277l126J078j1396l370J7981N280j2369
$$ plain form
792 -1592 -2346 -721 -4410 4282 9328 -7072 -13484 -554 2239 88 3989 -4482 -12739 1737 9949
807 9949 -1441 -4916 -2995 -8362 -1427 8048 -4261 -13838 -2468 2917 1803 6943 30 -12448
821 -12448 -3118 7801 -1439 -6622 -3591 -6765 -574 12734 4425 -9704 -2913 2648 -406 4088
835 4088 607 -11905 -5501 9102 3612 -3010 -124 -5020 -3592 10337 6233 -9278 -6985 -286
849 -286 -2450 2638 3582 -9814 -7362 8261 6831 -1887 -1946 -7571 -9248 4362 5952 -8912 -7637
864 -7637 914 109 3644 5859 -7775 -11665 2548 4366 -3390 -1709 -4958 -8956 3870 10366 -3302
879 -3302 -7036 364 -466 1645 6904 -4901 -13556 -329 6128 172 1367 -459 -6971 2752 11154
894 11154 -1551 -9295 -3172 -3101 -267 7822 201 -10626 -203 7783 1277 84 -1258 -9834 -3204
$$ packed form
792a592p54J625l689Q692N046j6400o412J2930K793k151L901q471q257J4476Q212
807I949j1390l475J921n367O935R475j2309r577J1370N385j114N140o913j2478
821a2448R330J0919r240n183L031l174O191J3308q309j4129O791N561l054M494
835D088l481j2512O404J4603n490o622K886m896J428J3929m104j5511K293O699
849b86k164N088R44j3396K452J5623j430q718n9n625j677J3610J590j4864J275
864g637Q551q05L535K215j3634l890J4213J818p756J681l249l998J2826O496j3668
879c302l734P400q30K111N259j1805q655J3227O457n956J195j826o512R723Q402
894A1154j2705p744O123P1K834Q089p621j0827J0423P986o506j193j342q576O630
$$ plain form
909 -3204 9028 1271 -8074 -2970 -1695 -864 8590 3246 -10483 -4857 5365 955 -1079 -999 -9345
924 -9345 -5334 9862 6306 -4396 -1772 -688 -1851 5949 4480 -10006 -7807 4699 3388 1731
938 1731 3681 -4991 -6174 8057 7919 -4570 -4339 -2012 -3766 4763 7391 -5777 -8052 3854 4121
953 4121 1960 4061 -4531 -9885 2605 6770 -3907 -4796 -1913 -3756 3407 9369 -3149 -9638 23
968 23 1950 -1035 2512 -3396 -10632 792 9386 228 -3232 -558 -4121 285 8734 -151 -9996
983 -9996 -1798 2950 1230 5227 1796 -7901 -274 10458 2784 -3069 -1029 -4624 -2217 8863 3591
998 3591 -7689 -1686 4272 1545 4786 2944 -8970 -5573 6718 2730 -3641 -1191 -4228 -3924 7412
1013 7412 5510 -7619 -6041 577 -1528 1180 2243 -8696 -8596 4476 4340 -2345 -846 -3951 -5847
$$ packed form
909c204J2232p757r345N104J275Q31R454n344j3729N626J0222m410k034Q0q346
924i345M011J5196l556j0702K624J084j163P800j469j4486K199J2506j311j657
938A731J950q672j183J4231j38j2489K31K327j754Q529K628j3168k275J1906K67
953D121k161K101q592n354J2490M165j0677q89K883j843P163N962j2518o489R661
968B3J927k985L547n908p236J1424Q594r158l460K674l563M406Q449q885r845
983i996Q198M748j720L997l431r697P627J0732p674n853K040l595K407J1080n272
998C591j1280O003N958k727L241j842j1914L397J2291l988o371K450l037L04J1336
1013G412j902j3129J578O618k105K708J063j0939J00J3072j36o685J499l105j896
$$ plain form
1028 -5847 4497 6217 -6590 -7341 86 -522 2271 6057 -3363 -7611 4264 6967 -340 42 -1763
1043 -1763 -6242 3975 9966 -1087 -4755 1896 2101 3120 8267 -216 -8310 1596 6849 893 650
1058 650 209 -5389 1738 10572 1388 -5890 -935 -629 -339 5539 -368 -10294 -2149 5837 663 -43
1074 -43 -115 -7280 -3241 7590 1809 -7744 -3234 -1709 -1973 5462 3076 -8090 -4063 5490 2522 234
1090 234 775 -5851 -5012 7859 6075 -3651 -1062 1555 189 6677 7092 -4584 -4430 5693 4481
1105 4481 2216 4241 -2335 -4141 7449 8716 -1248 -934 717 -1197 4501 7564 -3931 -7212 2467
1120 2467 3549 1033 3405 -2664 -7566 2356 6399 -2960 -5146 -1898 -4298 260 6292 -2981 -9276
1135 -9276 -802 1807 -1248 1261 -2496 -9198 -1375 6558 -727 -4542 -1425 -3782 -603 7666 1260
$$ packed form
1028e847J0344J720j2807p51P427o08K793L786r420m248J1875K703p307L82j805
1043a763m479J0217N991j1053l668O651K05J019N147q483q094R906N253n956k43
1058F50m41n598P127Q834r184p278M955L06K90N878n907r926Q145P986n174p06
1074d3p2p165M039J0831n781r553M510J525k64P435k386j1166M027R553k968k288
1090B34N41o626Q39J2871j784r726K589K617j366O488M15j1676J54J0123j212
1105D481k265K025o576j806J1590J267r964L14J651j914N698L063j1495l281R679
1120B467J082k516K372o069m902R922M043r359k186L248k400M558O032r273o295
1135i276Q474K609l055K509l757o702P823P933p285l815L117k357L179Q269o406
$$ plain form
1150 1260 -7837 -1443 3092 429 3414 1309 -6709 -1344 8911 3854 -2114 704 -1473 -1027 8035
1165 8035 4610 -5570 -1556 4346 2035 3898 3696 -5894 -3858 6892 4153 -2002 -96 -2223 -3879
1180 -3879 5117 4693 -6215 -5156 955 -171 1318 2834 -6029 -8169 2685 3277 -2858 -1962 -2839
1195 -2839 -5459 2928 5661 -4816 -6530 83 -228 1274 4854 -2856 -7215 2428 5645 -587 -120
1210 -120 -477 -4038 3382 9405 407 -4340 1693 1931 1787 6826 1033 -5830 2570 8324 2346 1321
1226 1321 1305 -3709 1171 9055 2644 -4341 313 1347 450 5490 1408 -7058 -1465 6016 1398 -40
1242 -40 225 -5778 -3612 6095 2210 -5689 -2059 173 -897 3893 2568 -7807 -5576 3649 1449
1257 1449 -683 1078 -3915 -3984 5921 4753 -4070 -2497 776 -762 4332 5702 -4275 -4757 4249 3580
$$ packed form
1150A260r097O394M535k663K985k105q018N365J0255n057n968K818k177M46R062
1165H035l425j0180M014N902k311J863k02r590K036J0750k739o155J906k127j656
1180c879Q996m24j0908J059O111j126J489J516q863k140J0854N92o135Q96q77
1195b839k620Q387K733j0477j714O613l11J502L580p710m359R643L217o232M67
1210a20l57l561P420O023q998m747O033K38j44N039n793o863Q400N754n978j025
1226A321j6n014M880P884o411o985M654J034q97N040m082q466N593P481m618j438
1242d0K65o003K166R707l885p899L630K232j070M790j325j0375K231R225k200
1257A449k132J761m993o9R905j168q823J573L273j538N094J370r977m82R006o69
$$ plain form
1273 3580 947 3326 -973 -3623 5420 7557 -1250 -2454 324 -1019 3548 7885 -1271 -5097 3096
1288 3096 4282 760 1881 -2130 -6532 2129 6945 -825 -3153 -431 -2928 200 6006 -1794 -7329
1303 -7329 -439 2256 -1090 506 -1765 -8117 -1725 5839 336 -3334 -769 -3216 -1886 4520 -467
1318 -467 -8255 -2611 3043 1108 2665 1659 -5858 -2668 5996 2199 -3304 -92 -1508 -1129 6463
1333 6463 3667 -5018 -2132 3602 1215 2863 3547 -4297 -3608 5113 3193 -2364 -520 -1369 -2173 5630
1349 5630 5856 -3988 -4523 436 -863 134 2253 -4541 -5821 3973 4931 -1739 -1697 -2613 -5119 1481 4846
1366 4846 -3958 -5449 913 388 281 3402 -2383 -6630 1735 4967 -414 -715 -934 -4787 196 6516
1382 6516 -397 -3809 1753 2454 1912 5397 92 -6928 -277 5385 1131 775 2003 -2207 1016 7678
$$ packed form
1273C580k633K379m299k650R043K137q807j204K778j343M567M337r156l826Q193
1288C096J186l522J121m011m402Q661M816p770k328K722k497L128N806p800n535
1303g329O890K695l346J596k271o352O392P564n503l670K565k447J330O406m987
1318d67p788N644N654j935J557j006p517L190Q664l797n503L212j416L79P592
1333F463k796q685K886N734k387J648O84p844O89Q721j920n557J844q49q04P803
1349E630K26r844n35M959j299R97K119o794j280R794R58o670M2r16k506O600L365
1366D846q804j491O362n25j07L121n785m247Q365L232n381l01k19l853M983O320
1382F516o913l412N562P01n42L485n305p020O651N662m254l56J228m210L223O662
$$ plain form
1398 7678 1426 -4992 -713 892 -253 4430 2111 -5490 -1705 4645 1183 -194 1181 -3458 -2491
1413 -2491 5667 2216 -5695 -2954 -953 -1589 3536 4115 -4511 -3449 4276 1436 -1783 -852 -4259 -4100
1429 -4100 4945 5287 -2618 -1388 1130 -659 2119 4099 -3500 -4551 3295 3095 562 2022 -1380
1444 -1380 -4145 3613 6580 -780 -1538 691 -1522 1003 4661 -2679 -6217 1633 4387 1403 2341
1459 2341 -830 -6058 -76 4067 -2330 -4825 -425 -1858 393 4796 -672 -6224 -787 1677 -1568
1474 -1568 326 -296 -5984 -1919 4901 -43 -3392 -557 -1326 -453 6072 2157 -5845 -2361 1885 -136
1490 -136 1213 1743 -3537 -317 7426 3636 -2048 -391 -1626 -2171 4089 3245 -3611 -1172 3684 1511
1506 1511 2012 2522 -3691 -4209 3391 3061 -2150 -585 -1963 -3797 2530 4439 -3521 -3796 1927 747
$$ packed form
1398G678o252o418M279J605j145M683k319p601L785O350l462j377J375m639R67
1413b491Q158l451p911K741K001o36N125N79q626J062P725k840l219R31l407J59
1429d100R045L42p905J230K518j789K778J980p599j051P846k00k533J460l402
1444a380k765P758K967p360p58K229k213K525L658p340l538P850K754k984R38
1459B341l171n228N982M143o397k495M400j433K251M403n468n552N437K464l245
1474a568J894o22n688M065O820m944l349K835p69Q73O525l915q002L484M246k021
1490a36J349N30n280L220P743l790n684J657j235n45O260q44o856K439M856k173
1506A511N01N10o213n18P600l30n211J565j378j834O327J909p960k75N723j180
$$ plain form
1522 747 246 1743 -4585 -7002 1322 3562 -1801 -537 519 -2394 1901 4433 -3310 -5605 198
1537 198 261 237 4089 266 -4090 1816 4693 153 -201 786 -2549 1064 6860 736 -3967 647 1906
1554 1906 1497 5168 1983 -4055 746 5170 37 -2030 -539 -3492 -122 6464 2363 -3223 -114
1569 -114 1035 -2083 1497 127 -6328 -2876 3146 801 -872 75 -4163 -4124 3356 2116 -4952 -2695
1585 -2695 -406 -1868 1237 1690 -5474 -4261 3630 2993 -115 960 -2416 -3727 2792 2941 -3430 -1732
1601 -1732 2228 1013 3643 5176 -1639 -3892 1916 1894 -441 1544 -112 -3063 3051 5793 -675
1616 -675 -2253 210 -876 1169 4674 -1464 -5468 -8 2207 -1099 36 -861 -4163 881 4782
1631 4782 -1757 -4706 -2020 -3306 -2460 2219 -843 -4985 21 2410 -1103 -116 -1141 -6213 -2698
$$ packed form
1522G47n01J497o328k417Q324K240n363J264J056k913M295K532p743k295N803
1537A98O3k4L852l823m356N906K877m540l54R87l335L613N796o124m703M614J259
1554A906m09L671l185o038M801M424n133k067J491k953L370O586m101n586L109
1569a14J149l118L580j370o455L452O022k345j673R47m238L9P480j240p068K257
1585b695K289j462L105M53p164J213P891o37l108J075l376j311O519J49o371J698
1601a732L960j215K630J533o815k253N808k2k335J985j656k951O114K742o468
1616f75j578K463j086K045L505o138m004N460K215l306J135q97l302N044L901
1631D782o539k949K686j286Q46M679l062m142N006K389l513R87j025n072L515
$$ plain form
1646 -2698 3874 751 -2653 187 -1148 -772 4539 2184 -4626 -1296 3769 1369 1534 1062 -3771 -1901
1662 -1901 5091 3391 -1072 1649 1525 58 4125 2819 -4117 -2744 2246 937 1954 3589 -1163
1677 -1163 -2992 3315 2533 -2572 -1741 -1626 -2960 2381 4161 -3296 -4352 698 203 -411 1474 -2729
1693 -2729 -4814 1768 2733 -3073 -2955 -1246 -2507 1480 4896 -922 -3265 651 260 -1206 1603 -1196
1709 -1196 -4155 1409 5178 1540 733 772 -2575 417 5231 660 -3501 1011 2487 1670 3470 838
1725 838 -4229 277 5414 1165 -259 838 -2114 -699 3678 520 -3915 -213 1820 185 2510
1740 2510 1497 -4862 -3235 1488 -334 -1673 9 -2603 -2557 3482 2083 -4808 -3350 -1203 -1824 1162
1756 1162 1516 -4412 -4067 2043 1320 -1997 -652 -1811 -2942 2627 2967 -3253 -2820 74 -1503 528
$$ packed form
1646b698O572l123l404K840j335L76N311k355o810L330N065k400J65m72m833J870
1662a901O992j700m463K721j24j467M067j306o936J373M990j309J017J635m752
1677a163j829O307p82n105Q31J15j334N341J780p457j056N050m95o14J885m203
1693b729k085O582R65n806J18J709j261L987L416n818k343L916l91j466K809k799
1709a196k959N564L769l638q07L9l347K992M814m571m161M512J476q17J800k632
1725H38n067M506N137m249j424J097k952J415M377l158m435L702K033j635K325
1740B510j013o359J627M723j822j339J682k612M6O039j399o891J458K147o21K986
1756A162L54n928L45O110p23l317J345j159j131N569L40o220M33K894j577K031
$$ plain form
1772 528 3168 -1234 -2430 2368 2612 -463 422 -1656 -4505 933 4503 -162 -1756 475 -550 802
1788 802 2954 -2196 -5451 479 2925 -485 -83 -881 -4434 -595 3386 -1593 -3441 -37 -782 -1138
1804 -1138 1778 -1463 -5443 -1896 1136 -534 689 659 -4068 -2081 2824 -468 -3908 -1754 -1223 -364
1820 -364 3963 1927 -4363 -1845 2191 28 464 584 -2467 -1186 4284 2003 -2247 -617 -126 -645
1836 -645 3408 3361 -2072 -1362 2395 433 -166 1740 -1869 -2087 3475 3917 -447 -406 -725 -2677 1532
1853 1532 3003 -2399 -3586 1854 1732 150 1190 -2454 -4491 1297 2959 -1440 -1337 87 -1991
1868 -1991 -262 2480 -1947 -3875 301 873 -244 2277 -384 -4627 -1065 2510 -442 -945 -57 -1597
1884 -1597 711 4542 -80 -4480 -951 495 124 2144 743 -3294 51 3324 -234 -2313 -396
$$ packed form
1772E28K640m402j196M798K44l075Q85k078k849N438L570m665j594K231j025J352
1788H02K152n150l255N930K446l410M02p98l553L839L981m979j848L404p45l56
1804a138K916l241l980L547L032j670J223l0m727J987M905l292l440K154N31Q59
1820c64M327k036o290K518M036k163M36J20l051J281N470k281m250J630M91n19
1836f45M053m7n433P10L757j962n99J906l609k18N562M42m364M1l19j952M209
1853A532J471n402j187N440j22j582J040l644k037N788J662m399J03J424k078
1868a991J729K742m427j928M176N72j117K521k661m243L562L575k952n03Q88j540
1884a597K308L831m622m400L529J446l71K020j401m037L345L273l558k079J917
$$ plain form
1899 -396 -1893 -781 3275 1414 -3247 -1045 50 -1310 665 879 -3473 -2356 2403 884 -1617
1914 -1617 -884 -3137 -3366 2205 1954 -3288 -2267 -125 -963 385 388 -4483 -3914 1795 1472 -1703 -349
1931 -349 -1606 -3058 771 1368 -2737 -2285 1195 -449 425 2364 -2201 -4430 541 1691 -145 707
1947 707 -641 -3190 1057 3277 -1644 -3275 -404 -118 1004 3295 -770 -4234 175 1935 -1037
1962 -1037 -246 -232 -2107 640 3527 -789 -2843 -746 -1276 -1289 2161 711 -3063 -608 1569 -407
1978 -407 -479 -569 -3557 -1412 3693 1548 -1996 -806 -462 -864 2322 710 -3481 -865 2978 1178 311
1995 311 419 -2425 -1902 3134 1615 -1391 573 614 -918 1328 1712 -3095 -2410 1475 990 535 2059
2012 2059 -1787 -3186 1265 1962 -1556 -1175 -430 -1235 2033 2754 -2783 -3674 694 526 -322 875 -1262
$$ packed form
1899c96j497J112M056j861m661K202J095j360J975K14m352J117M759j519k501
1914a617P33k253k29N571k51n242J021K142q38J348Lm871N69N709l23l175J354
1931c49j257j452L829N97m105M52L480j644Q74J939m565k229M971J150j836Q52
1947G07j348k549M247K220m921j631K871K86J122K291m065l464M409J760k972
1962a037P91J4j875K747K887m316k054K097n30j3L450j450l774K455K177j976
1978d07p2r0k988K145N105k145l544J190L44m02L186j612m191K616L843j800q67
1995C11J08k844N23N036j519l006J964M1j532K246L84m807O85L885m85m55J524
2012B059l846j399M451O97l518L81P45q05L268P21n537q91M368j68q48J197k137
$$ plain form
2029 -1262 -2638 1115 2092 -1636 -2063 -353 -1567 798 3195 -732 -2685 -70 -157 -1045 1065 -122
2045 -122 -3100 669 3452 326 -929 -938 -2106 -948 3676 444 -2959 129 1552 218 1151 -463
2061 -463 -3454 -691 3213 593 -1201 96 -1552 -1378 1774 170 -2532 -435 1206 -93 1253
2076 1253 614 -3498 -3029 1087 692 -928 237 -1363 -1666 2440 1426 -3364 -2679 23 47 1113 1582
$$ packed form
2029a262j376L753R77l728m27J710j214K365K397l927j953K615q7q88K110j187
2045a22k978L769K783l126j255rj168J158M624l232l403L088J423j334R33j614
2061d63k991K763L904k620j794J297j648J74L152j604k702K097J641j299J346
2076A253o39m112M69M116l95j620J165j600l03M106j014m790O85K702K4J066M69
$$ [...]
8191A91
##END NTUPLES=NMR FID
##END=
