##TITLE=1H_CG-1117-5
 CDCl3, 8 sc, 
 19.8.2019
##JCAMPDX= 6.0         $$ Bruker NMR JCAMP-DX V2.0
##DATA TYPE= NMR FID
##DATA CLASS= NTUPLES
##ORIGIN= UXNMR, Bruker Analytische Messtechnik GmbH
##OWNER= root
$$ XWIN-NMR		Version 3.5
$$ Mon Aug 19 14:20:22 2019 Russian Standard Time (UT+4h)  she@DPX200
##.OBSERVE FREQUENCY= 200.13155
##.OBSERVE NUCLEUS= ^1H
##.DELAY= (6, 6)
##.ACQUISITION MODE= SIMULTANEOUS
##.ACQUISITION SCHEME= undefined
##.AVERAGES= 8
##.DIGITISER RES= 18
##SPECTROMETER/DATA SYSTEM= spect
##.PULSE SEQUENCE= zg30
##.SOLVENT NAME= D2O
##.SHIFT REFERENCE= (INTERNAL, D2O, 0, 15.7039)
##AUDIT TRAIL= $$ (NUMBER, WHEN, WHO, WHERE, WHAT)
$$ ##TITLE= Audit trail, XWIN-NMR		Version 3.5
$$ ##JCAMPDX= 5.01
$$ ##ORIGIN= Bruker BioSpin GmbH
$$ ##OWNER= she
$$ F:/spectra/data/she/nmr/H-F/1/audita.txt
$$ ##AUDIT TRAIL=  $$ (NUMBER, WHEN, WHO, WHERE, WHAT)
(   1,<2019-08-19 14:18:37.45 +0400>,<she>,<DPX200>,
      <created by zg, POWCHK disabled, PULCHK disabled
       configuration hash MD5:
       00 E9 B6 7A A2 85 ED C7 34 08 36 98 17 FE 4E 26
       data hash MD5: 16K
       1F 32 4E 62 A3 DF E3 D0 20 78 87 1E 09 7B 84 67>)
$$ ##END=
$$ 
$$ hash MD5
$$ 91 1F E2 06 3D 69 36 C4 C6 40 F7 97 C3 32 CB A3
##$RELAX= 
##$RELAX= 
##$RELAX= 
##$RELAX= 
##$RELAX= 
##$RELAX= 
$$ Bruker specific parameters
$$ --------------------------
##$DU= <F:/spectra>
##$EXPNO= 1
##$NAME= <H-F>
##$PROCNO= 1
##$TYPE= <nmr>
##$USER= <she>
##$AMP= (0..31)
100 100 100 100 100 100 100 100 100 100 100 100 100 100 100 100 100 100 
100 100 100 100 100 100 100 100 100 100 100 100 100 100 
##$AQSEQ= 0
##$AQ_mod= 1
##$AUNM= <au_zg>
##$AUTOPOS= <>
##$BF1= 200.13
##$BF2= 200.13
##$BF3= 200.13
##$BF4= 200.13
##$BF5= 200.13
##$BF6= 200.13
##$BF7= 200.13
##$BF8= 200.13
##$BYTORDA= 1
##$CFDGTYP= 0
##$CFRGTYP= 5
##$CHEMSTR= <none>
##$CNST= (0..31)
1 1 145 1 1 1 1 1 1 1 1 1 1 1 1 1 1 1 1 1 1 1 1 1 1 1 1 1 1 1 1 1 
##$CPDPRG= <>
##$CPDPRG1= <>
##$CPDPRG2= <>
##$CPDPRG3= <>
##$CPDPRG4= <mlev>
##$CPDPRG5= <mlev>
##$CPDPRG6= <mlev>
##$CPDPRG7= <mlev>
##$CPDPRG8= <mlev>
##$CPDPRGB= <>
##$CPDPRGT= <>
##$D= (0..31)
0 1.2 0 0 0 0 0 0 0 0 0 0.03 0 0 0 0 0 0 0 0 0 0 0 0 0 0 0 0 0 0 0 0 
##$DATE= 1566209916
##$DBL= (0..7)
120 120 120 120 120 120 120 120 
##$DBP= (0..7)
150 150 150 150 150 150 150 150 
##$DBP07= 0
##$DBPNAM0= <>
##$DBPNAM1= <>
##$DBPNAM2= <>
##$DBPNAM3= <>
##$DBPNAM4= <>
##$DBPNAM5= <>
##$DBPNAM6= <>
##$DBPNAM7= <>
##$DBPOAL= (0..7)
0.5 0.5 0.5 0.5 0.5 0.5 0.5 0.5 
##$DBPOFFS= (0..7)
0 0 0 0 0 0 0 0 
##$DE= 6
##$DECBNUC= <off>
##$DECIM= 24
##$DECNUC= <off>
##$DECSTAT= 4
##$DIGMOD= 1
##$DIGTYP= 9
##$DL= (0..7)
0 120 120 120 120 120 120 120 
##$DP= (0..7)
150 150 150 150 150 150 150 150 
##$DP07= 0
##$DPNAME0= <>
##$DPNAME1= <>
##$DPNAME2= <>
##$DPNAME3= <>
##$DPNAME4= <>
##$DPNAME5= <>
##$DPNAME6= <>
##$DPNAME7= <>
##$DPOAL= (0..7)
0.5 0.5 0.5 0.5 0.5 0.5 0.5 0.5 
##$DPOFFS= (0..7)
0 0 0 0 0 0 0 0 
##$DQDMODE= 0
##$DR= 18
##$DS= 0
##$DSLIST= <SSSSSSSSSSSSSSS>
##$DSPFIRM= 0
$$ [...]
##$SUBNAM2= <"">
##$SUBNAM3= <"">
##$SUBNAM4= <"">
##$SUBNAM5= <"">
##$SUBNAM6= <"">
##$SUBNAM7= <"">
##$SUBNAM8= <"">
##$SUBNAM9= <"">
##$SW= 24.9336996594482
##$SWIBOX= (0..15)
0 0 2 0 0 0 0 0 0 0 0 0 0 0 0 0 
##$SW_h= 4990.01996007984
##$TD= 16384
##$TD0= 1
##$TE= 0
##$TE2= 300
##$TE3= 300
##$TEG= 300
##$TL= (0..7)
0 120 120 120 120 120 120 120 
##$TP= (0..7)
150 150 150 150 150 150 150 150 
##$TP07= 0
##$TPNAME0= <>
##$TPNAME1= <>
##$TPNAME2= <>
##$TPNAME3= <>
##$TPNAME4= <>
##$TPNAME5= <>
##$TPNAME6= <>
##$TPNAME7= <>
##$TPOAL= (0..7)
0.5 0.5 0.5 0.5 0.5 0.5 0.5 0.5 
##$TPOFFS= (0..7)
0 0 0 0 0 0 0 0 
##$TUNHIN= 0
##$TUNHOUT= 0
##$TUNXOUT= 0
##$USERA1= <user>
##$USERA2= <user>
##$USERA3= <user>
##$USERA4= <user>
##$USERA5= <user>
##$V9= 5
##$VALIST= <valist>
##$VCLIST= <CCCCCCCCCCCCCCC>
##$VD= 0
##$VDLIST= <DDDDDDDDDDDDDDD>
##$VPLIST= <PPPPPPPPPPPPPPP>
##$VTLIST= <TTTTTTTTTTTTTTT>
##$WBST= 1024
##$WBSW= 4
##$XGAIN= (0..3)
0 0 0 0 
##$XL= 0
##$YL= 0
##$YMAX_a= 60726
##$YMIN_a= -107493
##$ZGOPTNS= <>
##$ZL1= 120
##$ZL2= 120
##$ZL3= 120
##$ZL4= 120
##$ABSF1= 10
##$ABSF2= 0
##$ABSG= 5
##$ABSL= 3
##$ALPHA= 0
##$AQORDER= 0
##$ASSFAC= 0
##$ASSFACI= 0
##$ASSFACX= 0
##$ASSWID= 0
##$AUNMP= <proc_1d>
##$AZFE= 0.1
##$AZFW= 0.1
##$BCFW= 1
##$BC_mod= 2
##$BYTORDP= 1
##$COROFFS= 0
##$CY= 11.3945322036743
##$DATMOD= 1
##$DC= 2
##$DFILT= <>
##$DTYPP= 0
##$F1P= 20.1720416913024
##$F2P= 0.152960286110954
##$FCOR= 0.5
##$FTSIZE= 0
##$FT_mod= 4
##$GAMMA= 1
##$GB= 0.15
##$INTBC= 1
##$INTSCL= 1
##$ISEN= 128
##$LB= 0.24
##$LEV0= 0
##$LPBIN= 0
##$MAXI= 10000
##$MC2= 0
##$MEAN= 0
##$ME_mod= 0
##$MI= 1.114404
##$NCOEF= 0
##$NC_proc= 0
##$NLEV= 6
##$NOISF1= 3.799351
##$NOISF2= 2.8
##$NSP= 1
##$NTH_PI= 0
##$NZP= 0
##$OFFSET= 15.70392
##$PC= 1
##$PHC0= -9208.129
##$PHC1= 7.000973
##$PH_mod= 1
##$PKNL= yes
##$PPARMOD= 0
##$PSCAL= 0
##$PSIGN= 0
##$REVERSE= no
##$SF= 200.130013532006
##$SI= 16384
##$SIGF1= 3
##$SIGF2= 2
##$SINO= 400
##$SIOLD= 16384
##$SREGLST= <1H.CDCl3>
##$SSB= 0
##$STSI= 0
##$STSR= 0
##$SW_p= 3612.71676300578
##$SYMM= 0
##$S_DEV= 0
##$TDeff= 0
##$TDoff= 0
##$TI= <>
##$TILT= no
##$TM1= 0
##$TM2= 0
##$TOPLEV= 0
##$USERP1= <user>
##$USERP2= <user>
##$USERP3= <user>
##$USERP4= <user>
##$USERP5= <user>
##$WDW= 1
##$XDIM= 8192
##$YMAX_p= 0
##$YMIN_p= 0
$$ End of Bruker specific parameters
$$ ---------------------------------
##NTUPLES= NMR FID
##VAR_NAME=  TIME,          FID/REAL,        FID/IMAG
##SYMBOL=    X,             R,               I
##VAR_TYPE=  INDEPENDENT,   DEPENDENT,       DEPENDENT
##VAR_FORM=  AFFN,          ASDF,            ASDF
##VAR_DIM=   8192,          8192,            8192
##UNITS=     SECONDS,       ARBITRARY UNITS, ARBITRARY UNITS
##FACTOR=    0.0002004,     1,               1
##FIRST=     0,             0,               0
##LAST=      1.6414764,     0,               0
##MIN=       0,             -107493,         0
##MAX=       1.6414764,     60726,           0
$$ Real data points
##PAGE= N=1
##DATA TABLE= (X++(R..R)), XYDATA
$$ [...]
2268a063J595J356l325q42L396M99j908J122r44j466K767J903k795k90J158j641
2284d78L23K429k441j382K787J058r10M81r85l153K374K329k064j217J074m65
2300b40Q12K316k739k972K210J676j397M75M4k597J709K345j852j592J930j015
2316h87L2K620r06l421Q59J592o80R85Q73k293N04K861q16k310N78m65j03L320
2334B343j49l465Q74K222r10J9N40k527k07L708m24k249J016j43j755K639J074
2351B606k763j70J816p98j99R30k461j641L678Q17j856K52k18j701J865J376l114
2368a581j228K706M17L3J014k097j731K720J466k419o2O55j280J247K119j808
2384A71k119K137M01j68J785j229k380J299K215j877p4L52j205J280K986j676
$$ plain form
2268 -1063 532 1888 -1437 -2279 1117 1616 -292 830 -114 -1580 1187 3090 295 5 1163 -478
2284 -478 -155 2274 -167 -1549 1238 2296 1386 1867 882 -2271 103 2432 368 -849 225 -240
2300 -240 572 2888 149 -2823 -613 1063 -334 141 185 -2412 -703 1642 -210 -1802 128 -887
2316 -887 -855 1765 859 -2562 -1703 -111 -791 194 1067 -1226 -722 2139 1323 -987 -409 -874 -977 2343
2334 2343 2194 -1271 -397 1825 915 934 1474 -1053 -1260 2448 2024 -225 791 648 -1107 1532 2606
2351 2606 -157 -327 1489 691 492 1422 -1039 -2680 998 1815 -41 211 -7 -1708 157 1533 -1581
2368 -1581 -2809 -103 314 347 1361 -736 -2467 253 1719 -700 -762 -107 -1387 -140 1979 171
2384 171 -1948 189 590 422 2207 978 -1402 -103 2112 235 161 513 -692 588 3574 1898
2400A898k735J303Q30q87J207k82k847J326K966j561j178R99j691k0K690o62k640
2417a284Q95O15j069J199Q26k934K40K931m30j269P01k026q72K958M21k011R0
2434a019J654r59J061P40l053p58K941P7j321J226o44j388K473J055k718l39J724
2451G52j143J072J507k451j632K556O38j326J224n70k400K417J553k178j179P84
2467c76k83O51K003j543k262K102Q35j681O70m57j592J627K170k083r95R15n59
2484h58k42K336q80k324J329J015o85M57n9k258O86L130n53j659Q45k61n63J728
2502A184l38k736J359J682m13p4J053k573kK989q25k107J141N56j282J859R40
2519B413l265K39J707k90k10J038j870j275K834K11k233L64L77q93K143R37k721
$$ plain form
2400 1898 -837 466 1296 409 1616 1334 -1513 -187 2779 1218 40 1039 -652 -672 2018 1356 -1284
2417 -1284 -389 226 -843 356 1182 -1752 -1512 1419 989 -280 421 -1605 -2477 481 902 -1109 -1019
2434 -1019 635 -324 737 1477 -1576 -2334 607 684 -637 589 -55 -1443 1030 2085 -633 -972 752
2451 752 -391 681 2188 -263 -1895 661 1299 -27 1197 627 -1773 644 2197 19 -1160 -376
2467 -376 -659 -8 1995 452 -1810 292 1127 -554 116 -341 -1933 -306 1864 -219 -1214 -299 -858
2484 -858 -1100 1236 356 -1968 -639 376 -309 148 89 -2169 -1483 1647 1094 -565 280 19 -544 1184
2502 1184 846 -1890 -531 1151 738 664 1717 -856 -858 2131 1306 -801 340 896 -386 1473 2413
2519 2413 -852 -613 1094 804 594 1632 -238 -1513 1321 1532 -701 -337 40 -853 1290 2227 -494
2536d94r92J994o76k04J371j432j157K372R72j951j90N27j206J008J786j774j043
2553a089J704k64m55J703j339k071J961J916j638j60k9j275P25K629j525j861
2569a068J519M97m17P73n07k744J643K128j369o42J124j256j55K527j101k453
2585a501J367L02m80R84O85k720J1K330n43j011O25n50p08K684k91k865O08J187
2603A14m49J091M46k422l08K603m34j353Q45o57l24J925P47k396P9J095q43M81
2621B40J392j992r71J999P37j278O71p45j445J914J264j791q55J192m09K55J392
2638A570j701j645K133J077j404O90n09j657J303J894j809q05J309o02J34J486
2654A464j191j958J122J191r51P37L94k023N25K586j462j271J027o44j32K146
$$ plain form
2536 -494 -1486 508 -168 -372 999 -433 -1590 782 1754 -197 -387 140 -1066 -58 1728 -46 -1089
2553 -1089 615 351 -104 1599 260 -1811 150 2066 428 268 239 -1036 -311 2318 793 -1068
2569 -1068 451 948 531 1304 797 -1947 -304 1824 455 -187 937 -319 -474 2053 952 -1501
2585 -1501 -134 168 -312 672 1357 -1363 -1352 978 435 -576 49 -501 -1209 1475 1184 -1681 -1073 114
2603 114 -335 756 1202 -1220 -1528 1075 641 -712 133 -524 -848 1077 1824 -572 -493 602 -241 240
2621 240 1632 -360 -1331 668 1405 127 798 53 -1392 522 1786 -5 -860 332 -77 178 1570
2638 1570 -131 -1776 357 1434 30 720 211 -1446 -143 1751 -58 -863 446 -156 -22 1464
2654 1464 273 -1685 -563 628 -323 414 808 -1215 -690 1896 434 -837 190 -454 -586 1560
2670A560m77k360O70J832j320N10M51j497J69K284n96j628K21L22n17J728P4k137
2688g11k2J902j012J99M82j779n86K840L1k238P15L26j253J484R63k039l87J412
2706C27N0o25P22j285r21K154O71j874N50L35r13P68J324k122o92J835j58j40
2724FJ096q23k002J851J143j170k96Q00j433P91J825j581j692J759L98r04J140
2741I08k84j812J574J199j307m93P22j371O79J755j024j869R95O91q93J282J02
2758H54k015K55K387j081r21N01r91K44K060l17k054M00J113l64O54M78k090k03
2776a090K338m54r05O85p54m86J662P70k017J90J005j037Q35Q54j868p24K058
2793A062qq65P29q95r71J811Q42k045l45J130n30L10J262j487j466J782N96j302
$$ plain form
2670 1560 1083 -1277 -607 1225 -95 415 866 -631 -462 1822 1226 -402 -181 141 -376 1352 1426 -711
2688 -711 -733 1169 157 356 838 -941 -1527 1313 1344 -894 -179 147 -1106 378 1341 -698 -1085 327
2706 327 377 -248 474 -811 -1732 422 1093 -781 -231 104 -809 -41 1283 -839 -1531 304 146 6
2724 6 1102 279 -1723 128 1271 101 -195 605 -828 -37 1788 207 -1485 274 672 -232 908
2741 908 624 -1188 386 1585 278 -215 507 -864 -185 1570 546 -1323 -328 363 -530 752 854
2758 854 -1161 -906 1481 400 -521 -20 -1011 -767 1293 976 -1078 -678 435 71 725 1203 -887 -1090
2776 -1090 1248 794 -111 574 -180 -666 996 1766 -251 -61 944 -93 742 1596 -272 -996 1062
2793 1062 1054 189 918 23 -948 863 1705 -340 -685 445 -85 225 1487 0 -1466 316 912 -390
2811c90J95J09j477J473J697j777q94J123m55J75J144p20k060J364J071j044K12
2828b54M61j551P10K075j307j105P56j83n6J655m43k251J163J538j030LM36j542
2846i25M30J830q87j440J099j83m10J482j8k288N89J765j103n9O61j480k31K069
2864I01l3j844L08O13j132J629O21k393r8J531j64n81J062j357o73K240K25j260
2882d05l46N71p39J280O24j665n36J676M6m87N46n89r65J124J301j733M2L74n31
2901d12Q01J407j496j345J667K18j141J305m67j811J471J028j459K42M84q79K18
2918a69J707j336j282R93N50q43Q89K26k023L55K020q05q32N93q16r7J560m9k091
2937a450P69R88n63L73K42j397J59J681p55q34Q96l47m20J734J64j645m4Q64o36
$$ plain form
2811 -390 -195 -86 -1563 -90 1607 -170 -1064 59 -396 -221 923 203 -1857 -493 578 -466 -254
2828 -254 207 -1344 -634 1441 134 -971 -215 -398 -454 1201 758 -1493 -330 1208 178 181 617 -925
2846 -925 -495 1335 448 -992 107 -76 -486 996 978 -1310 -721 1044 -59 -118 543 -937 -1168 901
2864 901 868 -976 -668 -55 -1187 442 1063 -1330 -1428 103 -61 -642 420 -937 -1610 630 855 -405
2882 -405 -751 -180 -919 361 985 -680 -1216 460 506 19 565 -24 -989 135 1436 -297 -255 119 -412
2901 -412 389 1796 300 -1045 622 840 -301 1004 537 -1274 197 1225 -234 8 492 -387 -169
2918 -169 1538 202 -1080 -87 463 -380 509 735 -1288 -933 1087 282 -550 43 -773 -870 690 641 -1450
2937 -1450 -681 307 -256 117 359 -1038 -879 802 47 -787 109 -238 -658 1076 1240 -405 -449 415 -221
2956b21N22N01j567j44K097k80q68L71l14o29J337O32j616o53J177n33J28Q16
2974G56j025j055J760L95j343N84j56j070R75J519k151p1R77n61J32J179j113
2991b68j335J684N93j081j22N40j370Q61J477r86q69Q41J3m49J184n10j967J426
3009c38J113p74J38J09j202P03J559q63j159Q46k1p50J307j33j547P38J018o04
3027A40l65O35j190m90K067l13j435O68K63n02J160J51k109K40J251n51m06R92
3045B06j145o44K167j02j289p5P27r47J191N38j793k63J606j98l94R88j074n66
3063a067J446O04j352l39Q79q28Q84J150j512q71J456K36o42N87m35j126J173
3080B43Q83j490o2P36j090P33J330q14j550J300J64o03P79o29j566Q12J881j193
$$ plain form
2956 -221 301 802 -765 -909 1188 908 40 411 97 -532 805 1437 -179 -832 345 -188 -60 756
2974 756 -269 -1324 436 831 -512 72 -84 -1154 -179 1340 -811 -882 95 -466 -334 845 -268
2991 -268 -1603 81 674 -407 -529 11 -1359 -498 979 -7 -876 -35 -22 -471 713 203 -1764 -338
3009 -338 775 1 139 248 -954 -251 1308 445 -714 132 111 -639 668 535 -1012 -274 744 140
3027 140 -225 410 -780 -1270 797 484 -951 -283 -20 -522 638 789 -1320 -1080 171 -380 -786 206
3045 206 -939 -1583 584 482 -807 -882 -155 -1102 89 627 -1166 -1429 177 -21 -415 573 -501 -1067
3063 -1067 379 983 -369 -708 171 -657 227 1377 -135 -1006 450 686 44 631 196 -930 243
3080 243 1126 -364 -426 310 -780 -47 1283 469 -1081 219 383 -220 559 -70 -1636 -824 1057 -136
3098a36m29N58o92pJ401q65j282R54R44q10P11J95j601N16J239o99r24Q96k76
3117c07k55J393j97j614N99Q93o49J62P68j362j63J477o78l55O73n11n60J539
3135H53K59j531k60R86l06r0M67r90m57J403K78q16M15n8j105R96Q60j392m56
3154i44R92k20k94Q29n85j360J715L06r98j17P51j311J025R08j155o34R09K30
3172D7j08J063j237j071J034Q23q63P2K56m56K99J229j002r70Q39L48n38Q34l20
3191B79j338P64R97o54j97N21q99O5J255n26j258P00L49n94J178J66j714K39J458
3210G91p36m74M79n55p36J851J16j365L87M03o20P97K60j602K28J088k4l54L19
3229B53o41m76J359P40j551J77O49o90K55R61j255p75J608K7p38P17n90j107J310
$$ plain form
3098 -136 -565 -7 -699 -706 695 -170 -1452 -498 446 -364 347 542 -1059 -543 696 -3 -927 -31 -307
3117 -307 -562 831 634 -980 -381 512 -137 25 793 -569 -732 745 67 -288 385 -126 -686 853
3135 853 1112 -419 -679 307 1 -89 378 -612 -1069 334 612 -204 211 153 -952 44 904 -488 -944
3154 -944 48 -172 -466 363 -222 -1582 133 439 -559 -676 75 -1236 -211 697 -458 -1092 -183 47
3172 47 -61 1002 -235 -1306 -272 551 -312 -240 16 -440 -141 1088 86 -884 -45 303 -235 599 279
3191 279 -1059 -295 702 48 -149 372 -527 -462 793 267 -991 -291 58 -536 642 808 -906 -667 791
3210 791 55 -419 60 -495 -1231 620 736 -629 -242 161 -459 338 598 -1004 -776 312 288 -66 253
3229 253 -388 -864 495 1235 -316 -139 510 -180 75 1036 -219 -994 614 641 -97 620 30 -1077 233
3248B33P67j498M23j0m36K57J254j206q91P40K34j29K75J23j348Q26J272q87p30
3267g31P18n67K14J287p79j529J269M80p42M00J74j079K36J755r88o58O99m81
3285c22l97J049M26j565N56R21m93p5J78j026K91J453m89q39L15j42o05J117M66
3304H19j655K78R80n05R6P13j067m18J206K0j075O29j68q17J379K57j228j47O89
3323a4J02m75Q56r42p43J195Q37j314M83J90p25N06J337j350m19O11J27k42O51
3342F71m14j054J077N30p78j25M56r78P18J011p43r30J043j40m45R22p40p79M75
3361b23J212o36l90K08r39J68J659p57j088N06N63n10L49J28j231M54J098o86
3379a15M1J40n80k25J185q4j023N33N17p75Q60R9r44k40J035l66k5M97p26k02
$$ plain form
3248 233 1000 -498 -75 -85 -521 -264 990 -216 -1107 -367 -133 -262 13 136 -1212 -386 886 -1 -731
3267 -731 -13 -580 -366 921 142 -1387 -118 362 -380 20 194 -885 -649 1106 118 -540 159 -322
3285 -322 -719 330 756 -809 -253 668 175 100 278 -748 -457 996 507 -332 -17 -159 -764 353 819
3304 819 -836 -558 422 -83 13 726 -341 -759 447 467 -608 21 -147 -964 415 672 -556 -703 -14
3323 -14 88 -387 469 -473 -1216 -21 816 -498 -15 175 -550 -44 1293 -57 -476 135 262 20 671
3342 671 257 -797 280 810 32 -93 363 -615 103 1114 371 -559 484 344 -101 821 81 -698 -223
3361 -223 989 353 -37 171 -768 -600 1059 302 -786 -280 283 -227 122 250 -981 -527 571 -115
3379 -115 -74 66 -514 -739 446 362 -661 -128 389 -386 474 573 -371 -611 424 58 33 530 -196 -398
3399c98J131L72j495J01M67l60M49O83j102l73P03L00n84J18m5p28J196J05q56
3418c16j29K80l37M95M41p43p64J348K3p97K84j40o41M07J426q52n22K58j88J74
3438b93Q97j109o70J166M64p10Q27p42n84N22P21p36j27Q35l82m10J163n65r87
3457g20O93P86p60L69M16j157j34J386l26p65m1K00j24R22R9j249M33K79k37j24
3477e4N65p98q4R51l19p59K69k5k50Q06M22j149l06J176o12L4J91j60n25R47J2
3498C32n94J31M67q75Q30P61j675K79L72L26k85M65k55j089J125O30j100L46K42
3517D33o17Q5R22n77p24P23j65n3Q52o28j024P94O45n54j28K21m95J7J143q11
3537E9o67K28K08n49J119op81Q0R06p56k85L47k03m12J541o18p73L66M38n21K74
$$ plain form
3399 -398 733 1105 -390 -289 178 -182 267 950 -152 -525 178 478 -106 12 -33 -761 435 540 -316
3418 -316 -445 -165 -502 -7 434 -309 -1073 275 298 -499 -215 -355 -996 -589 837 -15 -537 -279 -467 -293
3438 -293 604 -505 -1175 -9 455 -255 572 -170 -754 -232 489 -247 -374 461 79 -331 832 267 -720
3457 -720 -27 759 -1 368 784 -373 -507 879 553 -212 -253 -53 -177 745 844 -405 28 307 70 -54
3477 -54 511 -287 -371 580 261 -498 -229 -254 -504 302 724 -425 -731 445 -167 -133 58 -102 -627 320 332
3498 332 -262 -131 336 -539 291 1052 -623 -344 28 354 69 534 279 -810 315 945 -155 191 433
3517 433 -184 -99 823 246 -478 245 80 27 879 251 -773 21 666 112 -16 205 -290 -273 870 59
3537 59 -608 -380 -172 -721 398 392 -389 -309 597 -159 -444 -97 -300 -712 829 211 -562 -196 242 -279 -5
3558eM26j091L05Q97n61J98jk49n40J017M18j252K33L50k17K22M03j007j0R70
3578E06k64k65K19k04p25Q48M94r68K38O85j017N61N29p57p27P69J37j64K10j04
3598Ar92P76Q56p35l20M76l29J83Q07m73j092O47N87p41J83K21p44N23P27m55
3618A06m74L21l98M2J016l66n68N52M76p88L41R9q53K67J048o16o46M83j22k48
3638c28P79Qr72K56N82k27l58J39o25j9J111M7o22N96k09o58N21L61j134K19O55
3659A22j00P9L62p72n07J148k9m36j50L21p56J026N99j072o11J070l64J45M06
3678D81l67l08N71K0j075O00K89q37P31Q52o10m40N18j09l72N03p9j112P84O62
3698G02n28m8L35q43K05J312j236m30N50p1k8K12j88p05R06L61n79l21M93l45
$$ plain form
3558 -5 421 -670 -365 532 -29 169 168 -81 -621 396 814 -438 -205 145 -72 150 553 -454 -464 506
3578 506 242 -23 196 -8 -733 115 609 -359 -121 564 -453 108 637 -120 -847 -78 59 -105 105 1
3598 1 -991 -215 641 -94 -414 62 -267 -84 723 250 -842 -195 392 -349 -166 55 -689 -166 561 106
3618 106 -368 -47 -445 -403 613 247 -321 231 707 -81 260 359 -494 -227 821 205 -441 42 -80 -328
3638 -328 451 459 -513 -257 325 98 -260 -121 -746 -765 346 393 -229 367 158 -500 21 382 -752 -533 122
3659 122 22 101 463 -309 -816 332 303 -133 -283 38 -718 308 907 -165 -776 294 -70 75 481
3678 481 114 -194 377 397 -678 -78 211 -626 105 957 347 -93 425 316 -56 447 368 -744 40 702
3698 702 174 126 461 -382 -177 1135 -101 -531 19 -52 -80 132 -56 -761 145 506 -73 -394 99 -246
3718b46j63Q21l47o68M53K75l61N37l1o51j9N15k78P2N03k98n37Q18N6q28K90
3739h7K55m69O62J13q86P9R34l65k75L97p7p76R20J16p29J39m1j6r1P15o75m43
3761f00J220k33o46L83n17o72J278K50m99n5L53k99k18O44m85l69O74M16p53J84
3781E6J14l85K63L68o46j52O24m82J32R66r58o72P98L92o12L19M86r76Q4Q41m33
3802A27m24N52k61K9P00k62q88L25M51m40LL77q12L86N63k7r47M91L52q02Q19
3823C12J92n87l98P01m61k9N13n54j8N00K87m32k35K53l41L44M64p37l46P54q0
3844A02j65J73k77k03N58R2k53j86M36q57M31M29k77o65J129j91l58K64n56l90
3864g64N21Q15o07N4K11o22O10K70p15n01P36L48l74K42k22o62N55O36q31O5J35
$$ plain form
3718 -246 -409 412 65 -603 -150 125 -236 301 270 -381 -400 115 -163 -91 412 114 -423 395 451 -377 -87
3739 -87 168 -301 361 474 -412 -333 601 236 -39 358 281 -495 425 541 -188 -49 -90 -106 -197 518 -157 -600
3761 -600 620 387 -259 124 -393 -1065 213 463 -36 -91 262 -37 -255 389 -96 -465 209 625 -128 56
3781 56 170 -215 48 416 -230 -382 242 -240 -108 858 -100 -772 26 418 -194 125 611 -365 -281 560 127
3802 127 -297 255 -6 23 723 461 -427 -102 349 -91 -88 289 -523 -137 426 399 -548 -57 295 -507 312
3823 312 504 -83 -481 220 -241 -270 243 -311 -329 171 458 26 -209 44 -297 47 511 -226 -572 182 102
3844 102 -63 110 -167 -370 188 280 27 -159 277 -580 -149 280 3 -662 467 276 -82 182 -374 -764
3864 -764 -243 572 -35 19 230 -392 218 488 -227 -728 8 356 -18 224 2 -660 -105 531 -300 -235 -100
3885a00m16l4P37l01n40O29M58n94M98j46o06J16P94m24j73P9j86kQ75m72n52
3906c60M58L29n77r9L15m23K14L57r9k48K64j64k7L13j99j20J04K47l28nL48n83
3928b83n70J214J98p63N64l81k73K90L80q30N0O90n12L31J47o25j77O06L18o92
3948c18K31K36l08M1L12j53l38L29q3K6N71l22p38N11J70k7k70M52k33J4M09l87
3970A25m37K78L29o09N05K80o66J34O75q64j13P04o68M1P06m03o11N76J37m72
3990c53N93po79J71N54l58J09M57q51o5Q41J46q76M90L4l48K59N7o04j0O30M9
4012B39j76J80k67o5N26O5r58M82J51k57J90M59m49n63P51k50j75M08l39j88L34
4033I8M02p59j16L67j64J24L07l41j08O75m13n76O07k06j60K93K39pl46m8n67
$$ plain form
3885 -100 -516 -550 187 -114 -654 -25 433 -161 337 191 -415 -299 495 71 -102 -23 -209 -211 664 192 -360
3906 -360 98 427 -150 -249 66 -357 -143 214 115 -133 131 -33 -60 253 54 -66 38 285 -43 -48 300 -283
3928 -283 -853 361 559 -204 360 -21 -294 -4 376 -454 -404 286 -226 105 252 -373 -550 56 374 -318
3948 -318 -87 149 -159 -118 194 41 -297 32 -51 -25 546 224 -514 -3 167 140 -130 322 89 103 512 125
3970 125 -312 -34 295 -314 191 471 -195 -61 614 -250 -363 341 -327 -286 420 17 -594 -18 119 -353
3990 -353 240 233 -446 -275 279 -79 30 487 -364 -429 412 558 -318 172 206 -142 117 174 -430 -440 190 239
4012 239 63 243 -24 -89 437 502 -456 26 177 -80 110 569 120 -443 308 58 -117 291 -48 -236 98
4033 98 500 -259 -375 -8 -172 -48 259 -82 -190 485 72 -504 103 -103 -263 30 269 262 -84 -132 -699
4054f99N66M28k50q08Q06J84m83O16j80m93MO35k46k81K89k24j63O11j42o26L85
4075g1O71m42J1K17o94K14N92j37l16J54j95k10N77K5o65J87J06k11J73L11m39
4096a42m00Q31j24m42K47P2m82N96j36n33L38M5L3ML52o13j03N92n4m23K18j5
4118a39k03L65N22n82m0J75j82J53P3j55m03M66M97l46l24L5j94N39K82l95m83
4139c39N20K04j74m5R4q73O11M17m39K45k93k84L79N97m74n80K26M57k37J06J5
4160A33m58J74J83l09L9Q9j1r2L37J42p91M66q9j28N39L76q08O6P55m86n17M44
4182E4j74j61L56J77n33K81J44n6K40M8k28m48O73m25J61j4j98k37K94N38p24
4203b32J85Q5j76R1M58n17l06K62L22l70N05n5q69R98k77l43L37k3m05J25N48
$$ plain form
4054 -699 -133 295 45 -763 43 227 -256 360 180 -313 -309 326 80 -201 88 -136 -299 312 170 -456 -71
4075 -71 600 158 169 386 -308 -94 498 361 45 199 4 -206 371 396 -269 -82 24 -187 -14 297 -142
4096 -142 -542 289 165 -277 -30 42 -440 156 20 -513 -175 -130 -97 -93 259 -354 -457 135 81 -342 -124 -139
4118 -139 -342 23 545 -37 -77 98 -84 69 142 -13 -416 50 547 201 -123 -88 -282 257 539 144 -339
4139 -339 181 385 211 166 260 -613 -2 415 -24 221 -72 -356 23 620 146 -434 -208 249 12 118 133
4160 133 -325 -151 32 -277 -238 -149 -160 -252 85 227 -564 -98 -187 -315 224 600 -208 -142 613 127 -390 54
4182 54 -120 -281 75 252 -281 0 144 88 328 376 148 -300 373 -52 109 95 -103 -340 -46 492 -232
4203 -232 -47 38 -138 -47 411 -106 -412 -150 172 -198 307 252 -617 381 104 -239 98 75 -330 -205 343
4224C43n47q2K78Q8j32J53L59j010R6R96j65l99J35j16n3M53j2j109O20L73m42
4245a73L23n9l85L74P2M7l85L70j42k12K29L03o67L37K39l67J05K29p75M25K21
4266A09rk02n5M24n80O39l2n28J05M58l76j99L66n4k37J98K63n74M17J69o94O07
4288B15l0n08J8L85Qk33O10k64m65K80K11m80K99M4j21j4P95p39r9K91j56Q5j93
4311f1K62r65R43L09o81L56R0n22K77K13o12L6J53O6m2L99rp38K82N29l59j15
4333a89j41j05J41N82n88p7K78K63M3k52J07o09M84M32o99K07J33j83k23N86r4
4354I6m14L51Q3k57K33M54p27n4M25R3k04k66J55j4J91J30m78k00N61k82l6K17
4376E7l95M8L1L63m46J69K26k62J50L96o43J29K27m97M39L17l56m57M55M3n1J11
$$ plain form
4224 343 -204 -286 -8 80 -52 101 460 -550 -454 542 377 -22 113 -3 -56 397 385 -724 -104 269 -173
4245 -173 150 91 -294 80 152 199 -186 184 42 -170 59 362 -305 32 271 -96 9 238 -537 -112 109
4266 109 100 -102 -157 267 -313 326 294 -234 -129 329 -47 -246 120 66 -171 27 290 -284 133 302 -392 215
4288 215 185 -323 -305 80 88 -145 465 201 -264 16 227 -253 46 90 -31 -45 750 11 -88 203 47 132 -61
4311 -61 201 -764 179 488 -193 163 253 -269 8 221 -391 -355 -202 -136 -178 221 212 -526 -244 285 -74 -189
4333 -189 -330 -435 -294 288 -300 -377 -99 164 207 -45 62 -547 -63 369 -330 -123 10 -173 -396 190 96
4354 96 -318 33 116 -141 92 546 -181 -235 190 283 79 -187 -32 -46 145 275 -203 -403 158 -124 -160 57
4376 57 -338 -290 -259 104 -342 -173 53 -209 -59 337 -306 -177 50 -447 -8 309 -47 -504 -49 -6 -57 54
4398E4j29l90J34P04n51R6J23k36J94K98k29n34P42J62p06O14m27l52J70P35j26
4419C46o44P11n12j47Q02l47l83oN49j39j13J52n60r1P09l78j37N4P3l24O39P5
4441C29p09j10M55l93M35K64o71J58M68l84K28K8j34m50O27P7m21J73L80j93l88
4462b31N16n5o20P50J12n67r6M03m78O00J70n80j01K17j35N3L03j99l87L65J69
4483B09k52l3K51l21m4L94p33K33M54l23j24O48k93m35K14N26q54J00O79n23J07
4504a20M10m3p72L87k8K7K28M2n98K80L69j02j43M27o81O1N12N5p45M45R3k04
4526a00K88K29o05P4L22M9j57j8k09j27M05J55n2o04M62k79N54Q1n63k62O81m29
4548a05J8M11l90j90K56M84n77l84P37J4o69P27k71n09N32O1l58L17J2m88M90
$$ plain form
4398 54 -75 -465 -331 373 -178 -82 41 -195 -1 297 68 -466 276 438 -268 346 -81 -433 -263 472 346
4419 346 -298 413 -99 -246 556 209 -174 -180 369 230 117 269 -291 -382 327 -51 -188 -134 -61 -385 254 329
4441 329 -380 -490 -35 -428 7 271 -400 -242 226 -158 70 98 -36 -486 141 218 -203 -30 350 157 -231
4462 -231 285 230 -390 360 472 -95 -191 212 -266 334 504 -76 -177 40 -95 -42 261 62 -325 40 209
4483 209 -43 -76 175 -146 -190 204 -529 -296 158 -165 -289 359 66 -369 -155 371 -483 -383 296 -227 -120
4504 -120 290 247 -525 -138 -166 -139 89 131 -467 -187 182 80 -63 364 -317 -256 256 311 -434 11 104 -100
4526 -100 188 417 -188 -114 208 257 100 82 -127 -254 151 306 254 -350 112 -167 387 468 -95 -357 324 -105
4548 -105 -87 324 -66 -256 0 484 -93 -477 260 274 -395 332 61 -448 84 145 -213 104 116 -372 118
4569A18L56o34k58L34J69n06P74l73j91J63J15l43M66J53k16J9L45n47j78K83
4589D9j22o4M73j79p56Q66k14q8k28M32n24M38L59o05QJ93K54m31K82j38p69N44
4611b20R9j22K25m8k76j4P79p6k78j59L20n36J1P65q56J74P64q88M77J49m16j45
4633b71L97K35l94rn0p7K47m4p3k51O86l49q3J33J08n87N87j8m79J24J83m8l19
4656c52N35r6n02M19J49l35M04m3n56M76K8j51l21N16l69J74L29l04j54K46j33
4677d0j67M38j43n50K79O93p22J4L50j21j89L20N5l80L24M8o2l7M5l51J3L43k33
4700g3M24j52l15J7L61j65j98L34j12k68qM52n28l3Q17m98k55J45M82o49J04P56
4722F38j056L17K27j97jL95J38r95P56j17k45j1J99k69L73K58o29J18J25j26j5
$$ plain form
4569 118 474 -160 -418 -84 85 -421 353 -20 -211 -48 67 -276 190 343 127 146 491 -56 -234 49
4589 49 -73 -137 336 157 -599 267 53 -35 -263 169 -355 83 442 -163 -155 38 292 -139 143 5 -764 -220
4611 -220 -121 -243 -18 -66 -342 -356 423 347 69 -90 230 -306 -295 470 -386 -212 552 -336 141 290 -126 -271
4633 -271 126 361 -33 -42 -92 -169 78 34 -39 -290 396 47 -36 97 205 -382 205 187 -292 -168 15 -33 -352
4656 -352 183 87 -415 4 153 -182 222 179 -377 99 127 -24 -345 171 -198 -24 305 1 -153 93 -40
4677 -40 -207 231 88 -462 -183 510 -212 -198 152 31 -158 162 217 -163 161 209 147 110 155 -196 -183 160 -73
4700 -73 351 199 -116 -99 262 97 -101 233 121 -147 -155 297 -231 -264 553 55 -200 -55 427 -222 -118 638
4722 638 -418 -101 126 -71 -72 323 461 -534 222 105 -140 -151 48 -221 152 410 -219 -101 24 -102 -117
4743a17N16l74k16L17O3q1J48k62l86L67N36l16n49L18l3j3L72j50k52L17J28
4764C33m64J14m0m03K64N40j39m65K8L43k44L13J34j090P46J42l84L42J49n10
4784b91N6L42l6l63M50p8l62N26j24l14N1N36j89l70J77j41k98Q33l01m89N79
4805A94j81k84K37K90m10n0J16J88o8O5Q1m71L62M46q05N07m3M8m27O01m16k16
4827b36N67j83j98k1J6k65K72K60m37J73P2j92k9L14j3o77M58J33j05M67l76m42
4849d42L24L72j84l29K81q8j44O69j35k86j08K20k12J53J14l25L4M23k08l61M41
4870B09j40m94N90J23l93J08L04j40P3r7k40k64M54J57m10K74P8m65L52J96p28
4891d53M4J09K76m6K14j44m8J75j34k31M27m94J28K36J55k07j22K31j32j39L63
$$ plain form
4743 -117 399 25 -191 126 189 108 256 -6 -392 -25 511 195 -354 -36 -69 -82 290 140 -112 205 333
4764 333 -131 -17 -57 -460 -196 344 205 -260 -232 111 -133 180 314 -776 -30 112 -272 70 219 -291
4784 -291 -235 107 71 -292 158 80 -282 244 120 -194 -143 393 204 -166 11 -130 -428 405 104 -385 194
4805 194 13 -271 -34 256 -154 -204 -88 100 32 97 178 -293 69 515 -290 217 174 222 -205 396 -20 -236
4827 -236 331 148 -50 -71 -55 -320 -48 212 -225 -52 20 -172 -201 113 100 -577 -119 14 -91 376 0 -442
4849 -442 -118 254 70 -259 22 -66 -210 459 324 38 -70 150 -62 91 205 -120 -86 337 129 -232 209
4870 209 69 -425 165 288 -105 3 307 167 240 143 -97 -361 93 250 -160 114 192 -273 79 275 -453
4891 -453 -409 -300 -24 -70 144 0 -48 127 -7 -238 189 -305 -177 59 214 7 -115 116 -16 -155 208
4912B08j15m30O94l32n2Q8K7k26p5N27l06m31L79j01L00n0o1j76R6J91l97M74
4934B32l60j81qM78j21k95J89j70J61K87j09l33O0P18n43l00M51m13jM47r9m33
4956c43K59L15l57K10p7l88J53O20m41N2K12o64L73N9K81n10L73j16j84M11Q2
4977C20l09n7L72l85j18K67K96m46L18l49l5j36N62p17M06K88m48j70L07Q8p1
4998a7J79J45q54N01J28k9k31L44j50j76M34l15l36L55o7r0O2J92m05K47J20l55
5020c18l6N19j70K2J94k50k21N82k71k83o3M20n02L76K06j34j46M8J57l54L62
5041A38j12l56K56K09n46N87q4o11M35O46o18m3P7j93K58J28P1m52qK01k16K69
5063C6K81l42m8Q9p9jJ72k22j42M23J77m64K29L7k09K25M7j39m04L96R9l30M74
$$ plain form
4912 208 93 -337 357 25 -27 61 88 -138 -213 314 8 -423 -44 -145 155 105 44 -132 -36 155 -242 232
4934 232 -128 -309 -317 161 40 -255 -66 -236 -75 212 103 -230 -170 548 5 -295 156 -257 -258 189 90 -343
4956 -343 -84 231 -126 84 7 -381 -228 392 -49 3 215 -449 -76 -17 264 -246 127 11 -173 238 320
4977 320 11 -46 326 -59 -177 90 386 -60 258 -91 -126 -262 300 -417 -11 277 -171 -341 -34 54 -17
4998 -17 162 307 -547 -46 82 53 -178 166 16 -160 274 -41 -377 -22 -89 -179 -117 75 -330 -83 37 -318
5020 -318 -354 165 -5 17 211 -39 -260 322 51 -232 -295 125 -377 -1 205 71 -75 -27 130 -224 138
5041 138 26 -330 -74 135 -411 176 92 -519 -84 562 -56 -99 -22 -215 43 171 242 -210 -218 -17 -233 36
5063 36 317 -25 -73 16 -63 -64 108 -114 -256 167 344 -120 109 146 -63 162 209 70 -334 62 161 -169 305
5086C05j47r8j10M33m71p1R4K11k28M38l33k38K24L51m88L4Qo1J40L07m40k82
5108d22M78L9k82K54p6m44L64J35j08k61N49k45%N96j15q46O79j77k66R3P11j088
5130d32K77K73j07J23K18o71L52k63J61j44K33Q5m12O24R0l11k7L49l92j34L40
5151B32m84Q2N49l09m67M00J00j05J51K59m17j36J93l34K25J24m3p1j9J18k26
5172a78J22j45J10O0J73l35O8K47j58p5O5J31m20J46M90l56K07j16j83k0M55l51
5194f3k86M01P0j30J50J89n77L29K28k70j97J92k8j77M51l88j31j71L60l9j31
5215b18K47k89J24K86m64J53Q9J42l73L36q3q6L00o8o3NK83l97N0K45n7j61j43
5238a42K03j60J3J13j67L76j07j01LJ78k99j59N09jm88L18n0j40J1L55m49K36
$$ plain form
5086 305 158 60 -50 383 -88 -159 -65 146 -82 356 23 -215 9 360 -128 -94 -86 -147 -7 300 -140 -422
5108 -422 56 95 -187 67 -9 -453 -89 46 -62 -323 226 -19 -19 577 462 -384 295 118 -148 -55 656 -432
5130 -432 -155 118 11 134 352 -319 33 -230 -69 -213 20 105 -307 317 407 96 69 418 26 -108 232
5151 232 -252 -170 379 70 -397 3 103 -2 149 408 -9 -145 48 -286 -61 63 20 -51 -70 48 -178
5172 -178 -56 -201 -91 -31 142 -193 -125 122 -36 -111 -46 85 -335 -189 301 -55 152 36 -147 -167 288 -63
5194 -63 -349 52 122 -8 142 331 -246 83 311 41 -156 36 8 -169 282 -106 -237 -408 -48 -87 -218
5215 -218 29 -260 -136 150 -314 -161 -72 70 -303 33 -50 -136 164 96 33 38 321 -76 -26 219 162 1 -142
5238 -142 61 -99 -86 27 -140 236 129 28 31 209 -90 -249 260 259 -229 89 39 -101 -90 265 -184 52
5260E2J95K6m75L89k12k12N21q4j50J61o8l02P8M7k04L18M4o3j80j0L15l46n1
5283b11L17J5l63M51l55K00K65l51m3l7K18k7J10J80o38K64K04m32O36p4k55J62
5305B36K8k38k86N78N1l00q5M47o44j04P22l73K1K3k65M01k8j14o8r6j98J33K34
5328G5ql28J76K08l7k74K92q4l97M93J40l70J69m3k68J64K50n7j55lN3M3mK11
5352B46j19j05J16k81p2K94j97K62M20o25M9K86l66r9N47k06m5L5j06jj41J99
5374I1J22m02O03l37m27N97Qm21J25J17m02L66j29o0P0J53N0j76J98Q9n09L9M39
5397B04k94p1K48m23K74J47O7l14L19l36k60O84o1m69K11M49j49j70J80k5l33
5418a22M02R9o14O22j92j65J98K01n84R7M03l38k12M88j99l13M52N2o38N12l05
$$ plain form
5260 52 247 273 -202 187 -25 -237 284 200 50 211 143 -159 -81 -34 -238 80 124 61 -119 -129 186 -160 -211
5283 -211 106 121 -242 209 -146 54 319 -32 -75 -112 106 79 189 369 -269 -5 199 -233 403 329 74 236
5305 236 264 26 -260 318 369 69 -16 431 -213 -317 405 32 53 76 -189 212 184 70 2 -94 -292 -159 75
5328 75 67 -261 -85 123 86 -188 104 20 -377 116 256 -114 55 12 -256 -92 158 101 -54 -57 -4 39 35 246
5352 246 127 22 138 -143 -215 79 -118 144 564 -61 -12 274 -92 -191 356 150 105 140 34 33 -108 91
5374 91 213 -189 414 77 -350 247 255 -166 -41 76 -326 40 -89 -149 -79 74 124 -52 146 235 -274 -235 204
5397 204 -90 -161 87 -336 -62 85 152 -162 157 -179 -439 245 184 -285 -74 375 226 56 236 211 -122
5418 -122 280 379 -235 387 195 30 228 429 -155 -58 345 7 -205 283 84 -229 223 275 -363 149 -156
5439a56n1M67J20n94j96N10k51J40J94n1l68k3M62k31l72O09m35K7L23p5k11M48
5461B86k04k75L69Rn67M09n7J09o0J88n79K35M42k23j58J47k49J84J75l69K38
5482E0k77O38l66k17M27l35NL69m03j23J64n4o3J80M08m30j52J19j44L09L5j44
5504dk36P05m07m41R8K82j03J24J94m18K28J04j66l63L85k23K1J78M57n91M24
5525B48L56o49j31N39j2n27N79k85l38J37K6J10M8K12k02j47J22j49J67K77k77
5546A04n1OJ75m52K87M7j90K00j19nj68K71o9l7L27m74l00L48r0K18j09J40m5
5569A4R8J78l24r4n2J34j64L99l4k58J61J69l35J34N7j85mK70j59M0p7K4j74N83
5593D01j60n48L02j34K33j25R9k18j6M02r2k91R7O9p3L41k9o04k49P17j48L9j03
$$ plain form
5439 -156 -207 260 380 -214 -410 100 -151 -11 183 132 -236 -259 203 -28 -400 209 -226 -199 124 49 -162 286
5461 286 82 -193 176 185 -382 27 -30 79 19 207 -372 -137 305 82 -76 71 -178 6 181 -188 50
5482 50 -227 411 45 -172 255 -80 -75 294 -109 -232 -68 -122 -185 -5 403 -27 -179 -60 -204 105 140 -4
5504 -4 -240 465 58 -383 -285 -3 -106 18 212 -206 22 126 -40 -403 -18 -241 -220 -42 415 -176 248
5525 248 604 -45 -176 363 351 -176 403 118 -220 -83 -57 53 101 313 111 -36 86 -63 104 381 104
5546 104 53 59 234 -218 69 116 -74 126 7 2 -166 105 36 -1 326 -148 -448 -100 -190 28 -81 59 14
5569 14 112 290 -34 -128 -180 -46 -210 189 155 -103 58 227 -108 26 83 -102 -106 164 5 45 -32 -8 -182 401
5593 401 241 -307 -5 -139 94 -31 68 -150 -166 236 144 -147 -50 19 -54 287 258 -346 -595 122 -26 13 -90
5616i0J11k83K22L16m45J07K21j46o2K13l66k7M79k44p9K83j92l63M59L11l54
5637G1o5L9j56J50j59J58l90M79j14j64L72l64k7K03k24m3j87L05K55o0p0O9l07
5660b29L62Q6n89M07M2o54K79L47j81J31P0j35j1J44J12m66k2K64K7j34M53n35
5682b32P9J21qq5K04k61m56J012m9o46N0L04O7n2K0k69M2K75k26Q0J58k76q8K63
5706B7M86l59p4J12l61J06J29j93K24L0j34j06K71j1k69N09k10l06K40j25j11
5727a25NM35p3n80N45j30K0k72K34k67J41J92n3k11M6J71r4L56l0l54j23N22j88
5750A67l71O34m92j04L45j58q8K70j6j8n4K07m92m2L14J83n07N06l48o8M40k56
5772E2O6r9Q7l90N63J40n03l85M50j72J32J42L8m78O55k70k74K63L62n55m5L65
$$ plain form
5616 -90 21 -262 -40 276 -169 -62 159 13 -49 164 -202 -229 250 6 -73 210 18 -345 114 425 71
5637 71 6 45 -111 39 -120 38 -352 127 13 -151 221 -143 -170 33 -191 -234 -421 -116 139 79 9 78 -229
5660 -229 133 219 -370 37 79 -575 -296 51 -130 1 71 -64 -75 69 181 -285 -307 -43 -16 -150 303 -232
5682 -232 -153 -32 -40 -125 79 -182 -638 374 325 -321 -271 33 100 48 68 -201 -159 116 -110 -30 128 -148 -236 27
5706 27 513 154 80 192 -169 -63 66 -127 97 127 -7 -113 158 147 -122 387 177 -129 111 -14 -125
5727 -125 -120 315 242 -338 207 77 97 -175 59 -208 -67 125 72 -139 -93 78 -16 340 310 -44 -167 355 167
5750 167 -204 430 -62 -166 179 21 -67 203 187 169 115 322 -170 -212 102 285 -222 284 -64 -132 308 52
5772 52 118 19 106 -284 279 419 -84 -469 -19 -191 -59 83 121 -357 298 28 -246 17 379 -176 -221 144
5794A44k82r4L38N0k52K86L0j47J23k99j01J17r9p7K1K54P8m82O41p8j61Q0K0
5817A10k24L85k75j97J08K08j43o7K33k05j56J63L15j11k07J72M4q9O3k33L23
5838B17l92J62k39L36j91l71M72J35j88L11l7k49q7K08o7j23n5o3P7K14J12l32
5860a50m4K22j39J51K01j11j03K24m28K64J7o3l60N26L34q65K17K04r9L36j00
5881B34k63j49O73p09j8J48o0r7M40J16o02K20L37n96L16K75k29o6j22M01o10
5902c61N26k46j61N1L61m19J22K16k15j51J67J37l03P3L96k23K16k64j57O3K69
5923I7j60n2l1L10m6L75n23m28M78K12m0k84J67J56m75K71J45k27Q1K7k90M3K42
5946D8j17j10M35l81O8J37j85r4M44k43l48M56k7l47K58K58q8k66K89j75P6J62
$$ plain form
5794 144 -138 -232 106 156 -96 190 220 73 196 -103 -204 -87 -186 -263 -242 12 90 -392 249 171 10 90 110
5817 110 -114 271 -4 -201 -93 115 -28 -95 138 -67 -223 -60 255 144 -63 109 153 64 127 -106 217
5838 217 -175 -13 -252 84 -107 -478 -6 129 -59 252 215 -34 -121 87 20 -103 -158 -221 -144 70 182 -150
5860 -150 -194 28 -111 40 241 130 27 251 -177 87 104 41 -319 207 541 -324 -107 97 -2 334 234
5881 234 -29 -178 495 -214 -232 -84 -144 -241 199 315 -287 -67 270 -326 -10 265 36 -30 -152 249 -361
5902 -361 165 -81 -242 -191 170 -249 -127 89 -126 -277 -110 27 -276 -203 193 -30 186 -78 -235 -172 97
5923 97 -63 -115 -146 164 118 493 -30 -458 20 232 192 -92 75 231 -244 27 172 -55 26 53 -237 -194 48
5946 48 -69 -179 256 -125 -57 80 -105 -199 245 2 -346 110 83 -264 -6 252 164 -102 187 12 88 250
5968B50n76J66L17j16k98L03p3j2O5J09l73K9M17j29k73L31O9l80N29l77k44M60
5990A94j19J57Rk63J54j97L63n42O8M98l52k45L69M60l05k22J13j72q7M85p5o80
6012c89M78R2k69p6N78k68m38N40qo02N30Q5l06J64k66o8J71j5K9K34q9k88L9
6035a42L52j80r9J11j79K92k60K42j84LQ6J59m30M53m20J95L1O6O4k77o7M6K71
6058A33J33l33k4J98o0j26L43j50k04J79R1k29L0k92l0M56K3o5l43K69MlK38n03
6082b65R3K41j96k02J28L24n3j42K36l61L37j21j97l49N49J53j3q0M91m68j71
6103f6K74k42j01K38Oj08J57l86N13k20r8k71K53M21k63j72J81k69j28L54J21
6124A94k81J16j42j15j56N56k79P9J40k9k34J61O3j84K23j52j76J73m6j76R7L91
$$ plain form
5968 250 -326 -160 157 41 -257 46 -27 -39 26 135 -238 -209 208 79 -194 137 206 -174 355 -22 -266 194
5990 194 75 232 241 -22 132 -65 298 -244 -176 322 -30 -275 94 554 249 27 140 -32 -119 366 291 -389
6012 -389 89 181 -88 -164 414 146 -292 248 240 -362 168 253 -53 111 -155 -223 -52 -67 -38 196 107 -181 -142
6035 -142 210 30 -69 42 -137 155 -105 137 -47 -44 42 201 -229 224 -196 -1 30 96 160 -117 -184 -138 133
6058 133 266 -67 -91 107 47 -79 264 114 -90 89 180 -49 -19 -311 -341 115 138 73 -270 -1 3 0 238 -265
6082 -265 -172 69 -127 -329 -201 123 70 -72 164 -197 140 19 -178 -527 22 175 162 82 573 105 -66
6103 -66 208 -34 -135 103 109 1 158 -228 285 65 -33 -304 -51 370 107 -65 116 -153 -281 73 194
6124 194 -87 29 -113 -228 -384 172 -107 -28 112 83 -151 10 73 -111 112 -40 -216 -43 -89 -265 -168 223
6146B23l14R6K7K65n9l04K60l58J42o3oQ0j77J83O7K09k20j77K09L8j21P0J42
6169B12l59K97j86l4K5j30P2J18L3j37k03O83j92j95m6J01l06K37L28l48K2o8
6191g6JJ88K34l00j6R9k15J18Q2J39m92J26R3J15k21K08r8k04L34j62j99J0K38
6214Bq1J29N3j32j12K09p3o9J85M3j73J06j7m06J58j74M41j17N8n8k74L95j96
6237a03j3K50k73L44k84L52p20L30M27k18j99J37O7l33K73L07n83J0J84l9O3J23
6259A02j34M9K56l33J40k37L14k86L97k02J7m43K59J06l98N33l70m9N22m52K91
6280H2r0L42l67j29N65m55J12O6j57N8L15m9m82M72k02j24R8m2K63k06mL9l4J44
6304B15J27j37k55M30o08Q3K53j41Q3j16M0q7J84L2j50J68k77J82J5n3k32K90
$$ plain form
6146 223 -91 5 32 297 238 -66 194 -164 -22 -85 -91 -11 -188 -5 62 271 51 -126 83 121 0 70 212
6169 212 -147 150 -36 -70 -45 -175 -103 15 48 -89 -292 391 199 4 -42 59 -247 -10 318 -30 -8 -76
6191 -76 -75 113 347 47 31 130 -85 33 115 254 -238 -112 -19 96 -125 83 -15 -219 115 -47 -246 -236 2
6214 2 -79 50 103 -29 -141 68 -5 -74 111 154 -19 87 70 -336 -178 -352 89 -28 30 -28 -302 93 -103
6237 -103 -116 134 -139 205 -79 273 -447 -117 310 92 -107 30 97 -236 37 344 -239 -229 -45 -84 -21 102
6259 102 -32 17 273 -60 80 -157 157 -129 268 66 83 -360 -101 5 -393 140 -230 -279 243 -209 82
6280 82 -8 334 -33 -162 403 -52 60 126 -31 27 342 293 -189 283 81 -43 55 13 276 70 66 105 71 215
6304 215 342 205 -50 380 -228 -145 108 -33 50 -66 -26 -113 71 103 -47 121 -156 26 41 -12 -244 46
6326D6M4k37L29n9j64R7M41j94k51P2j92k71J15M26l04mN4L79j65k03J53j85J2
6349f1J03k48J23l5L25k25J84k87R0J10J4P6K33k97j60L4N9J31N5K54o43Q4K62
6372A81m39J97j0K1J07N7kk79J65%O8j87M27m87q6M07l28J25K33j80j78K41J88
6395B41m33Q0K25k29l5K2K7J17J54p1l43J84N9p5J44n7j32j21L88J22j36n2L1
6418A10l60Q9K46j2K45l04J05n3p8J78l46J15K58m60L36J82k46L4l1J7JJl29L53
6442E1J24j22j59J49j16J56k57M0Q8j56K6J84j27J31j21J4j07N00l34K05L4l60
6464a57O3L35n53L55L35l98j32K78o8l3M74l86j97L29j79l51K63k1n8pL60k29
6486B3J87j47j6J1J87K2l20%j37J0P4K26p4k28K64l86J48O3qJ01Q2j85N2j22Q8
$$ plain form
6326 46 90 -147 182 123 -41 56 497 303 52 124 -68 -339 -224 202 -102 -106 -52 327 162 -41 112 -73 -61
6349 -61 42 -206 -83 -118 207 -18 166 -121 -31 79 93 169 402 105 -55 -21 38 169 224 478 -165 -81 181
6372 181 -258 -61 -71 -50 57 114 112 -167 -2 -2 66 -121 306 -181 -267 140 -188 -63 170 -10 -188 53 241
6395 241 -192 -112 113 -116 -151 -129 -102 15 169 98 -245 -61 -2 -77 67 10 -122 -243 145 267 131 79 110
6418 110 -250 -161 85 73 318 14 119 66 -12 166 -180 -65 193 -267 69 251 5 39 8 25 26 27 -302 51
6442 51 175 53 -106 43 -73 83 -174 -134 -46 -202 -176 8 -119 12 -109 -95 -202 298 -36 169 203 -157
6464 -157 -94 241 -312 43 378 -20 -152 126 58 25 499 113 -84 245 66 -285 -22 -43 -101 -108 252 23
6486 23 210 63 47 58 245 267 -53 -53 -190 -180 -106 120 46 -182 82 -304 -156 -93 -101 0 82 -103 -51 -173 -85
6511h5L24nk93M7j53K47N0o6l61L14j05n5L12k34J01M6j04j60M25m92K43n7J46
6534H5k62J32K61k73J99j61J04l34J35r1J36K00p5j71J68J82l97M16k52n3m4O5
6556c0P5k4j0l9j23J10q1L78k23j38RJ72J91k66q1j04L90k88M00k57q2J69J75
6579C23k35k69J30J17N2j67K23l61J57m2R8j08j85J55N94l41l55K71Q2k10k08
6600b79K31j02j70L86P7j82j42L35J2k53M11m99O3K25Qk15Q4J03o2K57k70j41
6622a23J24n8J6LM96o78J64M26m72j19M90k21k55j05M00j8k74L73L9k22K32k36
6644a8k18L21J2k00j14M25j43l4K14k42j39K24k77O9J19r5P0j83J48P9R6J31l52
6667a07q7K15J17k59O8j13j5J65J02k35J69k4k26K32J9k18K13o5o1J86j5k17l7
$$ plain form
6511 -85 239 234 -59 -12 -165 82 132 66 -295 19 -86 -141 171 -63 38 84 -20 -180 245 -247 -4 -61 85
6534 85 -177 -45 216 -57 142 -19 85 -249 -114 -205 -69 131 56 -115 53 235 -162 254 2 -51 -95 -30
6556 -30 45 21 11 -28 -151 -41 -122 256 33 -105 -96 76 267 1 -80 -184 206 -82 318 61 -21 148 323
6579 323 88 -181 -51 66 118 -49 174 -187 -30 -72 26 -82 -267 -112 482 141 -214 57 139 -71 -279
6600 -279 -48 -150 -320 66 143 -39 -181 154 166 -87 324 -175 -112 113 121 -94 -10 93 31 288 18 -123
6622 -123 1 -57 -41 -38 458 -220 -56 370 -102 -221 269 48 -207 -312 88 70 -204 169 208 -14 218 -18
6644 -18 -236 85 97 -103 -217 208 65 31 245 3 -136 88 -189 -120 -1 -96 -26 -209 -61 18 114 245 -107
6667 -107 -194 21 138 -121 -53 -166 -181 -16 86 -149 20 -4 -230 2 21 -197 16 -49 -110 76 61 -156 -193
6690a93J2QJ10N2K15l70L92m9l40N4J07j00L8P6P0j78K26m96K52O5K45k86J05
6713A5J10k53q9K62L38m64RK54m98K62J14J6l36J95R6j12J76Q2m36K77%J31k10
6736f1M94p52J39M58Qk57M9j24j36J69M1r1O7r9N8Q5m6j01J47K30o8l61L26r8
6760G7J03n0J08j42k83J55j88K62p4L00k90m9K86j31j64Ln4J20q2q4L0L12L4j32
6784F7l6k33j1L07l70M69l35K6N4L41j73j8k25M24l16l38L49J06j83J74P6k53
6806i8k29K39j05J72J10k85K37J58m24Q2N19l14p6L6L40l54N8j71j15K85j18K77
6828B24m59K34kp9J07M4J81l61K21j37L5M5l74M67l63M34l27J58j55L9J24R4j31
6851A9j37M15l34J16K9oj48N2J75j83L37j81n39L02K73j91R3K24k58m8k06Q3J84
$$ plain form
6690 -193 -181 -173 -63 -11 204 -166 226 177 -163 -109 -2 -102 -64 12 82 -96 130 -366 -114 -49 196 -90 15
6713 15 125 -128 -217 45 383 -81 -72 182 -316 -54 60 76 -260 -65 31 -81 95 177 -259 18 18 149 -61
6736 -61 433 -319 -180 278 286 29 78 -46 -182 -13 28 -63 4 -95 -37 48 2 -99 48 278 210 -151 175 77
6760 77 180 130 238 96 -187 -32 -220 42 -32 268 -22 -71 215 84 -80 -77 -131 -11 -93 -177 -147 165 199 67
6784 67 31 -202 -213 94 -276 193 -142 -116 -62 279 106 88 -137 287 -29 -367 -18 88 -95 79 155 -98
6806 -98 -327 -88 -193 -21 89 -196 41 199 -225 -143 376 62 -14 22 362 8 66 -105 -220 65 -53 224
6828 224 -235 -1 -3 -82 25 69 250 -111 110 -27 8 53 -321 146 -217 217 -110 48 -107 -68 56 150 19
6851 19 -118 297 -37 79 108 102 -46 6 181 -2 335 154 -385 -83 190 -1 92 316 58 10 -196 -113 71
6874G1j16K09k56P0K02l16J63L04m21l5J67j53O8m7j14K42m63J79O3K78r8j27
6896a30n5M55p9l53J87l04L23k01L42j63m05M28k4k76J68M84l67J88n5m75L67
6917E5L11m13l88N19l26K67j1n7L32l53J34m34L97j92p4J17L29l79K90j79L05
6938B50n76L87o0NO0j3J24m06P1kj3K47l5j85K71m0p1j71L55l89J41L39n26L97
6962A60j81J77j5l26K42J06K54m99J26m8m02K90K9n0K22N7R1n3J74j71k87K65
6984A61j13j08J41P5j1j41Q3l15K78J28kj69K8r3M05n69J46J17j31L3L24j43j28
7007dr5l15J43K26K4Q8k07K7J78n9L4k4P0qL9j14K0n9j35J19L16l57J93K58m76
7032a18L71k16n4j6L31m34r6M66j87q5J06k8q1LL50l46N0J87m07J76K7J03l07
$$ plain form
6874 71 -45 164 -92 -22 180 -136 27 331 -90 -125 42 -111 -43 -90 -204 38 -425 -246 -183 95 -3 -130
6896 -130 -185 270 191 -162 25 -279 44 -157 185 22 -383 45 21 -255 -87 397 30 218 163 -312 55
6917 55 366 -47 -435 84 -242 25 14 -43 289 -64 70 -364 33 -159 -233 -116 213 -166 124 -55 250
6938 250 -326 61 1 6 66 53 177 -229 -158 -160 -173 74 39 -146 125 85 14 -157 198 -191 -50 289 -237 160
6962 160 -21 156 141 -185 57 163 417 -82 44 -4 -406 -116 -87 -137 85 142 233 180 354 183 -104 161
6984 161 48 -60 81 156 145 4 87 -228 50 178 176 7 35 -58 347 -222 -76 41 -90 -57 267 124 -4
7007 -4 -99 -414 -271 -45 -21 67 -140 -113 65 6 40 16 86 78 117 3 23 -36 -171 -52 264 -93 100 358 -118
7032 -118 253 37 -17 -33 298 -136 -232 234 47 -38 68 40 -41 -38 312 -34 16 203 -204 -28 -1 102 -205
7055b05ML99J06j45K09o99L83L51p27R8l3M32k13j53J53j69K86j49k05J35K98
7076A56r4l62M4L93l28K61k0j64N1J74k8k56J06Q6J95q3M8N7k03K87k39k60P5
7099a04J82l03L49k13J49j8l2k88N69k28J7J0L2M0k64M9p1j9K41R4m10p9J72Q0
7123d5m3J48l05J9J79j28j26N62m00J88L9k97K08p4J10k81J68K39J07n32M79k99
7145h4Q6o9O2J34J1j99r3J72k4k68J06J73j93K48q6L35j46J01l85k59O11k4l08
7168i9J45l4k19l9K72k36K31K72k54k41J38J28j62L91j02m14L91l67K97j89M56
7189C65n41oL09k40J49k1K06k90J61j01K77m50L52j2l36L60m41L85r2J08j40O0
7211F2J41l29k24L47q0j54L5O0N2K15j27k50K36k27k4M60L12m62p1Q8J61n03K53
$$ plain form
7055 -205 -201 198 304 159 368 -331 52 403 -324 -226 -259 173 -40 -193 -40 -209 77 -72 -277 -142 156
7076 156 62 -300 -256 137 -191 70 50 -114 -63 111 83 -173 -67 19 214 131 179 236 33 320 81 -179 -104
7099 -104 78 -225 124 -89 60 42 10 -278 291 63 80 90 122 162 -102 -53 -124 -143 98 192 -218 -297 -125 -45
7123 -45 -88 60 -245 -226 -47 -175 -301 261 -139 49 88 -209 -1 -75 35 -246 -78 161 268 -264 215 -84
7145 -84 2 -67 -5 129 140 -59 -152 20 -4 -272 -166 7 -186 62 -24 311 165 266 -119 -378 233 209 -99
7168 -99 46 12 -207 -246 26 -210 21 293 39 -202 -64 64 -98 293 191 -223 168 -199 98 -91 365
7189 365 -176 -182 127 -113 36 15 221 -69 92 -9 268 -182 170 158 -178 182 -259 126 34 142 2 62
7211 62 203 -126 -350 -3 -83 -237 -202 -142 -90 125 -2 -252 -16 -243 -267 193 505 43 -28 60 221 -282 -29
7234b9O8l37N04k74Q2j71K45k52K58Qk60L66l78j16j9K89J10l05K91j05j93K16
7256bn1K26k61K02n9k13O5J44l52K29L41l07J34j34J48o2Q8l05Q2L1J98m90K50
7279i8K19j11L5J32k45j09J06N7R0Q5l08o9L25L8j75j25K20J12j74J11j61l70
7301d15L49N8J37n9j05O4k34l9J03J83m9q8qL24l51J77N7O0k09J75k49lK87k6
7325A39j28N8j86L26l92K00O4n10L49j28l7L51J24J00j21k69O5j91O03p02K60
7346b5J13k9l46L65j82N7K24l06k7J8K77l5k38k9J66q6K17k02K89k36j9k64L87
7369H9N5m04K2N07k95k66N58m5n99L78J30m42L65o8J77r4j04j37K44J69l07J38
7391G1o0OL6J51o5k44O5P1j39J56K2j33j72J42K36j5M8j45k30N9K51Pl36N79l72
$$ plain form
7234 -29 39 -298 206 -68 14 -157 88 -164 94 102 -158 208 -170 -286 -305 -16 94 -211 80 -25 -218 -2
7256 -2 -53 173 -88 114 55 -158 -93 51 -301 -72 269 -38 96 -38 110 48 136 -169 -87 -56 142 -348 -98
7279 -98 121 10 45 177 -68 -177 -71 -14 76 161 -147 -216 109 147 -28 -153 67 179 5 116 -45 -415
7301 -415 -66 -8 129 70 -35 29 -205 -244 -141 42 -7 -95 -103 221 -130 47 104 164 -45 130 -119 -122 165 139
7325 139 11 69 -117 209 -183 17 81 -429 -80 -208 -245 106 230 330 209 -60 5 -186 417 -285 -25
7346 -25 88 59 -287 78 -104 -47 177 -129 -156 -138 139 104 -134 -163 3 -83 134 -68 221 -15 -34 -298 89
7369 89 144 -260 -238 269 -26 -292 266 221 -378 0 130 -312 53 -15 162 68 -36 -173 71 240 -67 71
7391 71 11 17 53 204 139 -105 -40 31 -108 48 70 -63 -235 -93 143 128 176 31 -199 -140 111 118 -218 361 -11
7416a1M0n5K5k41N77m15J1K33O1l25L9M52l37m5o2K07j47j22K63j44M6L32n06
7439a24J03k0j26K80j91J95j21K98k64j74L42Q3m45o8N01m04R0n2J90O3n1p0M9
7462H4j40P0m8J58Kk98K22o4pQ1PN2j82L27j98k7J84M4k56P8R4l31K41Q9m05K26
7488Cn7k5j06M38k96J72k13J30o0L8L65n63K18j56J6p8J70n1l7O2J66k06k10M37
7512A57k52j44M61j84l10J73P5j35R4J90j56l3j42J88j40L37j26J46j29qj92L10
7534A80k51P0M0J14j7k72N48k00m73L66j64l88O61K8l63K71K44l06l57K10m38
7555d97O22J80n60M87j89pj92K35j03o8j72L57j87O1K07l62K47K98l78m7M6k2
7577d4J30J15j73k76M07k19j54P5L04O8k82M81l79p9P0j25j0j45N06k55k43L13
$$ plain form
7416 -11 29 -26 -1 -242 335 -80 -69 164 225 -100 -61 391 54 9 -53 154 7 -115 148 4 50 382 -124
7439 -124 -21 -41 -167 113 -78 117 -4 294 30 -144 198 281 -164 -232 269 -135 -45 -97 93 156 105 35 84
7462 84 -56 14 -34 124 126 -172 50 -14 -21 60 67 119 -63 264 66 39 223 267 11 89 183 -148 93 182 -223 3
7488 3 -54 -79 -185 253 -43 129 -84 46 -14 24 389 -174 44 -112 -96 -174 -4 -55 -92 -30 136 -70 -280 157
7512 157 -95 -239 222 38 -272 -99 -24 -159 -65 125 -31 -64 -206 -18 -158 179 53 199 70 62 -130 180
7534 180 -71 -1 39 153 136 -136 412 212 -261 105 -59 -447 214 242 -121 150 394 88 -269 -59 -497
7555 -497 125 305 -255 232 43 36 -156 79 -24 -92 -264 93 -94 -33 174 -188 59 357 -21 -68 -22 -44
7577 -44 86 201 28 -248 159 -60 -214 -139 165 233 -49 432 53 -26 44 -81 -91 -236 270 15 -228 85
7599H5K4P5Nj5k77J83l50J16J88J00N2l99k5L03r7J73k72j25J29M85l69R0j57
7622g8j04K80j30j72K44p1R9J31l99K12k90L07K15l68J62M17l04k67J5J63j22
7643f0K46r0l28J78K91l73J01L2k9r5J75L8l24L06L0m17M9K47K10r2o6j31k1K98
7667A75l04J01j84L13M8j58J67r6J05m0k09n1K81k90R5k89K90m26O02j11L6J8
7689G3k57J80p3j31K02j57K98j07j79n8L20j12J05j10J28k76o4J54l82M41p9j06
7711a90R2k25L76j87j53J89r6K71P4o6j30J55k39L51l1m41J46L05m52R2L12q4
7733F9k78O2k14L01j14m6K20j96L59k05j59J54O3J02j32l3j12M54j58k10J07J28
7755A62M6P4k39Q1J11j32m31K33L19l90K98R8p0R8l59J80j60Q7K31n15K91K48
$$ plain form
7599 85 109 184 189 174 -103 80 -270 -154 34 134 186 -213 -238 65 -32 141 -131 -256 -127 358 -11 79 -78
7622 -78 -182 98 -32 -204 40 -31 68 199 -200 12 -278 29 244 -124 38 455 151 -116 -101 62 -60
7643 -60 186 96 -232 -54 237 -136 -35 -3 -32 -127 48 86 -238 68 98 -319 -270 -23 187 95 29 -102 -123 175
7667 175 -129 -28 -212 101 149 -9 158 62 167 127 -82 -133 148 -142 -47 -336 -46 -472 130 19 55 73
7689 73 -184 -4 -77 -208 -6 -163 135 28 -151 -209 111 -1 104 -6 122 -154 -218 -64 -446 -5 -84 -190
7711 -190 -98 -323 53 -134 -287 -98 -194 77 151 85 -45 110 -129 222 191 -250 -104 201 -251 -159 153 69
7733 69 -209 -147 -361 -60 -174 -220 0 -196 163 -42 -201 -47 16 118 -14 -47 -159 295 137 -73 34 162
7755 162 208 282 43 124 235 103 -328 -95 224 -166 132 230 160 258 -101 79 -81 6 237 -278 13 261
7777B61j42j71k2R8j86J52J25l66K69K16m66N44l41j62K37J0o4k69L54r1j89O30
7799D27rk03K2pk08J37k49o0K38k28P5k7R0N3j56J68P7k38J60r2j7q9K04N1l06
7824a87L94j32l43K2K77N3j15P6l8O1k87n4J22K12j29J73J5Q8n8Kj07J01J49j14
7848A81j19J00r3k38P8r4J02J74k57lj0K61O2J70j39j22p5j97L58k47O2M6J73
7871A73l63L18j95n2M4J18K7o7j04N2O0k61lL60j40J40m28J42K04J0m9j71P2J29
7895A6r7LJ37l3K73k04k36K11L4j22Q5k30J85L85l01l2k23L91n84K64J55l46L32
7918F3j42j17j68N05j37MJ2j72%R9J62k53M95m20Kj15K67j74J74l6j90j50K75
7941a6L21l10L08j60l84O38m07q5K75j00mJ47l61L14k06L79M6n59K17R8l21K55
$$ plain form
7777 261 119 -52 -74 24 -162 -10 115 -251 18 234 -232 312 -29 -191 46 56 -8 -277 77 -14 -203 427
7799 427 418 215 237 230 22 159 -90 -150 88 -140 -65 -92 -2 51 -105 63 140 -98 62 -30 -47 -136 68 119 -187
7824 -187 207 75 -268 -246 31 84 -31 45 7 68 -219 -273 -151 61 -68 105 120 208 150 152 45 146 295 181
7848 181 62 162 69 -169 -91 -185 -83 91 -166 -169 -179 82 144 314 175 53 -22 -219 139 -108 -46 0 173
7871 173 -190 128 -67 -119 -75 43 70 3 -101 -49 11 -250 -253 107 -33 107 -321 -179 25 35 -14 -185 -113 16
7895 16 -81 -78 59 26 299 95 -141 70 104 -18 67 -163 22 407 106 74 -149 242 -342 -78 77 -269 63
7918 63 -79 -196 -364 141 4 8 20 -152 -152 -53 109 -144 351 -69 -67 -182 85 -89 85 49 -141 -291 -16
7941 -16 305 -5 303 143 -241 397 -10 -95 180 80 76 223 -138 176 -30 349 395 -164 53 151 -170 85
7963H5R0l25J1l4K47k37O4J75j57J18P0j96jk16J8J63K48k14O2K08j6k32Q2L67
7987C80m25O4k49N8J24J62K08p13L69K45k49l09L46K05j65l24N37q2k23k64K97
8008hK76m72K19NJ42n20L10J80l21K48J75l33n2J47J78j48j77J47l7j95J09j33
8030b60M29l53K57Q1Q8k44Q2j90K9K00r8N7j37K41l51K36j94L58k78j48J69n1
8052g7K42k76J11K12l55J15J83k31M60k81k43K42P5q4R1j96q7O2M2J10n7j1L7
8075H4l09K42J11j62J42k37M7R7k42oN00l96m5J98pp9j07J03J81lJ30l99j2k7
8099a96J95l36J18K91r8J49j23L14l37O8O7P0k14J73l70J57J37l49K88Q3j32n5
8121a00J84p8k3J44j21K70k73P4l13N0L88j55j83K59j69J44K1Q9k50OKQ9j3O9
$$ plain form
7963 85 175 -150 -139 -173 74 -163 -99 76 -81 37 107 -89 -90 -306 -288 -125 123 -91 -29 179 163 -69 13 380
7987 380 -45 19 -230 -172 -48 114 322 -391 -22 223 -26 -335 11 216 51 -273 264 182 -41 -305 -8
8008 -8 268 -204 15 20 162 -358 -48 132 -189 59 234 -99 -151 -4 174 26 -151 -4 -41 -236 -127 -260
8030 -260 169 -184 73 154 242 -2 80 -110 -81 119 21 78 -59 182 -169 67 -127 231 -47 -195 -26 -77
8052 -77 165 -111 0 212 -143 -28 155 -76 384 103 -140 102 177 93 184 -12 -99 -37 5 115 58 47 84
8075 84 -225 17 128 -34 108 -129 -82 15 -227 -233 267 -129 -174 24 17 -62 -169 -66 115 112 242 -157 -169 -196
8099 -196 -1 -337 -219 72 -26 123 0 314 -23 45 112 182 -32 141 -229 -72 65 -284 4 87 -45 -100
8121 -100 84 6 -17 127 6 276 3 77 -236 -186 202 47 -136 123 -46 98 119 208 -42 -36 -34 55 42 111
8145A11N0k40J76j59o4K98O7n43N70L2m33m5L16j32j36P7L3P8N2J25j22J02p3
8168A40m2n5m1J47l04K04K95m24j04K41j55K99j68qK6j8j31K43r0r1j18n5L58
$$ plain form
8145 111 161 -79 97 -62 -126 172 239 -304 266 298 -135 -180 136 4 -132 -55 -22 56 108 233 111 213 140
8168 140 98 43 2 149 -155 49 344 -80 -184 57 -98 201 33 25 51 33 -98 145 55 -36 -154 -209 149
8191A49
$$ Imaginary data points
##PAGE= N=2
##DATA TABLE= (X++(I..I)), XYDATA
0@%%%%%%%%%%%%mJ2j6J6j6J6k2L0l2L6m4M9n7O6p4Q4r5J09j21J34j51J69j89K12
36A12k35K60k89L20l55L94m36M82n34N94o61P35q22R23j042J188j365J588j881
55a024K285k879L832n608J0005l7368p6736P6174L9473j5623o643j6916j2855
68d3883N1472R621o3570j2781L0707j0927J4890L9654l0204l8270K6666P297r864
81b9192K9194q868m6228L5541N3954l1572l7092J777r751K5732N4180k4121m8181
94c4627L0624K6652k1770q04j2300m0530L2535O1737j8545l1157J0505j3789o016
107a7485L6621j2983m7310K1090L3160j1916O676j856n0606O83N6186j087k5181
120a4008R271j4274j2290M0877k05n9775M3M3563Q364J3079N599m9952j4651N0409
$$ plain form
0 0 0 0 0 0 0 0 0 0 0 0 0 0 -4 8 -8 8 -8 8 -14 16 -16 20 -24 25 -32 34 -40 44 -51 58 -63 71 -80 89 -100 112
36 112 -123 137 -152 168 -187 207 -229 253 -281 313 -348 387 -435 488 -554 634 -731 857 -1024
55 -1024 1261 -1618 2214 -3394 6611 -30757 -107493 -31319 8154 -7469 -14112 -31028 -43883
68 -43883 7589 17210 -46360 -59141 -28434 -39361 -24471 15183 -15021 -53291 -26625 -19328 -29192
81 -29192 2 -8866 -55094 -19553 34401 2829 -34263 -32486 -42237 -16505 37675 13554 -34627
94 -34627 -4003 22649 879 75 -12225 -52755 -20220 41517 22972 -8185 2320 -11469 -17485
107 -17485 19136 6153 -41157 -20067 13093 1177 7853 5997 -44609 -43926 12260 11173 -14008
120 -14008 -4737 -19011 -31301 9576 9371 -50404 -50361 -6798 1566 14645 20244 -29708 -44359 6050
134F050J43l6151R951Q022l393M1198J3067n4947j3146L0386m612N991K5299k8591
148g33k3763M2060J4261l0395n52l718j6483M1080L6581m5288l2626K1087N84
161B095L40J9682k6140k5754M8685K9192l5873j5992l861k3507J9492L6164k6698
174b175k1061K8256N85j1863J9604j7069m2058K2552L7505j2155k963p22l3625
187c5189Q277M6745j5319l7589J6785J6284K238K1400j8150n3441J4011M5813
199A1865p686q265J1194j6674K159L7847j7460m4772J1457J6739m917K6488J0299
212B8274m1615n839L1240q513r964J1852k1620j0533M6481J0388m4121r539P908
225a5601m560K7898J7185m3310j3660M0284J838k3839k96j6667r709M4941K0421
$$ plain form
134 6050 6193 -29958 -20007 -11985 -15378 25820 38887 -16060 -29206 1180 -3432 2559 27858 -733
148 -733 -24496 17564 31825 1430 878 -2840 -19323 21757 58338 13050 -19576 1511 2095
161 2095 2435 22117 -4023 -29777 18908 48100 12227 -3765 -7626 -31133 -11641 24523 -2175
174 -2175 -23236 5020 5605 -6258 13346 -3723 -45781 -23229 14276 2121 -842 -1564 -35189
187 -35189 -26912 19833 4514 -33075 -16290 -6 2232 23632 5482 -47959 -33948 11865
199 11865 4179 -4086 7108 -9566 -7407 30440 12980 -31792 -20335 -3596 -8513 17975 28274
212 28274 -13341 -19180 12060 3547 -6417 5435 -16185 -26718 19763 30151 -13970 -23509 -15601
225 -15601 -20161 7737 24922 -18388 -32048 8236 10074 -13765 -14061 -30728 -40437 4504 24925
238B4925l6505o353J3838j5696N124J9811k7984j6841L6061J2375j1786R618j5995
251i408l2057K6816L3565k1636j2571J1021r226J0571K6975l0035l6259K9163
263a3081K7893n264N624j1323l2472J8299L1603k5415j9813J8625J946N908K7619
276C0149j8085m0799J2002J7989r460J0862N945k9257N749L7014j1696k7282L686
289a3183o345K758L8338j505m4145J875K4295o697J793M228k6823N196M4090l615
303B0260l1595P03l883q262K8718J1434l1912J682K5512p532k439Q090k9356j3728
317c2308L8773J4429j9392J375n299j5878K4821J6910l5447j3321K7881O531K16
330I291P598k8650k2231L2895J8222k2554P2O808j2498J4636J6970l1311k0453
$$ plain form
238 24925 -11580 -17933 -4095 -19791 -14667 5144 -22840 -39681 -3620 8755 -3031 6587 -9408
251 -9408 -41465 -14649 18916 -2720 -15291 -4270 -13496 -2925 24050 -5985 -42244 -13081
263 -13081 14812 9548 15172 3849 -28623 -10324 21279 -4136 -23949 -5324 -3378 2530 30149
276 30149 12064 -28735 -16733 1256 -8204 2658 8603 -20654 -14905 22109 10413 -16869 -13183
289 -13183 -19528 -16770 21568 20063 -24082 -22207 2088 -4609 -2816 1412 -25411 -20215 23875 20260
303 20260 -11335 -10632 -14515 -22777 5941 17375 -14537 -12855 12657 5125 2686 10776 -18580 -32308
317 -32308 6465 20894 1502 2877 -2422 -18300 6521 23431 -12016 -25337 2544 9075 9291
330 9291 16889 -11761 -33992 -1097 17125 -5429 -5357 1451 -11047 3589 20559 -10752 -31205
343c1205K1710N723N41K0902j2845l0427J6766K0163j7089m895L023j4575J7184
356e024L4091k0613l2997J0753Q813l5J7503q380k8801J8255K9166j7688j5506
369a0463L541j1407Q800L3197r378k7718J0631O453j1133J2000K042k7843O897
382a4381L1386m786r735K636k1267p084L3431N114k8505K595J2139m081J3164
395A0626R37l6566m155L5898M478j2200M320j2568r627K6186M852l0396J166J7793
409G44l300J0267J1839k7916j6044K3684N237q264J0728p219j5679K3772J7477
422B5326k6783j3455R199k001J2857K1312k1830k3829K1175J1519j2912J281n065
435c206j4805K2154K4155k2261j7172Q556n090J742J9909j0588k1906J6708J4228
$$ plain form
343 -31205 -9495 -3772 -3231 17671 4826 -25601 -8835 11328 -5761 -10656 -7633 -22208 -5024
356 -5024 29067 8454 -24543 -13790 -4977 -5012 12491 4111 -24690 -6435 22731 5043 -10463
369 -10463 -6922 -18329 -9529 23668 14290 -13428 -2797 3656 -7477 4523 6565 -21278 -14381
382 -14381 17005 12219 2484 5120 -16147 -23231 10200 15314 -13191 -10596 1543 -2538 10626
395 10626 11563 -25003 -29158 6740 11218 -982 3338 -9230 -18857 7329 12181 -18215 -17049 744
409 744 -2556 7711 19550 -8366 -24410 -726 4511 -3753 6975 -244 -15923 7849 25326
422 25326 -1457 -14912 -5713 -7714 5143 26455 4625 -19204 1971 13490 578 1859 -3206
435 -3206 -18011 4143 28298 6037 -11135 -2579 -7669 -5927 13982 3394 -18512 -1804 12424
448A2424j2065J437l167k3397J0132L0753q208j6330N785n915j219K0840p464
461C606k9336J1816K3518l838M25j783k3986K088K9216m754j7380R652J529m479
475c706J8782o03l0458P77K0593j976L869Q246k1106q627K6544K133k0134J653
489d013M13m025K2765Q585l1757j0491J8749M15l15P822j6329r250K6842O753
503A6164k4001l943J829p779J6158J6847k0713j2042J5891j280m252J0183j2550
516i488j7287K1475J8750j3983n065j169j2665J1939K2862j6199j7863J4892Q686
529D885l223P502j2065k2094J7491K4286j0838o584N024r963K989J9072j2942
542C540k0468J2503J0186k916J1280k418k5363L509K0400o235o425M908j0912
$$ plain form
448 12424 359 1796 -1371 -24768 -14636 16117 7909 -8421 -2636 -8551 -9770 11070 3606
461 3606 -25730 -13914 9604 5766 6191 4408 -19578 -17490 11726 6972 -10408 -756 773 -3706
475 -3706 15076 14473 -15985 -15208 5385 3409 7278 15524 -5582 -14209 12335 14468 -5666 -4013
489 -4013 -3600 -7625 15140 23725 -8032 -18523 226 641 326 8148 -8181 -17431 9411 16164
503 16164 -7837 -11780 -9951 -17730 -1572 15275 -5438 -17480 -1589 -2869 -7121 3062 -9488
516 -9488 -26775 -5300 13450 -533 -5598 -6767 -19432 -7493 15369 -830 -18693 -3801 4885
529 4885 1662 9164 -2901 -24995 -7504 16782 5944 -640 4384 -5579 -2590 16482 3540
542 3540 -16928 -4425 5761 2845 14125 11707 -13656 -10147 10253 4018 -2407 2501 -8411
555h411k65K5000l949k7106J612J0275l63J1975K147k6052p12K3954l526j3697
569i118L415n919n17K4975L038k4910j869R389n731P337R543j8681n145K3683
583I490L525j0741K161q907r864K1694J3635j9706n919R203l598O674J0203j9041
597a191j2789K2793J0701j0388n46o901j3440J5291J5371j7284p922J1981j294
610D382J609J1352j5724k0310J4211J1990p221L688j563j5569R456J8663j3730
623A234j5215O775M70K493J5919r290k3364R573J5363o653Q07J733j4260O242
637h173K1649r648j8089N020R44m38J7702N89k1111L950J5082n944k089K561j5531
652a3526m09K5468J127j6581J705K66m581J4801L988k2735k101J8296q34l654
$$ plain form
555 -8411 -8676 16324 12375 -14731 -13119 -2844 -3207 8768 10915 -15137 -15849 8105 4579 -9118
569 -9118 -5703 -11622 -12139 12836 15874 -9036 -10905 -1516 -7247 90 9633 -9048 -14193 9490
583 9490 13015 2274 4435 -4472 -14336 7358 20993 1287 -4632 4571 973 7647 17850 -1191
597 -1191 -13980 8813 19514 9126 8580 1679 -11761 3530 18901 1617 -6305 5676 4382
610 4382 5991 17343 1619 -18691 -4480 7510 289 3977 2414 -13155 -3699 14964 1234
623 1234 -13981 -7206 -6736 -4243 11676 2386 -20978 -11405 3958 -2695 -1888 -155 -14415 -8173
637 -8173 13476 3828 -14261 -9241 -8297 -8735 8967 9556 -11555 -7605 7477 1533 -556 2005 -13526
652 -13526 -13935 11533 12660 -3921 -2216 -1950 -6531 8270 12258 -10477 -12578 5718 4884 1230
666A230K869j4172o165K2513N666j6220J95K516p600R062P520j9342o962J6662
680b228L217j295P064j2157j4234J5730J0141j3448k595L725n598J1333J4036
693A3691j7034j4396J3245N943j807O639p683j4479J4219J4151j2375n665N178
706c73m389O876J6382j1744j6228Q111N468m741Q585j959j5324R468J8027q001
720A0158q696J463r707J764J9597m469j8473N402Q422k746N728j439j9302L183
734i115K0285m194j0318K369o673k349J7466M32j7672L089R985l766M198K132
748E869j8814l552J8903K120p411M775m460n754J5617N058j9235l934R589j039
762b268O338P747j5553q344J7489N142q700J348l655p298J3799R698j6901p661
$$ plain form
666 1230 4099 -10073 -16238 6275 11941 -4279 -4084 -1568 -9168 -106 7414 -11928 -18890 -2228
680 -2228 989 -306 6758 -5399 -19633 -3903 6238 -7210 -9805 -6080 -11678 -345 13691
693 13691 -3343 -17739 -4494 1449 -358 6281 -1402 -15881 -1662 12489 114 -5551 -373
706 -373 -4762 2114 18496 6752 -9476 -1365 4103 -638 7947 5988 -9336 132 18159 10158
720 10158 1462 2925 -6782 -5018 14579 10110 -8363 -2961 5461 2715 8443 7004 -12298 -9115
734 -9115 11170 6976 -3342 -973 -7646 -9995 7471 7903 -9769 -6680 3305 -461 3737 5869
748 5869 -12945 -16497 2406 4526 -2885 1890 -2570 -8324 7293 12351 -6884 -10818 -1229 -2268
762 -2268 4070 11817 -3736 -12080 5409 10551 1851 3199 -456 -7754 6045 15743 -1158 -8819
776h819R254j76L552J0191j1399j2854J2615P484r668l67k287j0147J1583J6244
790A5206j1731j0836O022q10j98J0004q586j6472J1328J2476o243o47p17j1409
804a2613O361J6811q073j2720N904M29j870J1664l237j7051O877J4619l039r88
818C074J155j3284M76J7453k724j3371L755L729j164J2417O26j9421p53J4449
832F417k333k499L145j0355k651J7846J452j4655J143K985l855R435N003j7707
846f629m964J2889L49k566N312q644p027J6135O496j4036l707J574m256Q823R603
861I352j3725p977J3439L892m141L527p337j0611J3069J0851j1012m152M660m428
875d593N567J1952j0496j1826J0445M870m234M100l839j3279R426J3996p108n377
$$ plain form
776 -8819 435 259 3811 14002 2603 -10251 2364 9848 180 -187 -2474 -12621 -1038 15206
790 15206 3475 -7361 -1339 -2149 -2347 7657 -929 -17401 -6073 6403 160 -487 -1204 -12613
804 -12613 -6252 10559 2486 -10234 -4330 -3901 -5771 5893 2656 -14395 -7518 7101 4062 3074
818 3074 4229 -9055 -8579 8874 6150 -7221 -3466 263 -901 11516 12142 -7279 -8032 6417
832 6417 4084 1585 4730 -5625 -8276 9570 11022 -3633 -2490 495 -3360 6075 11078 -6629
846 -6629 -11593 1296 1645 -921 4391 -4253 -11280 4855 11351 -2685 -6392 -4818 -9074 -251 9352
861 9352 -4373 -12350 1089 4981 840 4367 -2970 -13581 -512 10339 -673 -4825 -165 -4593
875 -4593 974 12926 2430 -9396 1049 5919 1685 5785 1946 -11333 -1907 12089 4981 -396
889c96L654n239K051J2711q105j5540O524P784k089N083j123j3912M265J4880
903A0548n695q951K588l793k30J3861j942j5478L471Q622k900M198J690j4232
917h243p25J5561j962q605K841k723k454J4459L596j5786j456Q501k587K417M408
932G242j2928l946J5824L195q307J806k878n654J1481O238j4382m834Q467p45
946E79K118O440j0802q260J3128N928q382L2k044q079R130J0248j1343o959Q278
961A2J07R17P588q466j2181R427Q563o845M18L26p614O313J3266q314j0306O033
977g56O92q05Q961m232j3875O457J1533m391j076J285r025K998J4514n683j2043
992e446L767K099j244R389o61j4848K807J2080l524l156J627q854j253J4512k16
$$ plain form
889 -396 3258 -1981 70 12781 4676 -10864 -4340 3444 1355 6438 5315 -8597 -4332 10548
903 10548 4853 -4098 -1510 -5303 -5533 8328 6386 -9092 -5621 3001 101 4299 5989 -8243
917 -8243 -8968 6593 4631 -3974 -1133 -3856 -6310 8149 11745 -4041 -5497 3004 417 2834 7242
932 7242 -5686 -9632 6192 9387 1080 2886 8 -5646 5835 12073 -2309 -7143 1324 579
946 579 2697 9137 -1665 -9925 3203 9131 749 781 -1263 -9342 -212 10036 -1307 -8266 12
961 12 119 1036 8624 158 -12023 -2596 5967 -878 -460 -134 -7748 -1435 11831 3517 -6789 -756
977 -756 -64 -869 8092 3860 -10015 -3558 7975 3584 2508 3793 -5232 -2234 12280 6597 -5446
992 -5446 -1679 420 -824 8565 7904 -6944 -4137 7943 4419 1263 2890 -5964 -7217 7295 7079
1007G079j1786J969K566k645P890K843j4862k311J1895m89l307L321p457m039
1021i333J4098M189j1677j212L437l323O677N766j2679n729J2180K590l106L549
1035E427n795p054J1336P458j1120k778L670l554N207R234j0319q610R803L680
1049F585l867L309m172j0054Q606J0149q493m787L816l764K810J0456p940j2304
1063i650O732O046l527L396j956j1226N628J3022o089o804L278l005J26J1388
1077G359l656j3063M242P607k278K768J207j1332J612J3772k947p714K450k048
1091b021j427J1745Q45j3308J060Q201k495J925K469j0691k402J3586Q93q379
1105AJ298j605l788J0469L780j2978k203P490j474J002L752r631n543J2152M276
$$ plain form
1007 7079 -4707 -2738 -172 -2817 5073 7916 -6946 -9257 2638 2149 -1158 2163 -5294 -9333
1021 -9333 4765 8954 -2723 -3935 -498 -3821 2856 8622 -4057 -9786 2394 4984 1878 5427
1035 5427 -368 -7422 3914 11372 252 -2526 1144 -2410 2797 12031 1712 -6898 2905 6585
1049 6585 2718 6027 1855 -8199 407 10556 2063 -2724 1092 -2672 138 10594 2654 -9650
1063 -9650 -2918 3128 -399 2997 1041 -10185 -4557 8465 2376 -4428 -1150 -4155 -4029 7359
1077 7359 3703 -9360 -5118 2489 211 2979 4186 -7146 -5534 8238 5291 -2423 27 -2021
1091 -2021 -3448 8297 9142 -4166 -3106 5095 2600 4525 6994 -3697 -6099 7487 8380 1
1105 1 1299 -306 -4094 6375 10155 -2823 -5026 2464 990 1992 5744 -3887 -9430 2722 6998
1120F998q159P1o67n782Q199O882j1568m734P658N77k25N830p724q474R814O714
1136E410o672j95O00n946N973J0144q981p711P168J254k37O703m404j1129P374
1151f49Q757n468j615J723o473L501J1877o120r799M321K144j841P229j798j1977
1166f188M075R969m329l103J728o853L07J2517k482j0696K306L010l056N910J328
1181D443j1721J75J1058k068l006K065o493k684J2089J635r979P28L437k400N249
1196B528L812j1344k993J0804J261l361K986m860n161J0561M768j0213r89M448
1210B247k478M458N686r540o852R478K647l910L382l340p055P942P379q797m096
1225b849L765l468L128Q281p388r436P230L968l935K445j827q511O230J0011p369
$$ plain form
1120 6998 -1161 -1090 -1757 -7539 660 7542 -4026 -8760 -1102 -525 -750 5080 -2644 -11118 -1304 5410
1136 5410 -1262 -1457 -857 -6803 -830 9314 333 -7378 -210 1044 807 7510 3106 -8023 -649
1151 -649 8108 2640 1025 2748 -3725 -224 11653 5533 -4266 55 2199 358 7587 5789 -6188
1166 -6188 -2113 7856 3527 424 2152 -4701 -4394 8123 5641 -5055 -2749 261 -2795 3115 4443
1181 4443 -7278 -7103 3955 1887 -1119 946 -5547 -8231 3858 5493 -4486 -3758 -321 -2721 2528
1196 2528 6340 -5004 -7997 2807 4068 707 3693 -1167 -6328 4233 9001 -1212 -2201 2247
1210 2247 -231 4227 9913 373 -6479 2999 5646 1736 5118 1778 -5277 2665 10044 1247 -2849
1225 -2849 916 -2552 576 8857 1469 -7967 -737 3231 -704 1741 -86 -8597 -2367 7644 275
1240B75n956L405k819Q76R219l761j0292N595N974l627J916j54r411L033J1678
1255E951l206n964K852j890j095R470j074j1160K677P459j976J329J409r190o82
1270e090J1787k95p170J904m02k804Q170J486j2054l44P334r59J090L342q813
1285b818l662J0145J385p739P07j84l463P975M601j0610l508O406k87Q9M171o872
1301c664n789R684M360p357k14N42m038O362P897q631n818O425j2q57M919l878
1317f9p768Q061P200n482j421J184o354L899Q964n798o945M987K345j322N054
1332F535l288r750M759R018m526k660J797n338R64R267l816q589M087L195k067
1347d12M492n90j0687J238Q788k124k407K830m757j004J0029n49j0538Q47L919
$$ plain form
1240 275 -5681 -2276 -5095 -4219 5000 1239 -9053 -3458 2516 -1111 805 651 -8760 -5727 5951
1255 5951 2745 -3219 -367 -2257 -3352 6118 5044 -6116 -3439 4020 2044 3373 4782 -4408 -5090
1270 -5090 6697 6402 -768 1136 734 -2070 6100 7586 -4468 -4812 2522 1563 2653 5995 -2818
1285 -2818 -6480 3665 5050 -2689 -1982 -2166 -5629 2346 6947 -3663 -7171 -765 -1052 -963 3208 -3664
1301 -3664 -9453 231 4591 -2766 -2980 -2438 -6476 -114 7783 -848 -6666 -241 -253 -1110 3809 -69
1317 -69 -7837 224 7424 1942 521 1705 -4649 -750 8214 2416 -4529 458 2803 1481 6535
1332 6535 3247 -6503 -1744 7274 2748 88 1885 -3453 -2489 6778 2962 -5627 -1540 1655 -412
1347 -412 4080 3490 -7197 -5959 2829 705 -1702 1128 -3629 -4633 5396 4847 -5691 -4844 -925
1362i25k117N396K227r827o99R802p61m144K085l566k249R409K429r687o31M326
1378A068k518L624M962q316l238Q790N18m562K022l390n165Q072O335p478k581
1393a857L620k596J912N332p867o533Q289L708l651J572k446o003N989O765o692
1408d58l769L778j608J44O139m858p891O177N137k991K343j35p733K619Q183m587
1424D90n607L725p30O11Q181k285j0072K829N768k780O29J242o596J560R670k954
1440C681o706K625j74j794P167L81r154M89N804k862K59K956o683r41R798O30
1456E476p048R29j542l305O866L082q511j172P664n16r60K181o886l700R148K708
1472D414o660P98J359l695M984M732p847l053O736k74j023M165n000o747O989
$$ plain form
1362 -925 -3042 2354 4581 -5246 -5945 3857 3096 -1048 1037 -2529 -4778 4631 7060 -2627 -3258 1068
1378 1068 -1450 2174 7136 -1180 -4418 4372 4890 328 2350 -1040 -6205 1867 8202 724 -1857
1393 -1857 1763 -833 1079 6411 -1456 -7989 300 4008 357 1929 -517 -6520 -531 6234 -458
1408 -458 -4227 -449 -2057 -1913 4226 -632 -8523 -2346 2791 -200 2143 2008 -5725 -3106 5077 490
1424 490 -5117 -1392 -2122 -1511 6670 4385 -5687 -2858 2910 130 759 2001 -4595 -3035 6635 3681
1440 3681 -3025 -400 -574 -2368 4799 5180 -3974 -3485 2319 -543 -284 2672 -4011 -4952 4846 5476
1456 5476 -1572 -643 -2185 -5490 1376 4458 -4053 -5225 2439 1923 963 3144 -3742 -7442 1706 4414
1472 4414 -2246 -1448 -89 -3784 1200 5932 -1915 -4968 1768 1494 471 4636 -364 -7111 -122
1487a22N155n136l3J977m324L979O137p164o831M934J778l38M753k852p197N702
1503D18O051o254k605K219l894K694P349m194o964M277J663k308M555l28p794
1518e115K804O838l503k900J092l853K90R852l92p716J437K446k230L084J14q539
1534f291J483R562j043l577J915l668j814P437N07p849J278L819k365K637K533
1549D564p884k266Q130N84k831K303l473m619O789L040p801p75M009m31K903L761
1565F003p561n160O753K051m648K013n46l886O660M517p319l096L636j569J043
1580a109N359m593n692N963K938l681K043n21n765M832P398m959n055K550j714
1595b006O65N842k694o909N323N533l662o88m02n903K260P595l174m499L611K64
$$ plain form
1487 -122 5033 -103 -136 1841 -2483 1496 7633 469 -6362 -1428 350 12 4765 1913 -5284 418
1503 418 6469 215 -2390 -171 -4065 -1371 5978 1784 -5180 -903 760 -1548 3007 2679 -5115
1518 -5115 -2311 4527 1024 -1876 -784 -4637 -4347 5505 5113 -2603 -1166 1280 -950 2134 2248 -6291
1534 -6291 -4808 4754 3711 134 2049 -1619 -3433 4004 4511 -3338 -2060 1759 -606 2031 4564
1549 4564 -3320 -5586 2544 3128 297 2600 -873 -5492 1297 4337 -3464 -4239 -230 -661 2242 6003
1565 6003 -1558 -6718 35 2086 -2562 -549 -1095 -4981 1679 6196 -1123 -4219 -583 -2152 -1109
1580 -1109 4250 -343 -6035 -72 2866 -815 1228 707 -5058 -226 7172 2213 -2842 -292 -2006
1595 -2006 -1341 4501 1807 -5102 221 5754 2092 1404 1002 -4901 -2641 4954 1780 -2719 892 1156
1611A156k081M757j126p716K116N491k448N97J532o354j002Q141k65n234J598
1626h38K71j282N438L25r388m98O583R1K4K048m590j724P643l20p292R41J811
1643g57j770N193L192o695k054N125j265j164L820m093m007O699L201n561l45
1658d81L66k927M436N752o542m273N376J11k332K416l397m354O769N310n333j527
1674f30J472l782J537M859m986l820N282J209k035L191j634o629L018N930l093
1689a11j260J827m115P01O778k729o514K954L962j227K867o61p178J101O442k559
1705B78k386K536j270J42O212j585o782J065K801k266K792K252n644n34N949j164
1721B396l002J516l004j249O700J816p252p25K669j421K056K157n514j838P094
$$ plain form
1611 1156 -925 3832 2706 -5010 -2894 2597 149 746 2278 -4076 -5078 3063 2798 -2436 -838
1626 -838 -567 -1849 3589 3914 -5474 -5972 611 702 726 2774 -1816 -3540 4103 3783 -3509 -2568 -757
1643 -757 -2527 2666 5858 -837 -2891 2234 969 -195 3625 -468 -4475 2224 5425 -136 -481
1658 -481 -115 -3042 1394 7146 604 -3669 1707 1818 -514 1902 -1495 -5849 920 6230 897 -630
1674 -630 842 -2940 -1403 3456 -1530 -5350 -68 1141 -894 2297 663 -5966 -2948 2982 -111
1689 -111 -1371 456 -3659 -2958 3820 1091 -5423 -2469 1493 266 3133 2472 -4706 -3605 2837 278
1705 278 -2108 428 -842 -700 5512 3927 -2855 -1790 1011 -1255 1537 3789 -1855 -2389 3560 2396
1721 2396 -606 910 -2094 -3343 3357 5173 -2079 -2804 -135 -1556 500 2657 -2857 -4695 2399
1736B399P19m463M30j791k820N293L639n735m81L856k274K04L680m988l863N449
1752g46K750k453J862j173m700L888N571n060k825L352m93J162L752m196n723
1767e032M953M106k881J074L53l973K270N247m917m093L278P0m0M718j171o350
1783b388K138L233l046N20J344m431N54O513j338n133P94k66p48N151n7o939J350
1800b749N157j722j456N56l459j49P515k25n378J535O01k500L168J633n241L9
1816b675N409o49p01J722m076l170O088K122m319O61R24k248L453K772o516k395
1832c598N509Q14p27J366l294l417M800K433n091j85K215j666J850L583n351l945
1848d704L944N05j430L237q99m573K901M056l829j802J013k552J955O166l235
$$ plain form
1736 2399 3118 -1345 -915 -2706 -5526 -233 3406 -2329 -2810 1046 -1228 -1024 2656 -2332 -6195 -746
1752 -746 2004 -449 1413 240 -4460 -572 4999 -61 -2886 466 -27 1135 4887 691 -5032
1767 -5032 -79 4027 1146 2220 2573 -1400 870 6117 1200 -2893 385 455 415 5133 3962 -2388
1783 -2388 -250 2983 -63 457 1801 -2630 -2076 4437 3099 -2034 -1240 -1506 -2254 2897 2840 -4099 -2749
1800 -2749 2408 686 -770 -214 -3673 -3822 3693 3468 -1910 -375 226 -2274 894 2527 -2714 -2675
1816 -2675 2734 2085 1384 3106 -970 -4140 1948 4070 -249 412 1336 -912 2541 5313 -1203 -3598
1832 -3598 1911 2725 1998 3364 70 -3347 1453 3886 -1205 -1390 825 -841 1009 4592 -759 -4704
1848 -4704 -760 -255 -1685 1552 653 -3920 -1019 3037 -792 -2594 -1581 -4133 -2178 3988 753
1863G53n133K620K074j585K021j079m613L695N406k864l147J316j509j39N367
1878C183j023m299K523K223k468J561M52n187N90N648n16j852J457k522j959N115
1894B926M94n828P34L638p28J315L06n695r69N880Q1l067J497o46k097M438N24
1911B803n631o7L508j064P78L194m228k621M002P17k636J037M7k611M417L815
1927E460n271k635K329m84J324L394l376l146M540K178l408o14M15k720L261M289
1943E536l939k362K954j020j023K854j510m374L622L108k513M49km107O18N406
1959C697j985l519K150K56q51L086j429n661J789M844j263q69J290l404m24M739
1975B446j555m053K069J737j392L029M06n134P9L574j063l10K329k810j495M922
$$ plain form
1863 753 -4380 -1760 314 -1271 750 -329 -4942 -1247 4159 1295 -1852 -536 -2045 -2184 3183
1878 3183 2160 -2139 384 2607 139 1700 2152 -3035 -2445 3203 2687 835 2292 -230 -2189 2926
1894 2926 3420 -2408 -1674 1964 1236 2551 2857 -2838 -3807 2073 2154 -913 584 -62 -2159 2279 2803
1911 2803 -2828 -2895 613 -451 327 3521 -707 -3328 674 1391 -1245 -208 -161 -2772 1645 5460
1927 5460 189 -2446 -117 -601 723 4117 741 -2405 2135 4313 905 291 706 -2014 1247 5536
1943 5536 1597 -765 2189 1169 146 3000 1490 -2884 738 3846 1333 1782 1780 -2327 -1709 3697
1959 3697 1712 -1807 343 599 -252 2834 1405 -4256 -2467 2377 1114 245 1535 -1869 -2293 2446
1975 2446 891 -3162 -1093 644 -748 2281 2687 -2447 -2368 1206 143 -167 2162 -648 -2143 2779
1991B779O02m430n1P01o02L557J924n163j442M101j85j946J189j693j406M880
2007B815J548m523o75J078j912J768K891l403j715L726l51j414J292j589l555
2022d019L281L855k928q88O89k018J311L816l440l592L370K340q73Q36j421m060
2038c741K942L757k567j373K270q86k26L181k020m245K199K033j321K210O78m058
2054a167J83M240j698j993J068j287J3M530o77n163N08K385o97J155R25l927N09
2071a093M226j091l761J077n02r11M080J018m134J86K602k050L29J550l254j429
2087c157M772J045k495N98j293j817L396K090l916q48K705m53J81J359l522k122
2103c477M922J823k626M09L2k276J791K078l508j713L678k56M2K399k256l761
$$ plain form
1991 2779 3381 -1049 -1100 -399 -1001 2556 4480 -683 -2125 1976 1791 -155 1034 -659 -2065 2815
2007 2815 4363 -160 -835 243 -1669 99 2990 -413 -2128 1598 1247 -167 1125 -464 -4019
2022 -4019 -738 3117 189 -699 -10 -2028 -717 3099 -341 -3933 -563 1777 904 1740 319 -3741
2038 -3741 -799 2958 391 -982 1288 402 176 3357 1337 -2908 -709 1324 3 2213 2891 -1167
2054 -1167 -984 3256 1558 -435 633 -654 -641 3889 3212 -1951 -1443 942 245 1400 2325 -1602 -1093
2071 -1093 3133 2042 -1719 -642 -1144 -2055 2025 3043 -1091 -905 1697 -353 -24 1526 -1728 -3157
2087 -3157 1615 2660 165 763 -530 -2347 1049 3139 -777 -1625 1080 627 808 2167 -1355 -3477
2103 -3477 1445 3268 642 1051 1083 -1193 598 2676 -832 -2545 1133 877 919 3318 1062 -2699
2119b699K035K267j851J93N20k416J836L616k651l334J612O26k41K715j460l966
2135c198K026L381k234r04P90j631J215L575j534l448J756j08p89J991Q42l321
2151a591J427L011j270j057P48k836q69M684L15k931O44O09j260K510K52l923
2167a537m7M224m25j746P63k256q33L576M92l320Q22J758j329Q08J134l849j239
2184c004L244J42n78J949j248k614K558J887l320n95J021j000K057K559l282k714
2200b938L190R62j316J194j095j823K751K619l695j420J778o24O20K805j150k957
2216a099J982Q21k006J219r7l152J686L956j521j717O27j408m93L092r95l586
2232b691J469K347q01K02k17l116R76L380r65k357J539p71q97K235m02k573M70
$$ plain form
2119 -2699 -664 1603 -248 -55 465 -1951 -115 3501 850 -2484 -872 -246 -487 2228 768 -3198
2135 -3198 -1172 2209 -25 -929 -139 -1770 -555 3020 1486 -1962 -206 -314 -1103 888 1730 -1591
2151 -1591 -164 2847 1577 520 1268 -1568 -2437 2247 2562 -369 275 884 -376 2134 2386 -1537
2167 -1537 -1584 2640 2215 469 1232 -1024 -1857 1719 2211 -1109 -287 1471 142 950 2084 -1765 -3004
2184 -3004 240 382 -196 1753 505 -2109 449 2336 -984 -1579 -558 -1558 499 3058 -224 -2938
2200 -2938 252 1214 -102 1092 -3 -1826 925 3544 -151 -1571 207 -417 203 3008 1858 -1099
2216 -1099 883 1704 -302 917 820 -2332 -646 3310 1789 72 699 -709 -1202 1890 895 -2691
2232 -2691 -1222 1125 324 526 309 -2807 -1831 1549 584 -1773 -234 -1005 -1902 333 -69 -2642 -2172
2249b172L034j318P19J226l143j322L316K97j963J384k16r15K806J337m213p87
2265a930K520m68M17J284k370j045L614N63k863K96M22j599K694J565k874j631
2281a405K042o75k55K189j643k285K876J592k375l43k65k095J610L284k180j850
2297a778J688M25p22J691j884k771K011K937j664j061P98j427P33K846j643k301
2313b122K117O80r24J546m15l394J107L211q99k71J073k183k65L052l70l530J156
2330d31R77m31K286J80l422k03K841q99j082M41j121n61L467j95l409Q11J146
2347C95j096J077J194l159k88K346m27j303R46r98j309L009K105l117m66O37j123
2364a577J128J777k842j114L087J384j673M37r13j780K391J927k479n87J680q60
$$ plain form
2249 -2172 862 -456 263 1489 -1654 -2976 340 637 -1326 58 -158 -1073 1733 3070 -1143 -1930
2265 -1930 590 122 539 1823 -547 -1592 2022 2585 -278 18 440 -1159 1535 3100 226 -1405
2281 -1405 637 -38 -293 1896 253 -2032 844 2436 61 -282 -547 -2642 -1032 2252 72 -1778
2297 -1778 -90 335 -387 1304 -580 -3351 -1340 1597 -67 -1128 -330 -1757 -1024 1822 179 -2122
2313 -2122 -5 675 -249 1297 882 -2512 -1405 1806 907 636 1709 -474 -739 2313 1943 -1587 -431
2330 -431 546 115 2401 2581 -841 -1044 1797 898 -184 257 -864 -1425 2042 1847 -1562 -751 395
2347 395 -701 376 1570 -1589 -1877 469 42 -1261 -315 -1313 -2622 387 2492 -625 -1091 -454 -1577
2364 -1577 -449 1328 -1514 -2628 459 1843 170 607 -306 -2086 305 2232 -247 -834 846 -14
2380a4L80J915j946j921K577J003j368J042n57k878J418K332j240j523J365l97
2396A88K45K203j700l472J744J479j324J065k72j985P58L129j742k361J582q16
2412a279l29K701l07l272Q77J593q90O90Q24k153m6K855k09k028J69n30l91K453
2430G28R31k897R9K168p53j32Q05k293n67L202M76k260P76L02j253J405J189k653
2448g27p29K126j59n24J124j567k090K583J785j920M32l0j634J127J994k566j887
2465b662K201O57l1J135j412k362K127J653j867p15J142j267J107K256j706j809
2481a553J482Q5l39J365j45k576J252K324j702m97N35j240O70K721n78k770P54
2498b12P47o91J195J72k543O12K989r16p79O9j339j86K274j77k616J055R90r56
$$ plain form
2380 -14 366 2281 335 -1586 991 1994 626 1668 1111 -1767 -349 1983 743 -780 585 188
2396 188 433 2636 936 -2536 -792 687 -637 428 156 -1829 -1071 2058 316 -2045 -463 -1279
2412 -1279 -1608 1093 786 -2486 -1609 -16 -906 -216 608 -1545 -1591 1264 1055 -973 -804 -1334 -1725 728
2430 728 1659 -1238 -1139 1029 276 144 949 -1344 -1911 1291 1767 -493 283 585 -668 737 1926 -727
2448 -727 -1456 670 511 -13 1111 -456 -2546 37 1822 -98 334 304 -1330 -203 1791 -775 -2662
2465 -2662 -461 196 165 1300 -112 -2474 -347 1306 -561 -1276 -134 -1401 -294 1962 256 -1553
2481 -1553 -71 14 -325 1040 895 -1681 -429 1895 193 -304 231 -1009 -339 2382 1804 -966 -212
2498 -212 535 -156 1039 1211 -1332 -720 2269 1353 574 643 -696 -882 1392 1215 -1401 -346 644 -312
2516c12P98J145k777k63K622k07j380P91p96j653K714O27k548J88J229n62R68
2533E84R85k607j401K651O3r55Q75m59j125J964J242k756m05J437p21L92J844
2550A608j383j776J862O33j029M63j55j761J533K124k018j076R83o07K24K097
2566A722j243k320J626J476j455L80j91k105J158K664j334j351J017n19l14J786
2582I97q13k435J261J831j251M84K93k035J41L023q07j822J002m7p55J657J00
2599H24k815P05K417r18Q4O50j802l66K327r0k098O65P33r15J512Q29k367o49
2617a274K103l19m09J145j501j239K398P10j799j27L64j063J342J576k184j307
2633a584J554M34p93Q93p72j803K529J215k154o9M72q65M53J698j381j616K110
$$ plain form
2516 -312 486 1631 -1146 -1409 1213 1006 -374 417 -379 -2032 682 1309 -1239 -1051 178 -384 584
2533 584 1569 -1038 -2439 212 275 -680 195 -264 -1389 575 1817 -939 -1344 93 -628 -236 1608
2550 1608 225 -1551 311 944 -85 378 223 -1538 -5 2119 101 -975 8 -599 -375 1722
2566 1722 479 -1841 -215 1261 -194 186 -5 -2110 -952 1712 378 -973 44 -475 -789 997
2582 997 184 -2251 -990 841 -410 74 367 -1668 -1527 1496 689 -1133 -131 -178 -933 724 824
2599 824 -1991 -1286 1131 213 297 947 -855 -1221 1106 1016 -1082 -417 316 -599 913 1742 -625 -1274
2617 -1274 829 510 101 1246 -255 -1494 904 1614 -185 -312 52 -1011 331 1907 -277 -1584
2633 -1584 -30 404 -389 504 -268 -2071 458 1673 -481 -550 -78 -943 -490 1208 -173 -1789 321
2650C21op99J370m37k486J424K103j437m67P19r19q7K447j160j945J033J100p39
2668C5Q33R8k540J107J419p71n73Q07j258k09K733r44k403Q49J049j075J418J89
2686G64k359L15J954o07j005R52p57q64K460K97k771O50J308j046O19J046k133
2703a177o82K958l80j379O94l92j321K133J025j999k25J247q09M25J191j478j542
2720a711K189O17j126L89p0j431J270J619j786q03J016J4l10J578j624j649J654
2737a64R59r20K80J25j625R52J958j600j286J350m31j03J732q44k117J037J186
2754D89p17K16L50j426L45J909m78j422N53J11p19J845L09k643O45J591p29j73
2772E6O65j759j2K499k94j747K71N79j164J546L74j814J67J136l83n36R83j432
$$ plain form
2650 321 315 -484 886 449 -2037 -613 1490 53 -414 305 -614 -701 1746 586 -1359 -326 774 35
2668 35 868 966 -1574 -467 952 181 -392 415 -843 -1052 1681 737 -1666 -817 232 -843 575 764
2686 764 -1595 -1280 674 67 -938 14 -743 -1607 853 1150 -1621 -971 337 -709 -90 956 -1177
2703 -1177 -1859 1099 719 -660 34 -358 -1679 454 1479 -520 -745 502 -307 118 1309 -169 -1711
2720 -1711 478 1095 -31 358 288 -1143 127 1746 -40 -843 173 187 -123 1455 -169 -1818 -164
2737 -164 795 -125 155 280 -1345 -393 1565 -35 -1321 29 -402 -505 1227 383 -1734 -697 489
2754 489 -228 -12 338 -1088 -743 1166 688 -734 -181 -70 -789 1056 1365 -1278 -633 958 229 56
2772 56 721 -1038 -1050 1449 1155 -592 -321 258 -906 640 1014 -800 -633 503 120 -416 567 -865
2790h65n81K110K12j797M29K65j149J054J059k026n56J839K04j012J378j355j234
2807b025J744R74j715j76P29o93Q69J103j435r02J357J26n95R85m6k069J384J555
2825A170j380m69R31q25L52J594j116j542J281J76m34Q79j92j844J152J598j029
2842C02r63O49o10l23J995o23j900J085P36p94J098k39j933K61K008n94j021J123
2860B57q93n47J871J98k073K72J273r31P63L47j541l00J861L77j395Q45m25n72
2878f13J345Q26k148k47J129n57O57J064j498j100K137K46j149K62j38j500K119
2895H35P51j727p03R62M5o0J168j048j486J405M00q77L32K04j136R22J132j562
2913d43q16J124k72l24J339q88j434J233R20q59K34L59j458L41J828n46j664R45
$$ plain form
2790 -865 -1446 664 876 -921 -492 -227 -1376 -322 737 -1289 -1845 -6 198 -814 564 -791 -2025
2807 -2025 -281 693 -1022 -1198 -469 -1162 -293 810 -625 -1527 -170 -44 -639 346 300 -1769 -385 1170
2825 1170 -210 -679 252 -573 -221 1373 257 -1285 -4 172 -262 617 425 -1419 -267 1331 302
2842 302 -661 -12 -622 -945 1050 427 -1473 -388 348 -446 652 413 -1520 -1259 749 155 -866 257
2860 257 -636 -1183 688 886 -1187 -915 358 -573 190 537 -1004 -1304 557 934 -461 384 -41 -613
2878 -613 732 1558 -590 -837 292 -265 392 1456 -42 -1142 995 1241 92 354 216 -1284 835
2895 835 1586 -141 -844 118 163 103 1271 223 -1263 142 542 -335 -3 201 -935 -13 1119 -443
2913 -443 -1259 -135 -407 -731 608 -280 -1714 -481 439 -420 -186 173 -1285 -944 884 338 -1326 -381
2931c81O0m69J686p40j550N95J910j030j94K59q90k36K369q60j215N94O82j156
2949e66J163L16j782Q0J365o90k14Q58j053n61J722M65j913M66L30j127J478J61
2967D98j667l07J627k24q86J479j296q46J578P86j473m93Q82o42O94J264j239
2984b65j249J478K48p69J094p39j315J178J406j435k41R92r44M12J465j198j336
3001a218J335O04r44R39n52j354R87J450j080l63O92r41J20J352o18j739R92O11
3019B73o96Q10K41j822N91J524p85j057O62p36m54J589K87j672O40P57m91N60
3037B21M42j979J01J763n41m67O36l47n47J421K89j761K54J029q37M69O83j303
3055d74n52J784K17j200N54M32j527J402O87j539l89J093k33K29Q48j153j124
$$ plain form
2931 -381 -321 -790 896 156 -1394 -799 1111 81 -113 146 -744 -980 1389 529 -686 -92 590 -566
2949 -566 597 913 -869 -789 576 -114 -328 530 -523 -1084 638 1103 -810 -344 -14 -1141 337 498
2967 498 -1169 -1476 151 -73 -959 520 -776 -1622 -44 742 -731 -1224 -342 -984 -290 974 -265
2984 -265 -1514 -36 212 -557 537 -202 -1517 -339 1067 -368 -609 383 -561 -149 1316 118 -1218
3001 -1218 117 721 -223 716 164 -1190 -203 1247 167 -196 496 -445 -325 1027 409 -1330 -338 273
3019 273 -423 387 628 -1194 -603 921 136 -921 -259 -995 -1449 140 427 -1245 -605 152 -339 221
3037 221 663 -1316 -1215 548 7 -460 176 -171 -718 703 992 -769 -515 514 -323 146 829 -474
3055 -474 -1026 758 975 -225 329 761 -766 636 1323 -216 -605 488 255 484 1332 179 -945
3072i45J202O93j111L66m48n45O84J306j351o42R37K1m93J238p80j728J156J019
3090E79r95pP04j319L42J975j318o90M54K53o82J586m23j875J069J300r22K41
3108B72M78j783Q30J192n23j459J000j31j17R05L03j736J85J410m92k72L82j160
3126g16k32J702N8j684P48R9k32P55M37j876m77J753l91l30N04l68j036J961j42
3145E33j018j65N73q47O25J065j130r81J314L37o04O87n39j295J485J158j331
3162a33m26P60n58L27J190q35r14R95L74r10N81k70j216P82J533j025n50R67o00
3181G2k01J097m49j546R13P05j034Q82j93j192P73J243j048n65J97J22l71J351
3199G56k74j709P21R34j027J017K85j659L60J275m48r92P21j40l83J284M36j581
$$ plain form
3072 -945 257 950 -161 205 -243 -788 -104 1202 -149 -791 146 167 -326 912 132 -1596 -440 579
3090 579 -416 -423 281 -1038 -696 1279 -39 -729 -275 -22 -704 882 459 -1416 -347 953 31 272
3108 272 750 -1033 -203 989 466 -993 7 -124 -241 664 967 -769 -584 826 334 62 444 -716
3126 -716 -948 754 812 -872 -124 -25 -257 498 935 -941 -1418 335 -56 -386 118 -250 -1286 675 533
3145 533 -485 -650 -77 -924 -299 766 -364 -1345 -31 306 -298 389 -150 -1445 40 1198 -133
3162 -133 -559 201 -357 -30 1160 325 -589 406 780 -130 451 181 -1035 -253 1280 255 -295 672 72
3181 72 -129 968 519 -1027 -114 591 -443 439 246 -946 -173 1070 22 -543 -346 -224 -595 756
3199 756 482 -1227 -506 428 -599 418 703 -956 -596 679 231 -761 -40 -180 -563 721 1157 -424
3217d24K66O67m94J50M95j080m36J761k66p76N46k47r26J534O61j605l66J055
3235E15m70j15P77j002q01J643L78j068K72M5q55O88Q46j091q35J218k13k5R25
3254H32j058p13P65O22p41Q7J56p01M63J414j135j089J645o90l8R05n52j223R08
3273a43P73n46r6O54r57n7J405o87q10N83K43m22P66J79j409j6J505o76j45J81
3293C25p14k45J146r9j196P69J65n48O83O46j827K25J348m78l78M67q25r6J258
3312F26J62j270J86N67n26L43N96j191RQ64J0n26N31k29r91J354N78j226j06R31
3332F92j049P17R61j338p43J094K04l57M02l62p35O61R63j322j5L48r3p7R11o44
3352B18q92O38M15o25L48L85j422O60J240o53n30L15l86j51J232l98j252N07O82
$$ plain form
3217 -424 -158 509 15 165 660 -420 -856 905 639 -137 409 162 -764 770 1431 -174 -540 515
3235 515 45 -70 707 -295 -1096 547 925 -143 129 174 -681 7 853 -238 -1073 145 -68 -93 832
3254 832 -226 -939 -174 448 -293 -206 -50 -751 -288 1126 -9 -1098 547 -143 -181 724 172 -1051 -143
3273 -143 630 84 -12 642 -315 -372 1033 346 -464 119 362 -60 706 885 -524 -540 965 289 144 325
3293 325 -389 -634 512 413 -783 -14 151 -397 286 932 -895 -670 678 200 -178 289 -536 -632 626
3312 626 788 -482 -296 271 -255 88 684 -507 -498 366 376 -150 381 152 -839 515 1093 -133 -239 692
3332 692 -357 360 1321 -17 -760 334 538 181 583 221 -514 147 1110 -212 -227 121 28 -49 862 218
3352 218 -674 -36 379 -246 102 487 -935 -275 965 312 -218 97 -289 -440 792 394 -858 -351 331
3371C31o13L60K17j074J82J522o86j043R25l6m86R06j7j137K61R42p35L92L00
3390E11r36k85J093p5l92K49j01n82R50M58j469j61P81J29j21N83j083l80J249
3409D18K39j261J90Q08j051O88O33j023l56N99l11K94Q47q00o96R79M15p87K03
3428B8k2o33N02R85n22p70L13K19l40R08p81o26J144M53r10J11L39p51K45J052
3448I44l50o35N09Q9r51Q75J00j128K99P17ln95O41j135J91J186l46j193O03M84
3468C02k10M95j02j322K24J022k26q39P88k90l71Q11j45r43K44P47o69L47N93
3487D56j000p5J191j04o19P40n35n01Q25N75r72j88M43o83Q13P74j188n07J172
3506F17l10k19n3l77j82P54P03r16k53L59l55J01Q37o45p14J158j03m68N9K81
$$ plain form
3371 331 -282 78 295 -779 -597 925 239 -804 121 85 -401 505 488 -649 -388 554 -181 211 511
3390 511 -425 -710 383 308 -84 165 64 -518 432 890 -579 -740 41 170 49 632 -451 -831 418
3409 418 657 -604 -414 394 -657 31 664 -359 -715 -116 -427 -133 714 -86 -782 197 612 -175 28
3428 28 6 -627 -125 860 338 -432 -119 100 -240 668 -113 -739 405 858 -52 59 398 -353 -108 944
3448 944 594 -41 468 557 -394 481 581 -547 -248 469 466 -129 512 -623 -432 754 408 -785 -182 302
3468 302 92 587 485 -837 -613 409 183 -656 132 -158 -529 282 137 -806 -562 185 -484 -137 456
3487 456 -544 -619 572 468 -151 589 54 -447 378 953 -19 -207 236 -447 366 1140 -48 -555 617
3506 617 307 88 35 -342 -524 230 933 17 -236 123 -232 -131 706 61 -653 505 402 -66 -7 274
3526B74q13P5J014p46p0L03m27%R09o63j052J101J56k53L72l24q72O53P72l92
3546A7m45L59L8l61J051k43j040P72N42q97M64L38q70K0P89J45q91J70K02l19
3566a59L43M86j236J24Q53m20m9K65m73j13R25n3r02L72j86m35P12N60q25q5O01
3587C05j72j67L03n12n99P08M98m11k38K76n74N23O86q88m67R86J52j71J14l22
3607C0p12P64O49n71k22L47n55M96M00p72m26O91L2l05P79n8o83J74L66l39k52
3628a67N69p23J35R74m14q22L08R3l59O25K36j154K62J077o96n99J006m79j93
3647c21R44m88n04J80L64k33J29M84j128j34R47J53m55P53q81j37R52J64j032
3666b43L66K05p20N69N00j029k65J065k8k33j06n2o14P16M21q21j90L63K75n4
$$ plain form
3526 274 -539 -464 550 -196 -266 37 -390 -390 519 -144 -1196 -95 61 -192 180 -144 -1016 -363 409 17
3546 17 -428 -69 -31 -392 659 416 -624 148 690 -207 257 595 -275 -255 534 679 -212 -42 160 -159
3566 -159 184 670 -566 -442 411 -9 -58 207 -266 -379 546 493 -409 -37 -223 -658 54 614 -211 -296 305
3587 305 133 -34 269 -243 -842 -134 364 -47 -285 -9 -583 -60 626 -262 -729 257 409 238 352 30
3607 30 -682 82 731 160 -62 285 -270 226 626 -146 -572 119 151 -154 625 567 -116 58 424 85 -167
3628 -167 402 -321 -186 788 374 -448 -140 -47 -406 219 455 -699 -437 640 -56 -655 351 -128 -321
3647 -321 623 135 -369 -189 175 -58 71 555 -573 -707 240 393 -62 691 -190 -327 625 789 -243
3666 -243 123 328 -392 177 677 -352 -617 448 420 187 81 29 -585 131 552 -269 -459 -96 179 125
3686A25L99l39j066R41K42l64K92j3q78O44R97r06n98L40r6m23J326n90p78O98
3706d7M56p52K82k04o43Q67O89m52o80O82l49m73J032Q0j011M59O57p52N8N81
3726D80r48J1J228m96m11L06R9l13N52o2r28K61O14l09o0J95n23p5P02k72l02
3747b51J44M71o27J72O62j034m5P44m28NP73n18r71J216j96l51L7K93m32L86Q24
3768H74p77m60L96J35j36Q8j01o14Q28N07p49J9J88p0k82Q95j124j17N96O3m25
3789b66L69J32o92M51P44l68n01L39m95k16P65j36o69L37N29l05M71k78q93M10
3809b72R80o26l36N71q26N52J56K66q18KP27l85R7J46l30m11P77k23m75O00K7
3830A99n09Q83J75j168o3M58j58N40p3o11R1M40J65m19K85o0n06O17K83q71J57
$$ plain form
3686 125 524 185 -881 60 302 -62 230 217 -661 -17 980 74 -524 -184 -280 -703 623 33 -745 -47
3706 -47 409 -343 -61 -265 -908 -41 648 196 -484 198 -151 -624 408 488 -523 -64 593 -159 -101 480
3726 480 -468 -457 771 275 -136 170 269 -44 508 446 -482 -221 393 84 24 219 -304 -379 323 51 -251
3747 -251 -107 364 -263 -91 571 -463 -508 236 -192 -187 586 68 -903 313 117 -234 -197 96 -336 50 874
3768 874 97 -363 33 168 32 120 19 -595 233 740 -9 10 198 128 -154 741 -383 -500 96 159 -266
3789 -266 103 235 -457 -6 738 370 -131 208 -287 -503 262 126 -543 -206 323 18 489 211 -682 -272
3809 -272 708 82 -254 317 -509 43 199 465 -353 -351 376 -9 88 234 -96 -507 270 47 -428 172 199
3830 199 -310 573 748 -420 -483 -25 -183 357 284 -327 -236 204 369 -50 235 175 -331 286 569 -302 -145
3851a45O96o58K41K20k21m47L87K32n18M72l49p31R40J90P3o60M54k57pN80p32
3872b40o89R02J34P1j02R7n57j01R63k21m07M0j2j62O30k87n35L70M57j36j13
3893A02M71q18k19J059o69l48J39N6k87N97O39r41j49M19j47l5N36p58pQ59n84
3914h5J4q3K93k13J25M10q59m4P87p64J46M38k95k61N53J32m64J26J9m75K88O31
3936D19n19m17Q89q2k35Q5k61o60J019J65p33O4O52l16j5O91q59k30O31j9l43
3957g4L73jj156O80M14N4k05K64l88N2Q74j300n9P7N13m49P2N34p23L4M95J42
3979B23n76O41l10l41L70J78n01L60jl66J35N93m04j06K06J5j45Q8jl71O91K35
4001F13r04J77N05n17J01K96p13K13P56k67l82L43r0p18N86N60p53p8N24j84o2
$$ plain form
3851 -145 551 -107 134 354 133 -314 73 305 -213 259 -90 -821 119 309 382 -278 176 -81 -88 492 -240
3872 -240 -929 -27 107 178 76 173 -384 -485 478 257 -150 -110 -122 -284 346 59 -476 -106 351 215 102
3893 102 573 -245 -464 595 -74 -422 -283 -227 -514 83 722 -219 -368 51 -96 -131 405 -353 -360 499 -85
3914 -85 -71 -154 139 -74 51 461 -398 -442 345 -419 -273 165 -130 -391 162 294 -170 -44 -25 -500 -212 419
3936 419 -100 -517 372 290 55 140 -121 -781 238 403 -330 -266 386 70 55 746 -113 -343 288 269 -74
3957 -74 299 298 -858 -178 236 290 85 349 -39 13 887 -413 -472 -395 118 -331 -259 275 -448 -414 81 223
3979 223 -353 288 -22 -363 7 185 -316 44 43 -323 -188 405 1 -105 101 116 -29 59 58 -313 378 613
4001 613 -291 -114 391 -126 -25 271 -442 -229 527 260 -122 221 131 -587 -1 559 -194 -272 252 68 6
4022FM87n12n64R52o0l69j85L12n47N45mpp21O23j16p1O97m70p98P48K49l76r0
4045b71K51l91N19J58o6m05R5K51m52L22K43n08M94J67l44j30M60m09j55Q53m71
4066B11n56N56l02k27O90j69m71L68M86m56k15M30o76j19O67r4m44L42l9o9K94
4087B07p2n17J1N37q4n6N22o73n64Q21K11o35K47qoJ70N02p79k10O31P0l93K35
4110A67k30r5N88j56n01K44J06j35J35M39n23l83P37j85k42J74N6p53P08K59j95
4131B15n18L66n18L08O26m19n03J93N28l77J57J37r68P81M55n72k84O71k09m84
4151d15O83k13p84P84j07l5P6R8m87rO93j93k06O5O5n3J97M18q55J78J68q6J18
4174A00J03m20K9P14n39k22J32K3P1L23L5n97J3M71j48j41N63m83k31J22M86n77
$$ plain form
4022 6 493 -19 -583 369 309 -60 -245 67 -480 65 61 54 -667 -44 -160 -231 466 -4 -802 -54 195 -181 -271
4045 -271 -20 -411 108 266 200 -205 -110 141 -311 11 254 -254 240 407 63 -67 393 -16 -171 682 211
4066 211 -345 211 -91 -318 372 203 -268 100 586 130 -85 345 -331 -450 217 123 -321 21 -18 -87 207
4087 207 135 -382 -371 166 82 26 548 -125 -689 132 343 -292 -45 -53 -59 111 613 -166 -376 255 325 -68 167
4110 167 -63 -158 430 274 -227 17 123 -12 123 562 39 -344 393 208 -34 140 196 -557 151 410 215
4131 215 -303 63 -455 -147 479 60 -443 -250 278 -99 58 195 -773 8 463 -109 -393 278 69 -415
4151 -415 268 55 -729 55 -52 -87 -11 87 -400 -409 284 91 -115 -50 15 -38 159 577 -278 -100 68 -18 100
4174 100 203 -217 -188 526 -13 -235 -103 -80 -9 314 349 -248 -235 236 88 -53 510 27 -204 -82 404 -173
4196a73K05k13j16M44J75n34j83N50m21J87K51l93p9N93j3o30K39M69q44L78M47
4217C39p47j4N02j1j37M13k03n12N36j96J9JK64n65M30M78m90m17N65j97L3K11
4239C02O8n96N30n6j82j01J41n27LN73k22m86L50K51j44L76j70j01j54J43q6k79
4261c67N12o05P9P22j14m13q5L12k70K13K27l28l65P41n16r9M34k51l70Q84O6
4282D07o83L75R5n24L96J76j18l86M21j1m66R43m61n28N70N04q46j45J69k99M07
4303dL38l88n64Q47R2o92N51jm94L93J39m94k96M51J69l31P04nj114M95L53m68
4325c19J03N23o98k11Q30m2m05O47l18l84O06k29l03P5K26K7p8J32l19P0M68j51
4347B50m11K51J52o63N40k0l74L37j3j77J84j7j15n6O81o39j28j49J32k26N22
$$ plain form
4196 -173 32 -181 -297 147 322 -212 -395 155 -266 -79 172 -221 -300 293 280 -350 -111 358 -486 -108 339
4217 339 -408 -422 80 69 -68 345 142 -370 166 -30 -11 -10 254 -311 119 597 107 -310 255 58 91 302
4239 302 370 -226 304 248 66 -35 106 -421 -418 155 -67 -553 -203 48 -96 280 110 9 -145 -2 -88 -367
4261 -367 145 -460 -381 341 227 -186 -271 41 -229 -16 211 -117 -482 259 -257 -356 78 -173 -543 341 407
4282 407 -276 99 194 -330 66 242 124 -262 159 148 -318 625 164 -364 206 710 -136 -281 -112 -411 -4
4303 -4 334 -54 -618 229 321 -371 180 179 -315 78 217 -277 -573 -122 47 -284 420 415 -699 -204 149 -319
4325 -319 -216 307 -391 -602 228 186 -219 428 110 -274 332 103 -200 -125 101 128 50 182 -137 -67 401 250
4347 250 -161 90 242 -421 119 99 -275 62 49 -128 56 39 -76 -132 549 -90 -218 -367 -235 -461 61
4368F1M19p30j75N86l76%M80m46k81P27L0p26L09K82k89KN22o38k4L38k87L20
4390A04J93j13o69N13L1r5q3K26l67O2P17m01m36M16n3j09L96l8o98O80K57n67
4412c4j02K35l75K15L77k02n20L17J45j74M48j29n16J15M43o57J63L43k01l35
4432d44R61l43m37K76M28n65M2N85r78J61L20L72m23O32l58n22O89P9r75N66K35
4453C01l24j78M31l77n8L94Pj43K64j50m01M39L03m39j83P1k79L11M48l23k46
4474a32M36j22n57N21n5l62K43L65o95l9N34l31Q7r8K64o36N74N3rQ0l6m16K72
4497e9N67k86k33j30J22r5K41L27n52q9P45o17L19n8k94J12M62j42m70K27J61
4518B58m11L32J12l87QQ5j7k00O95l05l48M97k41l9J62l15q9K66k4k57R6J77o0
$$ plain form
4368 61 480 -250 -425 161 -215 -215 265 -181 -462 265 295 -431 -122 160 -129 -127 395 -243 -267 71 -216 104
4390 104 297 184 -485 28 59 -36 -119 107 -260 -198 519 118 -318 98 45 -64 332 294 -404 276 533 -34
4412 -34 -136 99 -276 -61 316 114 -406 -89 56 -118 330 201 -315 -200 243 -414 -251 92 -109 -444
4432 -444 517 174 -263 13 441 -124 -82 503 -475 -314 6 378 -45 587 229 -293 396 475 -500 66 301
4453 301 -23 -201 230 -147 -205 189 196 53 317 167 -234 205 508 69 -114 -43 -322 -11 437 114 -132
4474 -132 304 182 -375 146 91 -271 -28 337 -358 -397 137 -194 -107 -205 59 -577 -3 50 41 121 85 -331 -59
4497 -59 508 222 -11 -141 -19 -114 127 454 -98 -187 558 -59 260 202 -92 20 482 340 -130 97 258
4518 258 -153 179 291 -96 -88 -3 -20 -220 475 170 -178 319 78 39 201 -114 -203 63 39 -218 -122 55 -5
4541ek8K39l93j41O78k50l83K85M0q5n6Q46o61q1N41k96j25N6k12m89O61J31j84
4564H8m0N78o79J90M56o73k35K75L60l04m7K87m37J40j1P2N4k19j24R7Q4O1k70
4587b97L55J4k73M42o4n22K03N36o54M2L37m15J06L65j20k94P2K78n39K94N37
4608D03n92k36O61m64J91K00m04Q3J91K87n68J53M81p59N80L47r42j41J134m12
4628A93nk56R9m11R43l08l03m32M91M2j99P19o81k30M76k44K4J24J64l01n5O25
4650D75p24J23J11J55j34L19l32m53O99J08k40j52Q6n23O83K73m04j42J43j29
4670e8l2P51n52l84N14K57n73K83J00ql72N97j69l98J80q2l47N65J15p00L15L3
4692C5q8k92M77m66N7N86J79q62N00k39j95M58k59k85J37L36j34j03L69m36J8
$$ plain form
4541 -5 -33 206 -187 -328 350 100 -283 2 42 -43 -99 747 86 5 546 250 125 181 -31 -520 141 272 88
4564 88 48 626 -53 137 593 -80 -315 -40 320 16 -31 256 -181 -41 -52 20 74 -145 -269 -172 -88 -27 -297
4587 -297 58 72 -201 241 177 -345 -142 394 -260 -218 119 -296 -190 175 55 -239 -167 111 -428 -134 403
4608 403 -189 -425 236 -228 -37 163 -241 -158 33 320 -248 -95 386 -373 207 554 -388 -529 605 193
4628 193 188 -68 31 -380 563 255 -48 -480 11 53 -146 573 -108 -338 138 -106 -82 42 206 -95 -150 475
4650 475 -249 -126 -15 140 6 325 -7 -460 239 347 107 -45 41 -482 201 474 70 -72 71 -58
4670 -58 -90 661 109 -275 239 496 -77 206 306 298 -74 523 354 -44 136 54 -293 272 387 -313 2 35
4692 35 -53 -345 132 -334 -277 309 488 -374 126 -113 -308 150 -109 -394 -257 79 -55 -158 211 -225 -207
4713b07J01K12k22Q9K57n56K50N04o26k65P84l89J10o1O8l15K16K64k98P1r3l5
4735a41L67j35K4p35L61K33o6L30k04m31L05L55j35JN2j90o6L47o4l73M01m85
4757b49Q0K13P5m47J15M35o2r5j48j83j72N95j68n21K84L22R4j37J27n18K77K76
4779A93q3n65O61j69l51M52j16r8J43j04j04O08k95j25l53P09l37J17J17n47J24
4800a23J70L57n28j27L63j61K6M93m68k73L66J74m02N6k97O1L47Ql48J56L62l53
4822a41K47J13j00k93L74k7k19m2J82K03j57J50j68m33M35k44J27J10r7l10O35
4843C45J0k30j11P9j59j40M49l1q1k06J30j14J95L11n55QO59m53R1L09p91J73
4865a12O77o50p2N4K09k92M81K66r99L40J39m0j90L38m45j11O60q0n06L94L05
$$ plain form
4713 -207 -106 106 -116 -27 230 -326 -76 428 -198 -463 321 -68 42 -19 49 -266 -50 214 -84 -13 -106 -141
4735 -141 226 91 115 -620 -259 -26 -92 238 34 -397 -92 263 128 129 181 -9 -75 272 208 -165 236 -249
4757 -249 -169 44 119 -328 -213 222 160 65 -83 -266 -438 157 -11 -532 -248 74 168 31 158 -360 -83 193
4779 193 110 -455 206 37 -314 138 22 -76 67 -37 -141 467 172 47 -306 403 66 183 300 -247 -123
4800 -123 47 404 -124 -251 112 -49 -23 470 2 -271 95 269 -133 -77 -374 -313 34 42 -306 -150 212 -141
4822 -141 106 219 119 -174 200 173 -46 -88 94 297 140 290 122 -311 124 -120 7 117 20 -290 345
4843 345 355 125 14 93 -66 -206 243 212 131 -75 55 -59 136 447 -108 -100 559 106 197 506 -285 -112
4865 -112 565 -85 -157 -103 106 -186 295 561 -438 -98 41 1 -189 149 -296 -407 253 173 -333 61 366
4886C66p00J06L02j06k77L98pj32M52n29j34M43K09m81M67j89n27L95J36Rp54
4907e53J004m41k14p1L79m56N54M5k59J94q6j28j71M71j33l09K21r2J22L05Q7
4928D69q46M53J21j98j27K03l57j4M60k47l25K59L94l94J62R9l78L18L65l48m0
4949B9J53n88K13M41k48m50M26j07j0k3o7M4j38P23m17J3k7J66m46J02M48l60
4971a23m7M14k90j11J94k47K79L2N1L7j27k31o5N45k31k57N8M56l73j7J73l93
4993b73j45M83K84o91J34J39l28M01M09m17p0J96l36K19J96l68k23N18K43k77
$$ plain form
4886 366 -334 -228 74 -32 -309 89 82 -50 402 -127 -261 182 391 -90 377 188 -339 56 192 201 -553
4907 -553 451 10 -204 -275 104 -352 202 247 -12 182 96 -32 -203 268 135 -174 47 -45 77 382 469
4928 469 -377 76 197 -1 -128 75 -282 -296 164 -83 -408 -149 245 -149 13 112 -266 52 417 69 29
4949 29 182 -406 -193 248 0 -450 -24 -131 -141 -164 -231 -187 -325 398 -19 -6 -33 133 -313 -211 237 -123
4971 -123 -170 244 -46 -157 37 -210 69 101 152 189 62 -169 -234 311 80 -177 -119 337 -36 -53 120 -273
4993 -273 -418 65 349 -342 -208 -69 -397 4 413 -4 -74 122 -214 5 201 -167 -390 128 371 94
$$ [...]
8191a71
##END NTUPLES=NMR FID
##END=
