##TITLE=1H_CG-1117-4
 CDCl3, 8 sc, 
 19.8.2019
##JCAMPDX= 6.0         $$ Bruker NMR JCAMP-DX V2.0
##DATA TYPE= NMR FID
##DATA CLASS= NTUPLES
##ORIGIN= UXNMR, Bruker Analytische Messtechnik GmbH
##OWNER= root
$$ XWIN-NMR		Version 3.5
$$ Mon Aug 19 14:02:29 2019 Russian Standard Time (UT+4h)  she@DPX200
##.OBSERVE FREQUENCY= 200.13155
##.OBSERVE NUCLEUS= ^1H
##.DELAY= (6, 6)
##.ACQUISITION MODE= SIMULTANEOUS
##.ACQUISITION SCHEME= undefined
##.AVERAGES= 8
##.DIGITISER RES= 18
##SPECTROMETER/DATA SYSTEM= spect
##.PULSE SEQUENCE= zg30
##.SOLVENT NAME= D2O
##.SHIFT REFERENCE= (INTERNAL, D2O, 0, 15.7039)
##AUDIT TRAIL= $$ (NUMBER, WHEN, WHO, WHERE, WHAT)
$$ ##TITLE= Audit trail, XWIN-NMR		Version 3.5
$$ ##JCAMPDX= 5.01
$$ ##ORIGIN= Bruker BioSpin GmbH
$$ ##OWNER= she
$$ F:/spectra/data/she/nmr/H-F/1/audita.txt
$$ ##AUDIT TRAIL=  $$ (NUMBER, WHEN, WHO, WHERE, WHAT)
(   1,<2019-08-19 14:01:10.53 +0400>,<she>,<DPX200>,
      <created by zg, POWCHK disabled, PULCHK disabled
       configuration hash MD5:
       00 E9 B6 7A A2 85 ED C7 34 08 36 98 17 FE 4E 26
       data hash MD5: 16K
       D4 CF 2D BD 0F D6 85 7D 03 61 C7 8F 23 22 BB 95>)
$$ ##END=
$$ 
$$ hash MD5
$$ 62 34 21 B2 09 14 6B 6B 99 29 52 B4 2B 1D 5C 2E
##$RELAX= 
##$RELAX= 
##$RELAX= 
##$RELAX= 
##$RELAX= 
##$RELAX= 
$$ Bruker specific parameters
$$ --------------------------
##$DU= <F:/spectra>
##$EXPNO= 1
##$NAME= <H-F>
##$PROCNO= 1
##$TYPE= <nmr>
##$USER= <she>
##$AMP= (0..31)
100 100 100 100 100 100 100 100 100 100 100 100 100 100 100 100 100 100 
100 100 100 100 100 100 100 100 100 100 100 100 100 100 
##$AQSEQ= 0
##$AQ_mod= 1
##$AUNM= <au_zg>
##$AUTOPOS= <>
##$BF1= 200.13
##$BF2= 200.13
##$BF3= 200.13
##$BF4= 200.13
##$BF5= 200.13
##$BF6= 200.13
##$BF7= 200.13
##$BF8= 200.13
##$BYTORDA= 1
##$CFDGTYP= 0
##$CFRGTYP= 5
##$CHEMSTR= <none>
##$CNST= (0..31)
1 1 145 1 1 1 1 1 1 1 1 1 1 1 1 1 1 1 1 1 1 1 1 1 1 1 1 1 1 1 1 1 
##$CPDPRG= <>
##$CPDPRG1= <>
##$CPDPRG2= <>
##$CPDPRG3= <>
##$CPDPRG4= <mlev>
##$CPDPRG5= <mlev>
##$CPDPRG6= <mlev>
##$CPDPRG7= <mlev>
##$CPDPRG8= <mlev>
##$CPDPRGB= <>
##$CPDPRGT= <>
##$D= (0..31)
0 1.2 0 0 0 0 0 0 0 0 0 0.03 0 0 0 0 0 0 0 0 0 0 0 0 0 0 0 0 0 0 0 0 
##$DATE= 1566208869
##$DBL= (0..7)
120 120 120 120 120 120 120 120 
##$DBP= (0..7)
150 150 150 150 150 150 150 150 
##$DBP07= 0
##$DBPNAM0= <>
##$DBPNAM1= <>
##$DBPNAM2= <>
##$DBPNAM3= <>
##$DBPNAM4= <>
##$DBPNAM5= <>
##$DBPNAM6= <>
##$DBPNAM7= <>
##$DBPOAL= (0..7)
0.5 0.5 0.5 0.5 0.5 0.5 0.5 0.5 
##$DBPOFFS= (0..7)
0 0 0 0 0 0 0 0 
##$DE= 6
##$DECBNUC= <off>
##$DECIM= 24
##$DECNUC= <off>
##$DECSTAT= 4
##$DIGMOD= 1
##$DIGTYP= 9
##$DL= (0..7)
0 120 120 120 120 120 120 120 
##$DP= (0..7)
150 150 150 150 150 150 150 150 
##$DP07= 0
##$DPNAME0= <>
##$DPNAME1= <>
##$DPNAME2= <>
##$DPNAME3= <>
##$DPNAME4= <>
##$DPNAME5= <>
##$DPNAME6= <>
##$DPNAME7= <>
##$DPOAL= (0..7)
0.5 0.5 0.5 0.5 0.5 0.5 0.5 0.5 
##$DPOFFS= (0..7)
0 0 0 0 0 0 0 0 
##$DQDMODE= 0
##$DR= 18
##$DS= 0
##$DSLIST= <SSSSSSSSSSSSSSS>
##$DSPFIRM= 0
$$ [...]
##$SUBNAM2= <"">
##$SUBNAM3= <"">
##$SUBNAM4= <"">
##$SUBNAM5= <"">
##$SUBNAM6= <"">
##$SUBNAM7= <"">
##$SUBNAM8= <"">
##$SUBNAM9= <"">
##$SW= 24.9336996594482
##$SWIBOX= (0..15)
0 0 2 0 0 0 0 0 0 0 0 0 0 0 0 0 
##$SW_h= 4990.01996007984
##$TD= 16384
##$TD0= 1
##$TE= 0
##$TE2= 300
##$TE3= 300
##$TEG= 300
##$TL= (0..7)
0 120 120 120 120 120 120 120 
##$TP= (0..7)
150 150 150 150 150 150 150 150 
##$TP07= 0
##$TPNAME0= <>
##$TPNAME1= <>
##$TPNAME2= <>
##$TPNAME3= <>
##$TPNAME4= <>
##$TPNAME5= <>
##$TPNAME6= <>
##$TPNAME7= <>
##$TPOAL= (0..7)
0.5 0.5 0.5 0.5 0.5 0.5 0.5 0.5 
##$TPOFFS= (0..7)
0 0 0 0 0 0 0 0 
##$TUNHIN= 0
##$TUNHOUT= 0
##$TUNXOUT= 0
##$USERA1= <user>
##$USERA2= <user>
##$USERA3= <user>
##$USERA4= <user>
##$USERA5= <user>
##$V9= 5
##$VALIST= <valist>
##$VCLIST= <CCCCCCCCCCCCCCC>
##$VD= 0
##$VDLIST= <DDDDDDDDDDDDDDD>
##$VPLIST= <PPPPPPPPPPPPPPP>
##$VTLIST= <TTTTTTTTTTTTTTT>
##$WBST= 1024
##$WBSW= 4
##$XGAIN= (0..3)
0 0 0 0 
##$XL= 0
##$YL= 0
##$YMAX_a= 151949
##$YMIN_a= -253870
##$ZGOPTNS= <>
##$ZL1= 120
##$ZL2= 120
##$ZL3= 120
##$ZL4= 120
##$ABSF1= 10
##$ABSF2= 0
##$ABSG= 5
##$ABSL= 3
##$ALPHA= 0
##$AQORDER= 0
##$ASSFAC= 0
##$ASSFACI= 0
##$ASSFACX= 0
##$ASSWID= 0
##$AUNMP= <proc_1d>
##$AZFE= 0.1
##$AZFW= 0.1
##$BCFW= 1
##$BC_mod= 2
##$BYTORDP= 1
##$COROFFS= 0
##$CY= 11.3945322036743
##$DATMOD= 1
##$DC= 2
##$DFILT= <>
##$DTYPP= 0
##$F1P= 20.1720416913024
##$F2P= 0.152960286110954
##$FCOR= 0.5
##$FTSIZE= 0
##$FT_mod= 4
##$GAMMA= 1
##$GB= 0.15
##$INTBC= 1
##$INTSCL= 1
##$ISEN= 128
##$LB= 0.24
##$LEV0= 0
##$LPBIN= 0
##$MAXI= 10000
##$MC2= 0
##$MEAN= 0
##$ME_mod= 0
##$MI= 1.114404
##$NCOEF= 0
##$NC_proc= 0
##$NLEV= 6
##$NOISF1= 3.799351
##$NOISF2= 2.8
##$NSP= 1
##$NTH_PI= 0
##$NZP= 0
##$OFFSET= 15.70392
##$PC= 1
##$PHC0= -9216.039
##$PHC1= 17.60097
##$PH_mod= 1
##$PKNL= yes
##$PPARMOD= 0
##$PSCAL= 0
##$PSIGN= 0
##$REVERSE= no
##$SF= 200.130013532006
##$SI= 16384
##$SIGF1= 3
##$SIGF2= 2
##$SINO= 400
##$SIOLD= 16384
##$SREGLST= <1H.CDCl3>
##$SSB= 0
##$STSI= 0
##$STSR= 0
##$SW_p= 3612.71676300578
##$SYMM= 0
##$S_DEV= 0
##$TDeff= 0
##$TDoff= 0
##$TI= <>
##$TILT= no
##$TM1= 0
##$TM2= 0
##$TOPLEV= 0
##$USERP1= <user>
##$USERP2= <user>
##$USERP3= <user>
##$USERP4= <user>
##$USERP5= <user>
##$WDW= 1
##$XDIM= 8192
##$YMAX_p= 0
##$YMIN_p= 0
$$ End of Bruker specific parameters
$$ ---------------------------------
##NTUPLES= NMR FID
##VAR_NAME=  TIME,          FID/REAL,        FID/IMAG
##SYMBOL=    X,             R,               I
##VAR_TYPE=  INDEPENDENT,   DEPENDENT,       DEPENDENT
##VAR_FORM=  AFFN,          ASDF,            ASDF
##VAR_DIM=   8192,          8192,            8192
##UNITS=     SECONDS,       ARBITRARY UNITS, ARBITRARY UNITS
##FACTOR=    0.0002004,     1,               1
##FIRST=     0,             0,               0
##LAST=      1.6414764,     0,               0
##MIN=       0,             -253870,         0
##MAX=       1.6414764,     151949,          0
$$ Real data points
##PAGE= N=1
##DATA TABLE= (X++(R..R)), XYDATA
$$ [...]
2648B882l62j549k791k921L579N197k373m727MJ821K542L202l009n447J337M764
2664B149J437j738l747k632M032O537k310n494J10K379J289K483k589m528J96
2679b426M575J338l16k342l770J517O307J63n132k257R33K408M021j275o705q50
2695c811N260K461j668k580l233J358M953R39m384j517m57O89L912J321n711l243
2711e711L953L320N58j671m326j234N225K980l750l094r51J756M629Q39n400k675
2727e552L659K146m19n14k999k239L425L876j421k669j365K77L985K320m492m768
2743f750K161L470R74j21l562k713M640M705k478l589j283K35K724K595k618m014
2759e624J454K409K123J693l187m721K284N662o52l697j524m86L005N416j981
$$ plain form
2648 2882 2520 971 -1820 -4741 -1162 4035 1662 -3065 -3061 -1240 1302 4504 1495 -3952 -2615 2149
2664 2149 3586 1848 -1899 -4531 -499 6038 3728 -1766 -1656 723 2012 4495 1906 -2622 -2426
2679 -2426 2149 3487 3171 829 -2941 -1424 4883 5046 -86 -2343 -1410 998 5019 3744 -2961 -3811
2695 -3811 1449 3910 2242 -338 -3571 -2213 2740 3679 -705 -2222 -2679 -1990 1922 3243 -2468 -5711
2711 -5711 -1758 1562 2120 449 -3877 -5111 114 3094 -656 -3750 -4701 -2945 1684 2523 -2877 -5552
2727 -5552 -1893 253 -166 -680 -3679 -5918 -2493 1383 -38 -2707 -4072 -3795 190 2510 -1982 -6750
2743 -6750 -4589 -1119 -145 -266 -3828 -6541 -1901 2804 326 -3263 -4546 -4311 -1587 1008 -1610 -5624
2759 -5624 -4170 -1761 362 2055 -1132 -5853 -3569 2093 1441 -2256 -3780 -4266 -1261 4155 2174
2774B174n029K71L140J548L70k469m607J923M872Q19j816p26j558J363N249m29
2790E095n730j872K030J876K108j503l771J28N407J943k979k219k264O20M229
2805C098n0m452j262K688J985J987k59m537k026L566J629k191j730j993L70N309
2821B132K649l886k628J184J452J467l31n153k435M337L344q84j546j137l6L673
2837B202K230m182l983Q7J101K465K080l330l180L482M109l88j871l204k566L110
2853a838L941k756l826P61K508K777K463l691l854J338K979p44j240j580k310
2868e072K952N508n43l403l12K82J561K273k835n670J140M603J983k20j210k202
2884a165K241M294j477m677j637M76J176K819n1l611O46L935J648m09k057m595
$$ plain form
2774 2174 -2855 -2584 556 2104 2474 5 -4602 -2679 2193 3012 1196 470 -1088 275 5524 5095
2790 5095 -635 -2507 -477 1399 3507 2004 -1767 -1639 3768 5711 2732 513 -1751 -1131 3098
2805 3098 3048 -1404 -2666 22 2007 3994 3735 -802 -2828 738 2367 176 -1554 -3547 -3177 2132
2821 2132 4781 895 -1733 -549 903 2370 2039 -3114 -5549 -1212 2132 1248 -298 -1435 -1471 2202
2837 2202 4432 250 -3733 -3646 -2545 -80 2000 -1330 -4510 -1028 3081 2693 822 -2382 -4948 -1838
2853 -1838 2103 -653 -4479 -3718 -1210 1567 4030 339 -3515 -2177 802 58 -1182 -2762 -5072
2868 -5072 -2120 3388 2845 -558 -870 -588 973 3246 411 -5259 -4119 484 2467 2247 1037 -1165
2884 -1165 1076 5370 3893 -784 -2421 -1945 -769 2050 1999 -1612 -966 2969 4617 4208 2151 -2444
2900b444m99M397J409l888j502J176K593L887l61n225k179L442Q30j387j261k659
2916c671R0N135K883k199j533p71l91L069P96n342l433L039L335J806M75l580
2932b92p65M094K473l776l591j022K65K968J926k299j862K635K115M54J39l653
2948a91m082K072L366r65k195n42O28M309L376l125m914Q31K240k61o94k441k288
2965d876L744N030n98j488n75j103J367K630k479m885j43L073K617K647j459l681
2981a79J514M852l46m414k421j581K198M113k55l481O48K795J703O69k038n572
2997a795j199L896P53j874o93r15J268N051J158m723k885J081N84R44q61m381
3013d591k16N584K787j407j524j532q0K584M83m875k342J488K297K878J464l185
$$ plain form
2900 -2444 -2943 1454 2863 -1025 -2527 -1351 1242 5129 4768 -457 -2636 806 1636 249 -1012 -3671
2916 -3671 -3581 1554 4437 2238 705 -66 -457 2612 3408 -1934 -5367 -2328 1007 2813 3288 -292
2932 -292 -1057 3037 5510 1734 -1857 -2879 -2614 354 2280 -19 -1881 754 2869 3323 3462 -191
2948 -191 -4273 -2201 1165 200 -1995 -2537 -1909 2400 5776 2651 -2263 -1432 808 547 -147 -2588 -4876
2965 -4876 -1132 3898 3300 1812 1237 134 1501 4131 1652 -3233 -3376 -303 2314 4961 3502 -179
2981 -179 1335 6187 5841 1427 -994 -2575 -377 3736 3481 0 648 3443 5146 5815 3777 -1795
2997 -1795 -2994 902 1655 -219 -912 -1827 -559 4492 5650 927 -1958 -877 -293 651 -210 -4591
3013 -4591 -4807 777 3564 2157 633 -899 -979 1605 2088 -2787 -5129 -3641 -1344 1534 2998 -187
3029a87j960L890J973j906k880l039p34M129K990k711k418K206K499J545j96m628
3045a427l527K045K621j087p43r83l80L912L811k538l759p67k49J261J209k636
3061c237l857L286M842J101q74j750k184J991K889k492l955m51J672K801L168
3076B950q30l152J015L782n65j952k193k748R73M721O92k246l9J072K227K378
3092F085k252n972m66L086L46l29q42j643J725M949o4l660j730l63j34J656q84
3109d92l729O4L665K285Q86q31l585p71L848J161m593k805J132K186L558R70l487
3126e38q13K708J132o02j453l257j632L703L151j484j154J86Q93K298J553m171
3142E20m182J091K335L14P9k361q52M277L278k698k529n33j218P43J460k131k566
$$ plain form
3029 -187 -2147 1743 3716 1810 -1070 -4109 -4843 -714 2276 -435 -2853 -647 1852 3397 3201 -1427
3045 -1427 -4954 -2909 -288 -1375 -2118 -3101 -3481 431 4242 1704 -2055 -2822 -3071 -1810 -601 -3237
3061 -3237 -7094 -3808 1034 2135 1261 -489 -2673 -682 2207 -285 -4240 -4691 -3019 -218 2950
3076 2950 2120 -1032 -17 3765 3200 1248 -945 -3693 -2720 2001 2693 447 408 1480 3707 6085
3092 6085 3833 -2139 -2605 481 827 498 -344 -1987 -262 4687 4623 963 -767 -1130 -1264 392 -492
3109 -492 -4221 -4157 -492 1793 2679 1848 -1737 -2508 1340 2501 -2092 -4897 -3765 -1579 1979 2949 -538
3126 -538 -1351 1357 2489 1887 434 -2823 -4455 -752 2399 915 -239 -53 840 3138 4691 520
3142 520 -3662 -2571 -236 78 157 -2204 -3056 1221 4499 1801 -728 -1261 -2479 -1736 -276 -2407 -4973
3159d973J395K796J660J144k438k936J266K542j568k665p77m50L145L985j359
3174G67l465J591K664q7j074k272k338J092L490n8n22O46p18J435L457j086n640
3191b118p56J941P26J472o80k650J273M191J167k591j943j955M15K795n18l632
3207b863n4K680J194J639M96l524j458K123J174j624k363j100J055M464J501l001
3223C39j345J615P85P03q03l418j452L399K305q35m78n04%K785J280k989k358
3240i71k09P22J713J340l354j310L319K889p25j970j906j552K372J729k631k450
3256b994J196K237J402J036j993l101J656J378p34j364j750j410K713L928p60
3271A440k864j74P19J179J586k887l431J129L257P18J45j326j033J745L260j290
$$ plain form
3159 -4973 -3578 -782 878 2022 -416 -3352 -2086 456 -1112 -3777 -4554 -5004 -1859 2126 767
3174 767 -2698 -1107 1557 1470 396 -1876 -4214 -3122 368 310 -212 434 -284 1151 4608 3522 -2118
3191 -2118 -2874 -933 -207 1265 585 -2065 -792 3399 4566 1975 32 -1923 -1508 1287 769 -2863
3207 -2863 -2917 -237 957 2596 3092 -432 -1890 233 1407 -217 -2580 -3680 -2625 1839 3340 339
3223 339 -1006 609 1394 2097 1294 -2124 -3576 -177 2128 1293 815 311 311 3096 4376 1387 -971
3240 -971 -1180 -458 1255 2595 -759 -2069 1250 4139 3414 1444 -462 -2014 358 2087 -544 -2994
3256 -2994 -1798 439 1841 2877 884 -2217 -561 817 83 -1281 -3031 -4441 -1728 2200 1440
3271 1440 -1424 -1598 -879 300 1886 -1001 -4432 -3303 -46 672 817 -509 -1542 203 3463 2173
3287B173l439j191R35O51J806j98k721O05K892J320j00j824l323Q11L391j67l137
3304a516n64J408J169K814k69l959q42K591P55r08j534j781P42L578O24j811p43
3321b46l40O78K169R4l869j692K491K264L37o48k129o5L601J346k978j838k08
3338a033O62K237J470l372j494K601J420K94k75k260j733J460K827j064k291o12
3354a163K65L144K112l119k584J086J907J94p62j773k152K388K842j014j186o45
3370d60m49J360J688j580k597P6J432Q15J110j371k851J427L803l24k998j008
3386a927Q2J365K221j220k714P87K093N04M58j072k887L36L093R5j359q10j006
3403a961J051L018N36l683j153J535J446J290q98l620K91L772O83k084m44q79
$$ plain form
3287 2173 -1266 -2457 -1522 -871 935 737 -1984 -1379 1513 2833 2733 909 -2414 -1603 1788 1621 -1516
3304 -1516 -2080 -672 497 3311 3042 -917 -1759 832 1587 679 -855 -2636 -1894 1684 2308 497 -246
3321 -246 -586 92 2261 2355 -1514 -3206 -715 1549 1886 1238 -891 -956 2645 3991 1013 -825 -1033
3338 -1033 -371 1866 3336 -36 -1530 1071 2491 2785 2510 250 -1483 -23 2804 1740 -551 -1163
3354 -1163 -898 2246 4358 1239 -1345 -259 1648 1842 1080 -693 -2845 -457 2385 1371 185 -460
3370 -460 -909 451 2139 559 -2038 -1962 -530 285 1395 24 -2827 -1400 2403 2079 -919 -1927
3386 -1927 -1845 -480 1741 521 -2193 -1406 687 1191 1649 577 -2310 -1974 1119 1214 -145 -955 -1961
3403 -1961 -910 2108 2644 -1039 -2192 -657 789 2079 1181 -2439 -2148 1624 2307 223 -221 -1100
3419a100J84K579L9k102j325R28Q23J584K47l106j432L010J909j416j043j620
3435a841j07L120J416k844k064J265J622P82J42k240j905K518J436n82l38j423
3451a043j383K686K089k086k058M01J181J483O35k714k151K193K205m00j364j324
3467a650n64K124K631j970k482M13N91J411R96j758k483N08K624N95o07j531j851
3484c003J833L511j064l138k25P20J319J779j316k952P54K593R41j358j143j482
3500b231P74K963n00k403n8M58O07K592k59l056q79K435P44p3j196j853P03L268
3518B036O23k383r60P13O65J801q07k899o63K459N40J04k21j556l58K664J279
3535C037k611j808Q5M72K064L49k315j328K114K110k58q69k271j196K578J612
$$ plain form
3419 -1100 -916 1663 1702 -400 -1725 -797 26 1610 1857 -1249 -2681 329 2238 822 -221 -1841
3435 -1841 -1948 1172 2588 -256 -2320 -1055 567 1349 1491 -749 -2654 -136 1300 718 380 -1043
3451 -1043 -2426 260 2349 263 -1795 -1394 -213 1270 1905 -809 -2960 -767 1438 1038 -326 -1650
3467 -1650 -2214 -90 2541 571 -1911 -1498 -907 504 1500 -258 -2741 -2233 391 986 379 -1152 -3003
3484 -3003 -1170 2341 1277 -1861 -2086 -1366 -47 1732 416 -2536 -1782 811 1752 394 -749 -2231
3500 -2231 -1457 1506 1006 -1397 -1455 -997 -390 2202 1943 -1113 -1992 443 1187 1114 -82 -1935 -1232 2036
3518 2036 2659 276 -684 29 694 2495 1688 -1211 -1874 585 1125 1229 1008 -548 -906 1758 3037
3535 3037 426 -1382 -1297 -825 1239 1588 -727 -2055 59 2169 1911 1042 -1229 -2425 153 1765
3551A765j964j461K40R91K077J299k440k138R46J252Pj87k246j323K364L072r90
3568A264j804n86J07J384J346k030l304J415J920N79L73j092j474J640J929j304
3584C63j636m74p72R86K381p33k392M85K103R55L11j703k831R66K626l80j663
3601a408l98M90J350K336p29k593M9R02j51L52n00k036q5L141J435q65q62j282
3619h54J86K521k00l248j557K074J268J128j07j707j76K576N10j829j078q06n01
3636a800K118J089j646o79J101J144J457m7k688j924J721J401p72r75j23L43K312
3653B032J788k469j592M24L70j23K80j778r27J812J725K57m50r06j247J222J721
3670B139k128k673N55R33J674J006j271j443J615J811q19j771j312r96J563K040
$$ plain form
3551 1765 -199 -1660 -1420 -429 1648 2947 507 -1631 -685 567 574 387 -1859 -3182 -818 2254 1264
3568 1264 -540 -1126 -1019 365 1711 -319 -3623 -2208 -288 291 664 -428 -1902 -262 1667 363
3584 363 -1273 -1747 -2519 -1533 848 115 -2277 -1792 311 1266 1577 -126 -2957 -1991 635 255 -1408
3601 -1408 -1806 -1316 34 2370 1641 -952 -903 -1 -152 200 -300 -2336 -2421 720 2155 1290 428 -854
3619 -854 -668 1853 1653 -1595 -3152 -1078 190 1318 1211 -496 -672 1904 2414 585 -493 -1299 -1800
3636 -1800 318 1407 -239 -918 183 1327 2784 2737 49 -1875 -154 1247 475 -500 -623 -280 2032
3653 2032 3820 1351 -241 183 553 430 710 -1068 -1995 -183 1542 1799 1349 443 -804 418 2139
3670 2139 11 -2662 -2107 -1174 500 1506 235 -1208 407 2218 1399 -372 -1684 -2680 -1117 923
3686I23p61j211M85Q40R57J441j082l526K01J872J87m48o47p72J680L150k51l049
3704a1j82p6L87R64j033k330K83K486J373k72k48j744P8J573k93k374p95m1Q63
3723a392K811k81j664n59J790Q16r19r93k357l8K572Q24r44m96O59R54J251M25
3741B459k787j598J032O84M21j33r39k21K609J965j354j548p71m09J812M20k399
3758g57j590K132K081N67k11j570j137J469J098k118j518j65m2J593K221j075
3774I78j740N56J460j48k78k147k200J463K443k35j278O26M7J895J102j532k685
3791a673j0J155K09L21n61j041J511K586Q0j072j000j188L51J828j065k147n4
3808a770K412J225P15n10k518L96J688m07k001p63n12R92K242N16j856l13R25
$$ plain form
3686 923 162 -1049 -564 276 1233 2674 1592 -1934 -1733 139 326 -122 -769 -1541 139 3289 3038 -11
3704 -11 -193 -269 118 1082 49 -2281 -1998 488 1861 1589 1341 -403 -325 1248 955 -1419 -2214 -2255 -1392
3723 -1392 1419 1138 -526 -1085 705 1521 602 -391 -2748 -2786 -214 610 -334 -830 -171 783 2034 2459
3741 2459 -328 -1926 -894 -210 211 78 -861 -1082 1527 3492 2138 590 -181 -590 1222 1642 -757
3758 -757 -2347 -215 1866 2433 2222 652 -485 984 2082 -36 -1554 -1719 -1761 -168 2053 978
3774 978 -762 -206 1254 1106 828 -1319 -3519 -2056 387 152 -1126 -500 -453 1442 2544 1012 -1673
3791 -1673 -1683 -528 -319 2 -559 -1600 -89 2497 2577 1505 505 -683 -332 1496 431 -1716 -1770
3808 -1770 642 1867 2582 2072 -446 -50 1638 1231 -770 -1533 -2045 -1053 1189 1705 -151 -464 461
3825D61O4P9n78l059o52K488J394o87o41j54Q72K470l05k998j229O50R70O07j38
3844c86j135j76K477J758p66j026j284q58J470O69j180j476J264J138J648Q25
3860B962j952j595J474R78j287j169p49m15J945K308j249j515Q61J97q5L51j547
3877d87k672N87K123R5K08k02n21J116K046j313k697k13M52P41P37o14j392J615
3895c91K426k81r11o19j259l8J699m31j316j11Q54J664J671o88k357l27J856K39
3913A680j233j242j037O75L301K04j438m44K65P9P94j050k555j12J605N57K66
3930C15J6j063K22J858Q12k397j774m2Q03R59M38j616R4J861J216m57o42j727
3948a124m19J516Q00j484o02M94Q87J309J092j708j293O90P54m51o13r50q68J731
$$ plain form
3825 461 525 604 26 -3033 -3685 -1197 197 -490 -1131 -1285 -413 2057 1752 -1246 -2475 -1825 -855 -248 -386
3844 -386 -1521 -1697 780 2538 1772 746 -538 -1396 74 743 -437 -1913 -649 489 2137 2962
3860 2962 1010 -585 889 1867 580 -589 -1338 -1753 192 2500 1251 -264 597 794 709 1060 -487
3877 -487 -3159 -2572 -449 -354 -146 -348 -869 247 2293 980 -1717 -1930 -1478 -737 0 -614 -2006 -391
3895 -391 2035 1754 843 224 -1035 -1073 626 195 -1121 -1232 -378 1286 2957 2269 -88 -415 1441 1680
3913 1680 447 -795 -1832 -1157 2144 2348 910 466 731 810 1604 554 -2001 -2113 -508 49 315
3930 315 331 -732 -510 1348 2160 -237 -2011 -2053 -1250 -291 147 -1469 -1375 486 1702 1245 603 -1124
3948 -1124 -1543 -27 773 -711 -1313 -819 68 1377 2469 761 -532 158 912 461 -152 -1102 -1970 -239
3966b39K539j148j096r9N32Q35K31j841k216J116J762J30j90o64n14J388R48n72
3984I02j801o40o20J132J702j055j601Q87J943O48k68j301j962R47J590m74j374
4001a345NM11J006J878p33j700K12O61j21l17k46j560M35K431O68q53n50n80O13
4020C15J323o67k114o24J508O85M70j92j812Q43J996j47j614r47J3l50J528K99
4038E13j285J7P76Q06P76n64k381m11K094J89j030m54K41L8J642J236k164q76
4056h37O83M10J06j3j539j98J609R38o4l54p05q89J471J521j503j947L14J176
4074A79P84M73j641o88J393J247p89r85m39o12J064J253j011j175P15P02K77P76
4092A523q22k009J87J422L02q30l99o51J316J881j111j960M79Q07M1J40n01j172
$$ plain form
3966 -239 2300 1152 56 -43 489 1324 1555 -286 -2502 -1386 376 506 316 -348 -862 526 1474 902
3984 902 -899 -1539 -2159 -1027 675 -380 -1981 -1094 849 1497 1229 -72 -2034 -1087 503 29 -1345
4001 -1345 -1340 -929 77 1955 1222 -478 -266 395 274 -43 -289 -1849 -1414 1017 1685 832 282 -298 315
4020 315 1638 971 -1143 -1767 -259 426 896 704 -1108 -265 1731 1584 -30 -977 -964 -1314 214 513
4038 513 -772 -755 21 827 1603 1039 -1342 -1753 341 530 -500 -954 -713 -675 967 2203 39 -837
4056 -837 -154 256 362 349 -1190 -1388 221 1159 1095 741 36 -853 618 2139 636 -1311 -997 179
4074 179 963 1436 -205 -893 500 1747 958 -27 -466 -1078 -14 1239 228 -947 -232 470 747 1523
4092 1523 701 -1308 -1121 301 603 -227 -626 -1277 39 1920 809 -1151 -672 135 176 316 -185 -1357
4110a357L86J602m8n2m57p71J88J661n05j251o09M05N92J381n2k122j91K277r3
4129I84r72o04n32J38J755r5j034l89L96L53J060J35j876q37J342P40j06l14r93
4148h49l01J716Q30j313p93K24R9J122J81j694q27J185J061m23L32j377n25J467
4166A15R61j050q41J84M6J115N35j024j415P72J043L80m42o77r81R08J568q69
4184C28j082M46LP37J118j254j076L85J075L1J17q99j411J057J814l92j142m26
4202e71j75Q11J499r43j663M83Q67M39j49o70j197Q77J475p4j068k14l41J92J618
4221A196n4j891k79J190M53J71l87j350r5J841N52j396n58k44K70J513L19j851
4239f00m28J412L03n1K93j394o02J388N21q53l15r6k79J584O97j714j086P47P16
$$ plain form
4110 -1357 -971 631 583 531 74 -697 -509 1152 647 -604 -1213 -808 -216 1165 1113 -1009 -1200 1077 984
4129 984 12 -592 -1124 -986 769 674 -360 -749 -353 0 1060 1195 -681 -1518 -176 564 458 144 -849
4148 -849 -1150 566 1396 83 -710 -486 -387 735 916 -778 -1605 -420 641 218 550 -827 -1352 115
4166 115 1076 26 -815 -631 -585 530 1065 41 -1374 -602 441 821 379 -298 -1279 -371 1197 328
4184 328 -754 -308 -305 432 1550 296 -780 -395 680 711 828 -71 -1482 -425 1389 997 -145 -571
4202 -571 -746 65 1564 621 -1042 -559 308 747 598 -72 -1269 -392 1083 1009 -59 -273 -614 -422 1196
4221 1196 1142 -749 -1028 162 615 786 399 -951 -1046 795 1347 -49 -607 -851 -581 932 1251 -600
4239 -600 -1028 384 687 636 929 -465 -1067 321 842 -11 -326 -422 -701 883 1580 -134 -1220 -473 243
4258B43L19J55j678m59J408J376q97n95q05N92O34N35j369n47L63P84Q6M91q73
4277b37q62J315R18m47o94r50k70J006J391j002j231N56O13M87M65j191j286P45
4295f74J056j76m91r6o85R56J672n96j459j11M03K29O75q46j071N05J750j83k18
4314F40n38o57N61J191n92j461o9R23l0P08j4j013J23J198p2p39P0j486m1J616
4334C18J039j675l09K87J107M88r0j922l35J263M12m96k99n24q9J751O25j407
4352A44m19J11l5M11O68j611p06J085R69L96k0j115l09J259P31j514r50N9K24
4371f22J325J96p34p31J313K89m17j52j136r80J209J176o97l60O9l4P91P73r99
4390B79j475L14P57j59k03m54k50J132J196n88j018K60k42j12O54n37j155P21
$$ plain form
4258 243 562 717 -961 -1420 -12 1364 467 -128 -933 -341 293 828 -541 -1088 -725 59 145 636 -237
4277 -237 -1099 216 1134 687 -7 -957 -1227 -221 1170 168 -1063 -507 106 593 1058 -133 -1419 -674
4295 -674 382 206 -285 -381 -1066 -110 1562 966 -493 -604 -201 28 703 -143 -1214 -709 1041 858 640
4314 640 102 -555 6 1197 605 -856 -925 -2 -32 676 662 -351 -228 970 898 159 229 -1257 -1298 318
4334 318 1357 -318 -627 -340 767 1255 1165 -757 -1092 171 583 87 -212 -736 -825 926 1551 144
4352 144 -275 -164 -199 212 880 -731 -1437 -352 617 1013 993 -122 -431 828 1559 45 -905 -846 -622
4371 -622 703 899 165 -566 747 1036 619 467 -669 -1649 -440 736 39 -321 -252 -286 505 1278 279
4390 279 -1196 -882 -125 -284 -487 -941 -1191 -59 1137 549 -469 -209 -451 -563 91 -446 -1601 -880
4408h80J193L29M34n19j363K72J427n6j500l56K07L94J678q1j429K68O94Q6o2
4427G36n89j286j00J630N5n63K89m14M34R06k0j441o34N40M28j19K98j619N85
4446h84J912N27j130p59m50L10O62P1j440l84J400N68N79M7r23p33J435K3j031
4465b00o02N0j85J591R33j281m02R06M92j55k48j198o59O93J071n53j09J80j81
4484A43J150K58j108j172P6r0J77Q95p87p80R71J401l36o24o73q31L83J034j022
4503i35p92P22N20Q37N15o85r69K32M70O3q03On93Q29J116N06j123J27L61L98
4523H02K47n55k028N85J108L05k28K21k08K17J362o69j384n17K81K4M51L02j130
4542h14L19J451p7L4m29r76o39J131m8j294m6N87P34J112Mj059o38R71j55m48
$$ plain form
4408 -880 313 642 1076 557 -806 -534 893 837 -663 -1019 -812 -418 1260 1179 -250 18 712 798 736
4427 736 147 -1139 -1239 391 446 -117 172 -242 192 1098 1078 -363 -997 -457 -29 -148 150 -1469 -884
4446 -884 1028 1555 425 -334 -784 -474 188 259 -1181 -1565 -165 403 982 1029 106 -627 808 831 -200
4465 -200 -802 -752 -937 654 1587 306 -96 810 1302 1147 899 -299 -958 -265 806 253 144 324 143
4484 143 1293 1551 443 -729 -653 -743 -566 329 -458 -1238 -267 1134 798 174 -499 -1330 -947 87 -935
4503 -935 -1727 -1005 -485 352 867 182 -787 -555 -85 -22 -825 -819 -1412 -583 533 1039 -84 43 404 802
4523 802 1049 494 -1534 -949 159 464 236 457 249 466 1828 1159 -225 -742 -461 -437 14 316 -814
4542 -814 -495 956 879 913 484 -492 -1131 0 -48 -1342 -1388 -801 -67 1045 1049 -10 -648 323 168 -280
4562b80n18j5l53J326R53n20k64K12k48N79J11j110r65P23P92K97M44r79k70J097
4582A012O45r11j008k13j1L14M38m97o41P68J235l48nj059r66M49P72n25n94k25
4602a370N68Q14J167n76j551N10N05j03l11j014n82R42J400J54o84K41q7p1P33
4621F85l48j633O9Q56O60J65M14j129N02J296k03r59p75l75N36Q15q1q12J61Q91
4641G35K02N77n06j450k99P97J38o19j5L8r5J636K64j511j55L44l6j1k75j218
4661a459J01J595N45n56k24J93m8N16J80j386p28Q56M11K24Q58p77p31J283N70
4680A423p69l57p77k06Q48Q50j248n86Q61N13N36k1p90j329Q55K72l45n56M04
4699d22k95P67R75l86j544K78L61K3M04r51j049P10J566O1l56k75m41M57R28j176
$$ plain form
4562 -280 -798 -813 -1166 160 1113 593 329 541 293 872 983 -127 -1092 -369 423 720 1164 185 -85 1012
4582 1012 1657 746 -262 -475 -486 -172 266 -231 -872 -104 1131 783 778 -281 -1247 -798 -26 -551 -1145 -1370
4602 -1370 -802 12 1179 603 -948 -438 67 -36 -347 -1361 -1943 -1001 399 553 -131 110 23 -48 685
4621 685 337 -1296 -1227 -371 289 454 868 -261 241 1537 1334 375 -400 -775 -239 576 495 -317 -156 735
4641 735 937 1514 1008 -442 -741 56 194 -425 -440 -402 -497 1139 1403 -108 -263 81 45 34 -241 -1459
4661 -1459 -1358 237 782 226 2 195 147 663 843 -543 -1271 -415 -4 220 1078 301 -430 853 1423
4680 1423 654 297 -480 -686 162 1012 -236 -822 39 552 1088 1067 277 -1052 -197 75 -270 -826 -422
4699 -422 -717 50 1025 639 -905 -627 -266 -243 161 -790 -1839 -1129 437 498 142 -133 -574 -117 811 -365
4719c65q84K96L61M45K31M69j052L25J140j87n33l07q55m9J741j12j100J16N26
4738B06M09N29l23j478j58J449r8o92j32l03M19J102J53p95l73K5l55N70j25n24
4758d94o20J050O06L2k0o48l12J234J37j245m81K69J92R02J90j129K11O89J34
4777F97m10R0o75o12Q31R91p04l65m5M08R68J84j202j102P23M86l81L14n28o20
4797i52J299J040q29p09O2Q4k28M97p93m95P75L96O0N09p67q78R66N33m37q74
4817g41k19K41M94Q47n37j049P99L00Q2l63P9r04K35J083j57o55J36K16K60P49
4837H96m70q66l19N88J41l6K6m60rQ83K61q30p4J3J33L06J81j040k27J227m77
4858a53P71k40n75j79P75K54p83J33m38J8Q93Q24j301n78P75O16m94J48j185k49
$$ plain form
4719 -365 -1249 -953 -592 -147 84 553 -499 -174 966 779 246 -61 -916 -965 776 664 -436 -320 206
4738 206 615 1144 821 -657 -815 634 536 -156 -288 -591 -172 930 1083 288 -85 -60 -415 155 30 -494
4758 -494 -1114 -64 542 574 554 -94 -406 828 965 -280 -761 -492 -300 602 792 -337 -126 563 697
4777 697 287 377 -298 -910 -79 912 208 -157 -202 206 1174 1358 156 -946 -223 263 -118 196 -332 -952
4797 -952 347 1387 558 -151 -89 -5 -233 264 -529 -1024 -249 147 207 716 -51 -929 37 570 133 -741
4817 -741 -960 -719 -225 622 85 -964 -165 135 217 -146 -67 -971 -736 347 190 -465 -329 -113 147 896
4837 896 426 -440 -759 -171 -30 -66 -40 -500 -509 374 635 -195 -269 -256 -123 183 364 -676 -903 324 -153
4858 -153 618 378 -197 -376 399 653 -130 3 -435 -417 476 1300 -1 -579 196 812 318 466 -719 -968
4878i68J164K55k91j05j44l10P04O81r34l67NJ78O60r2n01n56O31O46l99n13j18
4899c74k75O81O61q41l59M09J37K80J19o69o42Q55O36m45j74k78m45P81N40j67
4919D30j022L81K6N90K54j77j231L04P45J71o77l46J75J36O68k59n82j36K99R
4939b42O27k41p58K42O01j48K6j43p09J44J062J73q67l99J33O23K03l42m28k43
4959f86Q52J95k42k30j98J3P73Ml80p34K25N77N78J2o33p12N43P04l66J0p07j47
4981e49J017M22j038j84L82K17J56O0k15o70N18K13RJ85o20n35P48P53m23n72
5001a26P6JK20L97o91o51M72M77L7M8l57m76Q30J50k35o73O22o62N33L97P6j090
5023f25M45N31n0l8j69p09K50P21j68n75P3K54K53O56q00m34j88O52k51O7J60
$$ plain form
4878 -968 196 451 160 55 -89 -399 305 986 52 -315 -310 -132 528 436 -65 -621 10 656 257 -256 -374
4899 -374 -649 32 693 -148 -507 -98 39 319 438 -231 -873 -18 618 173 -1 -279 -724 57 597 430
4919 430 -592 -211 -185 405 659 482 -749 -445 300 471 -206 -552 -377 -241 427 168 -414 -550 -251 -242
4939 -242 385 144 -614 -372 229 81 107 -36 -745 -601 461 634 -233 -632 -499 124 327 -15 -443 -686
4959 -686 166 361 119 -111 -309 -296 477 481 101 -633 -408 169 747 759 126 -586 -43 661 295 305 -402 -549
4981 -549 468 890 -148 -332 50 267 423 483 268 -402 116 329 338 523 -97 -632 116 869 446 -126
5001 -126 -50 -49 171 568 -123 -774 -302 175 212 260 -97 -573 257 407 172 -501 121 -541 -8 389 465 -625
5023 -625 -180 351 301 263 94 -615 -365 356 188 -387 -314 -60 193 849 49 -385 -573 79 -172 -105 55
5044E5o31M11P05q5r43L98n41L66O87k83q76j55P20L8M89j07p73R1N20J97q60
5065e77K75m75J87R14J02o05j1K2M21K68n5o68n92J174O3l80k70K75N5R16k26
5086H13l18q51L54J88J10j51l71j45J008K18m09J49o77j24M19L52o37l43L03L03
5106A91M50K49o98n27O49K03n61o18L7N0N32J55k12k15J6M53j85J82j55j085K73
5127h16O42J66k4J41l88L20R25m95r58j45K38K25M67k98o70O81O19M5k44m38m50
5148d57J08M04R6p18K82o2pQ60j83o63k13O82J7l08m45l05P0R07M29p29k97N28
5170dj84M64k45r34K54M70P9j98M38l18k13P86O07q08m95K00j17M71j36j76l81
5191d40Q97O65l76k73n13q0L06O81r28Q0J54k3P90P7k26o44Q5K48l07m22k47J67
$$ plain form
5044 55 -576 -165 540 455 -488 -90 -631 -265 422 139 -737 -892 -172 -134 355 248 -525 -434 86 283 -577
5065 -577 -302 -777 -590 324 426 -179 -190 -168 253 521 466 -202 -794 380 443 63 -207 68 123 1039 813
5086 813 495 -356 -2 186 296 145 -226 -371 637 855 446 595 -82 -206 213 565 -72 -415 -112 191
5106 191 641 890 192 -335 314 517 -44 -662 -625 -575 -43 112 -100 -315 -299 154 -31 151 -4 -1089 -816
5127 -816 -174 -8 -32 109 -279 41 966 471 -487 -632 -394 -169 298 0 -670 11 630 675 431 -7 -457
5148 -457 -349 55 151 -567 -285 -347 -354 506 323 -340 -553 129 146 -162 -607 -912 -842 65 494 -235 -532 -4
5170 -4 -188 276 31 -903 -649 -179 -100 -298 140 -178 -391 395 1002 194 -301 -101 -218 253 117 -59 -440
5191 -440 457 1122 746 473 -40 -120 186 867 -61 19 173 150 940 1017 791 147 232 480 173 -249 -496 -329
5213c29L12O89l43k66r2K56L4J04o91p77P54L35l54K85L16n70K83N77k80o61l2
5234d50m07L85O93m29l74J33O91L82K01p88p84P27K18r9p23L32K38JN80O5n60
5255C2k98M70k54o6J69n29j79Q57M46p21j07j81K15O74o66m96n60P23J42J51J21
5276e7j37o2P55n18K31o28k40l8N79M30m35j85M59N36m5J58p46n56N76K06R0o56
5298b83j3K36M39J101p69o34N01J12o04Q8n67L6M88L14o1n1O3l84J03O77p09q64
5320g81J52L16L02J40j93k40J37N69k46l83q6m78M92L75p3m32L77K44Q4M54l12
5341D18o06l21K85K39j15k26M1L79M44n7n40j49L39j02K47k38n13m0P31pJ20j19
5363B10j61l22M53m8l32j83p6L8M54K19m09j27N50N2k54l49k44j21J78P54o31
$$ plain form
5213 -329 -17 672 329 63 -29 227 261 365 -326 -1103 -349 -14 -368 -83 233 -337 -54 523 243 -418 -450
5234 -450 -857 -472 221 -208 -582 -449 242 624 825 37 -747 -20 198 99 -624 -292 -54 -53 527 592 32
5255 32 -266 204 -50 -116 53 -476 -655 202 648 -73 -180 -361 -146 528 -138 -634 -1194 -471 -329 -178 -57
5276 -57 -194 -256 499 -19 212 -416 -656 -694 -115 315 -120 -305 154 690 645 803 57 -499 77 283 373 -283
5298 -283 -296 -60 379 1480 711 77 578 690 86 174 -393 -357 131 445 384 333 396 12 115 792 83 -781
5320 -781 -629 -313 -11 129 -64 -304 -167 402 156 -227 -313 -791 -299 76 3 -429 -52 192 276 730 418
5341 418 -188 -509 -224 15 -100 -326 -285 94 538 481 -59 -208 131 29 276 38 -475 -515 216 209 329 210
5363 210 49 -273 180 132 -200 -383 -459 -421 33 252 -157 -284 266 318 64 -285 -529 -650 -472 282 -349
5384c49P2L88J90K68K56p99k42J20K90j10m2l01j7J039J90n12n03M4K16N9M06
5405F63p42n83O96L85K26m6n06k01M95K59o54m13K62k23j30Q62k03n11K61N59
5425D56q9k3l76o47J60N20j65r3k70M83K60J81j62o81J71J44J9Q9k08J4jO66o5
5448C83j67k16J12k69N31m68m93J9M34K91J64J05p57K27P04k19p00K8o1L32R8
5469G8L66m91k27J77L26k1j0o67K5J55L85m22m8L33j56L62K67m91n75N46j66J27
5491a27K24o27J71M09J95j8L80n06m82K3N22j21o29L93J72L89L57m41l10K9N83
5512E86l26n03M8j57J98P26m98j22k6K10J0J70l62m36K77N15l41Q8lm30O69P34
5534A027o28p44L3M29N1J33p6n97K77N97k32k45J3m16L01K41K36o82o9K38N8O07
$$ plain form
5384 -349 -277 111 301 569 825 26 -216 -96 194 84 42 -259 -276 763 953 441 -62 -18 198 257 663
5405 663 -79 -662 34 419 645 599 93 -108 387 646 -8 -421 -159 -382 -512 350 147 -364 -103 456
5425 456 367 344 -32 -679 -519 1 -164 -257 -527 -44 216 397 235 -446 -275 -131 -112 -23 -231 -217 -218 448 383
5448 383 216 0 112 -157 374 -94 -587 -568 -134 157 321 426 -331 -104 600 381 -319 -291 -352 -20 78
5469 78 444 -47 -274 -97 229 208 198 -469 -444 -289 96 -326 -374 -41 -197 165 432 -59 -634 -88 -254 -127
5491 -127 97 -530 -359 50 245 227 607 101 -381 -358 164 43 -586 -193 -21 368 725 284 -26 3 586
5512 586 260 -243 -195 -352 -154 572 74 -48 -74 136 146 316 -46 -482 -205 310 -31 57 54 -376 293 1027
5534 1027 399 -345 -312 117 168 301 225 -372 -95 502 270 25 38 -378 -77 164 400 -282 -351 -113 -55 552
5556E52oo05m42N89L34o60k53l7J05Q79l76k94l17O07l29J87L51j006j27P96O1
5577Ik5j75M9j85M74L94n85l70J69m3N48j66o49j74N76M72k38O0k72p7J71J89
5599A52m68k05L29L3M53L4l35n03O97J02k19j44m80M8N03O81o26m03L08J77K53
5620C87q2m25k02J35O03l94K68l00n7jN92ml61M5k87o0O97k13n97R4M71O5K28
5643F02j62o90M58L56jn04O5J20r4K78J71q02l17N95J27J51k49l53q9K61L53l51
5665g5o3k52M56L59j37o52k02N07L40l00p5m88J99N74j03k92K31l02O9R5M42p09
5687c78j54M53K7k0P0k1k74J52N04m45j84j32K80J24L55o54P1K37j24L34O7m73
5709a85k49M63J42p4j79K64m35L14L63k27p07K17K36K43J01m39j04J17P49k01
$$ plain form
5556 552 546 -59 -501 88 422 -238 -491 -528 -423 456 80 -214 -531 76 -253 -66 285 -721 -848 -52 9
5577 9 -16 -191 -142 -327 147 541 -44 -414 -245 -288 260 94 -555 -729 -153 319 81 141 -131 -208 -37 152
5599 152 -316 -521 -192 -159 294 328 -7 -510 187 289 70 -74 -554 -506 -3 678 52 -351 -43 134 387
5620 387 305 -120 -322 -187 416 22 290 -10 -67 -68 524 520 159 204 -83 -143 554 341 -256 -162 309 374 602
5643 602 440 -250 208 564 563 59 124 244 150 428 599 -203 -520 75 202 353 104 -249 -338 -77 276 -75
5665 -75 -138 -390 66 425 288 -364 -566 -59 281 -19 -94 -582 -383 191 88 -204 27 -275 -206 -111 331 -378
5687 -378 -532 -79 -52 -72 -2 -23 -297 -145 359 -86 -270 -402 -122 2 357 -297 -226 11 -113 221 288 -185
5709 -185 -434 29 171 97 -82 182 -253 61 424 197 -510 -293 -57 186 287 -152 -256 -139 610 409
5729D09m94K01K9J42K29k46k40j8N1R0L53o1j022M76R56l04m74K74n96L48K48
5750C51K00n97k0J07M71j73K58o20j98P06o6m39j74L35n08N43K19o42K93j62K3
5771i3K97J06o35qL96k68k21M30k32K06MJ2j36j42K22l25N56k53p8r5N02K16k16
5794B45l16j82k28M01L92m31j84K76K41J2J38j42m20M48n2o2j31j81O3J09N02
5815D98l05J06k01j45L21J04l23j27M41j38Kj60J33m50L19N83n13k75j36o2L9
5836b89P41l50n67M54J77O6m11L85l72k94Q55j07n36N4j86O7R17k65m65K16K84
5857C74k78ml25k97P96J86K0l84O4o7j80M13j05m40pM0K69Q5P3m04k15L18M96
5880D28n47j33K37n35P28J58q03K62M50k16j82N38j086o5Q45j12l39L75k0n62
$$ plain form
5729 409 -85 116 145 287 516 270 30 12 63 153 506 445 -577 -101 855 551 77 351 -245 103 351
5750 351 551 -46 -66 41 512 339 597 -23 -221 485 419 -20 -194 141 -367 176 395 -247 46 -116 -93
5771 -93 204 310 -325 -333 63 -205 -426 4 -228 -22 -18 -6 -142 -284 -62 -387 169 -84 -162 -257 245 461 245
5794 245 -71 -253 -481 -80 312 -119 -303 -27 214 226 364 222 -198 250 198 136 5 -176 -113 -4 498
5815 498 193 299 98 -47 274 378 55 -72 369 231 233 73 206 -244 75 658 145 -130 -266 -328 -289
5836 -289 452 102 -465 -11 166 232 -179 206 -166 -460 395 288 -248 -194 -380 -313 604 339 -126 90 374
5857 374 96 92 -233 -530 266 452 472 88 152 85 -95 318 213 -227 -234 -194 75 160 233 -171 -386 -68 428
5880 428 -119 -252 -15 -550 178 336 -467 -205 245 29 -153 385 -701 -766 79 -33 -372 3 -17 -579
5900e79M12P14k59p62K16Q07n81r9k08q1K92J39K17m62K63k03O44q6o19K96m66
5921d05J74M53J00J44o65O88QM8l44l09l81M98M95n51l67J61O10r7J24j06p26
5942d48K62M10m50J2J13k40K67L90J32n92M7P9n6K26j54n37J19M61J25J55q2j21
5964A18j13M97k34l95p4R2M06K8j36n86L98M49J65m74nk25r3K52j69K69m06k1
5986b57M82L10m57l56q7N88p06M58p7j10n3L29K00r3m60j83L44j34L55j80n05
6007e92J68P22l63J58k4l21M87M6l93m12K70J22jK41n0k18K77M18k50K83n88n79
6029e99J57O17j30j06J67j23L47K89l41p32q0O80j10K7n53J8K30Q09j89k39j63
6050b4J61k46L12qq62K35O43K51n9j00Qo2L4K01o54K7k83L64L59J03o50K54N25
$$ plain form
5900 -579 -167 547 288 -474 -258 549 -32 -131 -339 -420 -128 11 228 -234 29 -174 470 384 -235 61 -405
5921 -405 -231 222 322 466 -199 489 497 545 201 -108 -489 9 504 -47 -414 -253 357 260 384 278 -448
5942 -448 -186 224 -226 -214 -101 -341 -74 316 448 -144 -97 -18 -74 152 -2 -539 -420 41 166 321 239 118
5964 118 5 502 268 -127 -201 -109 297 325 189 -397 1 450 615 141 136 -89 -182 70 -99 170 -236 -257
5986 -257 225 535 78 -278 -365 223 -483 -25 -102 -212 -265 64 264 171 -289 -472 -128 -262 93 -87 -592
6007 -592 -424 298 -65 93 69 -252 235 281 -112 -524 -254 -132 -133 108 58 -160 117 535 285 568 -20 -599
6029 -599 -442 175 45 -61 106 -17 330 619 278 -454 -534 146 36 63 -490 -472 -242 567 378 139 -24
6050 -24 137 -109 203 195 -667 -432 211 462 403 303 311 249 283 484 -170 -143 -426 -62 297 400 -250 4 529
6073E29J03k69J2p04K54K20K8j88K23J63m3k27N45n68k96L08J05o9l52rj18K94
6095e9O11m15p8r7J84l55l2k47j18K65K23N12j44k1n18J54N09m32j71l52n1O42
6117A0N69n87l04M69P3j39P2l30m6M0L24k27j64L5J21O71K9k75o48pN9J18l3K37
6141F7m23m11J144j56l11j45N5n7P23m53n91j64M83K48L80q2m04M5K60j58l71
6162c21K76l46l0O49K07n04r2M10K04M6k97l02J52L35j39n15J82k16K66N36j9
6183D82m67k86O03m55J87J76n18j55N37L83k95r5J60n48J95M47n65q4j10R1M37
6204A20J40n41J79K13k5k3j07j37j22K0P61n04K23O3k95J23L73j35n42M9j58M64
6226A39k94j80k00O42L16j42n43Q0n8J66K8n9m30K19J95K5k68N65o27K04L10q1
$$ plain form
6073 529 632 363 375 -329 -75 145 173 -15 208 371 328 101 646 78 -218 90 195 126 -226 -235 -353 -59
6095 -59 552 137 59 -38 146 -209 -241 -488 -606 -341 -118 394 250 229 -289 -135 374 -58 -229 -581 -632 10
6117 10 579 -8 -312 157 230 91 163 -167 -213 -173 151 -76 -240 -205 -84 587 616 341 -307 -314 -255 -137 -170 67
6141 67 -356 -767 377 221 -90 -235 -180 -237 486 33 -558 -722 -239 9 389 307 -97 -52 208 50 -321
6162 -321 -45 -391 -421 228 435 -69 -161 249 453 499 202 -100 52 387 248 -267 -85 -301 -35 501 482
6183 482 15 -271 332 -123 64 240 -278 -433 104 487 192 97 257 -291 -96 351 -214 -298 -408 -317 120
6204 120 260 -281 -102 111 86 63 -44 -181 -303 -283 478 -26 197 260 -35 88 461 326 -216 -167 -325 139
6226 139 -155 -335 -535 107 423 281 -262 -182 -240 -74 -46 -105 -535 -316 -121 -96 -364 201 -426 -222 88 7
6248Gm91K17K99J00L4n8l65K23J49M5k67M7l97L70K76j64K44k81k91M44K15k8
6270C28o59P4L18r5M25l64J12j48N48L42r35r6K2k4O0J57l13L35Qk62l4L30l52
6293b23R8J6K12j31j17K4M7N19m43n5j66J0L54o2k14k62j11K07N03j98j4p4J32
6316E2O5J52m01m85L44Q3J15J30j7k7J79j09o8j88K26j40k02L29J23m61N72o0
6338B12k70J59k49L38l86L57k2m93M62j66m40R83k58n27L0N08M7l36J25o39M26
6359a39P7M09l35mn1J52L22n1n47j29L99k22L91J90o40J54O59o41j9n2K90l61
6381a48P9K85k40m6N1K30J81j65m05k09M04K61m55j2J93l6jo8l1k8L05l4j84M09
6405C36o81L8K18L58O7l26l44k5L83L97j69m76K37j5J65k1j37j70K38k18p8J56
$$ plain form
6248 7 -484 -267 32 132 166 108 -257 -34 115 160 -107 -60 -457 -87 189 25 269 -12 -303 141 356 328
6270 328 -331 -257 61 -34 391 27 139 -9 539 881 -54 -150 -128 -152 -92 65 -248 87 95 -167 -201 129 -223
6293 -223 -125 -109 103 -28 -145 -121 -74 445 2 -53 -219 -209 145 83 -131 -393 -504 -297 206 8 -6 -80 52
6316 52 117 269 -132 -617 -273 -190 -75 55 38 11 190 81 13 -175 51 -89 -291 38 161 -300 272 212
6338 212 -58 101 -148 190 -196 161 139 -354 108 -58 -498 485 227 -300 -270 238 285 -51 74 -565 -139
6359 -139 -62 347 12 8 -43 109 431 380 -167 -296 103 -119 272 462 -178 -24 635 -6 -25 -77 213 -148
6381 -148 -69 216 -24 -70 -19 211 392 227 -178 -387 17 278 -177 -189 4 -32 -33 -101 -132 -160 145 111 -73 336
6405 336 -345 -307 -89 269 336 10 -334 -359 24 421 252 -224 13 -2 163 142 5 -165 73 -145 -223 -67
6427f7J74m24J09L70J4l87K6L67R6L6k85j67Q7L56k66l66K80J8k55L55J51k93
6449g1K83m16P9K71J24l86q1M75j07j56J8l40j29O97J0k16l67L04p9L35Om00Q7
6472e9K78Q5l74K45O2l20L7M11k97q4j99p6M20L18m82j62M27R6k16J11l12m28
6494e19N26O07n34j91K35j81J3K53k92r1L85o7RK47k24p21Q32K13n31k08m3J41
6516a41M16J3k18l12L35m6n6J33O2n13L33M90m07J58m7k95k02N00l08j11M62j10
6538A36O3J39k32n82M1O90n79J87j00J10o4M45k21r1n6K93l07L20m31j01R8K91
6560D9q0J20l12k93N78J95O3o33o1j11P94j39j53J6k89J08L00q3Q7n99J77L70
6582A04K10l11k68L21K4M6L47n65l9J45J9P3p4k8l01M42j14J15n22L89J19j39
$$ plain form
6427 -67 107 -317 -208 162 176 -211 -185 182 278 314 29 -138 -51 305 39 -327 -47 -29 -284 71 222 -71
6449 -71 212 -204 -125 146 270 -116 -197 278 171 15 33 -307 -436 261 271 55 -312 -8 -87 248 254 -146 -59
6472 -59 219 304 -70 175 237 -83 -46 365 68 -16 -215 -291 129 447 -35 -197 230 326 110 221 -91 -519
6494 -519 7 614 80 -111 124 -57 -44 209 -83 -174 211 144 153 400 176 -545 287 500 -31 -239 -282 -141
6516 -141 275 288 70 -242 93 47 -9 124 186 -327 6 496 89 247 200 -95 -297 203 -105 -216 246 136
6538 136 199 338 106 -476 -435 255 -324 -137 -237 -127 -191 254 33 -58 -114 179 -128 192 -239 -340 -242 49
6560 49 -31 89 -223 -516 62 257 320 -313 -374 -485 309 170 17 33 -256 -148 152 69 156 -443 -266 104
6582 104 314 3 -265 56 80 126 473 -92 -131 14 33 106 32 4 -297 145 31 146 -376 13 132 -7
6604gJ38l79J1J90M33k45j31nJ16j80M5K4j83l9K43k76M20k4k36J55J39k34rj42
6628a76j20K49L42k52m27M54Q0K9Q6k34j00L16p9p0j54J38k08O2K30R4l64k9M70
6651C37j75Q6k77l56M22m0L1M3K25k71K7K09m10j25J27p5j03M45J80k62j32m5
6673a39J78K24k47j35p1m6M09k22l88L93r0K88J55k92o4P3k64J38Q7P3k67P7M76
6696C46j52n0j17r3K52J60l06l66J03L59l11K96J14m12J87K77j15n66K67k70J66
6717b31K41M5J6j74J88j47L05k68n84M40M19k22m6k8M5L61P2m17k21L82j8l59
6739b01L18jl13J59K50n6K28J2k48n7m0L41n22J52L4Q1N1p1m95L61L17j55j58
6762a3l5k18J66O58m72j55J39j27K83l21K78l3l43R7j15K11k49J0J47N27k22l4
$$ plain form
6604 -7 131 -248 -237 -47 386 141 10 5 121 -59 -14 10 -173 -212 31 -245 175 151 -85 70 209 -25 -34 -176
6628 -176 -296 -47 295 43 -384 70 150 179 265 31 -69 247 168 98 -56 82 -126 -64 166 260 -104 -133 337
6651 337 162 248 -29 -385 37 -3 28 71 296 25 52 261 -149 -274 -147 -222 -325 120 300 38 -94 -139
6673 -139 39 263 16 -119 -190 -236 173 -49 -437 -44 -134 154 309 17 -47 26 -238 -100 -13 60 -207 -130 346
6696 346 194 144 27 -66 186 346 40 -326 -223 136 -175 121 235 -177 10 287 172 -394 -127 -397 -231
6717 -231 10 55 71 -103 85 -62 243 -25 -609 -169 250 28 -18 -46 -1 360 432 15 -206 176 158 -201
6739 -201 117 116 -197 -38 212 156 384 396 148 91 51 392 -130 22 56 137 188 117 -378 -17 300 145 -13
6762 -13 -48 -266 -100 558 86 -69 70 -57 226 -95 183 150 -193 -96 -211 0 -249 -239 -92 435 213 179
6784A79k6k42j63K09L75m29j32J06M06k1m00O2n9Q3J22j32j18J65j55J08K20k91
6806a33%k6K38qk78j11k92M85J20j25K22k21K61k55M43l08l17J31N7p4K0n3o9
6829b93J98N11l60j26P3r9j84L97k7m26L37m5J36j5L7n19N17lM7j77k74L93J67
6852B65P2m17p1j21K27J52l98L58o13K35L91J7k03j50K03K1J47m2j07j15Q2j4
6874h1j22K25j40lQ4M09k25l5jm47Q8K96k06k60K32N30j39K78n57l61M75L06o40
6897b94k9k6L30M8M21j42n26L36L43l53R8r4m02L49N5k63J71j09j39J83L91l14
6919C4l93J71L05l77K23j34k72L51K10J1l53L6K24j68M5J22k79o2M48j75K30m6
6941A51l10J57K9O4j91J02k19lK06O7j86R6K54M3k06J69k16m92M65j24J4M02o94
$$ plain form
6784 179 153 -89 -252 -43 332 -97 -229 -123 283 262 -138 -76 -135 -52 70 -62 -180 -15 -170 -62 158 -133
6806 -133 -133 -159 79 71 -207 -318 -610 -125 -5 -130 92 -129 132 -123 320 12 -305 -174 -117 -191 -171 -224 -293
6829 -293 -95 416 56 -70 3 -96 -280 117 90 -336 1 -44 92 77 114 -405 112 109 156 -21 -295 98 265
6852 265 337 -80 -151 -272 -45 107 -291 67 -546 -311 80 97 -106 -256 -53 -32 115 73 -34 -149 -67 -81
6874 -81 -203 22 -118 -121 -37 372 147 112 111 -336 -248 48 -158 -418 -186 344 205 483 -74 -435 40 346 -294
6897 -294 -323 -349 -19 29 450 308 -218 118 461 108 206 112 -290 59 114 -149 22 -87 -226 -43 348 34
6919 34 -359 -188 117 -260 -37 -171 -443 -92 118 129 -224 -188 36 -132 -87 35 -244 -306 142 -33 197 151
6941 151 -159 -2 27 91 -100 2 -217 -220 -14 53 -133 -37 217 260 54 223 7 -485 -20 -144 -130 272 -422
6964d22K86N48O2o06j88p7J73M06j55j31O9J44r0JO0j18j11k2K19j51k32J09j1
6987b37J52M89m24L07k89J2L76n16j13j74L57K62j07M4j12K83k72O6k6l16J53
7008h5RJ57q5j90r6N11m3k73k98K55j71J42L13l28n8j6L39R8k8l22o0J31k67K64
7032a01j36o7J7J78L34l3k96K04j27J89j38j76l09O9M82N25n37k17J16R1L35l8
7054C65p09r8P16j27q9j59L85j39j93J68r7j70O7K90O5l63o9k3J0K58J83k35j61
7077a25k71N45M80m69j72J28L7L24K5j76l18J60j10rm13K05L3L51j2k70L5R6j28
7100e4O6L68k53j35l9k8J49J05n7o07O86J83o00K01k89J65O7M09j09n06K63p3
7122h8P2O1k3j95j20O22n29K12j11l79L01N95n04j01L4J10kJ22q8j89K95J47l85
$$ plain form
6964 -422 -136 412 474 -132 -320 -397 -224 182 27 -104 -35 109 19 20 80 -38 -149 -171 48 -103 -335 -226 -237
6987 -237 -85 404 -20 287 -2 10 386 -130 -243 -417 -60 202 95 139 27 310 38 104 78 -238 -85
7008 -85 -76 81 -4 -194 -290 221 178 -95 -393 -138 -309 -167 146 -182 -240 -256 83 181 153 -169 -229 -98 -365 -101
7032 -101 -237 -304 -287 -109 225 192 -104 100 -27 162 24 -152 -461 -392 90 615 78 -139 -23 68 403 365
7054 365 -344 -442 274 147 58 -101 284 145 -48 120 23 -147 -80 210 275 -88 -157 -180 -170 88 271 36 -125
7077 -125 -396 149 629 160 -12 116 153 477 502 326 8 168 58 49 -364 -159 -126 225 213 -57 -22 74 -54
7100 -54 12 380 127 -8 -47 -75 74 179 122 -485 201 384 -216 -15 -304 -139 -72 337 228 -278 -15 -88
7122 -88 -16 45 22 -173 -293 329 -200 12 -99 -478 -177 418 -86 -187 -153 -43 -45 77 -11 -200 95 242 -143
7145a43L79rl51l3K50N0k13j6J10p9N20l01j62j00O46m37l01J75l49J80L18P1
7167B05l27o1K00R6k75K94N9j98J91J73l12j62q4M5L73k2l49k16K83K69n0Mj86
7190e0l54M23p7j37K90j70k44K26N94m54J9q0rJ51J79j49n62L43p2M22m32j08
7212b51n1L08L88o83J42j11M88k71J27o3p8j0N1L8L20k37j58l29M46Pj40j19J45
7235d1j83K20P2l43L26j05J02k7j71Q6J30Q4M1m64R7K35j69J71J24m25j58M99
7257A01J17l95K64k69o8N19k70j23k7L7L00j17q3k94rM28k69J42L05l72k69L44
7279hL88m12K7j15o9K59L42o99M15mJ29k57l89K81l11M88K68l78j02K88k87L15
7301A69N8k25j51J06p0K22J53K3n00R4N19k73N7l19j08J66M25k90j98K53L40j80
$$ plain form
7145 -143 236 227 -124 -157 93 143 -70 -86 24 -55 465 164 2 -98 548 111 -190 -15 -364 -184 134 205
7167 205 -122 -183 17 113 -162 132 191 -7 184 357 45 -117 -201 -156 217 195 -154 -370 -87 182 132 136 -50
7190 -50 -404 19 -58 -195 95 -75 -319 -93 501 47 66 -14 -23 128 307 158 -404 -61 -133 289 -143 -251
7212 -251 -302 6 394 -289 -147 -258 230 -41 86 23 -55 -65 -14 24 344 107 -51 -380 66 73 -67 -186 -41
7235 -41 -224 -4 68 -275 51 -54 48 21 -150 -64 66 150 191 -273 -176 59 -110 61 185 -240 -398 101
7257 101 218 -177 87 -182 -250 269 -1 -124 -151 -114 186 69 -14 -308 -317 111 -158 -16 289 -83 -352 -8
7279 -8 380 -32 -5 -120 -189 70 412 -287 128 124 253 -4 -393 -112 -423 65 333 -45 -147 141 -146 169
7301 169 227 2 -149 -43 -113 109 262 285 -215 -121 398 125 182 -137 -245 -79 346 56 -142 111 451 271
7323B71j52j44n9M3M2M6m80N39K4r5J02O8k54k40N56k21M1k20r4n4K96k07j56
7346c48L23k80K15J95j23l62J6L53J27k85L37m94J19L82o7l30M4k02M8M26j68
7367g4k35L16L3K12l66K18j76j83O5Q7j6j33J55k34L09K24k91M1Pj50K16nl43
7390c23rJ57M80l29J63k24j43J49M0k32j2J35J41m6J80k2j80J28L79j17k59Qk70
7413b06P4M23l89p9K06N08j55L3k32j28q9K01k45l1l7P4K18J01K08j66l21l28
7435c60M60MQ6m37L81J64k52j00L44l99k76N12K26m39l2M3j50J38J47m7l07M36
7457A42J7n9j36j18O3L05Qk85J07N6j04J44J92k96j4j8J19j91j1j27k12O74j0
7480B46j04k34J44rJ10L0k34k13K50k2K93k30o0j03J59Q8k77K60o08M56J67j07
$$ plain form
7323 271 119 -25 -84 -41 1 47 -433 106 130 35 137 205 -49 -289 267 46 87 -133 -227 -281 15 -192 -348
7346 -348 -25 -305 -90 105 -18 -380 -364 -11 116 -169 168 -326 -207 175 108 -222 -178 -380 -332 94 -74
7367 -74 -309 7 40 252 -114 104 -72 -255 -190 -103 -119 -252 -97 -331 -22 202 -89 -48 -41 -191 25 20 -323
7390 -323 -332 -175 305 -24 139 -85 -228 -79 -39 -271 -283 -148 -7 -53 127 105 -75 53 432 315 56 64 -206
7413 -206 -132 291 -98 -177 29 537 382 415 183 55 -34 167 -78 -109 -146 -72 146 247 455 289 -32 -360
7435 -360 100 104 190 -247 134 298 46 -54 290 -109 -385 127 353 -86 -118 -75 -225 -87 60 13 -294 142
7457 142 159 100 -36 -154 -91 214 222 -63 44 100 -4 140 332 36 22 4 123 -68 -79 -206 -418 256 246
7480 246 142 -92 52 43 153 183 -51 -264 -14 -36 257 27 -33 -136 23 111 -166 94 -514 -58 109 2
7502BJ92q1q6L19k78L8Q4j91L94k49m0P0Q1m3N7J23m12J63l71M16m8K07k86L9
7526A00q1J86K95m75K22k64p7J70J09m79L53j1r3k21K94J9m8j61K07l50O1J7R0
7549a37p9L76j71j00K25k63J69O0m97J57L73l57J79J80j87J54J06k53j11J35Q0
7570C9k33J25J71o7j93J79J14J05k81l99K96J80j88m8K22qk53K62M29o83r1M41
7592A19K15m14j44J96k2J51K15j52o8J52j61r5J92K3p02M04m7K10J93J8l34J25
7614G4O74n91k46o0J61K11r9K94n39J28M34j39LM6m70k28N32j09l26J33Q2J82
7636A47r1j00K28l94L48j17j97k15J07J01M01m42K27j8o7L9M2J50o46J81Q2L33
7658I9j82J37k58K31K08O8l03k05O1j39L78k81j34P3K15k14L19j62J10l78M68
$$ plain form
7502 2 194 113 27 346 68 106 190 -1 393 144 104 174 255 212 269 392 -20 143 -228 188 140 347 61 100
7526 100 19 205 500 25 247 -17 -94 76 185 -294 59 48 -45 -266 28 47 -1 -162 45 -305 -244 -227 -137
7549 -137 -216 160 -11 -111 114 -149 20 80 -417 -260 113 -244 -65 115 -72 82 188 -65 -176 -41 39
7570 39 -194 -69 102 35 -158 21 135 240 -41 -440 -144 36 -152 -200 22 14 -239 23 452 -231 -322 119
7592 119 334 -80 -224 -28 -50 101 316 164 96 248 87 -8 184 207 -495 -91 -138 72 265 283 -51 74
7614 74 748 157 -89 -149 12 223 124 418 -121 7 441 302 305 351 -119 -347 185 76 -250 -117 -35 147
7636 147 56 -44 184 -210 138 21 -176 -391 -284 -183 218 -224 3 -15 -82 -43 -1 149 -497 -316 -234 99
7658 99 -83 54 -204 27 235 303 0 -205 -144 -283 95 -186 -320 -247 -32 -246 73 -89 21 -357 111
7679A11P3l23p7j18j09M40M8q6k16J4K54p3J08n2k03r2M55l98L68j78J3k3j7m5
7703a26n42J11N59k30L75k30J66q9M51o73J11Q7j08j0L73j82k71J55J81j20N60
7724E48m39m22K42Q5K83n71O14j56n34L36J29m58N74j15k77k31M92n02J33M66
7744A97j06Q0l08K26p1P6K3p5k84K44l07K80K35r9l61M08J89k42k66K8pJ74o4
7767c0j24M0L42Rj40n5j0l14K77l08O2J64M56m89Q7L55o03K05K78m30K05%k70
7790b93J19lJ50q7J14j97l3K54Kk0n55L99L36l8O5l60N4R2l52L58J42m42L08l88
7814c75N88j58j83Q8M5K29k92J03j33M6M82n95o9L5K9J77J97j12k41K37N7m42
7836b87N24j3l44Q6J34L00k69K84n76J89L87k60M8j12m03N38J11j12j65q4%J99
$$ plain form
7679 111 184 -139 -216 -334 -443 -3 45 -41 -257 -243 11 -62 46 -6 -209 -301 154 -244 124 -54 -41 -64 -81 -126
7703 -126 -668 -557 2 -228 147 -83 83 -6 445 -228 -117 -30 -138 -148 225 43 -228 -73 108 -12 548
7724 548 109 -313 -71 14 297 -274 340 184 -350 -14 115 -343 231 116 -161 -392 100 -402 -269 197
7744 197 91 171 -137 89 18 94 117 42 -242 2 -305 -25 210 111 -250 158 347 105 -161 -133 -140 34 -30
7767 -30 -154 -114 228 237 97 42 32 -282 -5 -313 -251 -87 369 -120 -33 322 -281 -76 202 -228 -23 -23 -293
7790 -293 -174 -177 -27 -114 0 -197 -230 24 26 6 -549 -150 186 148 213 -147 -93 -1 -353 5 147 -295 13 -375
7814 -375 213 55 -128 -40 5 234 -58 45 -88 -42 440 -155 -224 -189 -160 17 214 102 -139 98 155 -287
7836 -287 237 224 -120 -34 100 400 131 415 -161 28 415 155 203 91 -312 226 337 225 60 -24 -24 175
7858A75O7N5l42jK36j17J7R1j60K50M4j4k42j83J9L31j74N8J79l50M89N3k27j46
7882A08Ol08M22pj94j42J3L17k1j05q8k67K98j45Q5K29m95Q6K53L85l77l8P9J99
7906B93j45J02Pm34j17N78l16p5L17m54L79r7k32j26L01k03M95J5k14k30J54J31
7928A29J48k41j80JJ24O9l6k51K02q2j96M26k9m5o9L46k8j93j67R1o1N06l66k86
7952a88L06L28j70J09n12q0Q7L62%k72K36k26J10M4K47m76J57j50M57m46J88k20
7974a09j03K59K09l36J69K35q24Q69k07k10l1j90L20J01j12k18%Q4J78j75R9j16
7996a08l71M29L82k47j30j15P6j49J04J91m26M44J91k92r6j03l7K42m2K51n62
8017c68L87j95J47O2O4j40Q8K38n16N07k01j43M4O70k81n98L04k85j2N30m57K71
$$ plain form
7858 175 242 297 -45 -46 190 73 90 181 21 271 315 301 59 -124 -105 226 52 110 289 -61 428 481 254 108
7882 108 114 -194 228 221 27 -115 -102 215 194 89 1 -266 32 -113 -28 201 -294 -208 45 430 53 15 94 293
7906 293 148 250 257 -177 -294 284 -32 -107 210 -244 135 38 -194 -320 -19 -222 273 288 74 -156 -2 129
7928 129 277 36 -144 -143 -19 50 14 -237 -35 -117 -313 113 84 39 -30 316 288 95 -72 19 -42 464 98 -188
7952 -188 118 446 276 385 -127 -207 -120 242 242 -30 206 -20 90 134 381 -95 62 -88 369 -77 111 -109
7974 -109 -212 47 256 -80 89 324 -500 369 162 -48 -79 -269 51 152 40 -178 -178 -94 84 -91 8 -108
7996 -108 -479 -50 332 85 -45 -160 -84 -233 -129 62 -364 80 271 -21 -117 -220 -257 -15 -57 194 -368
8017 -368 19 -176 -29 33 97 -43 45 283 -233 274 73 -70 -26 644 363 -235 69 -216 -228 302 -155 116
8039A16n0l7K83k56K5L20k09k61K97j57l73m3L40L86j6m28o7K27N2J15r9j73J26
8062A18m5q5K37k13r8L52j58Nj51j90j35K61l1O9l0j48K03L7N3k59K5j15M12J2
8086A26j95l41M98k89k75K07L9k73N55M4j94K0J28j86q0L66k59j4p6K06l42J28
8108b07o0k67K70K36l4l03J03p9J56M36k83j27L5J00o3p2O9l64L44R9p2M22O3
8131D02k78q5K31k85l13L2j31L25J56ql22J35J57P0k62K5N9j14K73N9m20K35J86
8154A27l9r8K53m61j09L95J5O9m6l99K1N00K93n58j88P25n73R0L1p7Q2J37%R0
8178B80j98k5j83K51Om7l44L43j69L01K94p06L7
$$ plain form
8039 116 66 29 312 56 81 401 192 -69 228 71 -302 -345 -5 381 365 -63 -130 97 149 264 165 -8 118
8062 118 73 -12 225 12 -86 266 108 113 -38 -228 -363 -102 -133 -64 -94 -242 -39 -2 51 -208 -183 -298 114 126
8086 126 -69 -410 88 -201 -476 -269 -230 -503 52 96 -98 -78 50 -136 -216 150 -109 -123 -199 7 -335 -207
8108 -207 -267 -534 -264 -28 -62 -365 -262 -341 -185 251 -32 -159 -124 -24 -87 -159 -90 -454 -110 -11 -83 339 402
8131 402 124 39 270 -15 -328 -296 -427 -102 54 46 -276 -141 16 86 -176 -151 -92 -206 67 126 -294 -59 127
8154 127 88 -10 243 -218 -327 68 83 152 106 -293 -272 228 521 -37 -225 500 -73 17 48 -29 53 190 190 280
8178 280 82 57 -126 125 131 84 -260 83 -86 215 509 -197 -160
8191a60
$$ Imaginary data points
##PAGE= N=2
##DATA TABLE= (X++(I..I)), XYDATA
0@%%%%%%%%%Qj6J6j6J9k7L2m0M8n3O1p2Q5r8J13j29J49j71J92k17K47k78L12l50
33a85L90m33M85n40N97o64P36q14R03j000J105j224J358j509J682j880K109k380
51a264K707l107L614m277N183o507Q635j2600K2441q9211j79484J28218J15074
64a0578j2618o6311j8736K4408P6251L2612n0411q1105n0366N401Q1112L9596
76c0745p5664n4543O7878P8940L1744m623p3007p6894N3870R3848l1508r9229
88a19933k5605O4643J00972L9772o3461n2664L3753L3154l305j3864o2407o8673
100a37618N8347J18917R505o3808k2193K3509M6576K4357o5624r3395q265N4614
112e5078M9969J8053m8916n6301O0801J03408j4886q5295m3269q847K7274N7293
$$ plain form
0 0 0 0 0 0 0 0 0 0 0 8 -8 8 -8 11 -16 16 -24 24 -29 32 -40 45 -53 60 -69 80 -91 101 -116 131 -147 165 -185
33 -185 205 -228 257 -283 314 -350 386 -428 475 -525 580 -644 714 -795 887 -993 1116 -1264
51 -1264 1443 -1664 1950 -2327 2856 -3651 4984 -7616 14825 -74386 -253870 -125652 -10578
64 -10578 -23196 -89507 -108243 -83835 -7584 25028 -25383 -106488 -156854 -151453 -70341 -30745
76 -30745 -106409 -160952 -93074 -14134 17610 12987 -60020 -136914 -83044 10804 -20704 -119933
88 -119933 -145538 -80895 20077 59849 -3612 -56276 -22523 10631 7326 -6538 -68945 -137618
100 -137618 -79271 39646 49151 -14657 -36850 -13341 33235 57592 -8032 -101427 -109692 -55078
112 -55078 -5109 12944 -35972 -92273 -31472 71936 57050 -28245 -71514 -80361 -53087 4206
124D206j0813p2711l670P9319P1052J6540n7148q0270J0885P2003K912n4470l2922
137e5087l670N3412J01027J5079r0858m1496M5911L7010p374n1551o9858P310
149f0145Q7576M5026k3249k7864k1858J3583O1868K502r5317o2067K5957M3848
161a0140K9867n682n4778j0223P8382M7131m4045o7117m5429K025N8508K1023
173d78n9107k8984M8633N2314L1519l467o9025n3254M0650M6814k1134m1360k2702
186g9581J8492P9204N5109m5719o0772L781K8259K3522j343o3980n3319N1298
198d5049P9954R546l0523l0448j0189M9544M7026m8692p9106j3644L1184M1913
210A516L0383l1509m9631K9694O4052N571l5849m8761m3852K4058O7099l060n5680
$$ plain form
124 4206 -6607 -79318 -82988 -3669 67383 83923 26775 -53495 -42610 29393 32305 -22165 -55087
137 -55087 -58757 -5345 95682 110761 19903 -21593 24318 61328 53954 2403 -67455 -60145
149 -60145 27431 72457 49208 21344 -514 13069 74937 77439 -17878 -79945 -53988 -10140
161 -10140 19727 14045 -40733 -50956 27426 74557 30512 -36605 -82034 -80009 -21501 -478
173 -478 -59585 -88569 -39936 12378 43897 40430 -28595 -81849 -41199 5615 -15519 -56879 -79581
186 -79581 -61089 18115 73224 27505 -33267 -29486 -1227 22295 20952 -43028 -96347 -45049
198 -45049 34905 44451 13928 -16520 -26709 22835 69861 21169 -57937 -71581 -40397 1516
210 1516 31899 390 -49241 -19547 44505 50076 14227 -34534 -78386 -54328 12771 9711 -45969
223d5969j2401L5654N0995L5242l9923p7231J764N5852Q400k7242k1935j6817
235e3611L1383P0896J3887m7107k6960L730K0551L0859k1902p4076j1127O8373
247D896M5925l596k6214l3848J4092O2363K489p2379m2052J4263L2821L8498J611
260C8869m7735j2593M6297L1114n407k9809n7893j9668O2906M2080m2406m4576
272c8821Q469M1909N0125L763o7143m4417L1696L4749k121j9886l6048o872O3708
285A9111N1559k5782m0253j1739K848K9002K2192m3989n3073K1215N5115L1163
297E7369m429m4557l2583M3233M8517k9716n0316j3385R757L7126L6543k7260
309C0299m7886J4938M2781J4824r336l8046l9996K1413M9372j470l0851j5981
$$ plain form
223 -45969 -58370 -22716 28279 63521 23598 -53633 -51869 3983 12383 -14859 -36794 -53611
235 -53611 -22228 48668 62555 15448 -11512 -7782 12769 43628 21726 -52350 -63477 4896
247 4896 50821 47225 21011 -12837 1255 63618 66107 -6272 -48324 -34061 -1240 37258 38869
260 38869 -8866 -21459 24838 55952 50545 20736 -37157 -56825 6081 48161 5755 -38821
272 -38821 -30352 11557 61682 65445 -1698 -46115 -14419 20330 18209 -1677 -37725 -44597 19111
285 19111 70670 44888 4635 -7104 -4256 24746 46938 2949 -50124 -28909 26206 57369
297 57369 52940 8383 -24200 19033 67550 37834 -12482 -25867 -16110 21016 57559 30299
309 30299 -17587 -2649 40132 54956 45620 7574 -32422 -11009 38363 36893 6042 -9939
321i939m75L6773N0660k3009p2021j0418M2739K3682p576l4577l4519K8315O2406
334E2041O921l6553k4325r708J8633M0255j0987n8906j4239L6882L3008J6649
346D9671j7925n0599m415N6967K3430l7026m1818j6822K5453N4191L338n3190
358h745j8259L2662K4739Q714j2436m7892k0312M3058L4183j4607k5853j9301
370b4049R355M9892K0747m8402l9297J4137K6097K0133m432m4618k2146M6114
382C531L9547j5112k7704j9162k354L6098K6260l5312m0549O798K6981K8430R085
395C6537m0616l5905L2332M4223q533k9781k6632r491L9042M3203k2131m8183
407b5935l505K5809K9063J1639l9164m5855K2680N1501O122k3290k6633j6473
$$ plain form
321 -9939 -10414 26359 77019 54010 -18011 -28429 14310 37992 30416 -4161 -38680 -10365 52041
334 52041 58962 22409 -1916 -11624 7009 47264 36277 -22629 -36868 14 33022 49671
346 49671 31746 -18853 -23268 33699 57129 20103 -21715 -38537 -13084 41107 44445 -8745
358 -8745 -27004 5658 30397 39111 26675 -21217 -41529 1529 35712 21105 -4748 -24049
370 -24049 -14694 35198 55945 7543 -31754 -17617 8480 28613 24181 -20437 -42583 3531
382 3531 43078 27966 262 -18900 -21254 14844 41104 5792 -34757 -27959 -978 27452 36537
395 36537 -4079 -39984 -7652 36571 28038 -1743 -28375 -37866 1176 44379 22248 -25935
407 -25935 -29440 -3631 25432 37071 -2093 -47948 -25268 26233 32355 9065 -17568 -34041
419c4041L0861M7308j2220m7362j1446J8090K6565K3059k2031n0414J148M6621
431A6138K2029j2729l0589k7962K2381N4656j852n0984k0084J7513K5689K2330
443C6536j4528m5536n043L9173J9065q349j9316k7861M803M6861J3928l8435k8354
456b7056K883K2519L3328k960n0975j8152M0535K9382r138k5673l0324K304M5677
469A2350J8555l4872k6819M665J8409L0087N716m4842l0206K6225L1336L717j6883
482b562l5060j1947M6414L8329k6050m0078r207J6118L3503J0949m4989l7511
494f2091K4967L9176R609j1153l0719j9456L1725L5313j7196l5455j4532N569
506d4243L1194L0555k4660m4418P447L7445J8376r215l7511l0078K7747M5323
$$ plain form
419 -34041 -3180 44128 31908 -15454 -26900 -8810 17755 40814 18783 -31631 -30483 16138
431 16138 38167 25438 -5151 -33113 -10732 43924 42072 -8912 -28996 -11483 14206 36536
443 36536 22008 -23528 -28571 10602 29667 21318 2002 -25859 -21056 25805 39733 1298 -27056
456 -27056 -24173 -1654 31674 28714 -22261 -40413 122 29504 20366 -5307 -35631 -33327 12350
469 12350 30905 -3967 -30786 -26121 -7712 22375 28091 -16751 -46957 -20732 10604 14321 -2562
482 -2562 -37622 -49569 -3155 35174 9124 -30954 -40161 -24043 9460 20409 -24580 -62091
494 -62091 -37124 2052 11661 508 -30211 -49667 -17942 17371 175 -35280 -49812 -44243
506 -44243 -13049 17506 -7154 -51572 -44125 -6680 11696 2481 -35030 -65108 -37361 7962
518G962r225l4253q693J0983K7680K5775j9473m1912q42K6096J4042P44j8953
531b0069k8447J6275M9922J1881k8121k4437n757K3890L4325j6313n0942l176
543d0969M1537K6118J559j7784k6405P126L7799P594k6520k2654j0025J5389M0996
556C3761P982l9419j7357K5187K6012R997j9149m5467j1727M2316K6026k1730
568A6432k4550n949J9090L7000O007m0943k6635J0544J3444J0505j068l1666j5827
581c3616L8141L6684q508k6588k0316j145K7989J3818l3755k9703J1643K6541
593A185K3220N589l1194k3249K6722K8265j5802k8504j6431j476K7815K8990j4519
606A0611k6938M096J9208J6560Q72l4782l5974J6293L4264J459j5503j3230n024
$$ plain form
518 7962 -1263 -35516 -44209 -33226 -5546 20229 756 -41156 -41998 -15902 -1860 -1116 -20069
531 -20069 -48516 -32241 17681 29562 1441 -22996 -28753 -4863 29462 13149 -37793 -40969
543 -40969 568 26686 28245 10461 -15944 -8818 28981 36575 10055 -12599 -22624 -7235 33761
556 33761 41743 2324 -15033 10154 36166 46163 27014 -18453 -30180 12136 38162 16432
568 16432 -8118 -14067 5023 42023 48030 7087 -19548 -9004 4440 14945 13877 -17789 -33616
581 -33616 4525 41209 32701 6113 -14203 -15348 12641 26459 -7296 -36999 -25356 1185
593 1185 24405 29994 -1200 -24449 2273 30538 14736 -13768 -30199 -31675 -3860 25130 10611
606 10611 -16327 -12231 6977 23537 24409 -10373 -46347 -30054 4210 5669 -9834 -23064 -28088
619b8088K6813L4255j6110m4796j1998J5526J6853O115k1987k7512J7123L8358
631D552J0702j1162j8254k0676Q982L2646n208l7704j1997J7950K6533K5558n970
644A5952l2886l582K9412J1846j4950k4154k0851J3593M2384J1020k3866o411
656b493J2073J1668J4293n746l8181j8976K3826K1770J350j0218j5447P014L7352
669C8285J2125l0012k5799n384O304J9178L024l2422j4203L3613L0780r67j6324
682A8198k2298r086K1188J1025k3159k1867K38J6275L2023J8104k6137k5426J5566
695D644K0973k842j5628k6745j4177L0425L8471m926k3467l790J4015K3535O528
708D7016l5023l3506J0166K2169P661K720r592j4415J9005L3469m563l1325k2570
$$ plain form
619 -28088 -1275 32980 16870 -27926 -39924 -24398 -7545 -1430 -23417 -50929 -33806 4552
631 4552 15254 4092 -14162 -34838 -25856 6790 1582 -36122 -48119 -30169 -3636 21922 15952
644 15952 -16934 -20516 8896 20742 5792 -18362 -39213 -25620 16764 27784 3918 -2493
656 -2493 9580 21248 35541 29795 -8386 -27362 -3536 18234 19584 9366 -6081 933 38285
669 38285 50410 20398 -5401 -10785 -4481 14697 17721 -14701 -28904 4709 35489 34522 18198
682 18198 -4100 -13186 8002 19027 -4132 -25999 -25761 -9486 22537 40641 14504 -10922 4644
695 4644 25617 22775 7147 -19598 -33775 -3350 35121 30195 6728 2938 16953 40488 47016
708 47016 11993 -21513 -11347 10822 18483 21203 11611 -2804 16201 49670 45107 13782 -8788
721h788n753J6014K1027j4705l0646O651L1300J8406m13k3386k9172O794K7168
734A4497p908k7329p596O895J7705K6548J406k5103q980J2025J0061K231j9297
747d845l3524M850M3057J8217j6518j1086K537J4306K1833q052l9362j7072J6111
760i548J7674J0380l673j8761L241L3672J4921j9241k3341j8568k705K4372J1486
773A9909k6620j9140J8710K8957J6245j0134l6098j7186K2078J3540j8094j8939
785b6772o811P223L0762K2852j8837k4091L119J1365O163o084k8751j8839K3228
798b5473L0527N212o615j0167m448K3016J9332k5885l6809l23J9908J5652O674
811A0601j2199j0316J9992K4225l492j6919k0207j6238J2894K5180r190k3034
$$ plain form
721 -8788 -14541 1473 22500 7795 -22851 -16200 15100 33506 33093 9707 -19465 -12671 14497
734 14497 6589 -20740 -28336 -21441 -3736 22812 24218 -885 -9865 2160 12221 14452 -4845
747 -4845 -38369 -33519 9538 27755 11237 151 2688 16994 38827 30775 -8587 -25659 -9548
760 -9548 8126 18506 14833 -3928 -687 32985 47906 28665 5324 -13244 -15949 8423 19909
773 19909 -6711 -25851 -7141 21816 38061 27927 -8171 -25357 -3279 10261 -7833 -26772
785 -26772 -33583 -26360 4402 27254 8417 -15674 -12555 -1190 4973 -1111 -29862 -48701 -25473
798 -25473 5054 10266 3651 -6516 -10964 12052 31384 5499 -31310 -31633 -11725 3927 10601
811 10601 -1598 -11914 8078 32303 28811 11892 -8315 -24553 -11659 13521 4331 -18703
823a8703M120J9705J7308J0330j7437l3797j861K3020M019j6734j8548o573K5727
836i424L4371m396k7558n165Q155M884N736j2934l1308l035L1935K2326r20j2899
850b32j2361J0890K7624k152l2193j8914L092J5672K4106K027k5527k718L1707
863B1021J7759j1153k1013k1060k710K2770J0472j7145j1665O642J7983K3368
875C5269K56l3334j9964J5039J0976p850j1259j4423p21L0554K4616j3628k2848
888g317m974P628J2332l011l1112j7892K0693K4093O257j380j3014r287K0678
901C694J7933j9015k8574p188Q207K0074J6571j2801j8410J1570K3921R032j0041
914A4973k8285k0968J9484K7018r648k0600J900J1636J7541J5680j2757k9949
$$ plain form
823 -18703 -14583 5122 22430 32760 15323 -18474 -20335 2685 6704 -10030 -28578 -35151 -9424
836 -9424 24947 20551 -7007 -12172 -4017 867 6603 -6331 -37639 -40674 -8739 13587 12667 -232
850 -232 -12593 -1703 25921 23769 -8424 -27338 -24246 -8574 15532 17559 -7968 -10686 21021
863 21021 38780 27627 6614 -14446 -17156 5614 16086 -1059 -12724 -6082 11901 35269
875 35269 35525 2191 -17773 -2734 8242 392 -10867 -25290 -26011 4543 29159 15531 -7317
888 -7317 -12291 -4663 7669 4658 -26454 -44346 -23653 440 6697 5317 -7697 -16984 3694
901 3694 21627 2612 -25962 -33150 -24943 -4869 11702 -1099 -19509 -7939 15982 25014 14973
914 14973 -13312 -34280 -14796 12222 2574 -18026 -16126 -4490 13051 28731 15974 -13975
926a3975o577J3352Q249j705j7206j6540J7396L4257L724j8329j3192n183Q564
939g165J7525j2185l4090k630K7338J8344J241r790j3239O958J9390r50j8332
952g585j3471p513R900K7287N053k4477n583K2543J5385l7j4431k4570n043K4261
966A719J2367j2709j2602j14J6821K6988j59l1007j3302J2457O391l10m022j6864
980a4346n823K6303K3561o318j7797j2693K434J9933M100k7871j8504J2525J8318
993C822J4246L088k0856j3784K1447J9245j4355k1965r843K464J8154J4796r485
1006F974j2731M492J0518J1064L954k4243k5798J2769K4945j443j3560o743J962
1019g840J9036J8113j3338k5336l715R025P837K831j4863j5932J3722K4241J401
$$ plain form
926 -13975 -20552 -7200 1049 -656 -17862 -34402 -17006 17251 20975 2646 -10546 -15729 -7165
939 -7165 10360 -1825 -35915 -38545 -11207 7137 8378 -1412 -14651 -7693 11697 10747 -7585
952 -7585 -21056 -28569 -18669 8618 13671 -10806 -16389 6154 21539 21502 7071 -17499 -22542 1719
966 1719 14086 1377 -11225 -11339 5482 32470 32311 1304 -11998 459 6850 6540 2518 -14346
980 -14346 -20169 6134 29695 23377 5580 -7113 -4679 15254 19354 -8517 -27021 -14496 3822
993 3822 18068 21156 300 -13484 7963 27208 12853 -9112 -18955 -16491 1663 16459 6974
1006 6974 -5757 -1265 9253 20317 24271 28 -25770 -13001 11944 10501 -3059 -9802 -7840
1019 -7840 11196 29309 15971 -9365 -13080 -4055 3782 6613 -8250 -24182 -10460 13781 15182
1032A5182r268q845j1256N641J9647n709k6330p725J4603J8274J0562j2215k1247
1045a8686N977K2840J008j4186j2781j0381Q572K5322L177k0184o036J1181J0791
1058F614R168q486k5393o077J9429J1513l533q517j1777O551K7772O952k3317
1071H99j5129M495Q280J0189j816k0729n768K0341J5243j565q010j3205l159J8702
1085H768Q136j7339j3036L374P967J5035Q445j6880j4269J2692J4916j463r259
1098G087j5733n443K1143J6949j1734j3705K189P916J1477M976j8026j8009R625
1111a288J4754K053l023r991q794J5159J9873o916j8126p744J303J3717J2743
1124B3720j4713k1849O946K0318O477m781j3057j3684R597J9785m201j7177o447
$$ plain form
1032 15182 5914 -2931 -14187 -8546 11101 5392 -20938 -28663 -14060 4214 14776 2561 -18686
1045 -18686 -12709 10131 11139 -3047 -15828 -26209 -17637 7685 10862 -9322 -15358 -4177 6614
1058 6614 15782 7296 -18097 -24174 -4745 6768 3235 -5282 -17059 -10508 17264 24216 899
1071 899 -14230 -9735 -1455 8734 6918 -13811 -19579 762 16005 14440 6430 -6775 -9934 8768
1085 8768 16904 -435 -13471 -10097 -2130 12905 21350 4470 -9799 2893 17809 16346 7087
1098 7087 -8646 -14089 7054 24003 12269 -1436 753 8669 20146 25122 7096 -10913 -1288
1111 -1288 13466 15519 12496 2505 -6289 8870 28743 21827 3701 -4043 -2740 10977 23720
1124 23720 9007 -12842 -5896 14422 20899 16118 3061 -10623 -1026 18759 14558 -2619 -9066
1137i066J178J1700J6169n966k2207k090J4130P852J098j0991j8741M403K4343
1150A1812M837j5510r702p16R904J6015m325k2759m392J3318P587J895n527j5678
1164a3241p76K0524O752j1802r288m504L863J6165L779k0219j0937J0957J1354
1177B627O070n664j9327m286K1252J0799j2799j1675l031L746J5626O179j7232
1190g715j2244Q093R925P041m8j6548j1856J6344J7337m894j2170j0135j04J9606
1204B632J4368j7092j8770N950J4279Q329r25j6089j2178J3506J6266k792q395
1217i11p365m259J2735J7543q393j9826k254R159J0678N926j3619j8732R750K2059
1231A2491K144j1333j0111n411J1706J6034q272j9455o90J0249Q149P451p014
$$ plain form
1137 -9066 -7888 3812 19981 14015 -8192 -10282 3848 11700 12798 1807 -16934 -12531 11812
1150 11812 16649 1139 -8563 -9279 625 16640 12315 -10444 -14836 -1518 6069 7964 2437 -13241
1164 -13241 -14017 6507 13259 1457 -7831 -12335 -8472 7693 11472 -8747 -19684 -8727 2627
1177 2627 8697 3033 -16294 -20580 672 11471 -1328 -13003 -16034 -12288 3338 9517 -7715
1190 -7715 -19959 -11866 -1941 5100 5052 -11496 -23352 -7008 10329 5435 -6735 -16870 -16974 2632
1204 2632 17000 -92 -18862 -12912 1367 9696 8771 -7318 -19496 -5990 10276 7484 -911
1217 -911 -8276 -12535 200 17743 9350 -10476 -12730 -3571 7107 13033 -586 -19318 -9568 12491
1231 12491 14635 3302 -6809 -12220 -514 15520 7248 -12207 -12897 -2648 5501 12952 5938
1244E938j7443K505J7380M693q110j0737r954Q219K2484O66j9441n958R728J0306
1258A0276P272p807k1547j651J8739Q282o197p572p675N380K0688M176j8177j1252
1272g065K794O708J0929o02j9369p352J7976J4387j252r720j4573j639J8793P766
1286A7781j7437j3314L245R472J3150L481j7014j1004J2333R854k813p643j2962
1299a2871o217J6630J5690q434j2191o62N840J2415N129j9093j7747Q957J5358
1312B804J505m732q958l561J6555J5184r982j5544l303K136P549Q595j0340j5193
1326a7285P979J6553O149k403j1653j3429Q407J7174n832j7348n892N539J3662
1339A621J4015q647j8658K116J3647K891n705j1363j3492O998J9722L506j0995
$$ plain form
1244 5938 -11505 -9000 8380 13073 4963 -5774 -15728 -7509 14975 15641 -3800 -9758 -30 10276
1258 10276 17548 9741 -11806 -13457 5282 13564 7367 -205 -7880 -2500 18188 22364 4187 -7065
1272 -7065 -4271 2437 13366 12764 -6605 -13957 4019 18406 17154 7434 -7139 -8778 10015 17781
1286 17781 344 -12970 -9725 -253 12897 16378 -636 -11640 693 10547 7734 91 -12871
1299 -12871 -19088 -2458 13232 4798 -7393 -8055 -2215 10200 15329 -3764 -21511 -12554 2804
1312 2804 4309 -423 -9381 -12942 3613 18797 8815 -6729 -10032 -7896 -347 8248 -2092 -17285
1326 -17285 -9306 7247 13396 10993 -660 -14089 -5682 11492 5660 -11688 -17580 -12041 1621
1339 1621 15636 6989 -11669 -9553 4094 6985 1280 -10083 -23575 -16577 3145 6651 -4344
1352d344m485M88P416J3287n659k2805n994J2208R001L722n097j2183M560K1757
1366A1872O133j4699j1327l507N290J3112j059j6172k405J4774J0125L877k921
1379A3093j4541o071J3900O293j1124r317l083N798J9082P808j5976j1265P635
1392B232Q337Q93p689j7959n172J8627J3183p125o519j142K088J1076N360j6176
1406A4j6790K179R551Q054K854j1414p765J6336J6701m955j3437j0061l821J1844
1420g10J1391j1637j3697Q200J4923Q199J791j1164j3136M326J0632l217p515
1433a614o056l795J3401J9647m121j7352j560P070L138l9j1794j5935M823J7993
1447C806M862n490n463l355P866J1746q564j9204l592M801M172Q011j08j1715
$$ plain form
1352 -4344 -8829 -8341 -925 12362 6703 -16102 -22096 -9888 -887 2835 -2262 -14445 -9885 11872
1366 11872 18005 3306 -8021 -11528 -6238 6874 5815 -10357 -12762 2012 12137 16014 13093
1379 13093 -1448 -7519 6381 12674 1550 -7767 -10850 -5052 14030 21838 5862 -5403 2232
1392 2232 10569 11462 3773 -14186 -19358 -731 12452 5327 -1192 -2334 -246 10830 16190 14
1406 14 -16776 -14597 -5046 3008 5862 -5552 -13317 3019 19720 14765 1328 -8733 -12554 -710
1420 -710 10681 -956 -14653 -6453 8470 16669 18460 7296 -5840 -1514 9118 5901 -1614
1433 -1614 -7670 -11465 1936 21583 17462 110 -1450 5620 8758 8719 -3075 -19010 -14187 3806
1447 3806 8668 3178 -2285 -5640 2226 13972 5408 -13796 -17388 -12587 -8415 -404 -512 -12227
1461a2227J762J7073O582q254j1480j0368L479J4778j88j3469j702J0349J0078
1474F413R858l160j7926n676J3112M496q936o459l965M626J6831Q737r527p733
1488F91r7K822O842k217k0304q803J5503J3193n80l760n479p40J2079N032j5118
1503i36j3911q10M844Q478N420r014m940J2637R358k837m731j0617j0283Q432
1517h910J2876o131r622L317R173J2305N585j2564j2714N010O811k999l774n307
1531f944l435J1902J7023k762j0138j670N08K405L655r644j4466K801J2469P524
1545I228K376n667r512O184J3361n583j7257o879J388O192J0487j639j0736K252
1559e805J1323M392k051q558j3983n29J2848L196p760k342K387P041J4254J080
$$ plain form
1461 -12227 -10465 6608 13190 4936 -6544 -16912 -13433 1345 1157 -12312 -14014 -3665 6413
1474 6413 16271 13111 -4815 -10491 2621 7117 -1819 -8278 -12243 -7617 9214 17951 8424 691
1488 691 594 3416 10258 8041 -12263 -21066 -5563 7630 7050 3290 -2189 -2929 9150 14182 -936
1503 -936 -14847 -15657 -10813 -2335 3085 -5929 -10869 1768 11126 8289 3558 -7059 -17342 -8910
1517 -8910 3966 -2165 -11787 -8470 703 13008 18593 6029 -6685 -1675 5136 2137 -1637 -6944
1531 -6944 -10379 1523 18546 15784 5646 3976 4484 6889 10544 900 -13566 -10765 1704 9228
1545 9228 11604 5937 -3575 2609 15970 10387 -6870 -13749 -12361 -6169 4318 2679 -8057 -5805
1559 -5805 5518 9910 7859 -699 -14682 -15211 -2363 833 -6927 -9269 -6882 159 14413 15493
1573A5493j6654q945O790M426K69n251j0057L606J8253P707p024n239k633n15
1587B26O551l39j4812o652Q083Q201N680K193q439n051R939N972r072j0859o906
1602a5285K62J2759P619j0305n499R298P928P88l477j2965r130P172Q693k916
1616e058l989j13K322J1884J0011r010j3414j019L849L815J811q175q869J1754
1630d201J7189P88p278n771l084N745O218q462j2290J290P410P884Q023l965j1622
1645b126L017J0648j310q771q147o476N854J4812J023j0237j284O863O640L115
1659A3621r761j5731N98J1961K340m114p80k100N113J3362J193j2429o879J340
1673b266L877M953k208j1856M19J4937Q238k001n040p781n10J1583P03j4859p403
$$ plain form
1573 15493 -1161 -10106 -3316 1110 1379 -3872 -13929 -10323 7930 15637 8613 3374 741 226
1587 226 6777 6438 -8374 -15026 -6943 1258 6938 9131 692 -4359 5580 11552 2480 -8379 -15285
1602 -15285 -15023 -2264 5355 -4950 -10449 -1151 6777 7565 4088 -8877 -18007 -10835 -2142 -5058
1616 -5058 -9047 -9160 -6838 5046 15057 6047 -7367 -8386 -4537 -722 1089 -7086 -15955 -4201
1630 -4201 12988 13776 6498 727 -2357 3388 9606 1144 -11146 -9856 -2446 5438 13461 9496 -2126
1645 -2126 891 11539 10229 1458 -6689 -13165 -7311 7501 8524 -1713 -2997 3866 10506 13621
1659 13621 3860 -11871 -11273 688 3028 -1086 -1866 -3966 1147 14509 15702 3273 -3606 -2266
1673 -2266 1611 6564 4356 -7500 -7081 7856 16094 14093 9053 1272 762 12345 13048 -1811 -9214
1688i214O396Q162P702L22r491l082Q090L728m694o233r676l388J3311R980p828
1703D085p142K899N655O126j01j4482j0801O591Q437O04l330n836m50J3241R078
1718A4574r043j0274r32j0L620L973o695q123N927J2005M780j916q786q075P432
1733a543Q610p475j0341o65M112Q037Q760n322j1411K826Q915k30n268q056o275
1748a5326O463J1341o37n801o82M12M686Q439n871j6050k223J0498N022j216m258
1763e203n275N766J3553K87r923n837j891M392Q254k091j1741M52J1555N309J166
1778H773k596r152k583J0026M177o899o912k339O197J2547J559j1895m471Q282
1792D714L723p66l573r297l568J0861P094m753m381m99K335P768J988j0500q210
$$ plain form
1688 -9214 -2818 5344 13046 13368 3877 795 8885 12613 7919 1686 -7990 -11378 1933 11913 4085
1703 4085 -3057 -158 5497 11623 11522 -2960 -13761 -7170 1267 1871 -1459 -7295 -7745 5496 14574
1718 14574 5531 -4743 -5675 -5685 -2065 1908 -4787 -12910 -6983 5022 9802 7886 -900 -8975 -1543
1733 -1543 7067 -408 -10749 -11414 -7302 735 9495 4173 -7238 -4412 4503 4273 -995 -9051 -15326
1748 -15326 -8863 2478 1841 -3960 -4642 -4230 456 8895 3024 -13026 -15249 -4751 271 -945 -5203
1763 -5203 -10478 -4712 8841 9128 -795 -6632 -8523 -4131 4123 2032 -9709 -9257 2298 7607 8773
1778 8773 6177 -2975 -5558 4468 8645 1746 -5166 -7505 -1308 11239 12798 903 -3568 4714
1792 4714 8437 7671 4098 -5199 -8767 2094 9188 4435 54 -445 1890 9658 11646 1146 -7064
1807g064K582M672M419J226q391m779J1299R968o040q778l208nO911M435q168
1822i21o618M840P046M101R28q152p504N892Q024l854o174k828j378P754J0395
1837A1551m735j0965p9O118M351l80r054r363O283J0753N2m707l385k755N299
1852a016R010m162j2138j775M671M090L920l496q353J116J0421L518m623o280
1866e097n662L953J1317j435j1710j421O397M934L496k560r362j064Q727L133
1880C646m293l671l846K314J0038K073q119l841K007L370N321q55j1264m589J0838
1895h71O528l166n275m081J661R146K524q549n485J861K982N209J603r248n200
1910a0361Q017O805j329l452n534k830P774P539o221p671k93M265P164K794r365
$$ plain form
1807 -7064 -4482 190 4609 5835 -2556 -7335 3964 13932 7892 -886 -4094 -4099 2812 7247 -921
1822 -921 -7539 -2699 4347 8448 9376 1224 -6280 -388 7636 3782 -2392 -5220 -6598 1156 11551
1837 11551 6816 -4149 -4228 1890 6241 5861 -3193 -12556 -6273 4480 4532 -175 -3560 -6315 -1016
1852 -1016 7994 3832 -8306 -10081 -5410 -1320 2600 -896 -9249 -8133 2288 5806 1183 -5097
1866 -5097 -10759 -6806 4511 3076 -8634 -10055 -3658 1276 4772 2212 -7150 -8214 513 3646
1880 3646 -647 -4318 -8164 -5850 4188 6261 -1858 -5699 -3692 -322 4999 4144 -7120 -11709 -871
1895 -871 5657 2491 -2784 -6865 -5204 3942 6466 -2083 -7568 -5707 -2725 2484 4087 -5161 -10361
1910 -10361 -2344 4461 3132 -320 -5854 -8684 -910 6629 408 -7263 -7556 -3291 3873 6667 -2698
1925b698p513O775P535j338k984m119l551O426Q057l468p355o38J757N063M992
1940F941n827q665L105P204J588j394n194n557N086J0129k352q581j875L224M802
1955B634M149m875p915J373O863J344o64l157n980K705R403P01p217k999m16L494
1971e57O972j555j0642r31P701M936j48m329p287J768R108J411o994k983P09J944
1987h77P061J716q519l619M831L902J538k093q453k558R613O096m756m655j745
2002b518K084P706J846r743o175M784M498J219j68n870k367O850N675l510m461
2017a50l269j803N960N222n916p218L115N944L696m1o922n780N868O460l187n635
2033c656k070O21O471O420m826o982K104L754J931P14n784p033L807R066J036
$$ plain form
1925 -2698 -10211 -3436 4099 2761 -223 -4342 -7893 -1467 6590 3122 -4233 -4871 -3114 1949 6941
1940 6941 1114 -7551 -4446 2758 4346 2952 -2242 -7799 -2713 7416 5064 -3517 -5392 -2168 2634
1955 2634 6783 1908 -6007 -4634 2229 3573 2909 -248 -6228 -3523 5880 6581 -636 -3635 -4051 -557
1971 -557 6415 4860 -5782 -6713 988 5924 5776 1447 -5840 -4072 5036 6447 -547 -3530 -2821 -877
1987 -877 6184 7900 -619 -4238 593 4495 6033 3940 -4513 -7071 2542 8638 3882 -773 -2518
2002 -2518 -434 7272 9118 -625 -6800 -2016 2482 3701 3533 -2337 -4704 2146 7821 4311 -150
2017 -150 -3419 -5222 738 5960 44 -7174 -4059 1885 5581 5540 -1382 -7162 -1294 5166 1979 -3656
2033 -3656 -5726 -5105 1366 7786 2960 -4022 -1918 1836 3767 4481 -1303 -8336 -4529 4537 5573
2048E573l263l360j832N010Q186m480j0606j651M791M286K391l642o736L123R460
2063G250Q73m940l972m460J731P792j5p737k154M210M534N668k233j0016k367
2078e836P837L093l861m589l229L048J0343K231p293l041K150K587K584j516q289
2093c781l009P771N148j6j999l623l87Q169L339q297o768J08L479N654J307p554
2109d59l094Q293O002j981m961n881l011O592M287n366n133J969L960N624L311
2124A0152p716p984L200N048p21k989n120k892Q709R194k875o934j545K331L728
2139C586J810p363p915L563Q016K292j74l024l300L938P106l058q252l213L22
2154e666M155O008k361o986J604Q257K409k807n736p201J731P597j79o997q63
$$ plain form
2048 5573 2310 -1050 -2882 2128 10314 5834 -4772 -6423 -1632 2654 5045 1403 -5333 -2210 7250
2063 7250 8123 3183 -789 -5249 -3518 4274 4259 -3478 -5632 -1422 3112 8780 6547 -3469 -5836
2078 -5836 2001 5094 1233 -3356 -6585 -3537 6806 9037 1744 -1297 853 3440 6024 4508 -3781
2093 -3781 -6790 981 6129 6113 4114 491 104 8273 11612 3315 -3453 -3345 134 5788 7095 -459
2109 -459 -3553 4740 10742 8761 3800 -2081 -5092 1500 5787 421 -4712 -2743 1217 6841 10152
2124 10152 2436 -5548 -2348 2700 1979 -1010 -6130 -9022 -313 8881 6006 -928 -2473 -142 3586
2139 3586 5396 -1967 -9882 -6319 1697 3989 3815 791 -2509 1429 8535 5477 -2775 -5988 -5666
2154 -5666 -1511 4497 2136 -4850 -3246 5011 7420 4613 -1123 -8324 -6593 1004 825 -6172 -7035
2169g035K746M891N504k093q850j799L797R61q82k549n854J983J1165L887n324
2184E48m234k89K382M782k195j0000k943P317O266K098j204n159M62Q008K171
2199H010p169n201j178O80O600M380n358l669M802O085K235l463r318m075O908
2214B69N091m623l769N05L027O872L827o937p204J679K456Q7j538m489k515O376
2230h86P560l39k458l035k615L891M139o817q935K572P076L883J544l413l955
2245a788M840N352l180n967l985j478M323O281j962m964K498M236J629J357n138
2260B054r340m77O943J215l725k896n27O353P724k845r201k215K032N98P90k855
2276f372o232J660R276L838k341k815l381j09N554q50p621m072K956N391O361
$$ plain form
2169 -7035 -4289 602 6106 4013 -4837 -6636 -2839 -1878 -2760 -5309 -11163 -9180 1985 5872 548
2184 548 -3686 -3975 -1593 3189 994 -9006 -11949 -4632 1634 3732 2528 -2631 -2169 5839 8010
2199 8010 841 -4360 -5538 -4858 1742 6122 764 -2905 1897 7982 10217 6754 -2564 -6639 269
2214 269 5360 737 -3032 -2527 500 7372 11199 4262 -2942 -1263 1193 1280 -258 -4747 -7262 -886
2230 -886 6674 6335 3877 842 -1773 2118 6257 -560 -9495 -6923 153 4036 5580 2167 -1788
2245 -1788 3052 8404 5224 -743 -4728 -6206 -1883 4398 2436 -2528 -30 4206 5835 7192 2054
2260 2054 -7286 -7763 -820 395 -3330 -6226 -6753 -400 7324 4479 -4722 -6937 -4905 -4307 -3517 -6372
2276 -6372 -12604 -10944 -1668 2170 -171 -2986 -6367 -6476 -922 -1772 -9393 -13465 -10509 -5118 1243
2291A243K72o730r17P325K515m823n221l662P14P488L479l912j708L573L033L322
2307E991o22q547m989M418L582p84j292j978L51Q158N052n955o794k25J648K135
2323A49l91o320k322O649O603N10j082l592l075M078L270n636n826M04L395N290
2339B104N084l152m906K198N255j67m100n982l732N672P300j068m251J638K870
2354D763K368K613m717q534n01M458J557k80j737k691L983P708k40o300m192j531
2370c273J063M153k121p510Q01Q037M184n64l170m508L38M355r88n507k422O86
2386f446L531O831J621o209j349M770J148j352k924o098j021P736M728k800k607
2401d41N23L269N529q84r021m033L819K490N38j01k788o76O773M716l446n101
$$ plain form
2291 1243 1515 -5215 -6132 1193 3708 -1115 -6336 -9998 -9284 -1796 1683 -2229 -3937 -364 2669 5991
2307 5991 5369 -3178 -8167 -3749 -167 -951 -2243 -4221 -3870 4288 9340 3385 -3409 -3634 -1986 149
2323 149 -242 -6562 -8884 -2235 4368 4878 3796 204 -2871 1207 4477 -1159 -6985 -6581 -3186 2104
2339 2104 7188 4036 -870 1328 6583 6416 2316 -3666 -7398 -1726 5574 4506 255 1893 4763
2354 4763 7131 9744 5027 -3507 -4008 450 2007 1727 -10 -2701 1282 8990 8750 2450 -1742 -3273
2370 -3273 -2210 1943 -178 -7688 -6887 1150 5334 4770 1600 -2908 -2570 1785 797 -4710 -7132 -6446
2386 -6446 -2915 3916 5537 -672 -2021 2749 3897 2545 -379 -6477 -7498 238 4966 2166 -441
2401 -441 82 3351 8880 7996 -1025 -5058 -1239 1251 1789 1688 -1100 -1776 4997 9713 6267 1166
2417A166k874r69M106K080n866l522L771M975L139P19n866n325M734M588m430
2432D26n488q71J723N575M623k704l741J560J868N78L46n335o086L699P106M29
2448C708k268l51m36L969M369m432p738j344L058L195J525l173l607M922O160
2463G557q89m076k562l216N25M418m92n685r35M269M413L166k982p273l43N824
2479A719j8m251k764j894L412P613R97o202j179K689J943O75k034o342r14N662
2495h88L767K42j360k747M34O822J828p479m800J712K878L348L65n390q71O083
2511C944M030j941k809m026j589M603K499m577k485J561K627M135K189n632n488
2526b959L266L599r91l373l568n55O679N225l824m344K40J992K381R22n429n039
$$ plain form
2417 1166 -1708 -2677 1429 3509 -2357 -5879 -2108 2867 6006 6725 859 -4466 268 4856 426
2432 426 -5062 -5933 -4210 1365 5988 3284 -457 1103 2971 3549 3895 -1440 -7526 -3827 3279 3708
2448 3708 1440 1089 653 4622 8991 4559 -3179 -4523 -1465 1730 3255 82 -3525 1397 7557
2463 7557 6668 2592 30 -3186 -2661 1757 1265 -4420 -5355 -1086 3327 6493 3511 -3762 -4105 1719
2479 1719 1701 -2550 -5314 -7208 -3796 3817 4814 -1388 -2567 122 2065 2740 706 -5636 -6550 -888
2495 -888 2879 3121 1761 -986 -552 6270 8098 619 -4181 -2469 409 3757 4122 -1268 -2139 3944
2511 3944 7974 6033 3224 -802 -2391 2212 4711 134 -2351 -790 1837 5972 8161 2529 -2959
2526 -2959 307 3906 2915 -458 -4026 -4581 2098 7323 3499 -845 -605 1387 3768 4690 -739 -5778
2542e778L150N116P29p94k074k312M044N444k945o100j843N06L982L610l560n494
2558d319K603O405J320k225m460m226K431N541j496m560j098J786L716M006k269
2573C155o776p96L625J402q51k470m949K162Q004J344n168k417R2K444L499k100
2589B00o596j145N426K365L93j440l890Q24O203J202n318k577l89J341M467J267
2605B333n358k092M257L625M32k125n825r03O545K600m502l040M62J973M636J955
2621D973o178l935L410L417L23j226m622k122N754M102k169l102j578K8M451L293
2637D819n167n903K104M972K011r46m273k321M814M317k416l197j602n91L479
2652A00M250k693n176J306L348K059J57k926m700K490N182m05k839k725p53M221
$$ plain form
2542 -5778 -2628 2488 3217 2423 349 -1963 2081 7525 4580 -1520 -3363 -2857 1125 4735 1175 -4319
2558 -4319 -1716 4689 6009 3784 -676 -4902 -2471 3070 1574 -2986 -4084 -2298 1418 5424 3155
2573 3155 -3621 -4417 -792 610 -241 -2711 -7660 -5498 2506 3850 -1318 -3735 -3643 -1199 2300 200
2589 200 -6396 -7541 -2115 250 643 -797 -4687 -3863 2340 3542 -1776 -4353 -4742 -3401 1066 2333
2605 2333 -3025 -5117 -860 2765 3197 1072 -4753 -5656 889 3489 -1013 -4053 -3591 -1618 3018 4973
2621 4973 -1205 -5140 -1730 1687 2010 784 -3838 -5960 -206 3896 1727 -1375 -2953 -2925 1526 4819
2637 4819 -348 -6251 -4147 825 2836 1890 -2383 -4704 110 4427 2011 -1186 -2788 -3379 100
2652 100 4350 1657 -3519 -2213 1135 3194 3351 425 -4275 -1785 3397 2992 153 -2572 -3325 896
2668H96M910l486o351J174L936N36N59k619m036J864N016K95k479k102k110K114
2684a883N218r99o162r80K939K266J755k013n434l16O326J885l371k842j142J893
2700b860M662m47n083j159J747J595K137K21m912k196N150L268j905k621k425
2715d828L77M955K545m926k969J373L195K279J05n336k182M982K622k150j893
2730a851j321q60M255L029k281l680K80J758K498R99m558l945L985M627o71j678
2746E86k158j425M715L559l645m669J191J897J894J845l002l417K685M088J58
2761D302j247k417l447K993N263j515m874k04K075K729L379k863n541P25M143
2776C501P41j675k039k625K194N489l68l774q73M7R98L333j224o070r21M319K190
$$ plain form
2668 896 5806 2320 -4031 -2857 1079 1615 2174 -445 -4481 -2617 2399 2694 215 -1887 -3997 -1883
2684 -1883 3335 2336 -3826 -4806 -1867 399 2154 141 -5293 -5609 717 2602 -769 -3611 -4753 -2860
2700 -2860 1802 1355 -3728 -4887 -3140 -1545 592 813 -4099 -6295 -1145 2123 218 -2403 -4828
2715 -4828 -4451 504 3049 -1877 -4846 -3473 -278 2001 2106 -3230 -5412 -430 2192 42 -1851
2730 -1851 -3172 -4032 223 3252 971 -2709 -2429 -671 1827 2826 -1732 -5677 -1692 2935 2264 586
2746 586 -1572 -2997 1718 5277 1632 -3037 -1846 51 1945 3790 788 -2629 56 4144 4302
2761 4302 3055 638 -2809 184 5447 3932 -942 -1146 929 3658 7037 4174 -1367 -642 3501
2776 3501 4242 2567 528 -2097 97 5586 5218 1444 571 618 1616 4949 3725 -2345 -3266 1053 3243
2793C243k20j396l380Q15M717P53m867k352k92J415L672o3m504r94M193J935l32
2810B343j470l770j460M202K030l193j542L14J317M284J520n193l140K593K282
2825A117k85j441l493j076N623L941k757k536m64N28K538Q40m627l280K584K839
2841E1J349R41k774k637L968L659k368l762j859n54L939L555k977l368K269L363
2857B795J278k61l603l764K389L647j224j861j56P8K691M381j810m736m09J867
2873A302O86N27j909m409K446O066N97k433j318j195J539K857k789n095k27L099
2889b56J726J746m46l643M85M177m2k485k970k085M73N178J059m234q79K815K155
2906B774K110k271n715j451M520J372j927j005q62J723M304J853l808k820N8N07
$$ plain form
2793 3243 3023 1627 -1753 -938 3779 4532 -335 -2687 -2979 -1564 2108 2045 -2459 -3453 740 2675 2343
2810 2343 873 -2897 -4357 -155 1875 -1318 -2860 -2546 -1229 3055 4575 -618 -3758 -1165 1117
2825 1117 832 -609 -4102 -5178 445 4386 1629 -907 -1371 -843 1695 2535 -2092 -5372 -2788 51
2841 51 1400 2341 -433 -3070 898 4557 2189 -1573 -3432 -3986 -47 3508 531 -2837 -568 2795
2857 2795 4073 3812 209 -3555 -1166 2481 1257 -604 -760 -682 2009 6390 4580 -156 -565 1302
2873 1302 1988 2515 606 -3803 -1357 4709 5306 2873 1555 360 1899 4756 1967 -3128 -3355 -256
2889 -256 1470 3216 2770 -873 -388 3789 3747 1262 -1708 -3793 -3320 1858 2917 -1317 -2196 619 2774
2906 2774 4884 2613 -3102 -4553 -33 1339 -588 -1593 -2455 -732 3572 5425 1617 -1203 -1145 -638
2922f38J580P73m532k011M390M644m31j393k938j301L734J311m631l573J875K134
2938a007K469J809k711k416K702K442j546j680k895k246L118M100j201k691J064
2953f89J685K920J283m570m904K112L250n21j064o51o60L543M515j759l686r28
2969a24m68J090J691k112l804J580M601J729P2k115l799J170L895j547m910j272
2985d323J209K467L603p96l900L12L076j2j890k315l441P6M968J054k001n23Q18
3002a618J210L098n67n927k623K949K019l6k31k688J168N855J525l654k292q84
3018b696p0K303N02m133r50L813L155P52k43l072k166L117J292k911k928o69J298
3035c606M770K007l194k581K778J743n10j606m364k036M028L635j364j337M91
$$ plain form
2922 -638 942 1715 -2817 -4828 -438 4206 3775 2382 -556 -1857 1877 3188 -1443 -5016 -3141 -1007
2938 -1007 1462 3271 560 -1856 846 3288 1742 62 -2833 -5079 -1961 2139 938 -1753 -689
2953 -689 996 3916 5199 629 -4275 -2163 1087 566 -498 -1149 -1809 1734 6249 4490 804 -124
2969 -124 -592 498 2189 77 -3727 -2147 2454 4183 4255 2140 -1659 -489 3406 1859 -3051 -4323
2985 -4323 -3114 -647 2956 2160 -1740 -1428 1648 1636 -254 -2569 -6010 -5934 -966 88 -1913 -2436 -1618
3002 -1618 -408 2690 2123 -3804 -6427 -3478 -1459 -1495 -1726 -4414 -3246 2609 4134 480 -1812 -2696
3018 -2696 -2766 -463 39 -4094 -5044 -1231 1924 2676 2433 -639 -2805 312 1604 -1307 -4235 -4904 -3606
3035 -3606 1164 3171 -23 -2604 174 1917 1407 -199 -4563 -6599 -2571 1064 -300 -1637 -1146
3050a146O69K737J992l823m539M57K091J451Q29k297j682L847N128r92l046k113
3066d37o64J404K558k774l326J660L478K427J217j968l977J168K708j469k959
3081i54j259o09K247M634K1l787m78J882P91k4l254m291N71M744P22k069K3N0
3099a040J398L154r66n190k162J639J356J276K9k712O11M983J471k043j714k757
3115b667m15L875Q67m532j442L215L153J800n41l600j195K748N95k274j465j672
3131c550q8M616L011k983j737N88Q79P04j49m007l262K487M011J52r41j144m18
3148a831L716J266l627l361M49P57Q25J645j284j838K680L281J36j098k496k367
3164c147K118K867j892k510Q28K125K627K270k172l678R96K737j000k277j276
$$ plain form
3050 -1146 -477 2260 4252 429 -4110 -3653 -1562 -111 718 -1579 -3261 586 5714 4722 1676 -437
3066 -437 -1101 303 2861 87 -3239 -1579 1899 4326 5543 3575 -402 766 3474 2005 -954
3081 -954 -2213 -2822 -575 4059 4080 293 -185 1697 2488 2464 -790 -5081 -4510 234 956 -1113 -1090 -1040
3099 -1040 358 3512 2546 -2644 -4806 -3167 -1811 -535 -506 -3218 -2607 2376 3847 1804 90 -2667
3115 -2667 -3082 793 1660 -2872 -4314 -1099 2054 3854 3313 -287 -1482 1266 1861 -413 -1878 -3550
3131 -3550 -3638 978 3989 1006 -731 -143 736 1440 1291 -2716 -5978 -3491 520 672 -269 -1413 -1831
3148 -1831 1885 3151 -476 -3837 -3388 -2631 -1806 -161 -1445 -3283 -603 2678 2814 1716 -780 -3147
3164 -3147 -1029 1838 -54 -2564 -1736 389 3016 5286 3114 -564 432 3169 2169 -108 -1384
3179a384n79K175L667j4k137j43N9K08J785k042n029O1L938J225j9l49k166J145
3197D01M434r56m555j635J23Q51K741n93k958K90M281M31k12r41l438j243L311
3214C32J427k430j316O56J986L391P75m262j815K111J078o16j106k234m06M240
3230A811K500k396j420J37J72J430J71l333k585J867J694J135N16k603j328L163
3246I31K784k825l304p04K02K268J725k320k398K229K783M73o60k201k867J778
3262b106K807j538j418J12L68K682L148j907l723q6J791P96K53k335k335K125
3278a366L916O44j764p81j192J702K040j574l995n4K227J102J473o51k430M61
3294b42L241M3k011j951j731J086L708Pl614K00K147J192P16j127l687m58L552
$$ plain form
3179 -1384 -1963 212 3879 3865 1728 1585 1644 1852 3637 1595 -3434 -3373 565 1790 1771 1422 -744 401
3197 401 4835 3879 -676 -2311 -2188 -1337 1404 811 -2147 -1857 2424 2855 2643 1702 -1736 -2979 332
3214 332 1759 -671 -1987 -1331 655 4046 4821 559 -1256 855 1933 1317 211 -2023 -2429 1811
3230 1811 4311 1915 495 632 804 2234 2405 -928 -3513 -1646 48 1183 1699 -904 -2232 931
3246 931 3715 890 -2414 -3118 -2916 -648 1077 -1243 -3641 -1412 1371 1844 1184 -1017 -3884 -2106
3262 -2106 701 -837 -2255 -2143 -1775 907 4055 2148 -1575 -1661 130 926 1179 -1156 -3491 -1366
3278 -1366 2550 3194 1430 649 -543 1159 3199 1625 -2370 -2424 -197 905 2378 1727 -703 -242
3294 -242 2999 3042 1031 -920 -2651 -1565 2143 2150 -1464 -1264 883 2075 2791 1664 -2023 -2481 1071
3311A071N89j715j183n7J296L003J2k751j131Q31N43R21L03l420j248L801K871
3328C736j480j446j624M06K719Q05l912k049J827J278J495N58k505j720K851J684
3344B623j530j361j148j455K311K711j652k602M64J198K262M49l169l274K413
3359a760K838j199r68j028m41K454K490j883k462K4O76J176Q65j828j988J102
3375a932K154N82K53j472k065J454L614j261l869j87J547J724J237j600k341R72
3391a190K729j51n34j400j928Q37L021Jk296l37O13J069K072m49l798n97K452
3408A14J476l65j418k324J067L733L38l406p39M61M86J960k07k469j088J816J468
3425I03K68l11k594j276L548J683k180j353o24P91K527Q12l264j900K456J708
$$ plain form
3311 1071 1660 -55 -1238 -1295 1 3004 3016 265 -866 -35 508 1429 1732 -1688 -2936 865 3736
3328 3736 2256 810 -814 -408 2311 3116 -796 -2845 -1018 260 1755 2313 -192 -1912 939 2623
3344 2623 1093 -268 -1416 -2871 -560 2151 499 -2103 -1639 -441 1821 2270 -899 -4173 -1760
3359 -1760 1078 -121 -1089 -2117 -2558 -104 2386 503 -1959 -1935 -1259 -83 782 -1046 -3034 -1932
3375 -1932 222 804 1057 -415 -2480 -1026 2588 1327 -2542 -2729 -1182 542 1779 179 -2162 -1190
3391 -1190 1539 1388 854 -546 -2474 -1637 1384 1385 -911 -1248 -635 434 2506 2057 -1741 -2338 114
3408 114 1590 1225 -193 -2517 -1450 2283 2621 -785 -1524 -1063 -577 1383 1176 -1293 -2381 -565 903
3425 903 1171 860 -1734 -3010 538 2221 41 -1312 -1936 -1145 1382 2194 -1070 -2970 -514 1194
3441A194m64k65j984q50K801J535j535j565j05k56J922J665k346k438J251K079
3457F39O02l06k011j541J962K563j187k010o38Q65J635J792j814k909P59J704
3473A05P13K2j715k011J834K853k46j814r53m85J758K431j204l455M28K154J222
3490A637K96j580k322J268L303m5k196j061q26J540K535n40k938k4J805Q02N01
3507B155o51k930M0K653R75j710j182p99J322L003k70l046j053J553R65M32j202
3524B55k464J02K596J411j217j085m88m32K375N92k617j770J337J123J240L61
3540A319k552r07K832J520j834j326j327l23K807J723k404j533J436J257N45K76
3556A509k300k061J551J673m55k71j508l71K721K467k076k281j24R81R39M13j819
$$ plain form
3441 1194 730 465 -1519 -2369 432 1967 432 -1133 -1238 -1494 428 2093 -253 -2691 -1440 639
3457 639 1241 935 -1076 -2617 -655 1908 721 -1289 -1927 -1062 573 2365 551 -2358 -1599 105
3473 105 818 840 -875 -2886 -1052 1801 1555 -259 -1212 -1697 61 2492 1288 -2167 -1739 415 1637
3490 1637 1933 353 -1969 -701 2602 2557 361 -700 -1526 14 2549 2009 -929 -953 852 1654 2155
3507 2155 1504 -1426 -1386 1267 2242 532 -650 -1449 -127 2876 2606 -440 -1493 60 1025 1457 255
3524 255 -2209 -2107 489 1900 683 -402 -890 -1322 1053 1645 -972 -2742 -1405 -282 958 1319
3540 1319 -1233 -2140 692 2212 378 -948 -2275 -2598 209 1932 -472 -2005 -569 688 1233 1509
3556 1509 -791 -2852 -1301 372 -83 -354 -1862 -2233 488 2955 879 -1402 -1526 -545 394 807 -1012
3573a012k190J840K647J49r60o52j061J073K070j302k536K89Q22R85J993q62k236
3590i43K56K587K90j480j341j681J358K936o28k196P16J101Q52J070j500k883
3606a486J77K056j88o56K69j149M90K920O33k001j531j23M22J970p43l030j9K955
3624I66J498o17m70j748j72K610k31k457o24K54N86J539J510k329r64J559R07
3641A817k6j013j982j724K753K148j753j054O71P74J517L70k740j618P52P17M6
3658c45O2j005k98J786J901q21j535n49o61Q71J467j696k161J414K158O90L40
3675A618j530j340J684J031j307j951r6L08J683K014r52j460O23J232l3k47j511
3692b34k426N97K962K22j018k68j55J288K178j175l608n46J472M55N62r68j380
$$ plain form
3573 -1012 -3202 -1362 1285 1434 474 -178 -1239 -166 1904 602 -1934 -1645 -823 162 2155 1293 -943
3590 -943 -687 1900 2190 710 -631 -2312 -954 1982 1354 -842 -126 975 1827 2897 1397 -1486
3606 -1486 -1309 747 559 -97 172 -977 -487 2433 3066 1065 -466 -589 -167 1803 1060 -1970 -1989 966
3624 966 2464 1847 1377 -371 -543 2067 1836 -621 -1245 -991 -405 1134 2644 315 -649 910 1817
3641 1817 1791 778 -1204 -2928 -175 1973 220 -834 -163 611 2128 2498 -242 -1860 -1108 -391 -345
3658 -345 -283 -1288 -1586 200 2101 1280 -255 -804 -1465 -594 873 -823 -2984 -1570 588 1278 1618
3675 1618 88 -1252 432 1463 156 -1795 -1891 -1583 100 2114 1162 -298 325 1557 1524 1277 -234
3692 -234 -2660 -2063 899 1121 103 -165 -320 968 3146 1971 -1637 -2183 -711 -256 306 -662 -2042
3709b042R97K613M90j075j092j259l41K018j95k255m61J433J684J546J35k955
3725g59o49K226J87j445j476m71J247K368J233k039m24J302N08k35o22k251r13
3742b213J953J310k59j30l60K10J843P37k762j852J91P82Q20M96j763q63K284
3759D24J951n45j547j238j174J695J016k170j466J300J172J093J776j660k032
3774a405P85J492p27j327r38m73J669K710k97j930N15Q04K74M53j870k457R09
3791a813K274L23l44J27m88R65J471j085j651o85p66K97K192j07k579Q95K502
3808A528P81j193j148j909M53J358r0k221J6J204J189J429j73k135n27J478l08
3825b68n66n18j402Q5L157J373j545p63L15Q51J359q71l029o89K063J406k16K1
$$ plain form
3709 -2042 -1045 1568 2058 983 -109 -1368 -1709 309 114 -2141 -2602 -1169 515 2061 2196 -759
3725 -759 -1408 818 1005 -440 -1916 -2387 -1140 1228 2461 422 -2 1300 1808 1573 951 -1300 -2213
3742 -2213 -260 1050 791 661 301 511 2354 3091 329 -1523 -1332 -550 270 766 -997 -1860 424
3759 424 2375 1830 283 -955 -2129 -434 582 -1588 -3054 -1754 -582 511 2287 627 -1405
3774 -1405 -620 872 145 -1182 -2120 -2593 -924 1786 1489 -441 74 878 1152 1605 -265 -2722 -1813
3791 -1813 461 784 440 567 79 1044 2515 1430 -221 -906 -1672 -1375 817 710 -1869 -974 1528
3808 1528 2309 1116 -32 -1941 -1488 -130 -220 -2441 -2425 -1221 -32 1397 1224 -911 -1438 40 -268
3825 -268 -834 -1352 -2754 -2669 488 1861 316 -447 -132 719 2078 1207 -1822 -2511 -448 958 742 763
3843G63m16q4J860O55j601j973k34k42J869M59j107j102J499J613N20n75k262
3860c58j784J457J759k016r78M00J040J473J013j724j196P15K77l95k54j046j145
3877b762J426K564j81p58j20l76Q30J111j764k673P62J527J513l9n62m64J482
3894A516J580j227j765p09n69O78J575j76j543N53J469P52M74j779k202%K037
3911F64m96j349k96j08J474K315n02k361n70R95l28J34p15j274K74K115Q55k43
3929E84l76p33p6J676p9k641j054J231J317J043K54j110m46K097M98j603j047
3946d65j096M43J552P11j782m29J584Q94L59j51j632j768J263J043q19n81k86
3963a160L8K434R85j517k113N24Q87l32L81j910o31J840J737n83m70n40o06J392
$$ plain form
3843 763 347 263 2123 2778 1177 -796 -1030 -1272 597 1056 -51 -1153 346 1959 2479 1904 -358
3860 -358 -2142 -685 1074 -942 -1920 -1520 -480 993 2006 282 -914 -199 78 -317 -571 -1617 -2762
3877 -2762 -1336 1228 1047 289 169 -207 623 1734 -30 -2703 -1941 -414 1099 1060 498 34 1516
3894 1516 3096 1869 104 -605 -1174 -496 1079 903 -640 -87 1382 2134 2608 829 -1373 -1373 664
3911 664 168 -1181 -1477 -1585 -111 2204 1702 -659 -1229 -234 -562 -428 -1143 -2417 -2143 -28 827 584
3929 584 208 -525 -601 1075 996 -1645 -2699 -1468 -151 892 1146 36 -410 1687 2185 582 -465
3946 -465 -1561 -1118 434 1145 -637 -1066 518 1412 1771 1620 -12 -1780 -517 526 -293 -874 -1160
3963 -1160 -1122 1312 2297 780 -1333 -809 78 -254 127 -1783 -2414 -574 1163 580 110 -430 -1036 356
3981C56N18j437j425K59O10R70J629j055j662Q15K397o46r97r67j290J269J723
3998A067n88r78J36J320P95M11r56k111L44J193k09o46K27q00O52K105J87j749
4016D00p60Q8L34P52p69j963K53K146P98l41n35q76j47J727K33k277q28J049M24
4035b92R86N30j601m58J589N88n66q80j381J09J941J027j937m62R14K23J340J34
4053A804k176j156J185J259p70l26m84m45K070R57j419m35K0p29R27J221j583
4070h0j724J082J528K61j98j171p56J179J209j255r67j6O2Q93J344j452o85O15
4088a31J042l96m8p19j258N18J683j57q26p32J1J507J120j052k366P47J195J25
4106B63k86n28o68Q04J570k6j066o94l92N30J565n32k028M29R05M00R81m26j723
$$ plain form
3981 356 874 -563 -1988 -1729 -1119 -149 1480 425 -1237 -422 1975 1329 332 -635 -1925 -656 1067
3998 1067 479 -499 -363 957 1752 2163 1207 -904 -560 633 424 -222 5 -795 -143 1962 2149 400
4016 400 -360 -272 62 814 45 -1918 -1665 481 1279 938 403 -473 -620 1107 1340 -937 -1765 -716 -292
4035 -292 694 1224 -377 -835 754 1342 776 -104 -1485 -1376 565 1592 -345 -807 107 330 1670 1804
4053 1804 -372 -1528 -343 916 146 -180 -664 -1109 961 1918 499 64 84 -645 282 1503 -80
4070 -80 -1804 -722 806 1067 869 -302 -1058 121 1330 75 -892 -908 -846 47 1391 -61 -746 -131
4088 -131 911 515 467 -252 -1510 -992 691 534 -292 -1024 -1013 494 1614 562 -1804 -1057 138 263
4106 263 -23 -551 -1219 -415 1155 1129 63 -631 -1023 -493 1072 540 -1488 -1059 -154 246 1227 801 -922
4125i22o5J898L28j498o22j85P93J245J80j631j22M35L01O96j89j766m03J705
4143A78Q76p67m42n56R0J489N93j663r83O24P15J18L22j232l39J253Q72p30n31
4162a13m58j49J114P41j082r96N66P58Q30k03j138j153J210J188l43k90o62q18
4180i98J518J199j310j073J38J032M65j42p31j417J053J066j78m55k94j010J211
4197G4J393n76j522J06K88N13J002r70j990M14K185l15n62n80m46O37J769o51
4215G69j455J04O64N0O34l36j423J45J375M4k12l25r11L91J304K48j385n96N7
4234h58P95R35o5j525m58J932K58q83j62n64k40J175P25j284o61M68K36R50J93
4253I67j490q09J052O66l91J45j004m85J696J131j026j247L23J26R86J03j452
$$ plain form
4125 -922 -987 911 1239 -259 -881 -1066 -273 972 1152 -479 -601 -166 135 831 642 -1124 -1527 178
4143 178 1054 287 -155 -711 -621 868 1461 -202 -1185 -561 154 272 594 -638 -977 276 1148 418 -113
4162 -113 -571 -720 394 1135 53 -943 -377 381 1211 1008 -130 -1283 -73 1115 772 482 -180 -998
4180 -998 520 1719 409 -664 -526 506 971 829 98 -1319 -266 800 622 167 -127 -1137 74
4197 74 1467 891 -631 -525 -237 276 1278 308 -1682 -1268 917 602 40 -540 -986 -349 1420 769
4215 769 -686 -582 82 132 766 430 -993 -848 527 571 359 34 -877 -486 818 1066 -319 -915 -858
4234 -858 -63 872 807 -718 -1176 756 1014 131 -31 -595 -835 340 1065 -219 -880 -412 -176 774 967
4253 967 -523 -1332 -280 386 -5 140 -864 -1349 347 1478 452 -795 -472 -346 640 743 -709
4270g09o91J225N78J71J50j130m32P90J250r55q15L3j60Q94J383j211j358O05
4288c82J016K05m63r46n92Q55R82k05q18L24M7L36J046l75j828r7J021J01O27
4307H54r65j264J186J842k69j277r13K21M82R77p66j203J86J417K45j63J19j202
4325d93K3J142qo45p49p0p4J908J31j482m77R31P33j94o31j056l41J783J71q44
4345b42KR7L43N13J037k090o74N99K01J63L79p39m72R63J189o73n05o72m70J131
4365H0N69j561o65P96R60L05P5q00n23O67O12r31m54l76K8J161Q91p29p46L55
4385b86N78N1K98j253j547J068J255Qm03j99k19J534N02r43j259K01K37J02O82
4404D07o17r78J171J216J58n92l13j223M60J049l17j190J43M28Q84J111p17j659
$$ plain form
4270 -709 -1400 -175 403 574 724 -406 -838 -48 1202 247 -568 -535 -695 199 1582 371 -987 -382
4288 -382 634 839 376 -570 -1162 -307 675 470 -348 -24 23 359 1405 1030 -798 -895 126 227 854
4307 854 -111 -1375 -189 1653 1384 107 -806 -585 -103 874 108 -1095 -909 508 753 590 709 -493
4325 -493 -470 672 664 19 -730 -800 -874 1034 1165 -317 -794 137 870 676 45 -1011 -1352 431 602 -242
4345 -242 -240 -143 200 713 1750 -340 -1014 -415 -214 -51 328 -411 -883 80 1269 596 91 -581 -1051 80
4365 80 649 -912 -1577 -781 179 484 559 -241 -764 -97 515 -416 -870 -1246 -1218 -57 834 105 -641 -286
4385 -286 292 343 641 -612 -2159 -1091 164 172 -231 -430 -649 885 1387 444 -815 -614 -377 -275 407
4404 407 -210 -1188 -17 1199 1357 765 452 -771 -311 738 421 -769 -626 -198 686 1797 1080 -579
4422e79L04J146k16o80p37n12M11J502K81r56k29M75r7N36k52j660j93J027N16
$$ plain form
4422 -579 -275 871 655 -25 -762 -1274 -863 639 920 -36 -265 210 113 649 397 -1263 -1456 -429 87
$$ [...]
8191c
##END NTUPLES=NMR FID
##END=
