##TITLE=1H_CG-1113
 CDCl3, 8 sc, 
 22.7.2019
##JCAMPDX= 6.0         $$ Bruker NMR JCAMP-DX V2.0
##DATA TYPE= NMR FID
##DATA CLASS= NTUPLES
##ORIGIN= UXNMR, Bruker Analytische Messtechnik GmbH
##OWNER= root
$$ XWIN-NMR		Version 3.5
$$ Mon Jul 22 14:27:36 2019 Russian Standard Time (UT+4h)  she@DPX200
##.OBSERVE FREQUENCY= 200.13155
##.OBSERVE NUCLEUS= ^1H
##.DELAY= (6, 6)
##.ACQUISITION MODE= SIMULTANEOUS
##.ACQUISITION SCHEME= undefined
##.AVERAGES= 8
##.DIGITISER RES= 18
##SPECTROMETER/DATA SYSTEM= spect
##.PULSE SEQUENCE= zg30
##.SOLVENT NAME= CDCl3
##.SHIFT REFERENCE= (INTERNAL, CDCl3, 0, 15.7039)
##AUDIT TRAIL= $$ (NUMBER, WHEN, WHO, WHERE, WHAT)
$$ ##TITLE= Audit trail, XWIN-NMR		Version 3.5
$$ ##JCAMPDX= 5.01
$$ ##ORIGIN= Bruker BioSpin GmbH
$$ ##OWNER= she
$$ F:/spectra/data/she/nmr/H-F/1/audita.txt
$$ ##AUDIT TRAIL=  $$ (NUMBER, WHEN, WHO, WHERE, WHAT)
(   1,<2019-07-22 14:26:24.65 +0400>,<she>,<DPX200>,
      <created by zg, POWCHK disabled, PULCHK disabled
       configuration hash MD5:
       00 E9 B6 7A A2 85 ED C7 34 08 36 98 17 FE 4E 26
       data hash MD5: 16K
       F7 DB A6 40 FC DD 3C 27 F1 9E 4B F1 25 84 19 87>)
$$ ##END=
$$ 
$$ hash MD5
$$ 7F B4 84 EE 20 DF E1 1C B6 DB AF FE B5 47 61 FB
##$RELAX= 
##$RELAX= 
##$RELAX= 
##$RELAX= 
##$RELAX= 
##$RELAX= 
$$ Bruker specific parameters
$$ --------------------------
##$DU= <F:/spectra>
##$EXPNO= 1
##$NAME= <H-F>
##$PROCNO= 1
##$TYPE= <nmr>
##$USER= <she>
##$AMP= (0..31)
100 100 100 100 100 100 100 100 100 100 100 100 100 100 100 100 100 100 
100 100 100 100 100 100 100 100 100 100 100 100 100 100 
##$AQSEQ= 0
##$AQ_mod= 1
##$AUNM= <au_zg>
##$AUTOPOS= <>
##$BF1= 200.13
##$BF2= 200.13
##$BF3= 200.13
##$BF4= 200.13
##$BF5= 200.13
##$BF6= 200.13
##$BF7= 200.13
##$BF8= 200.13
##$BYTORDA= 1
##$CFDGTYP= 0
##$CFRGTYP= 5
##$CHEMSTR= <none>
##$CNST= (0..31)
1 1 145 1 1 1 1 1 1 1 1 1 1 1 1 1 1 1 1 1 1 1 1 1 1 1 1 1 1 1 1 1 
##$CPDPRG= <>
##$CPDPRG1= <>
##$CPDPRG2= <>
##$CPDPRG3= <>
##$CPDPRG4= <mlev>
##$CPDPRG5= <mlev>
##$CPDPRG6= <mlev>
##$CPDPRG7= <mlev>
##$CPDPRG8= <mlev>
##$CPDPRGB= <>
##$CPDPRGT= <>
##$D= (0..31)
0 1.2 0 0 0 0 0 0 0 0 0 0.03 0 0 0 0 0 0 0 0 0 0 0 0 0 0 0 0 0 0 0 0 
##$DATE= 1563791183
##$DBL= (0..7)
120 120 120 120 120 120 120 120 
##$DBP= (0..7)
150 150 150 150 150 150 150 150 
##$DBP07= 0
##$DBPNAM0= <>
##$DBPNAM1= <>
##$DBPNAM2= <>
##$DBPNAM3= <>
##$DBPNAM4= <>
##$DBPNAM5= <>
##$DBPNAM6= <>
##$DBPNAM7= <>
##$DBPOAL= (0..7)
0.5 0.5 0.5 0.5 0.5 0.5 0.5 0.5 
##$DBPOFFS= (0..7)
0 0 0 0 0 0 0 0 
##$DE= 6
##$DECBNUC= <off>
##$DECIM= 24
##$DECNUC= <off>
##$DECSTAT= 4
##$DIGMOD= 1
##$DIGTYP= 9
##$DL= (0..7)
0 120 120 120 120 120 120 120 
##$DP= (0..7)
150 150 150 150 150 150 150 150 
##$DP07= 0
##$DPNAME0= <>
##$DPNAME1= <>
##$DPNAME2= <>
##$DPNAME3= <>
##$DPNAME4= <>
##$DPNAME5= <>
##$DPNAME6= <>
##$DPNAME7= <>
##$DPOAL= (0..7)
0.5 0.5 0.5 0.5 0.5 0.5 0.5 0.5 
##$DPOFFS= (0..7)
0 0 0 0 0 0 0 0 
##$DQDMODE= 0
##$DR= 18
##$DS= 0
##$DSLIST= <SSSSSSSSSSSSSSS>
##$DSPFIRM= 0
$$ [...]
##$SUBNAM2= <"">
##$SUBNAM3= <"">
##$SUBNAM4= <"">
##$SUBNAM5= <"">
##$SUBNAM6= <"">
##$SUBNAM7= <"">
##$SUBNAM8= <"">
##$SUBNAM9= <"">
##$SW= 24.9336996594482
##$SWIBOX= (0..15)
0 0 2 0 0 0 0 0 0 0 0 0 0 0 0 0 
##$SW_h= 4990.01996007984
##$TD= 16384
##$TD0= 1
##$TE= 0
##$TE2= 300
##$TE3= 300
##$TEG= 300
##$TL= (0..7)
0 120 120 120 120 120 120 120 
##$TP= (0..7)
150 150 150 150 150 150 150 150 
##$TP07= 0
##$TPNAME0= <>
##$TPNAME1= <>
##$TPNAME2= <>
##$TPNAME3= <>
##$TPNAME4= <>
##$TPNAME5= <>
##$TPNAME6= <>
##$TPNAME7= <>
##$TPOAL= (0..7)
0.5 0.5 0.5 0.5 0.5 0.5 0.5 0.5 
##$TPOFFS= (0..7)
0 0 0 0 0 0 0 0 
##$TUNHIN= 0
##$TUNHOUT= 0
##$TUNXOUT= 0
##$USERA1= <user>
##$USERA2= <user>
##$USERA3= <user>
##$USERA4= <user>
##$USERA5= <user>
##$V9= 5
##$VALIST= <valist>
##$VCLIST= <CCCCCCCCCCCCCCC>
##$VD= 0
##$VDLIST= <DDDDDDDDDDDDDDD>
##$VPLIST= <PPPPPPPPPPPPPPP>
##$VTLIST= <TTTTTTTTTTTTTTT>
##$WBST= 1024
##$WBSW= 4
##$XGAIN= (0..3)
0 0 0 0 
##$XL= 0
##$YL= 0
##$YMAX_a= 438039
##$YMIN_a= -793325
##$ZGOPTNS= <>
##$ZL1= 120
##$ZL2= 120
##$ZL3= 120
##$ZL4= 120
##$ABSF1= 10
##$ABSF2= 0
##$ABSG= 5
##$ABSL= 3
##$ALPHA= 0
##$AQORDER= 0
##$ASSFAC= 0
##$ASSFACI= 0
##$ASSFACX= 0
##$ASSWID= 0
##$AUNMP= <proc_1d>
##$AZFE= 0.1
##$AZFW= 0.1
##$BCFW= 1
##$BC_mod= 2
##$BYTORDP= 1
##$COROFFS= 0
##$CY= 11.3945322036743
##$DATMOD= 1
##$DC= 2
##$DFILT= <>
##$DTYPP= 0
##$F1P= 18.9103706918063
##$F2P= -1.10871071338519
##$FCOR= 0.5
##$FTSIZE= 0
##$FT_mod= 4
##$GAMMA= 1
##$GB= 0.15
##$INTBC= 1
##$INTSCL= 1
##$ISEN= 128
##$LB= 0.24
##$LEV0= 0
##$LPBIN= 0
##$MAXI= 10000
##$MC2= 0
##$MEAN= 0
##$ME_mod= 0
##$MI= 1.114404
##$NCOEF= 0
##$NC_proc= 0
##$NLEV= 6
##$NOISF1= 3.799351
##$NOISF2= 2.8
##$NSP= 1
##$NTH_PI= 0
##$NZP= 0
##$OFFSET= 15.70392
##$PC= 1
##$PHC0= -8857.487
##$PHC1= 8.400959
##$PH_mod= 1
##$PKNL= yes
##$PPARMOD= 0
##$PSCAL= 0
##$PSIGN= 0
##$REVERSE= no
##$SF= 200.130013532006
##$SI= 16384
##$SIGF1= 3
##$SIGF2= 2
##$SINO= 400
##$SIOLD= 16384
##$SREGLST= <1H.CDCl3>
##$SSB= 0
##$STSI= 0
##$STSR= 0
##$SW_p= 3612.71676300578
##$SYMM= 0
##$S_DEV= 0
##$TDeff= 0
##$TDoff= 0
##$TI= <>
##$TILT= no
##$TM1= 0
##$TM2= 0
##$TOPLEV= 0
##$USERP1= <user>
##$USERP2= <user>
##$USERP3= <user>
##$USERP4= <user>
##$USERP5= <user>
##$WDW= 1
##$XDIM= 8192
##$YMAX_p= 0
##$YMIN_p= 0
$$ End of Bruker specific parameters
$$ ---------------------------------
##NTUPLES= NMR FID
##VAR_NAME=  TIME,          FID/REAL,        FID/IMAG
##SYMBOL=    X,             R,               I
##VAR_TYPE=  INDEPENDENT,   DEPENDENT,       DEPENDENT
##VAR_FORM=  AFFN,          ASDF,            ASDF
##VAR_DIM=   8192,          8192,            8192
##UNITS=     SECONDS,       ARBITRARY UNITS, ARBITRARY UNITS
##FACTOR=    0.0002004,     1,               1
##FIRST=     0,             0,               0
##LAST=      1.6414764,     0,               0
##MIN=       0,             -793325,         0
##MAX=       1.6414764,     438039,          0
$$ Real data points
##PAGE= N=1
##DATA TABLE= (X++(R..R)), XYDATA
0@%%%qJ6j6J6k4M0m9O5q8J05j27J58j93K27k70L25l84M50n26O11p07Q14r33J068
27E70j218J381j563J765j985K227k496K790l110L463l853M275m740N255n816O439
43C384p132P899q757R721j0814J2062j3501J5189j7195J9628k2653K6534l1721
56a7356L9060n0333P0078j14736L94315J8192n86465K43324L23191J18769k08753
67B29286r0857N1358J02753j59500k16074k2266K05957J14270m8239j83224j58465
78a75001n2445O4698P9255J04726q83k16699k23161J03954K36230Q99j91550o0978
90c30955J39907J37879j13205k73092l2400L15839K16776j53923k40984j0671
100c44829J65907J26772l8830j05424L7647J47156J9643j06714m0849M7751M9138
$$ plain form
0 0 0 0 0 -8 8 -8 8 -16 24 -25 40 -48 57 -70 88 -105 122 -148 177 -207 243 -283 328 -379 435 -498 570
27 570 -648 733 -830 935 -1050 1177 -1319 1471 -1639 1824 -2029 2246 -2494 2761 -3055 3384
43 3384 -3748 4151 -4606 5115 -5699 6363 -7138 8051 -9144 10484 -12169 14365 -17356
56 -17356 21704 -28629 41449 -73287 321028 339220 -247245 -3921 319270 438039 229286
67 229286 138429 189787 292540 133040 -83034 -105300 100657 214927 166688 -16536 -175001
78 -175001 -227446 -162748 -83493 21233 20350 -196349 -419510 -315556 -79326 -78427 -269977 -330955
90 -330955 -191048 -53169 -166374 -439466 -471866 -156027 60749 -93174 -334158 -344829
100 -344829 -178922 -52150 -90980 -196404 -158757 -11601 8042 -98672 -139521 -91770 -42632
111d2632M2181L9154L1304J2293o7109r2604O7811J67653L468j22346m415P9446
123A14204r837p3443l3183M6635J10124N0420r9304j17341k502M5517L4675M5826
135A11791J7589m6319p5645p1668O377J30414Q1342j09668j10833N9607P2756
146F5743n0801o8903J8557R8236Q1959p1868j81512m4895J45497J28346N323p0784
158E4898r9340l2646R2533R2606k1268p2050m5360J6972Q7915M2497j00154q4407
170f7804Q9106J26918k7743j60870j17641R9910K51691O3898k46132k15825P3721
181a30771J87802O7292p0772j06831j8565Q4912K7577r4041o7747M6836R1604
192A7296O3302l8942j53955j02041Q4587J64716P4086p9109j78401p5268J62025
$$ plain form
111 -42632 -451 38703 70007 82300 15191 -77413 -9602 158051 161519 39173 34758 114204
123 114204 104367 30924 -2259 44376 154500 204920 105616 -11725 -14227 31290 65965 111791
135 111791 129380 83061 7416 -64252 -57875 72539 153881 44213 -66620 -7013 65743
146 65743 14942 -53961 -35404 62832 144791 72923 -108589 -153484 -7987 120359 125682 54898
158 54898 -44442 -77088 15445 108051 86783 14733 -30627 -13655 74260 116757 16603 -67804
170 -67804 21302 148220 120477 -40393 -158034 -58124 193567 257465 11333 -204492 -130771
181 -130771 57031 124323 53551 -53280 -71845 13067 40644 -53397 -121144 -74308 17296
192 17296 80598 41656 -112299 -214340 -129753 34963 109049 29940 -148461 -223729 -61704
203f1704J72762q2642j86420K186J63890R3040r9851j77319p22K16874J31617
214A71711j33907j78952J708J25468R9634j2604r2868l0985P1466L5017m1440
225A4248j8678M044n416M2505P2592p300q6366p2257O536J05345R4712o5012j24268
238c9315K7906J07411j7811j06388l4771P7688J12817J0516j35203j08433N2725
249e2858Q9912N836j6163P130j0657m0091n0523j0956Q2825Q0330n8613r8547
261g2375K0820N4828l4990n0300K9696Q4867N4274o7518j49005l5564J30604J08274
273G3611j9102o4753m7499j1427L5478K7318q477R797K0327j8252p061K1758l4737
286b3019n7508M9400J17711L3089r6932j31265p564J63200J21907j07836j66050
$$ plain form
203 -61704 111058 28416 -158004 -155818 8072 101112 1261 -176058 -176780 40094 171711
214 171711 37804 -141148 -139440 -13972 85662 73058 -19810 -50795 20671 55688 14248
225 14248 -4430 -386 -5802 36703 109295 101995 15629 -56628 -50092 55253 149965 84953 -39315
238 -39315 -11409 96002 78191 -28197 -62968 14720 127537 138053 2850 -105583 -52858
249 -52858 37054 42890 26727 33857 23200 -16891 -67414 -78370 4455 84785 26172 -72375
261 -72375 -51555 3273 -31717 -82017 -52321 32546 86820 19302 -129703 -165267 -34663 73611
273 73611 54509 -10244 -57743 -69170 -33692 -6374 -14851 -5054 15273 -2979 -10040 11718 -23019
286 -23019 -80527 -31127 86584 119673 22741 -108524 -116088 47112 169019 61183 -104867
297a04867K5116J49130O2422q3984j24457l553J42680Q4024j07513j30088K1508
308f9582J09882P0625k4904j04041o6776N3368Q5377J5399m4774o9962k8921R0695
320A6386J07474o3048j62417l1634J30969J25739k5060j58504r1384J19252J53750
331A21523m7891j61339l9393J15718J23759j7207j52931q8025R9760J26502j3357
342F7119q3000m2076J1760N6374M8863l2010p1274j6640M0226N7770K9152o1530
354D734q7091L6073J16882J3889j01669p6874L1201J11384O2006q6351j16069
365i1885L2496J10528J4609o9045m0845K1464N1335J1307n3854k4707M5415J8105
377B4923l1570N633K6361k2768l2392R513L1060K5278j4343o1848j6056P4435
$$ plain form
297 -104867 -79751 69379 131801 47817 -76640 -80193 62487 146511 38998 -91090 -69582
308 -69582 40300 110925 86021 -18020 -84796 -31428 53949 69348 24574 -45388 -74309 16386
320 16386 123860 60812 -101605 -133239 -2270 123469 98409 -60095 -151479 -32227 121523
331 121523 73632 -87707 -127100 -11382 112377 95170 -57761 -145786 -46026 80476 67119
342 67119 -15881 -57957 -46197 10177 59040 27030 -44244 -60884 -20658 37112 66264 4734
354 4734 -82357 -46284 70598 84487 -17182 -94056 -62855 48529 110535 24184 -91885
365 -91885 -59389 51139 65748 -3297 -44142 -22678 28657 39964 -13890 -38597 6818 24923
377 24923 -6647 -1014 25347 2579 -29813 -20300 10760 36038 21695 -40153 -56209 18226
389A8226M4924n0455n0558P970K9861K1032j1372l5901O002M0190n111k4772J7082
402G118P06m4415m249N5959L1724l0868o1524j9961P7712P9655o1114j22474O000
415h5731J14609N7710n8479r9676j6894J07941Q5073p2585j15140Q474Q9252M9893
427F4447k1903o7082m1569M6091P0483N775m4056m8840k1338O0154R2391k1384
439G3169j20650m0519R3979J03239j0042j24752q9287R1341J56846j2968j56193
450c5837p0056R2289J23619M090j27812r2788P8814J27319q515r9820n1816K3078
462c7435O1931M3703l6830p9045j5223N2506N2772Q989o4895q6744K1794J15905
474C7428L5622r3711q8189J9834J02936O2299q3386j28401K2081J36945M2171
$$ plain form
389 18226 63150 12695 -37863 -29893 -32 21000 9628 -26273 -20271 19919 14808 -9964 7118
402 7118 7824 -36591 -40840 15119 46843 15975 -45549 -65510 12202 91857 30743 -91731 -85731
415 -85731 28878 86588 28109 -71567 -88461 19480 104553 31968 -83172 -74698 14554 64447
427 64447 42544 -24538 -66107 -20016 50467 56242 12186 -36654 -57992 2162 94553 73169
439 73169 -47481 -88000 5979 109218 99176 -25576 -114863 -23522 133324 120356 -35837
450 -35837 -105893 -13604 110015 114105 -13707 -106495 -27681 99638 91123 -8697 -60513 -37435
462 -37435 24496 68199 31369 -47676 -62899 -10393 42379 51368 -13527 -100271 -78477 37428
474 37428 73050 -20661 -108850 -89016 13920 76219 -7167 -135568 -113487 23458 65629
485F5629q9979p8871J9815Q4844M3288o0588p2088K5858O3020R199j4120m909
497h902j5324j592K7756J5532p013j0254j7135Q654N8010K2483n9881m3051L9909
510I192N3321M581l9762l8453K3908O1739l738n7111k250L8807m631k8416N25
523A7712J5288P350j4055k8897J2185M9399j3990p8438j6927O5436M1209l3569
535B2703o5363k2442O1920O4076m5458q9262M007O7772K4654k6795l8789j7745
547f0722L2304M4315m619l1227k0544j3433K2585O4284J1700p3972m4216N2692
559b0853P6874J1047p7220p8640M8101J33709K0564j24327q1187O4388J12383
570H4839K3810r5700r2042M9076J17756Q811r4354n8333K2487N9560M2067k8284
$$ plain form
485 65629 -24350 -103221 -83406 1438 44726 -15862 -87950 -62092 928 10127 -3993 -8902
497 -8902 -24226 -25818 1938 17470 10457 203 -16932 -8278 49732 72215 12334 -30717 9192
510 9192 62513 67094 27332 -11121 12787 74526 70788 13677 11427 50234 45603 17187 17712
523 17712 33000 40350 26295 -2602 9583 58982 44992 -33446 -50373 15063 56272 22703
535 22703 -42660 -65102 -3182 60894 15436 -73826 -69819 -2047 22607 -4188 -42977 -60722
547 -60722 -28418 15897 11278 -19949 -40493 -53926 -31341 32943 44643 -29329 -73545 -20853
559 -20853 56021 67068 -10152 -88792 -40691 93018 113582 -10745 -91932 -27544 84839
570 84839 108649 12949 -79093 -30017 87739 96550 2196 -56137 -33650 25910 67977 39693
582C9693p2752k1489M4310M0503K329m4904o6847M876R1680M2964p7239r0794
594a07670O155R4849P5409n6187j31880j7115J22244P1472o6133q4397Q236Q2242
606b775N3642n3686q9531R693Q8274M2722k2543l4497k4531R237M6482K7237j5388
619C4336k0430j1246P744M2866K1709m8335l5907M8608O0608j1533o5110m6159
631b2849L2844Q2039J2924p4831l7701L9336K3901k3469k1621J528J8440R698
643D0239k9242l2550J5170J4624l0305j0455L9529J8003l8222n3422j8303M4354
655d0580N8555j9680o7017j247M8574N53l9674j6016K0537M0865K2705k9719l9588
668f1732l10J2907J7316M6226K8939m5622n8142Q192N8058M4101j5119n5250O463
$$ plain form
582 39693 -33059 -54548 -10238 30265 32594 -12310 -79157 -74281 17399 60363 -16876 -107670
594 -107670 -101515 -6666 68743 12556 -119324 -136439 -14195 57277 -8856 -93253 -85017 -2775
606 -2775 50867 -2819 -92350 -82657 5617 48339 25796 -8701 -33232 -23995 22487 49724 34336
619 34336 13906 2660 10404 53270 74979 26644 -9263 39345 99953 88420 23310 -22849
631 -22849 9995 92034 104958 30127 -7574 31762 55663 32194 10573 12101 30541 40239
643 40239 10997 -21553 -6383 8241 -22064 -32519 7010 25013 -13209 -66631 -84934 -40580
655 -40580 17975 -1705 -68722 -69969 -21395 -20842 -60516 -76532 -55995 -15130 7575 -22144 -61732
668 -61732 -62042 -49135 -31819 14407 43346 -2276 -60418 -52226 5832 49933 34814 -20436 -13973
681a3973Q5642K3760r8470p0327P0636J25528L2004r9196j14502J8857J20868
692H0827M4878o7661n1777K1422L8795N591l9956m7218J2830N9288K3492k7814
704E2697m8500n2230k983P8337O1886n0029j00097l2077O3643Q1789j7233j12387
716g7184m0917J01882P9622p0108j16872r381J03675R0118m2039j23079l0538
727a34821R2022O4268l2607n4186j1508L5057M5928j173m4314j8622J8663K3962
739a7331L2544J8923m2630n1028K7235O7638J5046m5745m5054K1999Q0053K2441
751H4091q4478o2412N7158Q3581K133o2098m7456K0546N9603O134n1241j3478
763g917L7055P499k6538p969R506N435l196j3732k372K1375k819l5488L072M3896
$$ plain form
681 -13973 71669 95429 -3041 -73368 -2732 122796 154800 55604 -58898 -40041 80827
692 80827 125705 58044 6267 27689 66484 72075 32119 -15099 -2269 57019 80511 52697
704 52697 4197 -48033 -51016 27321 89207 39178 -60919 -92996 -29353 52436 35203 -77184
716 -77184 -118101 -16219 63403 -6705 -123577 -132958 -29283 60835 18796 -104283 -134821
727 -134821 -42799 21469 -11138 -65324 -76832 -41775 4153 2980 -41334 -59956 -41293 -17331
739 -17331 15213 34136 -8494 -59522 -32287 35351 50397 4652 -40402 -18403 61650 84091
751 84091 -387 -62799 -5641 77940 80073 17975 -29481 -8935 50668 56802 5561 -7917
763 -7917 29138 36637 10099 2130 11636 17071 13875 143 -2229 19146 16327 -19161 -16089 27807
777B7807J960m3993k3380J9626L8054K0224k8948l9839O936K4402n02P353K3459
790C3159p740l3732j1436J6649K7922J5299k2564j9070L3200K2132n4024m8769
802d8974M4259Q3039K3558o4597q8591p376Q3482N4486l3502m2859k005P265m88
815G697j0656j7725P957L9269J3786k8985m3139m0494n28P5318P1309m1027j06863
828g4081m2448N7661Q2052L958q3301m1186P5279O3867o4571r7727Q836J01781
840i880P6138l7562j08097l7287P1257O3632r997k7524p119M297J6137R471j7885
853a4419j7669J0065L1838M6013J5885o8768q2364L2013J10293L8570o6324o8171
865c3038K0092Q0724J4917r2585n6032Q4396J05153k0096j04586o0112L8077P9026
$$ plain form
777 27807 29767 -14226 -37606 -17980 20074 40298 11350 -28489 -21553 2849 2347 9700 33159
790 33159 25419 -8313 -19749 -3100 24822 40121 17557 -1513 31687 53819 -205 -48974
802 -48974 -4715 78324 101882 37285 -51306 -58682 24800 79286 45784 2925 920 8185 7697
815 7697 -2959 -20684 -12727 26542 40328 11343 -31796 -72290 -72818 2500 73809 32782 -74081
828 -74081 -116529 -58868 23184 27142 -56159 -97345 -22066 41801 -22770 -120497 -111661 -9880
840 -9880 66258 28696 -79401 -116688 -45431 18201 8204 -19320 -26439 -22142 -6005 3466 -14419
853 -14419 -32088 -22023 9815 55828 71713 2945 -79419 -47406 62887 101457 35133 -33038
865 -33038 -12946 67778 82695 -9890 -65922 18474 123627 103531 -1055 -61167 -23090 55936
877E5936K0007m7545k0349K3542j0560m2533L259M1904K0996r974j9853j3950
889H80m007j9180k0231M2017P4957j2110r7017n0996M4613O9832J9786l9807l3778
902b5041K2056J6098m7128l2751N3480O3635r228n5670l4979J5250L5708j97j9192
915a7959L0229L9007m4460p8793L308P7534N0175k8001o7683j6686N5622L1441
927C3734m3931l2252L6042M0128r837l8462k8270J2552M1301J1901k2424j0267
939i785n042j6738J4557M6323M406m7955l1365K4563N1733J0744o2512n5127N0536
952b5662Q7452r394q2945l4545N1064O8923j039p7774m5172N8000O9430j6438
964D1900n9039k4994K2464M5761K1198l4253m2268M060L2320K9821R974l7247
$$ plain form
877 55936 75943 28398 8049 31591 21031 -21502 -18243 23661 44657 34683 14830 880
889 880 -3127 -22307 -42538 -521 74436 62326 -34691 -85687 -41074 28758 48544 8737 -25041
902 -25041 -2985 13113 -34015 -66766 -13286 50349 41121 -14549 -49528 -34278 1430 1233 -17959
915 -17959 12270 51277 6817 -71976 -68668 8866 59041 31040 -36643 -53329 2293 33734
927 33734 -10197 -42449 -6407 33721 23884 -14578 -42848 -30296 11005 22906 482 -9785
939 -9785 -14827 -31565 -17008 29315 33721 -14234 -45599 -21036 30697 41441 -21071 -76198 -25662
952 -25662 61790 52396 -30549 -65094 -14030 54893 53854 -23920 -69092 -11092 58338 41900
964 41900 -17139 -42133 -19669 26092 47290 13037 -29231 -25171 7149 36970 46944 9697
976I697n3690J2938O5311J7571m8405m0933J8680O1723K3768o7344p0080L9405
988c1359R4841J8843o7999o7418O04O4461M5173l1927m5782J0522K6605m769j3694
1001a899o233N40K0419K1855j4928l5610k0612L480M0772M8487j6234p0900k7147
1014e8010M0100M3376M002k8371k4262J7239K4269k8978l8983K3507N2228R447
1026C5564l1453l5986j0790K5349K5165m198K60J1601k1755l9307M626L9432K1329
1039A9837q998k4423j3175J9084J4259k4833j5560L2099K7141j3690k7101j6039
1051c1399O340K8157J4452j4122o426K057j3902k120K9654J2065k6123j7214J6789
1064a792K8734N847l9669m1180L4072P3215K963o8046l7924L1793N3583J0829
$$ plain form
976 9697 -43993 -31055 34256 51827 3422 -37511 -18831 42892 66660 -684 -70764 -31359
988 -31359 63482 82325 14326 -53092 -52488 11973 57146 25219 -20563 -10041 16564 11795 -1899
1001 -1899 -8132 -7592 12827 34682 19754 -15856 -36468 -32988 7784 56271 40037 -30863 -58010
1014 -58010 -17910 25466 29468 1097 -23165 -5926 18343 -10635 -49618 -26111 26117 35564
1026 35564 4111 -31875 -42665 -17316 7849 3651 3911 15512 -6243 -45550 -40924 -1492 19837
1039 19837 10839 -13584 -26759 -7675 6584 -18249 -33809 -1710 25431 11741 -15360 -31399
1051 -31399 -25059 3098 17550 3428 -2998 -941 -14843 -16963 12691 24756 -1367 -18581 -1792
1064 -1792 26942 32789 -6880 -48060 -13988 59227 62190 -5856 -43780 -11987 41596 52425
1076E2425n1557m0198M0184N8902j5547n7959k0147K7939M2804J7628l2835m4841
1088b3202k261K6298K2767J2301j6045m1314m691M3604J7886l6093l6038J0825
1100b5963N2462L2052n1694q1244R839R1806M2959n2139p1797r925N8071M8293
1112D2720l1982n6731J2028N1130O305l4799k8975Q10L4946L4827j0039l5888
1124a5648j8280L371K3150L6278J034m7025k4703L1041L6104k281l3590k5109
1136c5658K8596N2623j0842o4677j4989N2509L9213j6352m4588k0781L1738L7578
1148C4370j5667l2901Q458K0276o753j0916K374M241M031k806r849Q111J4182
1161A7151j7540k3767J7725K8017o537k2352q894J0019K0756N88k6604m779K6659
$$ plain form
1076 52425 868 -39330 854 59756 44209 -13750 -33897 -5958 36846 54474 21639 -23202
1088 -23202 -25463 835 23602 35903 19858 -21456 -26147 17457 35343 -750 -36788 -25963
1100 -25963 26499 58551 6857 -74387 -64548 27258 70217 18078 -53719 -63644 -5573 42720
1112 42720 10738 -45993 -33965 17165 23470 -11329 -40304 -39494 -4548 30279 20240 -15648
1124 -15648 -33928 -30557 -7407 28871 29905 -17120 -41823 -10782 25322 23041 -10549 -35658
1136 -35658 -7062 45561 34719 -29958 -44947 7562 46775 30423 -14165 -34946 -3208 34370
1148 34370 18703 -14198 -5740 14536 7783 -3133 -759 3482 7513 4707 -5142 2969 17151
1161 17151 -389 -24156 -6431 21586 15049 -7303 -16197 -6178 14578 15166 -11438 -16217 10442
1174A0442M497k2495j115J4561j604r398k154J0782J8074o639l7435n450M6488
1187A8554K2891l6393l4953J0808L8400J8239l2575m4055K0010N6395K413m9209
1199i475k4346J9272L2044J3927k2332l2043K348K1902P096K40m463k2448q481
1212b6759L1021K1491k3518l5156m931L5641M1674j8867p0176j6654O7600M9671
1224E1037l3413o2705j4367N1149N2222k3724o5478m948N5856K6355k5199l3223
1236b6438r153K4844L4124j169k8904j4036N071J4078K5352O262l5815k5966K8002
1249c748M0017J865l7139l3398K0537O0783J0272o2853l7067M1757N0942l219
1261D8749m5055l0618K5962M7566m562m5039j0684K7104J3541o809j0527r942
$$ plain form
1174 10442 14939 -7556 -8671 5890 4286 -5112 -7266 3516 21590 14951 -22484 -27934 18554
1187 18554 41445 5052 -29901 -19093 19307 37546 4971 -39084 -19074 37321 39734 -9475
1199 -9475 -33821 -14549 17495 31422 9090 -22953 -20605 1297 8393 8633 4170 -18278 -26759
1212 -26759 4262 25753 2235 -32921 -37852 -2211 39463 20596 -49580 -66234 1366 51037
1224 51037 17624 -45081 -59448 -8299 43923 20199 -45279 -50227 5629 31984 6785 -26438
1236 -26438 -35591 -10747 23377 22208 -6696 -20732 -15661 -1583 23769 30031 -5784 -31750 -3748
1249 -3748 36269 38134 995 -32403 -11866 48917 59189 -3664 -40731 1026 51968 48749
1261 48749 3694 -26924 -962 46604 42042 -2997 -13681 13423 26964 20155 9628 -314
1273c14J805R342j243j661N825j3279j9635J4443K6693j0162k8813o515J7670
1286e844K0048n321l4692j0813L4506J9641k6540k1121J1439J4561N33j1370q145
1299b3118J3428J4511j8518j9498K2455K3672j6248k4460N422K5844J5786j8612
1311F64l4314Q187M6901Q825l7595j8852J9137K2760N075j6176j8845J0094K2227
1324A8088k831j1311J728n197q734J6453J8964j0242k5927j1685J6885L4806K796
1337C3793m9342k8323M3155M5373k1205n2869j6458L9700M8943j2842o4514j8720
1349e3309M9218L6306j8824l5139j1799J9196K9743n88k9548j2052J2907J3123
1361g66J3222L205k7230k4402K2206L9060N648l0830l3204R388N2749K1520n0832
$$ plain form
1273 -314 1491 10833 9590 7929 13754 475 -19160 -4717 21976 11814 -16999 -23514 -5844
1286 -5844 14204 8883 -25809 -36622 -2116 17525 -9015 -30136 -18697 -4136 -3603 -14973 -23118
1299 -23118 -9690 4821 -13697 -33195 -10740 12932 -3316 -27776 -22354 3490 19276 664
1311 664 -33650 -25463 21438 30263 -7332 -26184 -7047 15713 20788 4612 -14233 -4139 18088
1324 18088 15257 3946 5674 477 -8257 8196 27160 16918 -9009 -20694 -3809 30997 33793
1337 33793 -15549 -43872 -717 44656 23451 -29418 -45876 -6176 42767 29925 -34589 -53309
1349 -53309 -4091 32215 13391 -21748 -33547 -14351 15392 14804 -14744 -26796 -13889 -766
1361 -766 12456 15661 -11569 -35971 -13765 25295 30943 113 -33091 -23703 29046 50566 -266
1374b66m3943L1404N6260N251m4738l8079J8510N4617J0107m6728k5640K5508
1386B263K5342k535j6125j4290L464J8138M126j0613l939o118j1542J3794K6081
1399B8046r295l1771q342K0459K1684m498l3488j5191L4758K8928k6852l6149
1411c1711O488K7913J3196j4364k4506K482K6092M2k5086J574K3139R66j6840
1424a0615n806Q343J1942k193j9311j094L0676R367l0929j8614J8529K1007K833
1437A4135j3340j4527P039J6788o049j4308Q642J1391q194l285Q253j643j0873
1450e971o752P209K3999J2544l3413l5848K1631M4926j072l7762j9576K2158L6999
1463B9072k834m9143k0846M2432L8666j5587l6867j5141J4872K8167O461k2531
$$ plain form
1374 -266 -44209 -12805 43455 48706 3968 -34111 -15601 39016 49123 2395 -23245 2263
1386 2263 27605 25070 8945 -5345 -1881 16257 20383 9770 5831 -287 -11829 1965 28046
1399 28046 18751 -13020 -21362 -903 20781 16283 -17205 -32396 2362 31290 4438 -31711
1411 -31711 -25223 2690 15886 1522 -22984 -20502 5590 5632 -19454 -17880 5259 6225 -10615
1424 -10615 -16421 -8078 3864 1671 -17640 -18734 11942 21309 -9620 -28234 -9705 11302 14135
1437 14135 795 -13732 -6693 10095 4046 -10262 -1620 9771 1577 -1708 6545 4902 -5971
1450 -5971 -12723 -5514 18485 31029 -2384 -38232 -16601 28325 27253 -10509 -30085 -7927 29072
1463 29072 26238 -22905 -43751 -1319 37347 21760 -15107 -30248 -15376 12791 19252 -3279
1475c279j2146J0142O698K449M105j2119j8478J3332L1802M866k8270l2213K557
1488c0554M6941L2058l6681n1166J3337N1574J3165l6041l6925J3331N2322J7588
1500D8949m7989m0656K1750L9943R269j7763k1610l631J7652R220r438l728J624
1513C592n685N319J6303r151k8853l843K7948K5563o279l9462k5788L0530M3301
1526C3495j2801m2002m688K9387J6848j6718l1373%L7654J6851k9826k3127J3874
1539a2426J4837l180n378O89N531R91j3980o749K1053J4411j9797j5647J5299
1552d346J6350n842j4829o880J4720J9110j0508k5174O886K3271j833j4795K68
1565c602R122K351p269q754R938K1133j0774l3124K729L6227J0329k7010k3114
$$ plain form
1475 -3279 -15425 -5283 1415 3864 7969 -4150 -22628 -9296 22506 27372 -898 -33111 -30554
1488 -30554 16387 48445 11764 -39402 -26065 25509 38674 2633 -34292 -20961 31361 48949
1500 48949 960 -39696 -17946 21997 31266 13503 -8107 -11738 5914 15134 5696 1968 3592
1513 3592 -2093 3226 19529 10378 -18475 -22318 5630 31193 24914 -14548 -40336 -9806 33495
1526 33495 20694 -21308 -25996 3391 20239 3521 -27852 -27852 9802 26653 -3173 -26300 -12426
1539 -12426 2411 -769 -6147 -5458 73 1064 -12916 -19665 1388 15799 -3998 -19645 -4346
1552 -4346 12004 6162 -8667 -15547 -827 18283 7775 -17399 -10513 12758 10925 -3870 -3602
1565 -3602 5520 7871 602 -8152 1786 22919 12145 -20979 -18250 17977 28306 1296 -21818
1578b1818R157L2762R762l4891k8345K7604L6867r523l4125j2417J6184K4799
1590A6016K884k3307j2185J3129R188l637J544k316j4208K74K0709J0915j4322
1603D684k4917p786L0037L5431j8122m9214k794M4133K3706k5241l8619q4M5370
1616A6584K8383l6174m7404J0702M3089J7493j7195k5969q360J6431J5965o738
1628F807q563K064q43J975J0749o239k4840k780K8599K5721p420l9914l0010K5481
1642a9213N0216R53m2275j7267K2801K1129r312k8036n570L4402K6793k5389l6573
1655b7341j26K1131J3777M372n959r965m945l550k96J4565J2092j3708j2034J1912
1669g5Q106j3791j2678O886K2002J5310j7447l2582K088L0634P735j6328m487
$$ plain form
1578 -21818 -12661 20101 29863 -5028 -33373 -5769 31098 21575 -12550 -24967 -8783 16016
1590 16016 18900 -4407 -16592 -3463 5725 2088 3632 1316 -12892 -12618 8091 19006 4684
1603 4684 -20233 -28019 2018 37449 19327 -29887 -32681 11452 35158 9917 -28702 -28786 16584
1616 16584 44967 8793 -38611 -27909 15180 32673 15478 -10491 -18851 -2420 13545 6807
1628 6807 -1756 308 -535 1440 12189 5950 -18890 -21670 6929 32650 25230 -14684 -44694 -19213
1642 -19213 31003 31956 -10319 -27586 -4785 16344 7032 -21004 -26574 7828 34621 9232 -27341
1655 -27341 -27467 -6336 7441 11813 5854 -4111 -9056 -12606 -12902 1663 13755 47 -11987 -75
1669 -75 8031 -5760 -18438 -11552 10450 25760 8313 -24269 -22181 8453 16188 -140 -4627
1682d627R038M167p577j3045K616K2792O720k1682q866J8913O200j7993j1006
1695a4350J2116K3296N609k6999k5254J7428L0058m615k1630j673J2626O991p164
1708F439j6331k298J8538R852r233l647j065j3271n227K0115J9130n984k4013
1721f995j7318J4701L0332m527l5141l832L6227J7264k7862l6842O80M2903L3466
1734D3056k5767m7872j978L4026J5663j0752j4283k930J1218P532j0937j0499
1746a3523N834P508M163Q807m793k6484j1189K3630K9777K906k9835l1488J1483
1759b3204M3211Q199l7579j9267K4603K7446p250l3603j6928L0029L7601j0421
1771B2837l9304j0235K0100J6825J740r012r745K505N425l270J195O407n576o397
$$ plain form
1682 -4627 4411 8578 1001 -12044 -9428 13364 20084 -1598 -10464 8449 14649 -3344 -14350
1695 -14350 -2234 21062 26671 -328 -25582 -8154 21904 17289 -4341 -6014 6612 13603 6439
1708 6439 -9892 -12190 6348 16200 6967 3320 2255 -11016 -16243 3872 23002 17018 -6995
1721 -6995 -24313 -9612 20720 16193 -18948 -22780 13447 30711 2849 -33993 -33313 9590 43056
1734 43056 17289 -30583 -32561 1465 17128 6376 -7907 -10837 381 7913 -3024 -13523
1746 -13523 -7689 -181 3982 12789 7996 -18488 -29677 -6047 23730 26636 -3199 -34687 -23204
1759 -23204 20007 28206 -9373 -28640 -4037 23409 16159 -17444 -34372 -4343 33258 22837
1771 22837 -16467 -26702 -6602 10223 11963 2951 -6794 -4289 1136 -2134 -939 5468 -108 -6505
1785f505J1562R245j2905j6257K664J8808J6822r261l0327m407K9181J3657j9242
1798C035j4761Q048J5284L698j6224j4142J2401J9028p225j4874N182Q864n698
1811B616p948L65J0282J1185q932k1286J896K0291J408j4767k518J0062O949m217
1825E386j5388o576J5969J4601p285r572r6m823m662Q826J2678J409r753j3885
1839a3171j020J9375O861j9481r838K1839J7288j4821k8784q779K8201L5038q004
1852B4704m1375j3644K6645K0797n690j5459o142J1345J2242r158j7709J602J3240
1865A398Q362M882n056k0745j2096J6567K4562N997j8669k6807P83L2377J3921
1878B5476k8686k3056J7808L0739J906l1243k6556J6795M1924N785l5760k0928
$$ plain form
1785 -6505 5057 14302 1397 -14860 -12196 6612 23434 14173 -16154 -20561 8620 22277 3035
1798 3035 -11726 -3678 11606 15304 -920 -15062 -2661 16367 9142 -5732 -550 8314 2616
1811 2616 -5332 -4967 5315 16500 7568 -13718 -11822 8469 9877 -4890 -7408 2654 9603 5386
1825 5386 -10002 -16578 -609 13992 6707 -2865 -2961 -7784 -12446 -3620 9058 10467 714 -13171
1839 -13171 -14191 5184 12045 -7436 -17274 4565 21853 7032 -21752 -30531 -2330 32708 24704
1852 24704 -16671 -30315 -3670 17127 11437 -4022 -10164 1181 13423 4265 -13444 -11842 1398
1865 1398 9760 14642 9586 -11159 -23255 -6688 17874 23871 5202 -21605 -20822 11555 25476
1878 25476 -3210 -26266 -8458 22281 24187 -7056 -33612 -16817 25107 30892 -4868 -25796
1890b5796J4151K0985M424j1940j3529M631J4849J84q482k424k277j195J2509
1903F090J0803j2044j8756j888J6030J8464l036k6912j0526K5651J9674j7902
1915E648k4229M005K3569J4293j5498k7533J413K6257P123j6196o139P412L284
1928C409l948n623O14R746L234j1901l579J1604L82j3653j170J4217R115o054
1942F393j6555p433J5885J6533r617j3673N882P108n880n362M282Q712M068r116
1956A227j0781P840J2989r387j3814J1264J9315l108k2061j4335J3754K9625K384
1969B4912l1123j5478K1417J8670q368j8101l953J4235J4415p882j9636j129J3092
1982A071N158r52m76q985r925N457J3801O948q481j9461m523K4970J7309k1325
$$ plain form
1890 -25796 -11645 9340 13764 1824 -11705 -7074 7775 7959 -523 -2947 -5224 -6419 6090
1903 6090 16893 4849 -13907 -15795 235 18699 15663 -11249 -21775 3876 23550 5648
1915 5648 -18581 -14576 8993 23286 7788 -19745 -18332 7925 15048 -1148 -7287 125 3409
1928 3409 -539 -6162 -5548 4198 7432 -4469 -8048 3556 3938 -9715 -10885 3332 12447 6393
1942 6393 -10162 -17595 -1710 14823 5206 -8467 -2585 4523 -1357 -6719 -2437 6275 10343 1227
1956 1227 -9554 -1714 11275 1888 -11926 -662 18653 15545 -6516 -20851 -7097 22528 24912
1969 24912 -6211 -21689 -272 18398 10030 -8071 -12024 2211 16626 8744 -10892 -12021 1071
1982 1071 6229 5277 4801 -4184 -14109 -8652 5149 12097 3616 -15845 -20368 4602 21911 586
1996E86k8159R252L1923J0886k4951l0335N973L8858J3692k9557k4734J3121K4807
2009A1362N115j5943j6528N080J9646M768j1337o750n37k67Q660J1586n698j6322
2023g165m547J2955J7320j74k5052j4672K2595K6780j2692l0494m943K4401K1853
2036B6165r918l0928o405K6934J6084j5836j6793L829J0585K986p155q090M066
2049d476Q167l338m433O295P58j2017k314J2594R003o573j4398n146J4587J4421
2063A3130j1231j8277P062J7496J8j2803n869P389J1968j968j4564j154J4340
2076E537J123j3547j42J4012M725j1035j2193M041J9433O144k0697j3819J6234
2089a84J6928q392j7239l859J3472J4043m505j7304k366J2749L230o024M4J02
$$ plain form
1996 586 -27573 -18321 13602 24488 -463 -30798 -24825 14033 27725 -1832 -26566 -13445 11362
2009 11362 16477 534 -15994 -10914 8732 13500 2163 -4587 -5124 -5391 3269 14855 9157 -7165
2023 -7165 -11712 1243 18563 18389 -6663 -21335 1260 28040 15348 -15146 -20089 4312 26165
2036 26165 16247 -14681 -21086 5848 21932 6096 -10697 -6868 3717 6703 -452 -8542 -4476
2049 -4476 3691 353 -4080 2215 2973 -9044 -11358 1236 10239 3666 -10732 -15878 -1291 13130
2063 13130 1899 -16378 -9316 8180 8198 -4605 -10474 -3085 8883 6915 -7649 -8803 5537
2076 5537 6660 -6887 -7029 6983 11708 673 -11520 -7479 11954 18098 -2599 -16418 -184
2089 -184 16744 8352 -8887 -12746 726 14769 10264 -7040 -9406 3343 6573 549 593 695
2103F95m576o68N891M058k117j1333o979J6098J8694j1877k7258J69K5636J4944
2117B1377j5873k6819j794L0553J7841k2696k6501Q877K5576P943j5528j8559
2129a5603K063K0182P965j1672r012J218J852M678P902k991j2067l533J0245J3225
2143A4452Q52k0869j5993J7450K8591m586l0270j1675J9569K3691l376k8510j2228
2156b2902K4782K1828j2485k4317k131J5308J1375m074j3246k749Q927K637m556
2169a603K227K064p890k509R365O272o369j1349k958J4030J4116j0823k2210K708
2183a4929K2674O579j3944j2551M242J4827L719j5722q095J4004J0787r464r194
2196g067M610O809j313p016j476J0896P553j2523j3801R517J5510l351j3858l517
$$ plain form
2103 695 -3881 -4549 1342 5400 3283 -8050 -15029 1069 19763 7886 -19372 -19203 6433 21377
2117 21377 5504 -21315 -23109 7444 25285 2589 -23912 -15035 10541 18484 2956 -15603
2129 -15603 -13540 6642 14607 2935 -6077 -4859 -3007 1671 9573 6582 -5485 -9018 1227 14452
2143 14452 15304 -5565 -21558 -4108 24483 19897 -10373 -22048 -2479 21212 17836 -10674 -22902
2156 -22902 1880 23708 11223 -13094 -15225 83 11458 7384 -5862 -8611 316 2953 -1603
2169 -1603 624 2688 -5202 -7711 1654 7926 1557 -9792 -12750 1280 15396 4573 -17637 -14929
2183 -14929 7745 14324 380 -12171 -7929 6898 10617 -5105 -13200 804 11591 2127 -7067
2196 -7067 -2457 4352 3039 -3977 -5453 5443 12996 473 -13328 -3811 11699 8348 -5510 -9027
2210i027J0110J0419m365j5683k359J4689N820r289m292L012Q05j497M13K329
2224A085K370m479q377M509J5641j871k0067n198J8535J4625q198k3180o651K3426
2238B170K1489j4444k7110J320K2719J1052j1815j7693K76J8469R889j2109j2248
2251h035K045N516M415N378k298r939n270O668J0829L634j3309j5903R351K6459
2265A9541J057k7796j5718J5644K6368K460k6753j9558J7950K7437n185k5894
2277a0447p949J5272J6576k450j7113q640J0597J0831k568m442j575m988p01R363
2291A766O189o029j0429k636J1339J3010q060k1357M7K3751J1742j5679k0002
2304a6348J028J9767J2062j3615j7598P800J7037j871j3754l586P623P010j073
$$ plain form
2210 -9027 1083 11502 7137 -8546 -10905 3784 9604 315 -3977 -965 -160 -1657 -1244 1085
2224 1085 3455 -1024 -9401 -4892 10749 8878 -11189 -16387 2148 16773 8575 -14605 -21256 2170
2238 2170 23659 9215 -17895 -16575 6144 17196 5381 -12312 -12036 6433 16322 4213 -8035
2251 -8035 -5990 -474 3941 9319 7021 -2918 -8188 -1520 9309 12943 -366 -16269 -6918 19541
2265 19541 20598 -7198 -22916 -7272 19096 21556 -5197 -24755 -6805 20632 15447 -10447
2277 -10447 -18396 -3124 13452 11002 -6111 -14751 -4154 6677 4109 -333 -1908 -6896 -7597 1766
2291 1766 7955 1926 -8503 -11139 200 13210 5150 -16207 -16160 7591 19333 3654 -16348
2304 -16348 -15320 4447 16509 2894 -14704 -6904 10133 8262 -5492 -9078 -1455 5555 4482
2317D482o834J15O149l042q493N039J1305k441j1616k965Q325Q788l637j3201
2331h026r30J5040N505j3304p572P657P904q85o312k999N159L548o706l420J1264
2346E923N532j2127r043P668J3248r55j4274q675J3792J7621q616k3089j706K0479
2360E778J1841r912j6961k434J4767J0148j0001j1857L462P195R85j071j416m358
2374c834k310L287O537L636p216j4070K560K0884O408j9824j8274R739K4134P152
2388A8809k1191k0898J1381K7655J452k4386j1770J3720J7776O46j6645j1356
2400a4807R402J4371k72p763k772j179J95P079N645n056r420l502Q650J2757l793
2415I535j9715m663K1266J4850j3835k2206j774K0670J6146j1901k3338R66K0597
$$ plain form
2317 4482 -2352 -2237 3912 870 -7623 -2584 8721 6280 -5336 -8301 24 8812 5175 -8026
2331 -8026 -8956 6084 11589 -1715 -9287 -1630 6274 5389 -923 -3922 1237 4785 -1921 -5341 5923
2346 5923 11455 -672 -9715 -2047 11201 10246 -4028 -12703 1089 18710 10094 -12995 -14701 5778
2360 5778 17619 7707 -9254 -11688 3079 13227 3226 -8631 -5169 2026 3011 1940 524 -3834
2374 -3834 -6144 -2857 3680 7316 100 -13970 -11410 9474 15882 -3942 -22216 -12477 11657 18809
2388 18809 -2382 -23280 -11899 15756 17208 -7178 -18948 -5228 12548 13194 -3451 -14807
2400 -14807 -5405 8966 8694 931 -1841 -3020 -2825 4254 9899 4843 -4577 -8079 571 13328 9535
2415 9535 -10180 -14843 6423 21273 7438 -14768 -16542 4128 20274 8373 -14965 -13999 6598
2428F598M713j3729r531N776J0942K767q918o957M729L414l533J087O746k220
2442A884r502k128Q075P358k605j0700j562J3734O459j3325j1407Q661J3411N38
2456H891j0336q237O263R850k659q118M371Q872m776j0402N03R621M819n813q544
2471e695L673J1765l009j6888j770J7381J1929q640j6680m974J1979J1611n353
2484E329j1125K874P253j546n100n94J646K179K197M19q7m107q403Q62J6027R476
2500A7300j4035j7648K363J8579J0044j2344j7936N248K2437L604k1934j3953
2512a8275J1761K0051M356j5848j5697M852J5348L117p619m439j78J208L969J908
2526D514m560o348r4P834R377m045j8364p032J7727J7900q079k1053o119J5341
$$ plain form
2428 6598 11311 -2418 -11949 -6173 4769 7536 -1382 -8339 -3610 -196 -3729 -2642 4104 1884
2442 1884 -7618 -9746 -1671 5687 3082 -7618 -9180 4554 11013 -2312 -13719 -5058 8353 8891
2456 8891 -1445 -9682 -3419 6431 3772 -4346 25 8897 4121 -6281 -5778 3843 8662 2849 -5695
2471 -5695 -2022 9743 6734 -10154 -11924 5457 17386 8746 -7934 -12908 -929 10682 5329
2484 5329 -5796 -2922 4331 2785 -2315 -2909 -1263 916 3113 3532 3445 -662 -9065 -8203 7824 17300
2500 17300 3265 -14383 -12020 6559 16603 4259 -13677 -8429 14008 17612 -4322 -18275
2512 -18275 -6514 13537 17893 2045 -13652 -8800 6548 9665 2046 -2393 -2571 -1363 2606 4514
2526 4514 -46 -6394 -6488 1346 10723 6678 -11686 -18718 -991 16909 8830 -12223 -18342 -3001
2540c001J6952p423k1641j862K0572J1299j3383j5735L28J3536R819n312j1179
2553g030l30O013Q98o13K992j45m932j79N194K113m184p184J804J4050O418j4556
2569C29j4689O381J7002M759j0693j0615L815J1273J5j2127j744J1895M121p874
2583A848o792J638O235J845m070q61O108o28j1952m256J2483J0423m605j1893
2597d477m573Q087Q805m835r557L293J0167j024r403l434M071N335J731l235j591
2612f40R13l980l566Q188J0648n825j3734k620J1191R242o014j4463l6J8260Q379
2627A5943j7695j5951O562J9376P185j3164j5685K566J5423L429r925n023L225
2640c734N190K281j517n060l020J878N170O464n91j3079q940J1523J7494k123
$$ plain form
2540 -3001 13951 6528 -15113 -16975 3597 14896 1513 -14222 -13894 -358 9461 4149 -7030
2553 -7030 -7360 -1347 -449 -1062 1930 1785 -3147 -3326 1868 3981 -203 -7387 -5583 8467 14885 329
2569 329 -14360 -7979 9023 13782 3089 -7526 -3711 7562 7577 -4550 -6294 5601 9722 1848
2583 1848 -4944 -3306 2929 4774 704 -157 5951 5323 -6629 -10885 1598 12021 7416 -4477
2597 -4477 -9050 -963 7842 3007 -6550 -3257 6910 5886 -3517 -6951 -2880 2455 4186 951 -640
2612 -640 273 -3707 -7273 915 11563 5738 -7996 -10616 575 9817 3803 -10660 -10696 7564 15943
2627 15943 -1752 -17703 -11141 8235 15420 2256 -13429 -10863 4560 7989 -1936 -6959 -3734
2640 -3734 1456 3737 2220 -2840 -5860 -3982 1188 7652 7061 -6018 -14958 -3435 14059 11936
2654A1936j7536q527J2013J7042l460k0907p440K0264J7399r684k0991m892J4067
2667g16J4828l173j4236l611Q449M067l772j990O51n40J463K723m78n057n774
2682g166R90J1925Q987j1814j7512K600J6977P903j0170j3740J878J4861L408
2695I127j4574q615J1433J2923l444j1840n606N754Q092p90m733K162L286o042
2709b867n555O259Q085j516p100k922N908O133n553r317M471J2782M93j1770o484
2724h953N891Q393O14o323k964N687J299o917r19Q197K068o919n047M440Q105
2739F652k371j0935l484J3839R988j0639j6293K649J5417P179r459j3296K041
2752h712J3947L702j1557n832O392O662J9l524m320p76K026K238M607L027p451
$$ plain form
2654 11936 -5600 -14127 -2114 14928 11468 -9439 -16879 3385 20784 11100 -9891 -14783 -716
2667 -716 14112 10939 -3297 -6908 1541 5608 1836 -154 497 -43 1420 4143 3665 -1392 -7166
2682 -7166 -6176 5749 14736 2922 -14590 -11990 4987 12890 2720 -11020 -9142 5719 9127
2695 9127 -5447 -14062 -2629 10294 6850 -4990 -10596 -4842 3250 2460 -2273 -111 3175 -2867
2709 -2867 -8422 -2163 5922 4406 -2694 -5616 292 6425 872 -8445 -3974 8808 9301 -2469 -8953
2724 -8953 -3062 5331 5945 -378 -3342 2345 3644 -3273 -4192 4005 6073 -846 -5893 -1453 6652
2739 6652 4281 -6654 -10138 3701 13689 3050 -13243 -10594 4823 12002 2543 -10753 -8712
2752 -8712 5235 8937 -2620 -8452 -2060 4602 4621 1097 -3223 -3999 -1973 265 4872 7899 448
2767D48r828M441J4162J701j3579q620R159J6008P6j9668j1428J6418J9170n287
2781A3173k0127p003J2584J4299k257j4755n040J0295O492n107n466n43K202K458
2795A205K784j474m337n751qR758R267p750j6436j45J5494Q744r847j4220J024
2810a1692J6661P810j4712j4505P677J6680J723j2387q301M815J0208P95p109
2823b337j913M870K19l435J771M247j454m536n42N158M815n563r308L035J3712
2838H739K201j2155q010O247J0252L60r279m434Q056O767o295p770L725O495j570
2853C329m896j10N740J836p742n455P652R861n329j2543K32J1992O153q019j1066
2868h365J501J3073L799j1411p170O499Q242o25n605l411J179K750L12K77K914
$$ plain form
2767 448 -9380 -4939 9223 10924 -2655 -11275 -2116 13892 13968 -5700 -17128 -710 18460 13173
2781 13173 -6954 -13957 -1373 12926 10669 -4086 -9126 1169 7661 2554 -2912 -3455 -1253 1205
2795 1205 3989 2515 -1822 -7573 -7581 2177 11444 3694 -12742 -12887 2607 11351 1504 -12716 -11692
2810 -11692 4969 12779 -1933 -16438 -8761 7919 9642 -2745 -11046 -6231 3977 4772 -2337
2823 -2337 -4250 620 839 -2596 -825 3422 1968 -2568 -3110 2048 6863 1300 -8008 -4973 8739
2838 8739 10940 -1215 -9225 -2978 7274 7634 -1645 -6079 1977 8744 2449 -5321 -1596 4899 3329
2853 3329 -1567 -1677 4063 5899 -1843 -7298 354 10215 4886 -7657 -7425 4567 10720 2701 -8365
2868 -8365 -6864 6209 10008 -1403 -8573 -2074 6168 5543 -62 -3473 -2294 456 768 1045 3959
2883C959j980p224l38J0274L038r255q208N037J3546L419j5509j3047J0110J8807
2897A2629r52j7541q848J0008J4386j317j4791o495J0672J0294l926q572k127
2910f580K901M126K071j762l496k981n59O289P304m805j2805j477J4035R071q567
2925B765j4276n10J6612J0539j2439j8177L471J8330N518j1025j1014L497J2668
2938E959L186r734p173N151N892q24j192j24j395k012J114L464L581l765p514
2953e386K133J1179K464j1418q046O847J1536M70j0990p545Q681J1692l764j1457
2967c604p43Q593L149m415m782K620N034j165o560R63O625n69p955j56Q051M580
2983I666n717r012J7J0030M145r517p146N843Q321k016p288k658M672M612k629
$$ plain form
2883 3959 1979 -5245 -5583 4691 7729 -1526 -9734 -4697 8849 12268 -3241 -16288 -6178 12629
2897 12629 11677 -5864 -14712 -4704 9682 8365 -6426 -12921 -2249 8045 4119 -4453 -6580
2910 -6580 -3679 447 2518 756 -2740 -5721 -6280 9 7313 2508 -10297 -11774 2261 11332 2765
2925 2765 -11511 -12021 4591 15130 2691 -15486 -12015 6315 11833 808 -10206 -6709 5959
2938 5959 9145 -589 -7762 -2611 3281 2457 1265 1141 -254 -2266 -1152 2312 5893 2128 -5386
2953 -5386 -3253 7926 10390 -1028 -9074 -2227 9309 9779 -1211 -8756 -75 11617 7853 -3604
2967 -3604 -4347 4246 7395 2980 -1802 818 5852 4687 -1873 -910 5715 5146 -2809 -2965 5086 9666
2983 9666 3949 -5063 -5046 4984 9129 -388 -7534 -1691 6630 4614 -2674 -5332 -660 3952 1323
2998A323m987J476K549l669k556N399M419m486q430K94R236N965q818j1274N708
3013g851J4823J432j4772r413Q001J3933J040j3316p900R354J1714k513r172k368
3027g008M359M049N70k630k045J9M59K965M666j645j0193l012J1248R927m881
3042F848j3894l661J2859J2015q721j7223r1J7088R281j0068j4041J10J2870P375
3056A0747q867r996L100Q459J566m203l134q51R86K019K513R31k538n848J600
3071c516R660L327j0117r095O131J2366K349j1227r429P252J4281q10j3957m528
3085g313R746Q748l368q434k174O820M006m744l437M005K163l735k082L457K682
3100F340l214n913K82Q098L408r218p461N601Q466j817r189k414N576O115l401
$$ plain form
2998 1323 -3664 -2188 361 -3308 -5864 -465 3954 -532 -8962 -8668 568 6533 -2285 -13559 -7851
3013 -7851 6972 8404 -6368 -15781 -7780 6153 7193 -6123 -14023 -4669 7045 4532 -4640 -7008
3027 -7008 -2649 1400 1970 -660 -2705 -2686 -2227 738 5404 3759 -6434 -9446 1802 11729 6848
3042 6848 -7046 -10707 2152 14167 5446 -11777 -11868 5220 14501 4433 -9608 -9498 3372 10747
3056 10747 1880 -8116 -5016 3443 5009 806 -2328 -3179 -2193 -174 2339 3270 732 -5116 -3516
3071 -3516 6144 9471 -646 -9741 -3610 8756 11105 -122 -9551 -2299 11982 11172 -2785 -7313
3085 -7313 2433 11181 7813 -621 -2795 4025 8031 3287 -150 3855 6018 2283 201 3658 6340
3100 6340 3126 -2787 -2505 5593 9001 -217 -7678 -2077 6389 4572 -4617 -7031 -1455 4660 1259
3115A259q309J15O303N97n023O5M112K47n361k342M238O594l164r529P46J1569
3131B117L831j0018q604N590J2072J872j1072q423Q187J1815j197r834l012N535
3145a141N292p09m050j340K898Q10m06K203K83n635l403O671P951k327j1099n128
3161i130R184J2449m651j5510l970J4261J1132q219j5191j796J2788R492p623
3174C216j2273N88J0312L803n072n079p43K998K561O95l68j510l955M29P748L865
3190G215p862q750M326J2668L417j0265j1230N136J5260L034j4079q078Q349J2308
3204A1449j200j0644n627P018Q139k245p075j27M376L73k327l66J138j472k064
3219f54L80N197K333p495p302M820Q883j107q880m018O702P366l300j0199k099
$$ plain form
3115 1259 -7050 -6935 -632 -35 -5058 -4993 -881 -634 -5995 -8337 -4099 2495 -669 -10198 -9452 2117
3131 2117 5948 -4070 -12674 -7084 4988 6860 -4212 -12635 -4448 7367 6170 -3664 -6676 -1141
3145 -1141 4151 3442 -608 -1948 950 1760 1354 3557 3840 -1795 -5198 1473 9424 7097 -4002 -9130
3161 -9130 54 12503 7852 -7658 -11628 2633 13765 5546 -9645 -11441 1347 10839 3216
3174 3216 -9057 -8469 1843 5646 574 -4505 -5248 -2250 311 1006 638 -872 -4827 -4398 3350 7215
3190 7215 -647 -9397 -5071 7597 11014 749 -10481 -5345 9915 12949 -1130 -9208 -859 11449
3204 11449 10249 -395 -6022 996 9135 6890 -185 -312 4064 4437 2110 1744 2882 1410 -654
3219 -654 -274 4923 7256 -239 -7541 -2721 6162 5055 -3825 -7843 -1141 6225 2925 -7274 -9373
3234i373R684M219n854n532J998M180k50l777J55N186P43o475k971O640N122m889
3250a194o747K408Q875K783q701p355N772J1164r51r225l816O093O197j122n304
3265a123j512M233J632k830o32K535j094k838K175N331k36p050n520N965J0660
3280I696q25j3317o338J0367J0738m011j2441l449J1189R473n808j3518j402J0835
3294A189O343m794o854j705M309L683l17j740p05j354o95M704K766n064p102L000
3310d336J0157M030r275j1924K751J5044N977j1221j1362N277J2598J871j0988
3323a401p487N726J1542p47j0008m077M444N401L63k043j756j116o18M35L091
3338A749J562m607n074L653P856p22q650l589O967Q396k806j1942l684J0577Q353
$$ plain form
3234 -9373 311 4530 -1324 -6856 -4858 -678 -928 -4705 -4550 636 1379 -5096 -8067 -1427 3695 -1194
3250 -1194 -7941 -5533 3342 6125 -2576 -9931 -4159 7005 6054 -3171 -6987 -894 5303 4181 -1123
3265 -1123 -2635 1598 3230 400 -232 2303 1209 -1629 546 5877 5641 -1409 -6929 -964 9696
3280 9696 8871 -4446 -10784 -417 10321 6310 -6131 -9580 1609 11082 5274 -8244 -9646 1189
3294 1189 7532 2738 -4116 -5821 -1512 2171 1854 114 -591 -1945 -2640 2064 4830 -234 -7336 -4336
3310 -4336 5821 9851 576 -11348 -8597 6447 12424 1203 -10159 -4882 7716 9587 -1401
3323 -1401 -8888 -3162 8380 7633 -2375 -6452 -2008 3393 3756 1713 -43 -1159 -1777 -1342 1749
3338 1749 3311 -1296 -6370 -2717 5139 4417 -4233 -7822 -855 7541 4735 -7207 -10891 -314 8039
3353H039m533q926n02O440K603m443l866L965N575k008n075N72L824j058l545
3368b938J075N201K303n592o617L688Q988N11p942l761N853N617k675o321r67
3383c577N896L274m239m130K375K557j516p53K485J517l287n066R37P175L123
3398F771p802o640N302R295j133j0424m655Q644R517k922j2507l721R463P792
3412F980l203p330j770M031L931j962l391J008J678m1P46J237k871n221J422Q450
3428C694M962n989j1213q99J2321P880q355j1694K628J2195L823r673r744M063
3442f001J3564K582j1042p793L701P993J955l501k958k1J485J6O14J113j918l128
3458c339K502O381p09p922m716O248R784o51j1353o806R243J1129k819j0303k956
$$ plain form
3353 8039 3506 -5420 -5922 518 3121 -1322 -5188 -1223 4352 2344 -2731 -2159 1665 607 -2938
3368 -2938 -1863 3338 5641 49 -6568 -2880 6108 6619 -1323 -5084 769 6386 3711 -2610 -3577
3383 -3577 2319 5593 1354 -2776 -401 2156 640 -113 2372 3889 602 -4464 -3527 3648 6771
3398 6771 -1031 -7671 -2369 6926 5793 -4631 -9286 -642 8875 5953 -6554 -10275 -812 6980
3412 6980 3777 -3553 -5323 -1292 2639 677 -2714 -1706 -28 -69 677 1914 -957 -6178 -4756 3694
3428 3694 8656 2667 -8546 -9445 2876 10756 2401 -9293 -6665 5530 9353 -320 -10064 -6001
3442 -6001 7563 10145 -897 -8690 -4989 3004 4959 1458 -1500 -1521 -36 -20 594 1707 -211 -3339
3458 -3339 -837 5544 4835 -3087 -7803 -1555 8229 7578 -3775 -10581 -1338 9791 6972 -3331 -6287
3473f287P060O247m451q108R76P936L213n547l662J687J853j052l49K360J793
3488C669k990n257J606O429J021o688k830N390N256l339p709j041P533N869m662
3503B257p434J473M983O9l395m52L329J105l315l445L861M599l354n235K453O651
3519D150K1p867n265N972R996m92j0548m321P623P254l059p373j029M963L896
3534C921l262m483J310M108M47j159L51j124m013k42N208N445k735q775k887Q595
3550G05P688n105j0793L27J1306N639q354j1276K451J2798N085q999r589K513
3564e604Q313K541m200l862J012L686O87j687o17r41j546K050N358n1p260m291
3580f412M529R482J349j0544p181P148J1017j286j1620m249Q231Q744k738j0211
$$ plain form
3473 -6287 773 7020 2569 -5539 -4563 3373 6586 1039 -2623 -936 917 -135 -484 1876 3669
3488 3669 679 -4578 -2972 3457 4478 -2210 -5040 350 5606 2267 -5442 -6483 1050 6919 2257
3503 2257 -5177 -3704 1279 1348 -2047 -2499 830 1935 -1380 -4825 -964 3635 281 -4954 -2501 4150
3519 4150 4171 -3696 -8961 -2989 7007 6515 -4033 -8354 -731 6523 3464 -3909 -4938 25 3921
3534 3921 659 -3824 -2514 1594 2041 882 1233 109 -3904 -4146 1062 6507 3772 -5003 -7890 705
3550 705 8393 3288 -7505 -7178 4128 9767 1413 -9863 -7412 5386 10471 1472 -8117 -5604
3564 -5604 2709 5250 1050 -2812 -1800 1886 2573 886 269 -672 -2218 -168 5190 5139 -2121 -6412
3580 -6412 -1883 7599 8948 -1596 -8777 -1629 9388 8102 -3518 -7767 464 9208 6470 -3741
3594c741k886Q421O054l887o141J07L416J191j041p16J004p45k236K95M329l03
3610C121n373j844M994N258l525p946j328P420O354m651q214P2P339J878n325
3625a770l854L072N260j196n271j018M108Q85l741n88M143J849m457m415K657
3640d336O796O12p409m172O044N753k597o612j83N587M062l512n613J473M867
3655G60M68k216m00J513j096j351J385L811N74m820m083N143P040k543q499j280
3671e594Q673O429n288j0140n46J0583O832p030r119J205Q096L300m856m980P19
3686a716N020J331k521j803m50m78J186L543J072m838m573K371P258K254p466
3701A90p679M618J1016N71j0844n978O498J0358j95j0494n638P428P797k119p449
$$ plain form
3594 -3741 -6627 1794 7848 3961 -2180 -2073 1343 2534 1493 777 1781 1036 -1200 -905 3424 3121
3610 3121 -2252 -4096 898 6156 2631 -5315 -6643 777 7131 2480 -5734 -5662 1677 3555 -1770
3625 -1770 -5624 -2552 2708 1512 -3759 -4777 -669 216 -3525 -4113 30 1879 -2578 -6993 -4336
3640 -4336 2460 3072 -4337 -8509 -2465 3288 691 -5921 -6104 -517 3545 33 -5580 -4107 760
3655 760 1228 -988 -1388 125 -971 -2322 -937 2874 3448 -1372 -5455 -312 6728 4185 -4314 -5594
3671 -5594 3079 9508 4220 -5920 -6466 4117 10949 3919 -5200 -3995 4101 7401 2545 -2435 -1716
3686 -1716 3304 4635 2114 311 -139 -617 569 4112 5184 346 -4227 -1856 5402 7656 190
3701 190 -7489 -2871 8145 8716 -2128 -8106 -1608 8750 8555 -1939 -7577 -149 7648 5529 -1920
3716a920j957M464M013j011l216r72J834k95J38K124o73m163j929M399M617k130
3732C323p314k376O466O442l797r508o82Q872L969n720o988J273O645K351n981
3747c025m396L447L461j674l101J100K391o54k679k26L796J426m427l302M343
3762c520N846k309o133j91N440M189l297n519J036O091J151l929j675K938K466
3777B584j032j640J352J903r51l532J272N997J65o108k979N432O425k598q117
3792a827k360P572O369m672q706M36P461L732m377o216L55N000J714l226k467
3807a212Q73P12K05J627L44k573l589O93N274L065n001p679K134J0218L037q617
3823d89p759M167R687K013q799p366N823R822o55p865l892M401N252J64m308k323
$$ plain form
3716 -1920 -3877 587 4600 3589 373 -599 1235 940 1078 3202 2529 -1634 -3563 836 5453 3323
3732 3323 -3991 -6367 99 6541 2744 -6764 -7446 1426 5395 -325 -7313 -6040 605 2956 -3025
3747 -3025 -7421 -3974 -513 -2187 -5288 -4188 -1797 -2451 -5130 -5356 -1560 -134 -4561 -7863 -3520
3762 -3520 2326 17 -6116 -6307 -867 3322 25 -5494 -4458 1633 2784 -1145 -2820 118 2584
3777 2584 1552 -88 1264 3167 2216 -1316 -44 5953 6118 10 -2969 2463 8888 6290 -1827
3792 -1827 -4187 3385 9754 5082 -3624 -3188 4273 8005 3628 -2588 -2233 2767 4481 1255 -1212
3807 -1212 -339 373 578 2205 2549 -24 -3613 -2920 2354 5419 418 -7261 -5127 5091 8128 -489
3823 -489 -8248 -4081 5606 7619 -1180 -8546 -2723 7099 6444 -1421 -5313 -912 4340 4504 196 -2127
3839b127J957J642L43O4M90l070j924L543M031j580o096k628N547O810k785r400
3855e183k449Q546N943n295p973j014P507M665n172o719K091O010Q71m226k349
3870d747J426J673k12j449J303J079j753k668K809M148j772m905j50M625L612
3885C019k738n821P92O901K392n589l646L090M796n30l287q46L502J476k453k062
3901a004L144K354k866l136K224M608J33n039l581N099N933k701p858n49O754
3916C515L467l736n680K13N194J926l917k743J792K215j041r59N43p89j615j027
3932b642K972L063k391o096o00P395M256n917p050J480Q641K782o792p839L652
3947e086R490J239p337n364L390O440P78m629l126K518L029M5j358j62j503j009
$$ plain form
3839 -2127 -170 1472 1815 1879 2369 -701 -2625 918 4949 3369 -2727 -5355 192 7002 4217 -5183
3855 -5183 -7632 914 6857 1562 -6411 -7425 82 4747 -425 -7144 -5053 957 1828 -2398 -4747
3870 -4747 -3321 -1648 -1860 -3309 -2006 -927 -2680 -5348 -2539 1609 -163 -5068 -5218 -593 3019
3885 3019 281 -5540 -4748 2153 4545 -1044 -4690 -1600 3196 2666 -621 -1467 2035 3511 1058 -1004
3901 -1004 2140 4494 1628 -1508 716 5324 5457 418 -3163 1936 7869 5168 -2690 -3239 3515
3916 3515 6982 3246 -2434 -2221 2973 4899 982 -1761 31 2246 1205 246 789 0 -1615 -2642
3932 -2642 330 3393 1002 -5094 -5694 1701 5957 40 -7010 -5530 3111 5893 -899 -8738 -5086
3947 -5086 4404 5643 -1694 -7058 -3668 2772 3550 -1079 -4205 -1687 1342 1387 29 -133 -1636 -2645
3963b645K780L287r62m353k898L977O835n53q809l860P317P403l246q493k785
3978g005P151O823l519q136m73P062L109m052m378K95L475J511j810j091R09k27
3994c56j846J723K603j159m074j64L930L408k860n833J12O863L371n588n440K661
4010b649N948O09m575l070L169M698j431m517O06L256j45k230n06K861J631k401
4026A254l604J921M599j138m949j545N292L324l205m746l5N001K427m342l546
4041c292K576K763q88k377M14J374j9j523k74K452L16m028k568N115M329l356
4057A014n641n51N899M507m385p396J044Q238K606o554m918K809N906J168m841
4072a095l290J954L874L43k330j13K28j049J299K196L96l002k986J835N497N80
$$ plain form
3963 -2645 135 3422 2460 -1893 -4791 -814 6021 5468 -3341 -7201 116 7519 4273 -4220 -7005
3978 -7005 146 6969 3450 -4686 -5159 1903 5012 960 -3418 -3123 352 1863 53 -1038 -129 -356
3994 -356 -2202 -479 2124 965 -3109 -3273 657 4065 1205 -4628 -4516 2347 5718 130 -5310 -2649
4010 -2649 3299 3908 -667 -3737 -568 4130 2699 -1818 -1212 2044 1899 -331 -837 2024 3655 1254
4026 1254 -2350 -429 4170 3032 -1917 -3462 1830 5154 1949 -2797 -2832 2169 4596 254 -3292
4041 -3292 -716 2047 1159 -1218 -804 570 551 -972 -1246 1206 1522 -2506 -5074 41 4370 1014
4057 1014 -4627 -5178 721 5228 843 -6553 -5509 2729 5335 -1219 -6137 -3328 2578 3746 -1095
4072 -1095 -4385 -2431 1443 1786 -544 -657 -429 -1478 -179 2017 2413 -589 -3575 -1740 3757 4337
4088D337o411l868N191P613j336p479m342N291P815j301q608k481O523M583l061
4103B466n114m67L666L312j614l069m12J234p66P93K119q62l255r32L626K673
4119C398j687n482q26O423M088n005o138J322O488K230m716n008J959O361M18
4134C825n152k463L842K547j893j891K78J950J49k245l59K765K49l288p34L810
4150A390K556k555m418j62M786K561m185l540K135M258j002l636n19K542J810
4165B021r72k494P07K294j608l090J721M600m78m720j985L876L575j523n720n03
4181d299O415L112m518n381J405N818J568l552m130J507M586j80k866n4Q37r3
4197A75j40J039M92j059k291N17L847K068m650m978L086O905M09o176n150L435
$$ plain form
4088 4337 -2074 -5942 -751 6862 5526 -1953 -6295 -1004 6811 5510 -3098 -5579 944 5527 2466
4103 2466 -2648 -3115 551 3863 2249 -820 -1232 2 -764 29 2148 1286 -1969 -2901 725 3398
4119 3398 1711 -3771 -4597 1826 5914 909 -5229 -3907 2581 4811 95 -4913 -2954 3407 3825
4134 3825 -1327 -3790 52 2599 706 -1185 -907 1043 1192 -1053 -1412 1353 1602 -1686 -2420 1390
4150 1390 3946 1391 -3027 -3189 1597 4158 -27 -3567 -1432 2826 1824 -1812 -2331 211 2021
4165 2021 1049 -1445 -738 1556 -52 -3142 -1421 3179 2701 -2019 -4004 -128 3447 1924 -3796 -4299
4181 -4299 2116 5228 710 -4671 -3266 2552 4120 568 -3562 -2055 2531 2351 -515 -569 268 175
4197 175 35 1074 1566 507 -1784 -1267 2580 4648 -2 -4980 -1894 5011 5420 -756 -5906 -2471
4213b471P280Q31p571l632N423N686k244o099j898M010M483r05m396j060J663
4228i00M28K86J137n04k058j154K487K209j377l890j293M870M860l649p192J26
4244e614O688L920m142n975M55O230K412n013m196K863M415j18l025j648J319
4259a429K363q21j065J194N81k103j093L108K018j905l346J6L755K387l388l515
4275c243J818N719o97m739k126L332L492p07l355q16L176J048l531q49L308J323
4291C153j746k829J344K649N59l925j235M285L379l610n135Q81M876J884k825
4306A705l796J126L871k28l045p32J988O33p32o54QR5p62j113K343K531k308n117
4324d187O25N576J972m276m672J002O044J927n760m933M276O037j037o056k599
$$ plain form
4213 -2471 4809 5640 -1931 -5563 -140 5546 3302 -2797 -4695 -685 3798 2893 -1503 -2563 -900
4228 -900 -472 -186 951 447 -1611 -2765 -278 1931 554 -3336 -4629 241 5101 1452 -5740 -5614
4244 -5614 1074 4994 852 -5123 -4668 1562 3974 -1039 -5235 -2372 2043 1925 -1100 -2748 -1429
4259 -1429 934 113 -952 242 823 -1280 -2373 735 2753 848 -2498 -2482 1273 3660 272 -3243
4275 -3243 -1425 4294 3597 -1142 -3268 64 3556 2849 -506 -1322 1854 2902 -629 -1478 1830 3153
4291 3153 1407 -1422 -78 2571 3130 -795 -2030 2255 5634 2024 -3111 -2230 2646 4530 1705
4306 1705 -2091 -965 2906 2678 -367 -1099 889 1522 790 136 144 239 -523 -1636 707 3238 930 -4187
4324 -4187 -3562 2014 3986 -290 -4962 -3960 2084 4011 -1749 -6682 -2406 3631 2594 -3462 -6061
4339f061L929M348K0l862j902K290P96m36L77L8r40n31J505J756n06l124j668
4356c971L779N091k414o930j499O278M530k148n923j442O181L520m224n540J684
4371c028N137J524l152l178P87K501P94k161j21J295j043r12J465J484j248k293
4387b149p6K711K196k937l895J096N499J276m542l482K471M866K49m048k165L598
4403F68K481k062k979J617K759J41j796q44K056Q00j763j748K636L146j908m064
4419h60M34L168J958k218k911Q54L351L20m069j489L064J591j576j509j41N26
4435D93J38k007M53K578j82l866j508L155K671k115m146k44M293K857m181n340
4451f951K562N476N61m669k989K330M015P91l593j500K270J520r16n42O55l49
$$ plain form
4339 -6061 -2132 2216 2236 -1626 -3528 -1238 -442 -878 -501 -463 -1403 -1934 -429 1327 821 -2303 -3971
4356 -3971 -192 4899 2485 -4445 -5944 334 4864 2716 -3207 -4649 1532 5052 828 -4712 -3028
4371 -3028 2109 3633 481 -2697 -1910 591 1385 -776 -897 398 -645 -1557 -92 1392 144 -2149
4387 -2149 -2225 486 2682 -255 -4150 -3054 2445 3721 -821 -4303 -1832 3034 3283 -765 -2930 668
4403 668 3149 1087 -1892 -275 2484 2625 829 -15 2041 2841 1078 -670 1966 5112 3204 -860
4419 -860 -426 2742 4700 2482 -429 425 3776 4096 27 -1462 1602 3193 1617 108 -33 493
4435 493 631 -1376 -923 1655 1473 -2393 -3901 -746 1925 -190 -4336 -4580 -287 2570 -1611 -6951
4451 -6951 -4389 1087 1648 -3021 -6010 -3680 335 1126 -2467 -3967 -1697 -177 -1093 -1635 -980 -1329
4467a329k50J359J242M15k293k265K085N348k48n611k336M231M807r63n478k372
4483c658M801N544k928o541l35N035K680k284l678k83K807J613j844j832R72K16
4499B85j057J045P43j073j830k73K183K230j977m511L02N098K016l826m048J944
4515b749M501J411m087l719K587M866o13m167L4K419J612q83j435K89J679k18
4531A527k103R67K765p44k868J33K374J170j553k684L61L504J200m197j860K765
4547G57K499j594k329p35K231P85k154j602J867J623j906k259J597K647j002k944
4563b519j421K821K997k156m152j30N052J672l477l222J317L809J075l129k250
4578c713K670K361q36j483M70P25n29l08J143J012o48j994o2L682J556m050k946
$$ plain form
4467 -1329 -1579 -220 1022 1437 -856 -3121 -1036 4312 4064 -1547 -3883 348 5155 4192 -1286 -3658
4483 -3658 1143 6687 3759 -2782 -3117 1918 4598 2314 -1364 -1647 1160 2773 929 -903 69 285
4499 285 -772 273 1016 -57 -1887 -2160 23 2253 276 -4235 -3933 1165 3181 -645 -4693 -2749
4515 -2749 1752 3163 -924 -4643 -2056 2810 2197 -1970 -1936 483 2095 1212 -223 66 1745 1527
4531 1527 -576 391 3156 2412 -456 -323 2051 3221 1668 -1016 -655 2849 4049 -148 -2008 757
4547 757 3256 1662 -667 -1402 829 1614 -540 -2142 -275 1348 -558 -2817 -1220 1427 425 -2519
4563 -2519 -3940 -1119 1878 -278 -4430 -4560 492 2164 -1313 -4535 -3218 591 1666 -1463 -3713
4578 -3713 -1043 1318 482 -1001 -531 194 -335 -643 500 1512 864 -1130 -1192 2490 4046 -4 -2950
4595b950K655M502m4m462l043L201N351r28n673j893M324L158j592l440j407K985
4611G44K247j549k484K84J332p81K25J093j078j445m77J978J828j215l820j062
4627d180M606K770l182m128P69M314K531l552m475J361M840J018m074j948K527
4642h03K223k08j893r15J566J418j285m26J444j62j857J94K208Q81j334k568K29
4659a288L316J395l073k874K498L257j086l319j055K588K437j481l241P10K814
4674A598rl015lK228L33j439j992J333K921p27l413r67L574J916k716k460P87
4691b051K808J070k147k556J678K743j109k282P41J584m69q63J58J056O02j516
4707e53j079K042K530k314l296R46M063J265k829l708J243M745J215m990k701
$$ plain form
4595 -2950 -295 4207 4163 -299 -3342 -141 5210 4282 -1391 -3284 1040 4198 2606 -834 -2241 744
4611 744 2991 1442 -1042 -758 574 -207 18 1111 33 -1412 -1889 89 1917 702 -3118 -4180
4627 -4180 426 3196 14 -4114 -3345 969 3500 -52 -4527 -3166 1674 2692 -1382 -3330 -803
4642 -803 1420 1212 -681 -1596 -30 1388 103 -323 1121 959 -898 -704 1504 2385 1051 -1517 -1288
4659 -1288 2028 3423 350 -2524 -26 3231 2145 -1174 -2229 359 2796 1315 -1926 -1216 1598
4674 1598 1589 -1426 -1429 799 1132 -307 -2299 -966 1955 1228 -2185 -3152 422 2338 -378 -2838 -2051
4691 -2051 757 1827 -320 -2876 -1198 1545 436 -1846 -1105 479 10 -853 -695 361 963 -553
4707 -553 -1632 410 2940 626 -2670 -1724 2339 3604 775 -2933 -1690 3055 4270 -720 -3421
4722c421L349L664j135l183j699K333K719p31k763m9J554n30p1J049j16j441m88
4739i59N70J904J41k909k029L243L997k035m884o86M068L155k056m597n06N089
4755A506K229l814l054J597K796Q10k275j586J119J765m14j470R57N01j355m13
4771a101K004Q94j264j895l90K679K296k865l413J973L640J66l318k091K342K787
4787B444p75l064j264L175J391k287r86O33J180q2j089l29J389R27k140j785K532
4804a30J679j782k157O79K193J234j826k564J589K776r89k493k67K423O81r30
4820A16p85N25J350q08j912N84K798m32k893l14K561J415j083l411K63L877J511
4837C362l323l160K161L430J83k770j876J335K971n42k504r58K385j0n42J54Q41
$$ plain form
4722 -3421 -72 3592 2457 -726 -2425 -92 2627 1896 -867 -916 638 108 37 1086 970 -471 -959
4739 -959 -389 1515 1656 -1253 -3282 -39 3958 1923 -2961 -3647 421 3576 1520 -3077 -3583 1506
4755 1506 3735 -79 -3133 -1536 1260 2070 -205 -1791 -672 1093 679 -791 166 667 -688 -1101
4771 -1101 903 1797 533 -1362 -1752 927 3223 358 -3055 -1082 2558 2724 -594 -2685 -343 2444
4787 2444 1669 -1395 -2659 516 1907 -380 -1366 -733 447 365 -724 -1053 336 1263 -877 -2662 -130
4804 -130 1549 -233 -2390 -1711 482 1716 -110 -2674 -1085 1691 702 -1791 -2058 365 1046 116
4820 116 -669 -144 1206 398 -1514 -930 1868 1436 -1457 -1771 790 2205 1122 -2289 -2026 1851 3362
4837 3362 39 -3121 -960 2470 2653 -117 -1993 -658 2313 1771 -733 -1691 694 684 142 296 1137
4854A137r84j125J89J390J037j704k863J817M270p49l987j651K806L276n18m137
4870a796k159M254L418k800l620K30L371P39j359k029M9K443J64j294K10N89o23
4887b13p00J247J242j198j749m00K178K761j888l976N66L869J338l091k748J136
4903a626L712O03l399k502K680K952j319k325j11J445R32o78j431R90J488j001
4919D10j804J330J870j361j907K22K023J098j429k363J189K668k25k937r50K705
4935E39J419j192j512n91J996O44j924j089K071J519k417r75J383K190o36j872
4951d47j597K378K515k248l087L70L531N98j971j742O95K576K81k689j117J895
4967e9L79p22j52Q64l04q67L41Q8J724p91k648K30L609N14k858k646J573L819
$$ plain form
4854 1137 153 -972 -783 607 1644 -60 -2923 -1106 3164 2415 -1572 -3223 -417 2859 2341 -1796
4870 -1796 -3955 299 3717 917 -2703 -2473 898 1637 278 -1751 -1702 741 905 -389 -179 410 -213
4887 -213 -913 334 1576 378 -1371 -1771 407 3168 1280 -2696 -2130 1739 3077 -14 -2762 -1626
4903 -1626 2086 2689 -710 -3212 -532 2420 1101 -1224 -1335 110 1042 364 -1067 -77 1411 410
4919 410 -1394 -64 1806 445 -1462 -1240 783 1881 452 -1911 -722 1946 1721 -1216 -2166 539
4935 539 1958 766 -746 -1337 659 1303 -621 -1710 361 1880 -537 -1512 -129 2061 1425 -447
4951 -447 -2044 334 2849 601 -2486 -2116 1415 2013 42 -1700 -1005 1571 1852 -837 -1954 -59
4967 -59 320 -402 -554 310 6 -861 -520 -432 1292 501 -2147 -1917 1692 2206 -652 -3298 -1725 2094
4985B094M26l521k580K537M113r10l865m21K192K301j055k651l32J801J608j753
5001a6n02N20J67j045J257J197j254r58j466J450K604l23l968l45L212K483k502
5018E11l273M03L268K068k361l547R47L233N16k769m75Q69J590K36j561m17J684
5035I22N8r86J32J706j083j743M73J569J255q59k540R9L211P04k934j192J944
5052G36K001r74k052q95J976J933j627k161R75J831r54j851L58J608Q7j001j990
5069b000J052K285q43k696k95K294J069j810j517M33K168O47k076j900J704J309
5085a76r88o04P79N34o63l72k23J581O33k149q56K625J827k185k272Q87K765J613
5103B756k389k988J395L647O12l455j397K140J935K15k321j319J675J765p35j293
$$ plain form
4985 2094 2520 -1001 -3581 -1044 3069 2159 -1706 -2127 65 2366 1311 -1340 -1672 129 1737 -16
5001 -16 -518 2 169 -876 381 1578 324 -634 -2100 -650 1954 1631 -2337 -2682 530 3013 511
5018 511 -2762 -2359 909 2977 616 -2931 -1984 1249 1765 -1004 -1479 -610 980 1216 -345 -762 922
5035 922 980 -6 126 1832 749 -994 -521 1048 2303 1444 -1096 -997 2214 2918 -16 -1208 736
5052 736 2737 1763 -289 -1184 792 2725 1098 -1063 -88 1743 789 -1062 -704 904 991 -10 -2000
5069 -2000 -948 1337 494 -2202 -2497 -203 866 -944 -2461 -2028 140 787 -1289 -3189 -1485 -176
5085 -176 -1164 -1768 -989 -455 -1118 -1490 -1713 -132 501 -1648 -2504 121 1948 -237 -2509 -1622 1143 2756
5103 2756 367 -2621 -1226 2421 3033 -422 -1819 321 2256 2471 150 -1169 506 2271 1536 243
5119B43N91j2m21j01J502k63j521j030Q50K223L13l548j561L058K910j830l289
5136a886r84K817K709j303l776l18L498J077k099j613P99J579P54j380j281N31
5152h76J434o47j65J332o82j561jJ663J212o19k470k10K671J480k514k344J663
5169f34K776qk427j791J089L152m71k591k36K111L25j670o57R89R52p00j387r1
5187a269J993J91k351m76K580P04j586j724K7J932J291j571k272J448K212r73
5203A56j442l02J607M45o02j023N64J402r46j242R44K103p54k252j27K222J516
5220B269r18k806j05L478R69k742j924J833K366k6j684j748R43J864k78j212L53
5237F32O59p31m07P75J28j006q12Q9J509J208k092k787K133L238q78l299j615
$$ plain form
5119 243 834 822 401 300 1802 1539 18 -1012 -162 2061 2374 -1174 -2735 323 3233 1403 -1886
5136 -1886 -2870 -53 2656 1353 -2423 -2741 757 1834 -265 -1878 -1079 500 1254 -126 -1407 -876
5152 -876 558 -89 -254 1078 396 -1165 -1166 497 1709 1090 -1380 -1590 1081 2561 47 -2297 -634
5169 -634 2142 2134 -293 -2084 -995 2157 1686 -905 -1141 970 1295 -375 -1032 -43 909 209 -1178 -1269
5187 -1269 724 915 -1436 -1912 668 1372 -214 -1938 -1911 21 1312 -259 -2531 -1083 1129 156
5203 156 -1286 -1588 19 464 -138 -1161 -597 805 -141 -1383 -439 1664 910 -1342 -1469 753 2269
5220 2269 1351 -1455 -1560 1918 2887 145 -1779 54 2420 2394 710 -1038 -95 1769 1491 279 632
5237 632 1291 560 153 928 1056 50 -762 -673 836 2044 -48 -2835 -702 2536 1658 -1641 -3256
5254c256J889L298K20l904j436K763K449j934k273m0J809J239n99j770K0J262
5270b63m4l01P92K1j588k70J397J589n88j778p50K189K246k102l081P92L341J125
5288B727j976k447J87K683J238k630j307J563J824j121r73j49P08N08m75j013
5304f53J013N00j432j095K417J136j528j654K10J697Q36j212j994O03K688n73
5320I59k082r25J712J112k64j095n46J694M76k078j25K149L06k051m71Q60J964
5337A595m44k482n92K814J730k104k309J053K377j13j051j850M48K308l7j963
5353f20pJ199k85o90K44O43l47p47m15J278J674j310k685P20K925M23k742j443
5371b185J066K790P25k841k576K185L231j218k326j034J715J757k26j523p69J107
$$ plain form
5254 -3256 -1367 1931 2151 -1753 -3189 -426 2023 89 -2184 -2224 -415 824 225 -1545 -1525 -263
5270 -263 -307 -608 184 205 -1383 -1653 -256 1333 745 -1033 -1783 406 2652 550 -2531 -1739 1602 2727
5288 2727 751 -1696 -1509 1174 2412 -218 -1525 38 1862 741 -232 -381 327 835 360 -653
5304 -653 360 860 -572 -1667 750 1886 358 -1296 -1086 611 1447 235 -1759 -1156 1532 959
5320 959 -1123 -2048 -336 776 512 -583 -1129 565 1041 -1037 -1162 987 1293 -758 -1229 -369 1595
5337 1595 1151 -1331 -1923 891 2621 517 -1792 -739 1638 1525 474 -1376 -928 1380 1343 -620
5353 -620 -627 572 287 -403 -159 484 137 -610 -1025 253 1927 617 -2068 -1348 1577 2000 -742 -2185
5371 -2185 -1119 1671 2396 -445 -3021 -836 2395 1177 -1149 -2183 -468 1289 1063 -460 -1229 -122
5387a22M76n70Q01k69j019l18J029J073m49j745n88J406K776j178l788p1L271
5404G15J962k019k746j70K855J930k019k922J496J784N3p93o22j98J102M90j256
5421c58K17M27p95m72J421R90j160j667N17J186J156j182k196N28K818P07l017
5438h80j234K193J214m0j447j068J246J882j271j439R47J152j065p06N69Q10O13
5455A476j379j156J534J656j224k361P57J881N19j232j647P06J714Q41k460m46
5471h21J188N92p35l98O13j76l80l92L21J155R5k365k26K098J095j856j870O41
5489a421K752N84k018k930J401L295K3k642q42R12J670L62j904p17Q55J149n07
5506B2m93O21p29o35R83J156q9j508n62P85K468j08l356j127K830K462j254k631
$$ plain form
5387 -122 354 -216 585 316 -703 -1021 8 1081 632 -1113 -1701 -295 2481 1303 -2485 -2556 715
5404 715 2677 658 -2088 -2258 597 2527 508 -2414 -918 866 919 126 -496 -694 408 898 -358
5421 -358 -141 286 -509 -981 440 1430 270 -1397 -880 306 1462 280 -1916 -1388 1430 2137 -880
5438 -880 -2114 79 1293 1253 -194 -1262 -16 1866 595 -844 103 1255 190 -516 53 863 1476
5455 1476 97 -1059 475 2131 907 -1454 -697 1184 1703 471 -1176 -470 1244 2085 -375 -821
5471 -821 367 959 224 -174 439 263 -117 -509 -188 967 1062 -1303 -1529 569 1664 -192 -2062 -1421
5489 -1421 1331 1915 -103 -3033 -1632 1663 1686 -956 -1798 -886 784 1146 -758 -1475 -620 529 22
5506 22 -471 150 -579 -1214 -231 925 836 -672 -1234 -449 2019 1911 -1445 -2572 258 2720 1466 -1165
5524a165j122K256K549j289k773l21K574J093j287j043k13Q67R10n43j069M35
5540a41J17o07J142R47j305j349J33J905N41p56k299q9L167J183k929j941J560
5557g21K391m2j827j676R74K572k32k037l38J266P2n62o2N58J78m39r02Q26R45
5576I44l93j792K96J989M8j145j375M36J858P33k072j211J745Q16o64p62k78J021
5594A94pl98n56Q01R23j154j200J563J266j068j994M45J706J333j129k608O32
5611a251K514Q14k475j350J276J676K43j104j933J485J228o66p20N71l90m68O56
5628A06R05j88j108n66L00J912N75k446k003K189K594m68k612j804J740K979p50
5645A355k697j095K770J342j207j531k98J005J000k48r89j37N35n50O22J398q06
$$ plain form
5524 -1165 -2287 -31 2518 1229 -1544 -1865 709 1802 515 -528 -741 126 1036 493 -576 -141
5540 -141 -24 -631 511 1458 153 -1196 -1063 842 1383 627 -1672 -1761 1406 2589 -340 -2281 -721
5557 -721 1670 1628 -199 -1875 -901 1671 1439 -598 -936 330 402 -160 -222 336 514 75 -827 -1 944
5576 944 551 -1241 -945 1044 1092 -53 -1428 -992 866 1599 -473 -1684 61 877 213 -549 -827 194
5594 194 187 -211 -767 34 957 -197 -1397 166 1432 364 -1630 -1185 521 1854 725 -1883 -1251
5611 -1251 1263 2077 -398 -1748 -472 1204 1447 343 -1590 -105 1123 457 -263 308 -82 -550 106
5628 106 1011 823 -285 -851 -551 1361 1936 -510 -2513 -324 2270 1802 -810 -2614 -874 2105 1355
5645 1355 -1342 -2437 333 1675 468 -1063 -1361 -356 644 396 -593 -730 -195 -745 -123 1275 469
5662D69k097L24J839J089o65k325l22K435J923k373k561J046K499R42j764k434
5678a975P37K733P69k275j209J149O03k03l8l48p8K71K3J61L73M5j507m4J960
5697A147K27j758j047M33J964O26j901j952J969J910j138j244K3P61P27p01j052
5714a006P4J556j03j664N23J418n33j188p4J162R46o88j748k57K501Q19k191j160
5732a613P84J781K24j065j269P09J580n53j198Q5O05n4LP23l67m58m10k53J449
5751G03J088j534k418J363K644o3k208j114P56K605N10l172j572K124K429p97
5767A344j933q43O95J671L21j594k65N83k65N01P41o65j226j18J338J006q37j666
5785a212o76K023K275j585l142K10K631J451j299k305l96K802J421k253j916J060
$$ plain form
5662 469 -1628 -1304 535 1624 959 -1366 -1688 747 2670 297 -2264 -1218 1281 2223 459 -1975
5678 -1975 -1238 1495 2264 -11 -1220 -71 532 329 291 -57 -135 136 159 320 693 738 -769 -813 1147
5697 1147 1374 -384 -1431 -998 966 1592 -309 -2261 -292 1618 480 -764 -741 20 747 46 -1006
5714 -1006 -932 624 521 -1143 -620 798 265 -923 -997 165 1111 423 -1325 -1582 919 1738 -453 -1613
5732 -1613 -829 952 1176 111 -1158 -449 1131 578 -620 -535 70 16 19 742 375 -83 -493 -746 703
5751 703 1791 257 -2161 -798 1846 1783 -425 -1539 -783 1822 2332 -840 -2412 -288 2141 1344
5767 1344 -589 -1432 -737 934 1255 -339 -604 -21 -286 215 956 291 -935 -1053 285 1291 454 -1212
5785 -1212 -1888 135 2410 825 -2317 -2107 524 1975 676 -1629 -2025 777 2198 -55 -1971 -911
5801i11J507J93k07j102q7N66Q1k22N46j80r39k4J755K85j898l78L08J896Q38
5820B027j915k401J289K693k49k320m39J016J405L6j775p28J716R80j440n52Q57
5837B00j0m63K32K14L08J1r36o14J490J294j805j169Q51R78L26r24j115Q92J134
5856H94M15k000Q7J338k27k65r9L04m17q4p18O41J254k52k132L20K222K17j455
5875D3j365M44J871J186k451j805J291K065r3j525p31M79J213J83j137q47P11
5892d68M21j50N75q6j378j48J171J249m33j929o33J139K391r81k616j98J890J667
5910A483o35k489j044K741K556j544k635K06J602J204n17j086m71N22R04l02l78
5927A17L6j70l13J533P11j971r74O38J544J191j444k528M71K935M05k362j096
$$ plain form
5801 -911 596 789 582 -520 -607 -41 40 -182 364 184 -755 -779 976 1261 -637 -1015 -707 1189 2027
5820 2027 112 -2289 -1000 1693 1444 -876 -1315 -299 1106 1142 -633 -1361 355 1335 -105 -657 200
5837 200 190 -273 -41 173 481 492 -444 -1058 432 1726 -79 -1248 -397 581 907 -17 -1132 -240 894
5856 894 1309 -691 -604 734 507 242 143 447 30 -54 -772 -131 1123 871 -1261 -941 1281 1498 43
5875 43 -1322 -878 993 2179 -272 -2077 -786 1279 1186 -339 -1070 -591 622 805 -332 -1179 -468
5892 -468 -47 -197 378 292 -1086 -1234 -63 1186 753 -1176 -1809 -670 1721 740 -1876 -2074 -184 1483
5910 1483 848 -1641 -2685 56 2612 1068 -1567 -1361 241 1445 928 -158 -629 -107 797 495 117
5927 117 153 -17 -330 1203 1914 -57 -1031 -393 1151 2342 898 -1630 -1159 1776 2181 -181 -1277
5944a277J137J221Q58k037j808J151K394n75j435p2L73M7L37l54P3Q7l61l59O92
5963I2P56j309j394J474J507n93j129j094N28K031N51k388o07J406R13r67m41
5980f64j12Q49L98o89r17J298M38j184J31J167L92j634n92K18J184J734j844k171
5998a998J295J617p1j134n26M66J126N54j187j406J288Q64m69r8n1n12l54J062
6016D66J49J12k55j146J25J858N38k657p33J832J878p77k276q89J189L004p89
6033A629k857o09K067Q69j62j360m70M83J515m45j180K38l49M2J156R65j651j407
6051a526N56J421J178j177k173m39L139Q73k518j357P54K133J063k071k272Q11
6067a605K836n8j481n32K31K74N69l40p22P07M31n10L74N60j174j083J408J538
$$ plain form
5944 -1277 -140 1081 1939 -98 -1906 -755 1639 1064 -371 -443 -70 -23 314 -40 33 120 -241 -600 92
5963 92 848 -461 -1855 -381 1126 533 -596 -1690 -1162 869 1420 -968 -1575 -169 744 -223 -664
5980 -664 -776 73 471 -218 -1135 163 601 -583 -452 715 1107 -527 -1119 -901 283 2017 173 -1998
5998 -1998 -703 914 843 -291 -817 -351 775 1329 142 -1264 24 888 419 321 270 -242 -596 466
6016 466 615 727 472 -674 -549 1309 1847 -810 -1543 289 2167 1390 -886 -1775 -586 2418 1629
6033 1629 -1228 -1837 230 1099 937 -423 -893 -410 1105 660 -520 -282 -631 -589 567 1532 -119 -1526
6051 -1526 -970 451 1629 452 -1721 -2160 979 1852 -666 -2023 -1269 864 1927 -144 -2416 -1605
6067 -1605 1231 1173 -308 -840 -609 -335 234 -106 -828 -121 310 -200 174 734 -440 -1523 -115 1423
6085A423k21j310j124L39K111M51j733j363J919J215j177p80l36J008J074o62
6101H34j313J7J227n49m26P41L13p64m44p8P81Q74l76k056N39J905n08j053k96
6120f32M40J111L11j519j015Q89J452r03l75M14m6p06M9O74j2m5r35l41J721R08
6140A440k316j204J380K230l11j625j335Q66K670m32k448p12J518J255k34j164
6156d22m30J24J442J28j064m37K54l46J264Q14j258j517Q57J056P03k00k294l79
6174a705K484J641k004k073N83K064Q82p84k365n13K901J060j741j405M60J094
6190E79N31k49j568K2Q22M95l43K54p99j139R92J852n78r24j271O55J458L96j925
6209g40j625J959K029o92j831k82M85J947j13k204l10J334N49n17l11L90m27K81
$$ plain form
6085 1423 1202 -108 -1232 -893 1218 1669 -64 -1427 492 1707 530 -250 -586 422 1496 834
6101 834 -479 -462 765 216 -210 531 844 80 -364 -442 339 1213 837 -1219 -680 1225 717 -336 -632
6120 -632 -192 919 1230 -289 -1304 -415 1037 134 -241 173 127 -579 -530 144 132 87 -848 -1189 532 1440
6140 1440 -876 -2080 -700 1530 1219 -406 -1741 -875 1795 1363 -1085 -1797 -279 976 742 -422
6156 -422 -852 -728 714 842 -222 -659 -405 -751 513 1327 69 -1448 -591 465 1168 968 -1326 -1705
6174 -1705 779 2420 416 -1657 -1074 990 1872 1088 -1277 -1790 1111 2171 430 -975 -515 579
6190 579 1110 861 -707 -685 137 632 289 543 -256 -1395 -403 1449 871 -53 -1324 -669 789 1185 -740
6209 -740 -2365 -406 1623 931 -900 -1182 -697 1250 1137 -1067 -1377 -43 506 -11 -322 68 -359 -78
6227g8J20j94K93L42j346J36J581J01j543l32O02J120L6j084j117J267J426j316
6245A4o79P97L97j94k25j42j60M20k45p04Q20R86j081j107N34J395Q3r35j311
6264a337M72J742Q23j916j478J722J129m81j012o11M01J372Q8j168l60N87n2K01
6282A22P38n31j265J97R48P33l38j451q00J662K291j719k104j01J832J630q29
6299A015k361o94K286K073j730k005P44P35Q24J41j393q55R71J059m56Q7o74r41
6317a174N14J919l87j213r26O51J354P75j560k100J416K485o9k141j140J096J306
6334H06O41j668j083R65J722q05j052M23j44K21N81n88j22L77n40l50J332M45
6352A161j999j38Q47Q45o1j112p95R31J738p55k141P06J065J31l60o68O9L10Q86
$$ plain form
6227 -78 42 -152 141 483 -863 -727 854 955 -588 -920 -318 802 838 -246 -1363 -96 1330 14
6245 14 -665 132 529 335 110 -32 -192 228 -17 -721 99 1085 4 -1103 -569 826 909 -26 -1337
6264 -1337 -865 877 1700 -216 -1694 28 1157 676 -336 -947 -546 826 914 -254 -614 -27 -79 122
6282 122 860 329 -936 -739 209 942 604 -847 -1647 15 2306 587 -1517 -1618 214 1844 1015
6299 1015 -1346 -2040 246 2319 589 -1416 -672 63 887 1028 -365 -1220 -249 810 354 441 -233 -1174
6317 -1174 -660 1259 872 -341 -1267 -616 738 1513 -47 -2147 -731 1754 1685 -456 -1596 -500 806
6334 806 1447 -221 -1304 -339 1383 578 -474 -51 -195 26 607 19 -103 274 -266 -616 716 1161
6352 1161 -838 -976 -129 716 655 -457 -1252 -321 1417 662 -1479 -773 292 423 63 -605 -536 -226 660
6371F60r23j34P09K15j299R4J249l36l92m16l75J358O40j287j461J274J457n05
6389E28n90l64q7J240K78j713J23Q71J59n70N24j16p40P2N86O80k8j123j219J102
6409c87J994m84k110l67J643J446n88k215r78K088J967j068k337M28P84J175j83
6426H08j147p95P05R27k14K4k27j050K9K002k08j509o82N54J488O22j226k150
6444b049O73K337M43j832r94M30J621J056j652k062J055J924l8j006o35M01J38
6461a90P40p9r19M08J46j21M69K25j633k75J331J280q60q27o97O67K031k70k442
6480a016j61J580N85l95r37l29O94J081o84j002P64O54p72r6M13m8l37j76k75
6499d57O06J155j316q85O52J233p46l42n48N88Q17N8j059q36J436N01q82j70K54
$$ plain form
6371 660 -263 -397 312 527 -772 -678 571 235 -157 -573 -948 410 1050 -237 -1698 -424 1033 528
6389 528 -62 -426 -513 727 1005 -708 -585 286 445 -125 399 283 -457 -385 201 881 853 -270 -1489 -387
6409 -387 1607 1123 -987 -1354 289 1735 1147 -1068 -2046 42 2009 941 -1396 -968 -184 991 808
6426 808 -339 -1134 -429 498 284 308 81 -969 -940 1062 854 -655 -1337 -783 705 1327 101 -2049
6444 -2049 -1376 961 1404 -428 -1422 -992 629 1685 33 -2029 -974 950 912 -94 -729 -328 -190
6461 -190 550 471 -448 -40 106 -15 454 679 -954 -1229 102 1382 522 -305 -1002 -335 1696 1426 -1016
6480 -1016 -1177 403 988 593 -344 -673 21 1102 418 -584 180 834 62 -34 379 331 -6 -182 -457
6499 -457 149 1304 -12 -897 -245 988 242 -100 -648 -60 757 815 -244 -1080 356 857 -25 -195 59
6518E9l25l43O56m9N04m16j232N29J519J15j636o21J295R32j35j340j255J048
6536f95K299r73j816l24J290N37Q2q15r82O43J099k60m23J44o25K61Q21P65j562
6555e34n49J80J157J011j094j447n81K916Q46j869j373M58J647J037j167j952
6571a314K29K091N43j298r85J38P28R85J34j785L30N69k42P08K82j311j080J590
6589C12J101n50j268q77P69J922l21k029o08K084R92r56r67p65Q14J660o68j498
6607h53m64J569M3k96j42m28J10L39J58j55L18l43q02O27J212p86q22r6O34P44
6627E67q4j012p80J754L28j020p57P13L94J08j54j64J36J91l07n93J052Q84r46
6646C10j349R66O13L28j061o62N21J520j32j709n11J041R70Q1p81j107O35R00
$$ plain form
6518 59 -266 -609 47 -2 502 86 -1146 -617 902 1017 -619 -1240 55 987 852 -488 -1743 -695
6536 -695 1604 631 -1185 -1509 -219 318 400 -415 -1397 -754 345 85 -338 -194 -819 -558 263 1028 -534
6555 -534 -1083 -903 254 1265 171 -1276 -1857 1059 1905 36 -1337 -879 768 1805 638 -1314
6571 -1314 -1085 1006 1549 251 -734 -596 132 1117 1251 -534 -204 365 123 831 1113 -198 -1278 312
6589 312 1413 863 -405 -1282 -513 1409 1088 -941 -1549 535 1527 571 -396 -1161 -347 1313 645 -853
6607 -853 -1317 252 295 -1 -143 -571 -461 -122 36 -119 199 -144 -946 -319 893 107 -715 -811 -177 567
6627 567 483 -529 -1309 445 773 -247 -1004 -291 103 211 57 -107 29 220 -87 -680 372 1256 310
6646 310 -1039 -73 540 868 -193 -855 -334 1186 1054 -655 -1166 -125 845 926 145 -962 -327 573
6664E73j22q91O64L26q31L84Q31r41o33M11K54J116l59j818m70J843J360j241
6682D56j786J16J532J042q17k055K41J822J164j447q88n08P19J250k00j379k47
6699i85N43N95qM88j134o99J122J040n77p41q17L63J767P60k435j596J834K005
6717A525m13j466j038N26J783P1j751l90J311O52P7r66j57m17J171J35m29p8O4
6736B10q33O74P81l37j104J66R89J33O7j182p52J538J256j146j333O83O48L57
6754H15l50m78j34Q78j32j044M98P05m15p12K21J73K23j52o65K39Q66M30j787
6773h21o23J419M45J00o10p74L56R08k64p55O49K24o34O8N79l40p90O21N1O33
6793D42M15j589j040J232J719m74j542k10P50J256l71j654o39J842J101r64j044
$$ plain form
6664 573 451 -440 224 550 -281 103 934 -7 -640 -229 25 1141 782 -1036 -1506 337 1697 456
6682 456 -1330 -1214 318 1360 543 -1512 -1271 551 1715 268 -620 -1128 -409 841 641 -738 -985
6699 -985 -442 153 145 633 -501 -1200 -78 962 385 -356 -1173 -810 957 1717 -718 -2314 -480 1525
6717 1525 1112 -354 -1392 -866 917 988 -763 -1153 158 810 887 -79 -236 -653 518 653 224 146 210
6736 210 -623 51 832 495 -609 -443 546 679 746 -436 -1188 350 1606 460 -873 -190 458 815
6754 815 465 -13 -147 731 599 -445 53 758 343 -369 -148 25 248 96 -569 -330 536 966 -821
6773 -821 -1444 -25 420 520 -90 -864 -508 400 136 -619 30 254 -380 -312 267 -73 -863 -242 -191 442
6793 442 857 -732 -1772 -540 1179 705 -837 -1047 -297 959 588 -1066 -1705 137 1238 274 -770
6810g70m9N25J019M89j259n84N65L07o6K13k04q02L05J346k31j264k61M9J471
6829G99J355k211j741J217J861m3j275r93O4J961O27j781j512J629J250n11p27
6846c1l95m21Q98R30o29m68J87n14M33O46j04j074J0Q99O84l78j458l23J193J356
6866A441q07j896J38J411K35l26p98k47J206M83j158n96R10K39m32J57J84m56
6884c12J78k36k48R41N21j225q10J230J32k10m69n7N32P56n28r39J68Q73k07k69
6904a79L62P4o89Q9K55J18N61K3j694O47J474k06j372j35N33R36L27j825p55J700
6924B44J375q70j580n0N91N62O69q41o15O29M30o14m8L63p92L11J155p4r53q54
6944i62oJ393J318j404j986M85K195K74j438r63N3J710R19j743j558O68J928L2
$$ plain form
6810 -770 -819 -294 725 1214 -45 -629 -64 243 177 390 186 -616 -311 1035 804 -460 -721 -672 799
6829 799 2154 -57 -1798 -581 1280 1237 -38 -1031 -967 994 1621 -160 -1672 -43 1207 696 -31
6846 -31 -426 -847 51 981 352 -116 71 -443 -10 636 532 -542 -532 367 1051 673 -785 -1108 85 1441
6866 1441 634 -1262 -1124 287 522 196 -602 -849 357 840 -318 -914 -4 235 -197 -40 144 -312
6884 -312 -134 -370 -618 323 844 -381 -1191 39 171 -39 -508 -565 -33 723 195 -744 -576 297 90 -179
6904 -179 183 257 -432 -343 -88 30 591 614 -1080 -433 1041 835 -537 -672 -139 797 1124 -701 -1456 244
6924 244 1619 749 -831 -881 -290 272 941 100 -515 114 544 -70 -118 245 -547 -236 919 845 -108 -962
6944 -962 -968 425 1743 339 -1647 -1162 1033 1307 -131 -1094 -1041 669 1588 -155 -1713 -1045 883 915
6962I15p36o00m58R96P54n11o81K4k74M95R23m11j291K90J058N89q32o17r61J215
6982a13J770n08k137o4J619L10l61j142n27J438Q47j048j177M62Q39K0L98o05
7000B1n19L62M52m61K89K70p00n08P99N67n54q65J98M71P72k08j386J8J621J78
7020H17j285L30M5J87m5K20q19P76N70j237n42J586j74q62k59O36N05N19q51j417
7040a300J004J341k96j193RO25J66K67p22n08M09P71o93M1K14n84j52R17M14p80
7060e0p55J14L25J516n83k004R3J695O28r24j303j07J198J619o76k258M31J354
7078C13N59o59p59k82M87R26q4q02k36K14M82K82J14j370p5J012R69m09o80j229
7098a227O83J860J6j935p67J636O67k6j341q35Q78K039j095j354R8N43L85K50
$$ plain form
6962 915 179 -421 -879 117 871 360 -321 -297 -571 -76 847 436 -855 -565 493 1082 250 -367 -1328 -113
6982 -113 1657 1149 -988 -1052 567 877 516 -626 -1153 285 1132 84 -1093 -631 208 228 626 21
7000 21 -498 -136 316 -145 144 414 -286 -794 5 572 18 -847 -649 -178 594 386 -1000 -982 639 817
7020 817 -468 -138 -93 94 49 269 -550 226 796 -441 -983 603 429 -433 -692 -56 449 968 117 -1300
7040 -1300 -296 1045 749 -444 -435 190 356 623 -99 -607 -198 573 -120 -79 135 -449 -601 316 730 -50
7060 -50 -805 -691 -366 1150 567 -1437 -1344 351 979 55 -1248 -1355 -157 1462 786 -1472 -1041 313
7078 313 872 213 -546 -828 -341 585 501 -301 -537 -323 159 441 555 -815 -890 122 1091 682 2 -1227
7098 -1227 -544 1316 1332 -603 -1370 266 933 907 -434 -1269 -391 1648 553 -801 -703 -160 225 475
7116D75k91q80K13P79k77k39L10l63n29Q32J008r24n64L24K21O21k84j287KJ510
7136F57M88j269l87M35N46J83l27j135N01Q98l84m02P16N14r38k88K57M1L26k68
7156A64j127O94J219n57j218L03P75j75L74l54p68O55K93m95l32O44l22n25O75
7175g7O65p74n20N07n1N09Q95j883r36J689J337j070j171k38Q21J370l1k504M58
7194a004J670P6j67o89m86J75J160K09j045m85P96k91M82O58r87j036R30J161
7212A127k78j058p12J32J835M91j778j527J657J157j42r87j113L67J880J29j579
7229c99o52R94P79J09o00r79n9R74P97j128L38l95k96Q00N49j023l56K43N33M16
7249F45r5j257o45J887L73j033p26N57N75J0K29r52j65J182k76r59K32N47l06
$$ plain form
7116 475 184 -696 -483 296 19 -220 90 -273 -802 30 1038 114 -450 -126 95 716 432 -855 -853 657
7136 657 1145 -124 -511 -76 470 653 326 -809 -308 590 206 -196 520 1034 96 -192 65 106 432 164
7156 164 -963 -269 950 393 -825 -522 253 78 452 98 -670 -15 278 -217 -549 95 -227 -752 -77
7175 -77 588 -186 -706 -199 -250 259 1154 -729 -1665 24 1361 291 -880 -1118 -297 1073 1042 -1462 -1004
7194 -1004 666 742 575 -114 -600 -425 735 944 -101 -586 210 -81 401 1059 72 -964 -34 1127
7212 1127 849 -209 -921 -789 1046 1537 -241 -1768 -111 1046 904 -83 -1196 -829 1051 1180 -399
7229 -399 -1051 -57 722 831 231 -748 -807 167 964 -164 174 -221 -517 283 832 -191 -547 -304 229 645
7249 645 550 -707 -1352 535 908 -125 -851 -294 281 291 520 -432 -597 585 309 -650 -418 129 -177
7268a77J8L23k19l0J75l53l72J162k80j249L37J106j70k12j18n26L36P77o45n59
7288f76Q28J49p57J98M81n28K47R7j45L51M81j047p83R67J113m23p69k13K40J040
7308H51J86j475o89J603P58r17n48k34R7P74M56p66m74L01OJ54O46m23j096O43
7328a47J262o81m90p87J90J101J184j727j496R28J097L69o92r99n48K058O49j451
7346a80r28P15P55mJ86j093o31J062Q27n07l62k24m12O93J156q98r93N00P57L74
7366G93o6j147q41J147J892j274j362L07M48O27L9j122k86J069Q56j033n20K75
7384a98J8K04L45n55k46O87J54p84O80j2p81N4Q50L11p60O9l72R7R45o55q60O35
7406a74P69j76q73O20j71L14k13l42l5Q10k09j061M38R25l15o81J78j81P00Q31
$$ plain form
7268 -177 -159 164 -55 -85 90 -263 -635 527 247 -1002 -665 441 271 59 -59 -585 -249 528 -117 -676
7288 -676 152 301 -456 -258 223 -305 -58 39 -106 245 726 -321 -1104 -137 976 553 -216 -429 -189 851
7308 851 1037 -438 -1127 476 1234 317 -231 -465 -368 406 862 96 -378 -77 -71 83 729 306 -790 -147
7328 -147 1115 434 -56 -843 -653 448 1632 -95 -1591 -663 434 803 111 -888 -1436 622 1271 -180
7346 -180 -1108 -393 362 358 544 -549 -1180 -118 709 202 -160 -384 -796 -103 1053 155 -838 -338 419 793
7366 793 727 -420 -1261 -114 1778 504 -858 -551 -103 524 563 -559 -845 224 1080 47 -473 -198
7384 -198 -180 24 369 -186 -432 255 409 -375 305 293 -488 -434 416 727 -33 36 -336 -239 706 51 -809 -174
7406 -174 595 419 -454 166 -5 309 96 -246 -281 529 320 -741 -303 622 307 -374 -196 -377 323 1154
7426A154j458r30J019J185q92n94J59j9Q10J90n51m22O27j34p9K99j40q19L5J016
7446D56j34j24m35p69J071J123n83j569r6J489N95n32j204k04J374J053j167j291
7464i47L93J158j10J7o61l43O77Q73n38o45L04n77L92J157l60j502K43N56Q71
7483I58k1q96j363J078J631n27j766j00P82R04M45j091j261J057J097l27j436
7500h36O08K93J00J61k57n56K74N38m32J96K36j041l3J464l55l89n16q1L33R36
7520F43k99j533Q77P69j82p56J61M6N92q6j56q04P72N59q87j21M25O6l64M8p6
7541c06o6J161p23p37P23P82p38m87J60R5M90P5n08q34J062L06k83j4J01p73J2
7562e02O11J40j96j25k26J21J113m27j602K38J402N89n91q90o48J014J162m46
$$ plain form
7426 1154 -304 -1234 -215 970 78 -516 -357 -376 434 624 73 -349 278 144 65 364 224 -595 -560 456
7446 456 322 198 -237 -1006 65 1188 605 -964 -1060 429 1024 492 -712 -916 458 1511 344 -947
7464 -947 -554 604 494 511 -150 -493 184 1057 519 -126 178 -399 -7 1150 790 -712 -469 87 958
7483 958 937 41 -1322 -244 1387 860 -906 -1006 -224 680 1125 34 -1227 -170 927 600 -836
7500 -836 -228 65 165 326 69 -487 -213 325 -107 89 325 -716 -749 715 360 -29 -545 -626 -293 643
7520 643 344 -1189 -312 457 275 -481 -320 -274 318 232 76 -728 44 603 -284 -405 20 86 -278 -230 -306
7541 -306 -372 789 66 -671 52 834 96 -391 -231 -136 354 429 -79 -913 149 455 172 158 259 -514 -502
7562 -502 109 249 53 -72 -298 -177 936 509 -1093 -855 547 1136 545 -345 -993 21 1183 737
7580G37j624L97Q31K90k87l63n92N25J305m71j099J22j2j21J118J47j289l82Q61
7599I3L67K30p88r21N11J873j65j897n74J088R68L61q54j585M58J924l71j499
7617g81J73M66J13K53j45r45L26P42k5j48L20o90p26J297N42p78p20L82J33N23
7637C12P9j271j13J665K78j338o5j67J150L28n25q73j71J318l18l83J31M06m67
7656b4J9k3J1M31j12r60N90R64o15n65R0M00j76M59o29p3K43L84p81Q6R25q57
7678b13l00N92M4Mo9k71pP76K94j397m98J134O63o03l03o12J88J435M3j552k93
7699i45J275j37K3m93m50M97J266m73q98P9J52k75Q37K44j134k66N38M46l3l75
7719a22q88K25J552O47j764r26R75J206j18n04j447J48J885J07j583r4N30L62
$$ plain form
7580 737 -887 -490 341 631 344 -19 -611 -86 1219 748 -351 -229 -241 -362 756 903 -386 -768 93
7599 93 460 690 -98 -1019 -508 1365 1200 -697 -1271 -183 785 1146 292 -1293 -835 1089 718 -781
7617 -781 -608 -142 -29 224 79 -866 -540 202 177 29 349 -341 -1067 230 772 -6 -726 -344 -211 312
7637 312 391 -880 -993 672 950 -388 -453 -620 530 858 333 -540 -711 607 289 -94 37 443 -24
7656 -24 -5 -28 -17 414 302 -658 -68 896 281 -284 -194 206 30 489 -140 -213 30 414 -367 -281 644 -213
7678 -213 -513 79 123 127 58 -213 -220 556 850 -547 -1045 89 752 149 -154 -766 -578 857 900 -652 -945
7699 -945 330 193 216 -277 -727 -230 1036 563 -335 -256 -104 -379 458 702 -432 -698 -160 286 253 -122
7719 -122 -1010 -785 767 1414 -350 -1276 -301 905 787 283 -1164 -1016 869 976 -607 -701 -171 191
7737A91P30m04j416J39J125K27m09R9o07p24J100R78r24p03R1N01O60j19j315
7756g80o18K079P48j033j077Q3L53P97j34j064j29J034K87p45J42m3J58M84j27
7775D15m72j36M02m34K64O17k42j130M30P56k88K21l98l46N25O85j097n53R50
7794A69K15n16K8K4k39M10j45m95O45Q95j249o51M51O41J34n06k66O4O55M48j531
7815h19J77J074J25k95m52m13K38Q05k09l02l08L88k07M13K54n50p19O79M33J94
7835E06k47r79l7J059R91j380q64O56P75L13m41j144l88J839M90j308r52O59P43
7854B91N16l37j103k8N93R30p80j57n0n38O60Q87o85r14K34N95N84l7j239q46
7874a424J402J280p53j487j39Q93J001L38j469o43J411O10p62p71L15J6L70M55
$$ plain form
7737 191 921 517 -899 -760 365 592 183 282 -325 -1049 51 1029 105 -598 -507 -6 654 535 -780
7756 -780 -1398 681 1429 396 -681 -598 -245 552 418 -646 -775 259 546 -199 -57 -100 58 542 415
7775 415 -57 -193 209 -225 39 656 414 -716 -286 470 182 403 5 -341 184 869 -228 -781 169
7794 169 384 -132 -104 -80 -319 91 -54 -549 96 991 -258 -909 -458 183 317 -189 -455 -391 264 712 -819
7815 -819 -642 432 557 262 -190 -603 -365 440 231 -71 -379 9 -198 215 469 -81 -800 -121 312 506
7835 506 259 -720 -757 302 1293 -87 -951 -295 480 793 352 -792 -1180 659 1149 -159 -1111 -452 291
7854 291 807 470 -633 -661 -68 862 82 -75 -125 -663 -3 884 199 -715 -481 114 698 661 -578 -1424
7874 -1424 -22 1258 505 -982 -1121 -228 773 1111 -358 -1001 410 1020 258 -513 -198 -182 188 643
7892F43r18j91L97j60JQ39o84n31R6P93j15j39j11j62O00L95o06r30N87Q39k91
7913C52m83j85N9M25J55r92N60N51j60j072N67N29k87K95l20l42M50N01q97n88
7933h82J518J49q57o7k70L2P20P0r29N9Q70j59j19L12k53l67R2J12M77l2m17p30
7955f71R53J036r73j377O66P65M28j63j310n49J765N16j219o18J68P38L55K6j020
7974d84l81R78M08l96l83Ln24O47P11k2j226N0N20O77K77j209q82M25J925m08
7994G06j703M47j07J381M64j566j094J299J190p23n65j82K9J93R32p41p06M29
8012c17L32k43L61m8r51O68Q07L1p00k44m16J155N48j011j101P96Q21J40o62l17
8032c51j47M71O64n57p55O67M02n09J63K65l09r6N24l38J93R4l89o04R18L06q18
$$ plain form
7892 643 -275 -466 -69 -229 -228 611 -73 -604 -508 285 170 31 -80 -242 358 753 147 -783 -196 643 352
7913 352 -131 -316 -257 168 323 -669 -109 442 282 -790 -223 306 19 314 -6 -348 102 603 -294 -882
7933 -882 636 785 -72 -139 -409 -377 343 413 -516 -457 413 254 135 447 194 -173 -81 31 508 476 59 -671
7955 -671 282 1318 345 -1032 -366 399 827 664 -646 -1195 570 1086 -133 -751 -583 155 510 536 -484
7974 -484 -865 113 521 125 -258 -255 -779 -132 579 557 -669 -619 -99 578 855 -354 -1236 -811 1114 706
7994 706 -997 -550 -657 724 1188 -378 -1472 -173 1017 294 -271 -453 -424 -231 701 -40 -746 -317
8012 -317 15 -228 133 85 -866 -198 609 640 -60 -304 -720 435 983 -28 -1129 -333 488 628 -34 -351
8032 -351 -498 -27 637 80 -675 -8 394 -115 48 313 4 -92 432 94 287 381 -8 -612 306 612 -206
8053b06j28N71j20J25K02o48M8Q12l67j33J20M3o35J59L53m17K67J72o63J63J005
8074G23l25j169K55Q24j31L07q48m60P20J188r11r87M40O66k28L97q45m19O79
8093a24N53l84l69J26l63J91P86J70j196P8O46N02j74m32j087P23J314j23j208
8112c71o75J033M98M13q36j210P43J222j65q32k23j74P00O62p06o81N92M29l21
8131I8L6K21j290J84J150L58p32j79m36L36J276l66j405l70K008%o83m42m66P63
8151F1P54j29j457N74P43n25J53n58J1J48O55n83l5M15P3n64L08M18r04J33L76
8172F7J09pK41n57n27R24L54o32k06P35l03k29p4k49J40K72k90j50P94
$$ plain form
8053 -206 -334 237 117 242 444 -204 -156 656 289 156 276 319 -316 -157 196 -221 46 218 -445 -282 723
8074 723 398 -771 -516 308 177 484 -364 -824 -104 1084 173 -814 -374 292 64 461 -384 -803 -124
8093 -124 429 45 -324 -198 -561 -370 416 586 -610 -532 114 616 442 10 -1077 -354 960 837 -371
8112 -371 -1046 -13 485 898 62 -1148 -405 817 652 -180 -403 -577 123 785 79 -602 -10 419 98
8131 98 134 355 -935 -751 399 757 25 -154 -590 -254 1022 656 -749 -1119 889 889 206 -236 -702 61
8151 61 815 686 -771 -197 546 21 174 -384 -373 -225 430 -153 -188 227 300 -264 44 462 -442 -309 67
8172 67 176 169 410 -147 -674 250 604 -28 -234 501 198 -31 -105 -354 -214 58 -232 -382 412
8191D12
$$ Imaginary data points
##PAGE= N=2
##DATA TABLE= (X++(I..I)), XYDATA
0@%%%Qj6QqJ6k4L2m0M9n7P2r2J11j32J61j89K21k62L04l51M06m66N34o11O94p87
29d19Q91j002J125j263J413j576J755j954K173k409K672k961L274l625M017m449
45b338M934n484O106o819P651q629R800j1237J3045j5395J8602k3263L0675m4353
59b6705P7905l08700n35825M41543M30221J8421k88305j00635Q7594R9576j20555
70b25465j39887Q4158K51649P5233j29667j76238o1090P7876J58294R8212L4186
81D7261n3587j72055j11544J87994K58734l2926k11141k7684J63367R5531j31543
92A2407k00420N7929L21995J34909k49109k50605O6932K11949Q2840r6231j22242
103b9646K8036J20677j7946j39169l6344Q1077N3843P632l198j7442k9756n7278
$$ plain form
0 0 0 0 0 8 -8 0 -8 8 -16 16 -24 25 -32 40 -52 59 -73 88 -101 120 -142 162 -189 217 -249 285 -326 368 -419
29 -419 472 -530 595 -668 745 -831 924 -1030 1143 -1266 1406 -1555 1719 -1906 2111 -2338
45 -2338 2596 -2888 3218 -3601 4050 -4579 5221 -6016 7029 -8366 10236 -13027 17648 -26705
59 -26705 51200 -257500 -793325 -351782 78439 96860 -191445 -292080 -204486 -104910 -225465
70 -225465 -365352 -281194 -29545 45688 -83979 -260217 -321307 -243431 -85137 13075 47261
81 47261 -6326 -178381 -289925 -101931 156803 123877 -87264 -114948 48419 143950 12407
92 12407 -188013 -130084 191911 326820 77711 -172894 -105962 105987 188827 92596 -29646
103 -29646 -1610 119067 101121 -38048 -74392 6685 60528 68160 64962 47520 17764 -39514
115c9514n0556P6677J42144k9810j52194r397R9176j865o7817M757P5323Q1800
127A28724L368j14229r1453N7051J01943L8742J1830j0866n9035n3497m317N7188
139F5449J16236M3565j27366j07568P9800R1242n5530o7951L6419P7725J6224
150A68245j06014j50324J0483J75181R0813q4773j25381p6728N603R6263O0872
161F4240p1151j00489k4761L6830O1896O268j04158p1511R3070R9827p1809j51812
173b33560l8655J46610J95470k4545k70650j51164J75394K29692J7049j23991
183g8350r1029K4553J04857L5968p8444l2483R1940R6269J3470o9714j11943j9686
195a14592J48111J59955J005j32065j34695O878J87778J38162j21740j85686M3775
$$ plain form
115 -39514 -90070 -13393 128751 98941 -53253 -62650 36526 34661 -33156 -28399 46924 128724
127 128724 132092 17863 -73590 -16539 85404 124146 135976 125110 66075 12578 8261 65449
139 65449 181685 225250 97884 -9684 70116 161358 105828 37877 74296 152021 168245
150 168245 62231 -88093 -77610 97571 188384 103611 -21770 -98498 -92895 3368 64240
161 64240 -6911 -107400 -132161 -95331 -33435 -27167 -131325 -202836 -109766 -9939 -81748 -233560
173 -233560 -272215 -125605 69865 45320 -225330 -376494 -201100 28592 45641 -78350
183 -78350 -169379 -144826 -39969 -4001 -82445 -114928 -22988 73281 86751 17037 -94906 -114592
195 -114592 33519 193474 194479 62414 -72281 -65403 122375 260537 138797 -46889 -3114
206c114J78118M3100j38797j40642N2066K04661O3820j94744j75020O2288J57822
217A09558N3752p3919j13011k6184P3998K8315o3984l3793J9688N106J8833L2966
229C1325m0823r5214l6354N3785R7729M8132r1080j19689M2542J17785k1794j02798
241a16454J232J02613P8447l7026j33249o3842J05548J19040q973m8619k597n597
253i477k5218j0960K7840P8679N2028p4142r7068L8169Q0108k2032m3317M1354
265C5964O8003L251q9686j10736K0667J56114Q2295q0022j00733k8686K1023M5256
277B2710K6583k0675j2523J0160k1873k2096J5048j4786l5510M9738Q9207j9844
289F6139j22372q7515N0202J58974O9807j43380j53139O8087J65164K0264j20347
$$ plain form
206 -3114 175004 218104 79307 -61335 -9269 195392 259212 64468 -110552 -48264 109558
217 109558 163310 89391 -23620 -49804 24194 52509 -11475 -45268 -25580 -20474 -1641 31325
229 31325 -9498 -104712 -141066 -87281 10448 58580 -32500 -152189 -109647 8138 -13656 -116454
241 -116454 -115222 -12609 65838 28812 -104437 -168279 -62731 56309 47336 -1283 -3880 -9477
253 -9477 -34695 -45655 -17815 60864 112892 38750 -58318 -20149 59959 37927 -5390 35964
265 35964 103967 107218 17532 -93204 -72537 83577 165872 85850 -14883 -43569 -22546 22710
277 22710 49293 28618 16095 26255 4382 -17714 -2666 -17452 -52962 -3224 85983 66139
289 66139 -56233 -143748 -93546 65428 135235 -8145 -161284 -93197 71967 92231 -28116
300b8116r6606M2496J41391M7901j30591j11098P1137J31095L0004p1766r6549
311g0702k4791Q7302Q7743j7015o8843m4644J0689Q5903O8324q4936j42289K1702
323i1557J58192Q3371q3858j53462l7571J44723J29063q7083j64421M758J44722
334D6877Q3274p3113j49076m0660J33985J18171n6679j13291k0360M7266N3034
345B9428K1337m8911o6659R013O2560M0794p476o4080o1028N1512J06621j3784
357E9327j15624m5396P3549J01211J6775j04916r6335O0611J20401o209r1829
368b8435l0034M4555M7757k882n2500k0235N0869K4586l8158p096K6620j6651
380a604k8991K0222L3263O088k3936m5027j64P2878L2023o6405n1557K9093M1986
$$ plain form
300 -28116 -124722 -82226 59165 107066 -23525 -134623 -63486 67609 97613 25847 -70702
311 -70702 -95493 -8191 79552 62537 -6306 -50950 -40261 45642 113966 29030 -113259 -91557
323 -91557 66635 150006 66148 -87314 -124885 19838 148901 61818 -102603 -97845 46877
334 46877 130151 57038 -92038 -132698 1287 119458 62779 -50512 -70872 -23606 29428
345 29428 50765 1854 -64805 -55792 6768 47562 40086 -23994 -85022 -33510 73111 59327
357 59327 -56297 -101693 -28144 73067 89842 -15074 -111409 -50798 69603 63394 -28435
368 -28435 -58469 -13914 33843 30961 -21539 -41774 9095 33681 -4477 -11573 15047 -1604
380 -1604 -30595 -10373 22890 28978 5042 -39985 -40149 32729 64752 -1653 -53210 -24117 17869
393A7869R600j8230k9536P939M0648m509l4857Q404J2453k9751K059N5331J6643
406E4063m7053m6505P779P2571N0283p4863j05654L7376J25998K6578r0705q2728
418g2860K0997J07995N3460r6559j07409M1109J08020K3483n8955o5669j3669
429f0057O0666O0612k3023o5079l0836J3315N9663N8179m6344j13958q242J14018
441A8914P4421n7663j21363m0627J15736J30356n5655j64833k9682J31017J03047
452A03668m5125j32018n1462J09356J18476m3174j20404k5695O4921O4001J4753
463E7297n3065o6819J2496P2562L7085k5016o4238m9622M8855J09019O679j12246
475b7013o5157O0460J00499K0779r8564j01044N5881J40770J1054j19292o5327
$$ plain form
393 17869 27469 9239 -20297 -12358 28290 23781 -11076 -2672 9781 -19970 -17911 37420 54063
406 54063 7010 -39495 -31716 40855 91138 16275 -89379 -52003 73995 100573 9868 -72860
418 -72860 -51863 56132 109592 13033 -94376 -53267 54753 78236 19281 -46388 -60057
429 -60057 609 61221 38198 -26881 -57717 -44402 15261 73440 27096 -86862 -95104 18914
441 18914 93335 35672 -85691 -126318 -10582 119774 64119 -100714 -130396 621 103668
452 103668 58543 -73475 -124937 -15581 102895 59721 -60683 -86378 -21457 42544 57297
463 57297 4232 -62587 -50091 22471 59556 34540 -29698 -79320 -30465 78554 85233 -27013
475 -27013 -92170 -31710 68789 89568 -8996 -110040 -54159 86611 97665 -21627 -86954
486h6954N5052Q5212J3930p5964o2933M3588P3860o264m0111j0331l340J909K4600
499A2254R873j8803j2732k863J2825L9282O089o3018l3013N4822N1487j7183m6647
512g627k1562L3452N3941j1771o1470j237M8888p57l2856N094K2221K594j3944
525A4966j7008J1501L7152j6079o6868n98P5464K8472n4044n6237M280O4017M2994
538F8012n8492q3528K3495Q0954J0111n0820l6198J798L6074L2215k2110m4818
550d3307j2073J0407K4907M0125q954p5543k8688O7478O2228k4665q0383m4945
562a13413O8164J12555j5549j35320n2060J01761J04131j8143j06792n9820P7296
573c7190J13846j7830j09640l4388O4822O8528J6249m4777o1304M809O6730L6415
$$ plain form
486 -86954 -31902 53310 67240 -8724 -71657 -28069 45791 39527 -584 -10915 -14255 -12346 12254
499 12254 22127 3324 -9408 -12271 554 39836 45925 -17093 -50106 4716 56203 39020 -7627
512 -7627 -29189 4263 58204 46433 -15037 -16274 32614 31857 -999 4095 26316 28910 14966
525 14966 -2042 9459 46611 30532 -36336 -36934 38530 67002 12958 -43279 -38999 25018 68012
538 68012 9520 -74008 -50513 30441 40552 -10268 -46466 -44668 -8594 23621 1511 -43307
550 -43307 -55380 -44973 -20066 20059 11105 -64438 -93126 -25648 36580 11915 -68468 -113413
562 -113413 -45249 67306 51757 -83563 -135623 -33862 70269 52126 -54666 -114486 -37190
573 -37190 76656 58826 -50814 -85202 -20380 48148 64397 19620 -41684 -36875 29855 66270
585F6270k1109m4889l3892L0825Q6074J9620q9869o9515M6657R8870L4701q1879
597D1864j11012J9621J34070M7877r9149q3782L4403Q2940K0615p3744p8516L1330
609c3483R3748J7363o2065m7624q127K0793L8670Q934l6377k9570m41J3356K7382
622B559O563m8375k9591N0997M7563l4373o6289j5945N4370P0920p469q1961k7809
635g8840N9471L5068k6936j8575J5449K1365O486k2113k1517K5433K9165j7933
$$ plain form
585 66270 45161 272 -33620 -2795 83279 102899 13030 -56485 -9828 89042 123743 41864
597 41864 -69148 -49527 84543 132420 33271 -50511 -16108 66832 87447 13703 -64813 -33483
609 -33483 60265 77628 15563 -32061 -40188 -19395 19275 28209 -8168 -37738 -38179 -24823 2559
622 2559 9122 -39253 -68844 -17847 29716 -4657 -70946 -86891 -32521 38399 30930 -51031 -78840
635 -78840 -19369 15699 -11237 -29812 -14363 7002 13488 -8625 -30142 -4709 24456 6523
$$ [...]
8191C92
##END NTUPLES=NMR FID
##END=
