##TITLE=1H_CG-1113-4
 CDCl3, 8 sc, 
 24.7.2019
##JCAMPDX= 6.0         $$ Bruker NMR JCAMP-DX V2.0
##DATA TYPE= NMR FID
##DATA CLASS= NTUPLES
##ORIGIN= UXNMR, Bruker Analytische Messtechnik GmbH
##OWNER= root
$$ XWIN-NMR		Version 3.5
$$ Wed Jul 24 15:16:16 2019 Russian Standard Time (UT+4h)  she@DPX200
##.OBSERVE FREQUENCY= 200.13155
##.OBSERVE NUCLEUS= ^1H
##.DELAY= (6, 6)
##.ACQUISITION MODE= SIMULTANEOUS
##.ACQUISITION SCHEME= undefined
##.AVERAGES= 8
##.DIGITISER RES= 18
##SPECTROMETER/DATA SYSTEM= spect
##.PULSE SEQUENCE= zg30
##.SOLVENT NAME= CDCl3
##.SHIFT REFERENCE= (INTERNAL, CDCl3, 0, 15.7039)
##AUDIT TRAIL= $$ (NUMBER, WHEN, WHO, WHERE, WHAT)
$$ ##TITLE= Audit trail, XWIN-NMR		Version 3.5
$$ ##JCAMPDX= 5.01
$$ ##ORIGIN= Bruker BioSpin GmbH
$$ ##OWNER= she
$$ F:/spectra/data/she/nmr/H-F/1/audita.txt
$$ ##AUDIT TRAIL=  $$ (NUMBER, WHEN, WHO, WHERE, WHAT)
(   1,<2019-07-24 15:15:10.78 +0400>,<she>,<DPX200>,
      <created by zg, POWCHK disabled, PULCHK disabled
       configuration hash MD5:
       00 E9 B6 7A A2 85 ED C7 34 08 36 98 17 FE 4E 26
       data hash MD5: 16K
       5B 83 75 E3 3E 77 DB C2 C6 FD 6E A9 F6 6D F1 D6>)
$$ ##END=
$$ 
$$ hash MD5
$$ BD 0E B3 56 82 FB 84 8F 16 5E 09 57 DC F4 99 F1
##$RELAX= 
##$RELAX= 
##$RELAX= 
##$RELAX= 
##$RELAX= 
##$RELAX= 
$$ Bruker specific parameters
$$ --------------------------
##$DU= <F:/spectra>
##$EXPNO= 1
##$NAME= <H-F>
##$PROCNO= 1
##$TYPE= <nmr>
##$USER= <she>
##$AMP= (0..31)
100 100 100 100 100 100 100 100 100 100 100 100 100 100 100 100 100 100 
100 100 100 100 100 100 100 100 100 100 100 100 100 100 
##$AQSEQ= 0
##$AQ_mod= 1
##$AUNM= <au_zg>
##$AUTOPOS= <>
##$BF1= 200.13
##$BF2= 200.13
##$BF3= 200.13
##$BF4= 200.13
##$BF5= 200.13
##$BF6= 200.13
##$BF7= 200.13
##$BF8= 200.13
##$BYTORDA= 1
##$CFDGTYP= 0
##$CFRGTYP= 5
##$CHEMSTR= <none>
##$CNST= (0..31)
1 1 145 1 1 1 1 1 1 1 1 1 1 1 1 1 1 1 1 1 1 1 1 1 1 1 1 1 1 1 1 1 
##$CPDPRG= <>
##$CPDPRG1= <>
##$CPDPRG2= <>
##$CPDPRG3= <>
##$CPDPRG4= <mlev>
##$CPDPRG5= <mlev>
##$CPDPRG6= <mlev>
##$CPDPRG7= <mlev>
##$CPDPRG8= <mlev>
##$CPDPRGB= <>
##$CPDPRGT= <>
##$D= (0..31)
0 1.2 0 0 0 0 0 0 0 0 0 0.03 0 0 0 0 0 0 0 0 0 0 0 0 0 0 0 0 0 0 0 0 
##$DATE= 1563966910
##$DBL= (0..7)
120 120 120 120 120 120 120 120 
##$DBP= (0..7)
150 150 150 150 150 150 150 150 
##$DBP07= 0
##$DBPNAM0= <>
##$DBPNAM1= <>
##$DBPNAM2= <>
##$DBPNAM3= <>
##$DBPNAM4= <>
##$DBPNAM5= <>
##$DBPNAM6= <>
##$DBPNAM7= <>
##$DBPOAL= (0..7)
0.5 0.5 0.5 0.5 0.5 0.5 0.5 0.5 
##$DBPOFFS= (0..7)
0 0 0 0 0 0 0 0 
##$DE= 6
##$DECBNUC= <off>
##$DECIM= 24
##$DECNUC= <off>
##$DECSTAT= 4
##$DIGMOD= 1
##$DIGTYP= 9
##$DL= (0..7)
0 120 120 120 120 120 120 120 
##$DP= (0..7)
150 150 150 150 150 150 150 150 
##$DP07= 0
##$DPNAME0= <>
##$DPNAME1= <>
##$DPNAME2= <>
##$DPNAME3= <>
##$DPNAME4= <>
##$DPNAME5= <>
##$DPNAME6= <>
##$DPNAME7= <>
##$DPOAL= (0..7)
0.5 0.5 0.5 0.5 0.5 0.5 0.5 0.5 
##$DPOFFS= (0..7)
0 0 0 0 0 0 0 0 
##$DQDMODE= 0
##$DR= 18
##$DS= 0
##$DSLIST= <SSSSSSSSSSSSSSS>
##$DSPFIRM= 0
$$ [...]
##$SUBNAM2= <"">
##$SUBNAM3= <"">
##$SUBNAM4= <"">
##$SUBNAM5= <"">
##$SUBNAM6= <"">
##$SUBNAM7= <"">
##$SUBNAM8= <"">
##$SUBNAM9= <"">
##$SW= 24.9336996594482
##$SWIBOX= (0..15)
0 0 2 0 0 0 0 0 0 0 0 0 0 0 0 0 
##$SW_h= 4990.01996007984
##$TD= 16384
##$TD0= 1
##$TE= 0
##$TE2= 300
##$TE3= 300
##$TEG= 300
##$TL= (0..7)
0 120 120 120 120 120 120 120 
##$TP= (0..7)
150 150 150 150 150 150 150 150 
##$TP07= 0
##$TPNAME0= <>
##$TPNAME1= <>
##$TPNAME2= <>
##$TPNAME3= <>
##$TPNAME4= <>
##$TPNAME5= <>
##$TPNAME6= <>
##$TPNAME7= <>
##$TPOAL= (0..7)
0.5 0.5 0.5 0.5 0.5 0.5 0.5 0.5 
##$TPOFFS= (0..7)
0 0 0 0 0 0 0 0 
##$TUNHIN= 0
##$TUNHOUT= 0
##$TUNXOUT= 0
##$USERA1= <user>
##$USERA2= <user>
##$USERA3= <user>
##$USERA4= <user>
##$USERA5= <user>
##$V9= 5
##$VALIST= <valist>
##$VCLIST= <CCCCCCCCCCCCCCC>
##$VD= 0
##$VDLIST= <DDDDDDDDDDDDDDD>
##$VPLIST= <PPPPPPPPPPPPPPP>
##$VTLIST= <TTTTTTTTTTTTTTT>
##$WBST= 1024
##$WBSW= 4
##$XGAIN= (0..3)
0 0 0 0 
##$XL= 0
##$YL= 0
##$YMAX_a= 297001
##$YMIN_a= -489517
##$ZGOPTNS= <>
##$ZL1= 120
##$ZL2= 120
##$ZL3= 120
##$ZL4= 120
##$ABSF1= 10
##$ABSF2= 0
##$ABSG= 5
##$ABSL= 3
##$ALPHA= 0
##$AQORDER= 0
##$ASSFAC= 0
##$ASSFACI= 0
##$ASSFACX= 0
##$ASSWID= 0
##$AUNMP= <proc_1d>
##$AZFE= 0.1
##$AZFW= 0.1
##$BCFW= 1
##$BC_mod= 2
##$BYTORDP= 1
##$COROFFS= 0
##$CY= 11.3945322036743
##$DATMOD= 1
##$DC= 2
##$DFILT= <>
##$DTYPP= 0
##$F1P= 18.9103706918063
##$F2P= -1.10871071338519
##$FCOR= 0.5
##$FTSIZE= 0
##$FT_mod= 4
##$GAMMA= 1
##$GB= 0.15
##$INTBC= 1
##$INTSCL= 1
##$ISEN= 128
##$LB= 0.24
##$LEV0= 0
##$LPBIN= 0
##$MAXI= 10000
##$MC2= 0
##$MEAN= 0
##$ME_mod= 0
##$MI= 1.114404
##$NCOEF= 0
##$NC_proc= 0
##$NLEV= 6
##$NOISF1= 3.799351
##$NOISF2= 2.8
##$NSP= 1
##$NTH_PI= 0
##$NZP= 0
##$OFFSET= 15.70392
##$PC= 1
##$PHC0= -8859.426
##$PHC1= 10.40096
##$PH_mod= 1
##$PKNL= yes
##$PPARMOD= 0
##$PSCAL= 0
##$PSIGN= 0
##$REVERSE= no
##$SF= 200.130013532006
##$SI= 16384
##$SIGF1= 3
##$SIGF2= 2
##$SINO= 400
##$SIOLD= 16384
##$SREGLST= <1H.CDCl3>
##$SSB= 0
##$STSI= 0
##$STSR= 0
##$SW_p= 3612.71676300578
##$SYMM= 0
##$S_DEV= 0
##$TDeff= 0
##$TDoff= 0
##$TI= <>
##$TILT= no
##$TM1= 0
##$TM2= 0
##$TOPLEV= 0
##$USERP1= <user>
##$USERP2= <user>
##$USERP3= <user>
##$USERP4= <user>
##$USERP5= <user>
##$WDW= 1
##$XDIM= 8192
##$YMAX_p= 0
##$YMIN_p= 0
$$ End of Bruker specific parameters
$$ ---------------------------------
##NTUPLES= NMR FID
##VAR_NAME=  TIME,          FID/REAL,        FID/IMAG
##SYMBOL=    X,             R,               I
##VAR_TYPE=  INDEPENDENT,   DEPENDENT,       DEPENDENT
##VAR_FORM=  AFFN,          ASDF,            ASDF
##VAR_DIM=   8192,          8192,            8192
##UNITS=     SECONDS,       ARBITRARY UNITS, ARBITRARY UNITS
##FACTOR=    0.0002004,     1,               1
##FIRST=     0,             0,               0
##LAST=      1.6414764,     0,               0
##MIN=       0,             -489517,         0
##MAX=       1.6414764,     297001,          0
$$ Real data points
##PAGE= N=1
##DATA TABLE= (X++(R..R)), XYDATA
$$ [...]
3276a025o527N377J0664k53q948m736K689N853K490n579p417L945Q843Qp264m931
3292f811J518O775N455n475r282Q21P739K382l640l863r78N358N851n053q202
3307g405J604P335K945k711n527k612O165O621l549p782L35N680L732q45n727
3322a741l936N693O823l308o770n58M777M073j53p024n112O547Q022j886o681
3337a234l054K219N947J781o825o064N091P488n74n696m311J535P891L736q572
3352f42q098M389Q717K453m864p532j303Q513O220n840p712J897O751L100l429
3367B620q038k131R716P938n784r440j988N628P318P54q957n444O739P591k108
3382D414p411l906K787Q564K016q947o681N543Q604J27o266o776N19R622N472
$$ plain form
3276 -1025 -7552 -2175 8489 8236 -712 -5448 -2759 3094 5584 5 -7412 -3467 5376 5384 -1880 -6811
3292 -6811 -5293 1482 6937 1462 -7820 -6999 740 3122 -518 -4381 -5359 -1 5850 797 -7405
3307 -7405 -5801 1534 4479 1768 -3759 -6371 -206 6415 2866 -4916 -4581 1099 4831 3986 -1741
3322 -1741 -5677 16 6839 3531 -3239 -3797 980 5053 4900 -2124 -7236 -689 7333 5447 -1234
3337 -1234 -4288 -2069 3878 5659 -1166 -7230 -2139 5349 4775 -921 -5232 -3697 4194 7930 -642
3352 -642 -8740 -4351 4366 6819 1955 -5577 -6880 1633 7853 2013 -5699 -3802 2949 6049 2620
3367 2620 -5418 -7549 2167 10105 4321 -5119 -7107 -1479 5839 6593 -2364 -7808 -1069 6522 4414
3382 4414 -2997 -6903 -4116 4448 6464 -2483 -9164 -3621 4983 5110 -1156 -7932 -7413 2209 7681
3397G681p148q227J547O852L394k571o768j371Q500N192o340p287J001O377N711
3412F543j269q885m055Q036O820k702n811j856L024N756O25p182l578N945N631
3427G042k135n136l315K957P418J165q272n132M359N726N03l481n052J82O541
3442C370J564o317l567L916M879j36m465o350Q39Q601L064o472m977J203M540
3457c08L298k165o538n17P486K922n311m508J007M774M797k999q585n94Q733N059
3473F551l499n991k688M204P702n76q432k454O028M317j992n626l210N148R387
3488H869j172j0211m831N076O726J438n429p438J999R463J880p332n216J871N878
3503A571L499m828q501J565R600K980o315p043m84O771P443k675r892k263P681
$$ plain form
3397 7681 533 -7694 -6147 705 4099 1528 -5240 -6611 1889 7081 741 -6546 -5545 832 6543
3412 6543 5274 -3611 -7666 370 7190 4488 -1323 -3179 -155 5601 6226 -956 -4534 1411 7042
3427 7042 4907 -229 -3544 -587 6831 7996 -276 -5408 -1049 4677 5180 1699 -3353 -3171 3370
3442 3370 4934 -1383 -4950 -1034 3845 3709 -756 -7106 -6267 2334 5398 -1074 -6051 -4848 -308
3457 -308 2990 825 -5713 -6230 1256 4178 -1133 -5641 -4634 140 4937 1938 -6647 -7241 1492 6551
3473 6551 3052 -2939 -5627 -1423 6279 5703 -2729 -5183 845 5162 3170 -2456 -5666 -518 8869
3488 8869 7697 -2514 -7345 -2269 4457 5895 466 -6972 -4973 4490 6370 -962 -6178 -4307 1571
3503 1571 5070 242 -8259 -6694 2906 5886 -429 -7472 -7956 -1185 6258 3583 -6309 -8572 -891
3518h91N415j795n471k954M355P630j896r176k291P018O757J02o224o086L235
3533b272R638J239p498m480K549N513K910l996o480J925P858J437n935m366J389
3548e69N042M308m667q331N73P810L447l491m975k314L440N046k690o644P14O012
3564B711J966l207n005k255M563O485k781p504r60M870L638j72m610l706L707
3579b260N907k150o358o34L833L944K15n429m491N123P193j024o759l556K625
3594c821N405K915n446n558L323O762m39n208l604J426O502L502o615p267K681
3609e442P848J908l928n998j516O716N783m753p593N86N869L835j888o245l013
3624g831O652O966m095q111j573N300P146Q33p713o407N317Q286p06o097l502
$$ plain form
3518 -891 4524 2729 -2742 -5696 -1341 6289 4393 -4783 -7074 -56 6701 6803 579 -5507 -2272
3533 -2272 7366 8605 1107 -3373 -824 4689 7599 3603 -2877 -952 6906 8343 2408 -1958 -569
3548 -569 4473 8781 4114 -4217 -3644 4166 7613 4122 -853 -3167 273 5319 2629 -4015 -3301 2711
3564 2711 4677 1470 -3535 -5790 -1227 5258 2477 -5027 -5987 -1117 2521 2349 -2261 -5967 -2260
3579 -2260 3647 1497 -4861 -5495 -1662 2282 2497 -2932 -7423 -2300 4893 3869 -2890 -6446 -3821
3594 -3821 1584 4499 -947 -6505 -3182 3580 3141 -2067 -5671 -4245 2257 5759 -856 -8123 -5442
3609 -5442 2406 4314 386 -5612 -7128 -412 5371 618 -6975 -6389 -520 3315 1427 -4818 -7831
3624 -7831 -1179 5787 1692 -6419 -7992 -2692 4454 5287 -2426 -8833 -3516 4770 4064 -2033 -5535
3639e535K785O725K388p520o317M779Q432J108n352n893k2P614N138n619p138
3654d427J996O317K964k500o253k138O680N685m109o611o7M768M330l79o935l796
3670d475N956O375k367n686k551K649N436J797o065m593M428N455j061m365k981
3685b048J657N829J994o389m792L791N292M98l564m028j16N937K587n670m083
3700c105L006L922P02k980m793j54O676K839n461m987P96L970K552j866n485j173
3716e541O043K896n037m842K12M033M426j731p493k203O475M166l209m769j736
3731h310L615N967j280p892k888O559N537j147n012m247K809P645R61p587l563
3746h833M559O003J044m577n963J890Q777K775o217n334J577N623M601l207p140
$$ plain form
3639 -5535 -2750 3975 6363 -1157 -7474 -2695 5737 6845 1493 -4400 -4422 3192 8330 2711 -4427
3654 -4427 -2431 3886 6850 4350 -1903 -4041 2639 8324 4215 -2396 -2463 2305 6635 6256 -679 -4475
3670 -4475 1481 7856 5489 -197 -2748 -99 5337 7134 1069 -3524 904 6359 5298 933 -2048
3685 -2048 -391 5438 7432 1043 -3749 42 5334 5832 2268 -1760 -1876 4061 6648 978 -3105
3700 -3105 -99 3823 4525 1545 -3248 -3402 3274 6113 652 -4335 -3539 431 2983 1117 -4368 -5541
3716 -5541 502 3398 -1639 -6481 -6269 -2236 2190 459 -7034 -9237 -2762 1404 -1805 -6574 -8310
3731 -8310 -4695 1272 -8 -7900 -10788 -4229 1308 161 -4851 -9098 -6289 1356 2317 -5270 -8833
3746 -8833 -4274 1729 2773 -1804 -7767 -5877 2900 5675 -542 -5876 -4299 1324 5925 2718 -4422
3761d422j52Q228M403n109o010r30N517O581j858q524k112O798N177k350n235
3776Bl286L511P410q41q219l422N541N553L89m727n573J529P386J107o557l291
3792c488K623M845K006l605o545J050P782K506n375m627k05M068M824j840o227
3807b208n3O207J909l649m297q03M344N128j900o829p86N291L076j805l755k353
3823b483K778M854j789n944o39M478K944q23m161l928K650N228j033n744j401
3838e013L005L542J032n022m847K826O231l35n375k560J355M352K238m478n048
3853h097K973O642P0n449m022J036O434M540m265o592J468O009J734k746m273
3868d538m14N870N084m410p036J143O702M219j628o225l705N030O662j734o186
$$ plain form
3761 -4422 -4574 3654 8057 2948 -3062 -3992 1525 8106 6248 -2276 -4388 2410 7587 5237 2
3776 2 -3284 227 7637 6796 -1423 -4845 696 6249 6638 1911 -3662 -2133 5253 6360 -197 -3488
3792 -3488 -865 3980 5986 2381 -4164 -3114 4668 7174 1799 -2828 -3033 1035 5859 4019 -2208
3807 -2208 -2261 3946 5855 2206 -2091 -2894 1450 6578 4678 -2151 -2937 2354 5430 3625 -130 -2483
3823 -2483 295 5149 3360 -2584 -3223 1255 4199 3376 -785 -4713 -2063 3165 2132 -3612 -5013
3838 -5013 -2008 1534 2566 -2456 -7303 -4477 1754 1419 -3956 -6516 -5161 -809 1429 -3049 -8097
3853 -8097 -5124 1518 1588 -3861 -7883 -6847 -413 4127 -138 -6730 -5262 747 2481 -265 -4538
3868 -4538 -4952 918 6002 1592 -5444 -4301 2401 6620 4992 -1233 -4938 92 6754 5020 -1166
3883a166j370L992M808O10o035n430M460P189n65o189l988J790O315L290n916
3898A795p054K391O905J196m481n267n26O347M775m835p006R10N466K787k430
3913I73n724j999O139N392l331o844m96M445M107J88n683l854M398N614j100m562
3929b337j013K421M036O66n146l995M177O346k02m212l319L01M912K823l808m319
3945b669K805M140M5l103l648M80N856K742n212m957J852M267J528k303m115q06
3961c098N077K796m808m296J311L720K288j663m956j359N441L197m096m288K96
3976d438L264M065o67o201k159N198M223k148m223j577K629N060L18o341k828
3991e825N200N007q48m955l638K233P077J756o836m121L302N273J585l641n155
$$ plain form
3883 -1166 -2536 1456 6264 6874 839 -4591 -131 7058 6493 304 -3684 -1894 4421 7711 1795
3898 1795 -5259 -2868 4037 5233 752 -4515 -5041 1306 6081 1246 -5760 -4850 616 3403 973
3913 973 -4751 -6750 -611 4781 1450 -5394 -5890 -1445 2662 2850 -2833 -6687 -2289 3325 2225 -2337
3929 -2337 -3350 -929 3107 3773 -1373 -5368 -1191 5155 4953 741 -2578 -2277 2635 5458 1650 -2669
3945 -2669 136 4276 4321 1218 -2430 -1950 3906 6648 1436 -3521 -1669 2598 4126 1823 -2292 -3098
3961 -3098 1979 4775 -33 -4329 -3018 702 2990 1327 -3629 -4988 453 3650 -446 -4734 -4438
3976 -4438 -1174 2891 2224 -3977 -6136 -938 3285 1137 -3086 -4663 -2034 3026 3344 -2997 -5825
3991 -5825 -625 4382 3534 -1421 -5059 -2826 4251 6007 -829 -4950 -1648 3625 5210 1569 -3586
4006c586O86O906K027o282m399K337N506L167l034p265r88O835M092l881m671
4021b550r16L518M809j334o836k253O187M239j924n030l324K557O592R32o464
4036a797l622L984M841K0m160n185J409P387K151n277m261K115M030J885k875
4051F45n451N09O772K448m624m076L43L902L625j377n804o88N177K358k984l095
4067b320p78K887M447j173n719j043M386K708j527l446j859K521N040p16n482
4082b074j485L493K777m67k727k955K410M954n42n234j670L147L020J158l823
4097a8l977J967N626k80m517j951K197L577J631l613n260J729N601J069l930k954
4113c103P18L769L478l873n803J025N890K183l037m271j709M235M944k691o020
$$ plain form
4006 -3586 -2900 4006 6033 -249 -4648 -2311 3195 6362 3328 -3937 -4925 1910 6002 2121 -2550
4021 -2550 -3466 52 4861 3527 -3309 -5562 625 4864 2940 -2090 -5414 -2857 3735 4667 -1797
4036 -1797 -5419 -1435 3406 3426 -734 -5919 -4510 2877 5028 -249 -4510 -2395 1635 3520 645
4051 645 -4806 -4297 2475 4923 299 -3777 -3434 468 4093 2716 -3088 -3776 1401 3759 775 -2320
4067 -2320 -3098 -211 4236 3063 -2656 -3699 687 3395 1868 -1578 -3437 -916 4124 3408 -2074
4082 -2074 -3559 -66 2711 2244 -483 -3438 -1028 3926 3384 -1850 -3520 -373 2647 3805 -18
4097 -18 -3995 -2028 3598 3318 -1199 -3150 -953 2624 4255 642 -4618 -2889 2712 3781 -149 -3103
4113 -3103 -2385 1384 4862 989 -4814 -3789 2101 4284 1247 -3024 -4733 -498 4446 1755 -4265
4128d265o8M921L384j914n118l023M657O214j529o337j591L223M225O91m946m433
4144e909L430O812j11n328l390J490N106K642m129n908K245O319J197m085m237
4159c856l54N312M813l429o223K38M576K735k163m095j817M260N413k524n810
4174b924j062L520L630k35m218l518L593N352j219n126j665J924M054J691m026
4189b29m399K473M738j68l401k057J194M179K161m080m727K083M720Q72k184k781
4205a606l75M026K449l605l969J904L881R09j572l498o87M291L324l886l768R25
4221a257L324K275j026m473j906M204L587k464l753k3K635K512q81m953k081M954
4237F74M036k040m279j838J824M442Q42n368l139L765M187n17m090k828J384N389
$$ plain form
4128 -4265 -4333 588 3972 2058 -3060 -6083 -1426 4788 3259 -3078 -4669 -1446 2779 3470 -1476 -5909
4144 -5909 -2479 4333 4222 -1106 -4496 -3006 2100 4742 613 -5295 -3050 3269 4466 381 -3856
4159 -3856 -4210 1102 5915 2486 -3737 -3499 1077 3812 1649 -2446 -4263 -3 5410 2886 -2924
4174 -2924 -3986 -466 3164 2929 -1289 -4807 -1214 4138 2919 -2207 -3872 -1948 2106 3797 -229
4189 -229 -4628 -2155 2583 2415 -986 -3043 -1849 2330 4491 411 -4316 -2233 2487 3359 1175 -1606
4205 -1606 -1981 2045 4494 889 -3080 -1176 2705 3614 2042 -1456 -2143 2148 5472 1586 -2182 -1257
4221 -1257 2067 4342 3316 -1157 -3063 1141 4728 2264 -1489 -1512 1123 3635 2754 -2199 -4280 674
4237 674 4710 2670 -1609 -3447 -1623 2819 3661 -1707 -4846 -1081 3106 2589 -1501 -4329 -2945 2444
4253B444J688n398l957L050M684P77l332m694K09O242L443m639m843Q86L621L109
4269C290j394n367j004N640L517l592n119o91L842M645k64o429k987M650M398
4284C135j634m170k392K081N257Q02n680l501L263M212j40l046l819J100N909
4299A377J812n098m017J663M056K122j707m590o14M908K671l249k967R61L204
4314E32K646j368n100r42N111L289j950l048r05K222L777Qm642j745M018K625
4330D528q90k593j348J767M203j92m892j707L571K776l03k472l423J426M343R18
4346E712m153j689K033K068K24k705l034J613N125J72m346k784J335K953J896
4361D420k815m419Q80N216J048l335k997K73K816K839k591n339O69N224J630k704
$$ plain form
4253 2444 4132 -1266 -5223 -2173 2511 3288 -44 -4738 -4529 1713 5156 517 -4326 -3440 181 3290
4269 3290 1896 -3471 -4475 1165 4682 1090 -4029 -4720 -878 3767 3503 -2926 -5913 -1263 3135
4284 3135 1501 -2669 -5061 -2980 2277 3079 -2601 -6102 -2839 1373 1233 -1813 -5632 -4532 1377
4299 1377 3189 -1909 -5926 -4263 -207 1915 208 -4382 -4996 -88 2583 -666 -3633 -2672 532
4314 532 3178 1810 -3290 -4232 879 4168 2218 -830 -1735 487 4264 4272 -370 -2115 1903 4528
4330 4528 3638 1045 -303 1464 5667 5475 583 -1124 2447 5223 4920 2448 -975 451 4794 5712
4346 5712 1559 -130 1903 3971 4195 1490 -1544 69 5194 5366 1020 -1764 -429 2524 4420
4361 4420 1605 -2814 -1934 3282 4330 995 -2002 -1729 1087 3926 1335 -4004 -3335 1889 3519 815
4377H15l811r88L457M669j719o217j074L728K848r96l302k614K838N028j077o020
4393d435k013L006M315J029m126m860J837N902P21m836l017R99M097K905l175
4408a651n238J323N495J544l293l426l85L846M168k282n850J35N005L043j106
4423A328l316k521L160M824j037m542p93L383L075J76l268l200K538N493m57l941
4439I02j892J734L331J650l137m026J714M530K01l127j880M59K893K083l256m109
4455a930J874L729N16k448k896r56L038L001k438l521O67K897N87j486k713j070
4471c149L467L260k604m100M01K757J852k92l308j833L445L644k032l678j16K329
4487D3K784J00l780k549L425M092j262l569j549J932L725Q87m311l699K966M115
$$ plain form
4377 815 -2996 -3984 -527 4142 2423 -3794 -4868 -1140 1708 712 -2590 -5204 -2366 2662 1585 -4435
4393 -4435 -6448 -3442 873 1902 -2224 -7084 -5247 655 1376 -3460 -6477 -5478 -1381 1524 -1651
4408 -1651 -6889 -5566 -71 1473 -1820 -5246 -5631 -1785 2383 101 -5749 -5614 -609 2434 1328
4423 1328 -1988 -4509 -1349 3475 2438 -2104 -2897 486 3561 3737 469 -2731 -193 5300 4843 902
4439 902 -990 744 4075 5725 2588 -1438 276 4806 5007 1880 0 459 3352 5435 2179 -1930
4455 -1930 -56 3673 4189 1741 -1155 -2111 927 3928 1490 -2031 -1364 1533 2120 634 -2079 -3149
4471 -3149 318 3578 974 -3126 -2725 32 1884 1592 -1716 -3549 -104 3540 1508 -2170 -2286 43
4487 43 2827 2927 -853 -3402 23 4115 2853 -716 -2265 -333 3392 4279 -32 -3731 -765 3350
4503C350k00l133k561P29M075J826m713m058K264L918Q11k533l720o29M752L012
4519C190l493m716N98L012K688j091m512j871M719L715k334m163r35K983L952
4534A742K33n160k824L863M846n93l134k316J514M506J351m451l194L009M470
4549C862P54k407l537l9M682K660l676l566J370L155J874j650l860j155M346K932
4565E745l077l707r3J932K734m41m266j831L640K541k228k955j222J574L181N1
4581A578m247j915L001K482r26k561j578J287L503M31m163j634L026K475jj963
4597a205k012P77L809P37l404j564K422K254Q27j642l188J014M343J319l386k246
4613a145Q78K444K144j448l903R0M198J398l235k809L9K842L011j936m972n12
$$ plain form
4503 3350 3150 17 -2544 -1815 2260 4086 -627 -4685 -2421 1497 2308 -225 -3945 -4574 178 3190
4519 3190 -303 -5019 -4421 -1409 1279 188 -4324 -6195 -1476 2239 -95 -4258 -5193 -2210 1742
4534 1742 1975 -3185 -6009 -2146 2700 2107 -1027 -3343 -1829 2677 4028 -423 -3617 -608 3862
4549 3862 4616 2209 -1328 -1367 3315 5975 2299 -1267 103 3258 5132 3482 -378 -1533 2813 5745
4565 5745 2668 -1039 -1132 800 3534 3093 -1173 -3004 636 3177 949 -2006 -3228 -1654 1527 1578
4581 1578 -2669 -4584 -1583 899 -27 -2588 -4166 -2879 624 1055 -3108 -4742 -1716 759 758 -1205
4597 -1205 -3217 -2440 1369 2106 -1298 -2862 -440 1814 2641 999 -2189 -1175 3168 4487 1101 -1145
4613 -1145 -267 2177 4321 2873 -1030 -940 3258 4656 1421 -1388 -1349 1493 4504 2568 -2404 -2916
4629b916M051K064k032l066j441K403L720j558m956r96L633K926q85l617k601
4644e271K056M743J23m512k175K679L224J078l135l352J336N044J232l936k499
4659c365J131L531K548k221m814P41N013K025k560l229q77L508L668j299m956
4674a156o80L867K144r53k796k238K638L975j295m564j402K780K833K87l042l536
4690c138J177M196L60l551j656R52K353J269k748l366J492M039L91k734k069k34
4706c267K961K426j852l760Q52L194J129j787j930k65K326K742j669l561O76L533
4722A748Q54j157k568q60K669K939j592l476K19K488J387m76k559j610K541K915
4738C462j688l345m36K461J882K8l236k713K422L740r26l045j560R68K886J201
$$ plain form
4629 -2916 1135 3199 1167 -1899 -3340 -937 2783 1225 -3731 -4727 -1094 1832 947 -2670 -5271
4644 -5271 -3215 1528 1651 -2861 -5036 -2357 867 1945 -1190 -4542 -3206 1838 3070 -866 -3365
4659 -3365 -2234 1297 3845 1624 -3190 -2449 2564 4589 2029 -1200 -2077 1431 5099 3800 -1156
4674 -1156 -1836 2031 4175 3222 426 -1812 826 4801 3506 -1058 -2460 320 3153 3440 398 -3138
4690 -3138 -1961 2235 2595 -956 -2612 -1660 693 1962 -786 -4152 -2660 1379 1770 -964 -3033 -3267
4706 -3267 -306 2120 268 -3492 -2640 554 1683 -104 -2034 -2299 27 2769 1100 -2461 -1785 1748
4722 1748 2602 1445 -1123 -1983 686 3625 2033 -1443 -1224 1264 2651 2175 -384 -1994 547 3462
4738 3462 1774 -1571 -2007 454 2336 2364 -872 -3585 -1163 2577 1651 -1394 -2954 -1986 900 2101
4754B101l016l117K235L565l61k987k121P52M110K189l573m293J313M152J517
4769B466j664l053o19L487L086k831m045R16L302K284j135l735j628L769M019
4784D619j813m019q35K084L148N50m020k977K784L845n80l093k148R84L725J284
4800C538l847l416K048L741O67k322l347k64L641K726k925l825J100K641J742
4815A898j087l130j153L754K765k325l615O8K382K489P0l612j533K938L108j408
4831A609k480q19J175K692M40l133j316K364K306o55k266j600P57L302R10l203
4847H3j955J638K164K65j849j931L42L075P71k987k291J734K643K89j774k807
4863b590J60L500J461l092k212Q98K442J295j041l231k60L480J430k462k440P80
$$ plain form
4754 2101 -915 -4032 -1797 1768 1407 -1580 -3701 -2949 1161 3350 -223 -4516 -3203 949 2466
4769 2466 802 -2251 -2870 617 3703 872 -3173 -2257 1045 3329 2194 -1541 -3169 600 4619
4784 4619 2806 -1213 -2048 36 3184 3734 -286 -3263 -479 3366 2786 -307 -2455 -1471 2254 3538
4800 3538 -309 -3725 -1677 2064 2731 409 -2938 -3202 439 3165 240 -3585 -2485 156 1898
4815 1898 811 -2319 -3472 282 3047 722 -2893 -2825 -443 2046 2116 -1496 -3029 -91 3017 1609
4831 1609 -871 -1690 -515 2177 2617 -516 -1832 532 2838 2183 -83 -1683 -926 2376 3286 83
4847 83 -1872 -234 1930 2195 346 -1585 -1243 1832 2603 -384 -2675 -941 1702 1991 217 -2590
4863 -2590 -2430 1070 2531 -561 -2773 -1875 567 1862 821 -2410 -2670 810 2240 -222 -2662 -1882
4879a882K280K637j285l943q22L810K139j338k709j116J972L419l71m353p93K984
4895F29K526o03k834k318J495M247N20m089k452K167L079Q64k277l892M93M518
4911B073J277l318k362N07K916J737j765l957m33M340K186k332k908r87K454L476
4927B904j019m126j119L243K112o97k795j692K089L678n5m126j438K278K451L35
4943B023k481k887J436L889O59l278j849P93K215J543j911k992O63L332P63k361
4959d43k088K38J994K123j542l161K77L192J106j742j729n58J481K561j510k875
4975b676Q0K810J312q57j903p54J801K753j164l169j42K125J624p1j948j724J954
4992E1K790o15k898l16J983J681P9k454k099K015L210n53k849j432J338K320J168
$$ plain form
4879 -1882 398 3035 1750 -2193 -3015 795 2934 1596 -1113 -2229 -257 3162 2791 -1562 -2355 629
4895 629 3155 2552 -282 -2600 -1105 3142 3662 -427 -2879 -712 2367 3231 954 -2938 -2445 2073
4911 2073 3350 32 -2330 -1823 1093 2830 1065 -2892 -3325 1015 3201 869 -2039 -3026 -572 2904
4927 2904 1885 -2241 -3360 -117 1995 1298 -1497 -3189 -1100 2578 2523 -1603 -3041 -763 1688 2023
4943 2023 -458 -3345 -1909 1980 2639 -639 -2488 -1695 520 2063 152 -2840 -2177 1155 1918 -443
4959 -443 -2531 -2293 -299 1824 282 -2879 -2602 590 1696 -46 -1775 -2333 -852 1709 199 -2676
4975 -2676 -2596 214 1526 669 -1234 -1988 -187 2566 1402 -1767 -1909 216 1840 1769 -179 -1903 51
4992 51 2841 2226 -672 -988 995 2676 2755 301 -1798 217 3427 2874 25 -1407 -69 2251 3419
5009C419k657k814J606L559O3k531k268M14K663J894k435l463J201L285J327k259
5025A004k756p51L070K564j950l472R2K614J902p05k953j899K954L624j375l581
5041a618j114K014K902M20l481k722K249L851k54k793k140O77L376J535l100l109
5057c307J440L058M92k040k600l04L284K470k267l532L65K840J434r46k759j285
5073c657K651K605j459k997k79J990K225j23k709j727K629K449q24k222j252J762
5089i38K077P38k621j739J927K633l45j618r03N22K369O05k284j944J572K540
5105B591j46j474j579J83K810J099k548k060J378J835M10j268k132k76K940J371
5121C134k620k344J266J452J238j232k764l10K943J713j965k573k5J846J707l95
$$ plain form
5009 3419 762 -2052 -446 3113 3176 645 -1623 -1209 1454 3348 913 -2550 -1349 1936 3263 1004
5025 1004 -1752 -2503 567 3131 1181 -2291 -2199 415 2317 1612 -1341 -3240 -286 3338 1963 -1618
5041 -1618 -2732 -718 2184 2604 -877 -3599 -1350 2501 2247 -546 -2686 -2009 1367 2902 -198 -3307
5057 -3307 -1867 1191 1683 -357 -2957 -3261 23 2493 226 -3306 -2941 -101 1333 387 -2372 -3657
5073 -3657 -1006 1599 140 -2857 -3136 -1146 1079 956 -1753 -3480 -851 1598 774 -1448 -2700 -938
5089 -938 1139 1877 -744 -2483 -556 2077 1732 114 -789 -267 2102 2707 423 -1521 51 2591
5105 2591 2445 971 -608 -425 2385 3484 936 -1124 254 2089 2499 1231 -901 -1177 1763 3134
5121 3134 514 -1830 -564 888 2126 894 -1870 -2180 763 2476 511 -2062 -2087 -241 1466 1071
5137A071l190q07K927J999j398k594q55J772K951J75l629j619K438K395p9k073
5153e16j737R33L578O07l311k140J901K604R08k083k688K62L816J509l008k510
5169a875N06K402J946j261l515m98L244J818j863k659m59J872K614n91l754j278
5185c351K798K384p21k681j660J298L231K62l031j682J648K155L79j565k281N93
5201b224L199R15k928j696J301K352J061j421k438j55L165J343j792j690L71J580
5217I43J658r45k538j28K898J130j595j914j65J482K103q07k775m22K176J130
5233B231p19j776j010J531J743n24k827j99J840J170m03j818j603J388K533o18
5249I39k521q09J269J659L60j627k095J227L006j82k553j278J287K129P50j991
$$ plain form
5137 1071 -2119 -2926 1 2000 602 -1992 -2847 -1075 1876 2051 -1578 -3197 -759 1636 1557 -516
5153 -516 -2253 -1320 2258 2865 -446 -2586 -685 1919 2827 744 -1944 -1682 2134 3643 635 -1875
5169 -1875 -1369 1033 2979 1718 -1797 -2295 949 2767 904 -1755 -2214 -342 2272 1681 -2073 -3351
5185 -3351 -553 1831 1110 -1571 -3231 -1933 1298 1560 -1471 -3153 -1505 650 1029 -536 -2817 -2224
5201 -2224 975 1890 -1038 -2734 -1433 919 1980 559 -1879 -2034 1131 2474 682 -1008 -637 943
5217 943 2601 1656 -882 -1010 1888 3018 1423 -491 -656 826 2929 2122 -653 -1075 1101 2231
5233 2231 1512 -264 -1274 257 2000 1476 -1351 -1550 290 1460 1057 -761 -2364 -976 1557 939
5249 939 -1582 -2391 -1122 537 897 -730 -2825 -1598 1408 1226 -1327 -2605 -1318 811 1561 -430
5265d30k634J114L297N43j912j750K57K383J551j534k746N57K724J231j431k411
5281a191n54K481K606j308l586j64K366J896l49k559k075K003K962q62l027j170
5297b531J729K541L15k677k743J679L173Q9k708j684M20L011J310k236k978J035
5313b255L045O03j633k025m61K751K104j629k908M95K222J344q11k071r82K143
5329f8K661q26k654l76J598J649K22k233j650J737K773p35k060p46R24J778O19
5346B613k300j759J116K580l01j825j002M57J505J195k297j799J232J848K21j427
5362E7j472j16K096J186j935j984J036J557N67j302j520j6K376J185j639k167
5378b091O83J576J043n66k180n17K575J577j603j883j6J657J716m58k711r99K601
$$ plain form
5265 -430 -3064 -1950 1347 1890 -22 -1772 -1515 868 2419 885 -1861 -1304 1420 2651 1220 -1191
5281 -1191 -1745 736 3342 2034 -1552 -1716 650 2546 2197 -362 -2437 -434 2528 1666 -1361 -2531
5297 -2531 -802 1739 2054 -623 -3366 -1687 1486 1575 -1133 -2817 -2397 614 1924 -312 -3290 -2255
5313 -2255 790 1393 -240 -2265 -2726 25 2129 500 -2408 -1913 309 1653 842 -1229 -2211 -68
5329 -68 2593 1767 -887 -1263 335 1984 2206 -27 -1677 60 2833 2098 38 -708 216 1994 2613
5346 2613 313 -1446 -330 2250 1949 124 -878 -421 1084 2279 -18 -1817 -585 1263 1484 57
5362 57 -1415 -1531 565 1751 -184 -2168 -1132 425 992 -310 -1830 -1846 530 1715 76 -2091
5378 -2091 -1408 168 1211 645 -1535 -2052 523 2100 497 -1386 -1402 255 1971 1513 -1198 -2197 404
5395D04J959q36k214o84J071K383J90k965j702K075K470l15j960j923Q02K749
5411A504Q04k783k091J102K487P29j668k509j91L405J359k333k305K2K372J810
5427A714j109l036l83K769K049j607k385o82J974K383j02k828j527K422K267l89
5443A530k061j518J178K669M91k645j605J861J982M39j698k133L34K827J110k206
5459E55j657M27J792R98q54k367L2K253J180j688j850J03J398J669q13k495n79
5476a896K175J570j477j481m93J056J927o00k154o08J819J321q56j471o61R25
5492i04K262m87k287l91J489J534m30j188j226Q63K429k14j992q67J374J495j7
5509A443j311j826J082K579K24k277j209P75J822R35j358k316M05K472N76j839
$$ plain form
5395 404 2363 1527 -687 -1371 -300 2083 2273 -692 -2394 -319 2151 1836 -124 -2047 -1245 1504
5411 1504 2308 -475 -2566 -1464 1023 1752 84 -2425 -2616 789 2148 -185 -2490 -2468 -96 1714
5427 1714 605 -2431 -2814 -45 2004 397 -1988 -2670 -696 1687 1585 -1243 -2770 -348 1919 1530
5443 1530 -531 -2049 -871 1798 2289 -356 -1961 -100 1882 2321 623 -1510 -1176 1651 2761 555
5459 555 -1102 -675 1117 2115 1261 -1106 -1074 1179 2359 671 -1179 -1076 322 1991 1178 -1317 -1896
5476 -1896 279 1849 372 -1109 -1602 -546 1381 781 -1373 -1981 -162 1159 303 -1168 -1829 -904
5492 -904 1358 871 -1416 -1807 -318 1216 786 -402 -1628 -765 1664 1450 -542 -1409 -35 1460 1443
5509 1443 132 -1694 -612 1967 2191 -86 -1295 -520 1302 2237 879 -1437 -1032 1440 2016 177
5525A77j315J47J848J461j463k841K59K506J078j176k080r37K098K583j224l034
5541a913m03K198J423k92k215j595J742K917n33k679j008J402K115O58k162k255
5557b600R02L178M46k080j815N82K062J547j652k554N52K848Q04j744j914q7J861
5574C36K279r51l202j19J981J459m78j717j167J362K277o22k416n11J440J569
5590A520J84j996j709J144K588l82j859q16N30J529P93j648j382P47J969k01j551
5607e40p04K26J844P92j547j902P21J982N56j298j003l18J549J379j567j810R50
5624f90J454L64o02j633m16J772J641j355k254M53J363J198n00j888r01K015J737
5641A758j239j833m2J360J020l4k383q49K053K078j031j849q29Q95K045O03k259
$$ plain form
5525 177 -1138 -991 857 2318 855 -1986 -1727 779 1857 681 -1399 -2336 -238 2345 1121 -1913
5541 -1913 -2316 -118 1305 1013 -1202 -2797 -1055 1862 1329 -1350 -2358 -956 1159 1817 -345 -2600
5557 -2600 -1698 1480 1926 -154 -1969 -1387 675 2222 570 -1984 -1432 1416 2220 476 -1438 -1525 336
5574 336 2615 1664 -1538 -1657 324 1783 1305 -412 -1579 -217 2060 1438 -978 -1489 -49 1520
5590 1520 1704 -292 -2001 -857 1731 1349 -510 -1326 -796 733 1526 -122 -1504 -757 1212 1011 -540
5607 -540 -1244 -1018 826 1618 71 -1831 -1110 872 1428 130 -873 -1191 358 1737 170 -1640 -690
5624 -690 764 1128 526 -1107 -1523 249 1890 535 -1719 -1266 97 1295 795 -1093 -1994 21 1758
5641 1758 519 -1314 -1356 4 1024 990 -1393 -2242 -189 1889 858 -991 -1820 -925 1120 1723 -536
5658e36j866J621K281l49j412j154K38K642J056k587j998J079K567M16j181k237
5674a420j99K534J519j528k107K8J846J286m82k401o68K150J699r20k420o11J348
5691c46K306K22k499j855J697K200j93j835j268N44K360N72k385j533J186J743
5707I16M46j552j540J11K166J116j618j847N07J473J002m32k065l86J967J223
5723A487j546j264J1J241J196j83k111q52K121J455r36j194n40P44J552p8j934
5740h31n50J520J235o06j211n67O85J758Lk165p66J359J433j89j186j275N27K025
5758A199K99j974r66J407R03K85j328j406N74K303L39j930j014M76J463J045j057
5775F18k211L19K304M67j467j225k1J583J506q80k299m0J972J172j114j575j002
$$ plain form
5658 -536 -2402 -781 1500 1151 -261 -1415 -1177 1465 2521 -66 -2064 -985 1582 1998 817 -1420
5674 -1420 -1619 915 2434 906 -1201 -1173 673 1959 1477 -924 -1592 558 2257 1337 -1083 -1694 -346
5691 -346 1960 2182 -317 -2172 -475 1725 1532 -303 -1571 -1027 1333 1905 -480 -2013 -827 916
5707 916 1362 -190 -1730 -1619 547 1663 45 -1802 -1295 178 1180 748 -1317 -1703 264 1487
5723 1487 -59 -1323 -1312 -71 1125 942 -1169 -2021 100 1555 619 -575 -1115 -371 1181 1103 -831
5740 -831 -1381 139 1374 768 -443 -1010 -325 1433 1436 -729 -1495 -136 1297 1108 -78 -1353 -826 1199
5758 1199 1498 -476 -1442 -35 868 1153 -175 -1581 -1007 1296 1635 -295 -1309 -833 630 1675 618
5775 618 -1593 -1274 1030 1497 30 -1195 -1216 367 1873 993 -1306 -1346 626 1798 684 -891 -1893
5792a893J598K445p85k695o40K131J123k23j466j490J339K295m5k592j060J333
5808f25J915N21j773k061M87K673N69j801j554L90J746J336j402k225K38K082
5824E16J071j386j584j82J557J915q73k502k46J607J381k15j500j019R42J948
5840A430l5k127m98J239J246J62j314j466P66K068J98j963q74P16J210O16j069
5857C05j453N60K068j27j156j126K63J102R26j234j505N48J536L24r03j044l56
5874a272J296J370j233j603K98J465M29n62j211o22J585J489r69j852K10J256
5890G4Q47l49j547p81J585J684q99j829P7Q64J712j11j696j206J487J857p86j563
5908e80n66P73K008K86k063j498J189J881L43j416j236l4K086R66j933j929Q23
$$ plain form
5792 -1893 -295 2150 1365 -1330 -1970 161 1284 1061 -405 -1895 -556 1739 1694 -898 -1958 -625
5808 -625 1290 1811 38 -2023 -1536 1137 1706 -95 -1649 -1259 487 1823 421 -1804 -1566 516
5824 516 1587 201 -1383 -1565 -8 1907 1034 -1468 -1714 -107 1274 1059 -441 -1460 -518 1430
5840 1430 1395 -732 -1230 9 1255 1417 103 -1363 -597 1471 1669 -294 -1168 -452 758 1374 305
5857 305 -1148 -588 1480 1353 197 -929 -666 436 1362 128 -1377 -829 707 1031 128 -916 -1272
5874 -1272 24 1394 161 -1442 -1144 321 750 188 -1023 -1645 -60 1429 460 -1392 -1182 74
5890 74 921 572 -975 -1756 -171 1513 614 -1215 -1138 -274 1438 1327 -369 -1575 -88 1769 983 -580
5908 -580 -1146 -373 1635 1921 -142 -1640 -451 1430 1773 357 -879 -913 1173 2139 206 -1723 -900
5925i00J990M95r83j797l12K051J303j252k156m2J811J283n49k190j043J868K023
5942A600q18k004m16J033J922n6k100j279J438J913r3j637r91M10J908P43j668
5959i5j514R15J522N44r12j440k50J963J137j492j686N65J337Q93o32j651o31
5976a427J791J391r88j636j67J073Q20J49j811n07J399J111o40j406l76O16J510
5993I02kj810o86J251J206m51q70p03M65J329L59j635q50J041J493m01r84q10
6011a156M66J762K03j535r92R62J250K15r40j492N96J691N49j511r65L10J471
6028H84O65j134j486jJ964Q73j459j085p9J279J084m35j998n42J856J223q41j400
6046f32r13J111J903k13k186r65J618J614l31j458j253N26K445K53k058j237J111
$$ plain form
5925 -900 1090 1585 602 -1195 -1507 544 1847 595 -1561 -1603 208 1491 942 -1248 -2291 -423 1600
5942 1600 782 -1222 -1638 -605 1317 1261 -839 -2118 -680 1233 1140 -497 -1488 -1078 830 1573 -95
5959 -95 -1609 -694 828 1372 460 -980 -1230 733 1870 378 -1308 -743 594 1487 855 -796 -1427
5976 -1427 364 1755 767 -869 -1036 37 857 1006 -805 -1312 87 1198 558 -848 -1224 -608 902
5993 902 900 -910 -1596 -345 861 410 -460 -1163 -698 631 990 -645 -1495 -454 1039 638 -346 -1156
6011 -1156 -690 1072 1275 -260 -1252 -290 960 1175 235 -1257 -661 1030 1579 68 -897 -587 884
6028 884 1549 415 -1071 -1072 892 1765 306 -779 -858 421 1505 1070 -928 -1470 386 1609 768 -632
6046 -632 -1545 -434 1469 1256 -930 -1895 -277 1337 1006 -452 -1705 -1179 1266 1519 -539 -1776 -665
6063f65J356Q10j391j853K34K549R22j739j517J79J565J197q07k059j05K075J072
6080A823j135j451n73J157J747l60j972p69J652J052n02j232q92P97J928L2k011
6097g09q33J030R71M41j231j187N08K023M2j849o50M41J220P52j005j340K43J694
6115E61K94r74r60M14P45J111r24j384M07J512K73o43q56j98J090J096n07j880
6133h23L7J741J93k40j080m62R13J499q08j737M2J329O81n18j011q12J048J336
6151A328l90j986j40J068R60J33j463j303J244J359L3j847m88P07J315M48j505
6168e27j433Q78J913J96j453j203M19J306J280j388j777M61J962N58j149j202
6184a159l72J692J555j101j569j17J271J305m01j523q88J351J838o08j892m66
$$ plain form
6063 -665 691 1501 110 -1743 -1509 1040 1962 223 -1294 -1115 450 1647 840 -1219 -1324 751 1823
6080 1823 688 -763 -1336 -179 1568 1208 -764 -1533 119 1171 669 -563 -1455 -658 1270 1302 -709
6097 -709 -1542 -512 459 900 -331 -1518 -1010 1013 1055 -794 -1444 -1003 217 969 -36 -1376 -1133 561
6115 561 855 -119 -1079 -665 80 1191 267 -1117 -710 802 1075 432 -424 -622 468 1564 1057 -823
6133 -823 -786 955 1148 908 -172 -634 279 1778 970 -767 -725 604 1285 767 -244 -1056 -8 1328
6151 1328 938 -1048 -1188 -120 840 973 -490 -1793 -549 810 843 -1004 -1492 -785 530 978 -527
6168 -527 -1960 -1082 831 1027 -426 -1629 -1210 96 1376 -12 -1789 -1328 634 1192 43 -1159
6184 -1159 -1531 161 1716 615 -954 -1071 200 1505 1104 -419 -1307 44 1882 1274 -618 -1084
6200a084R72J439K26j634j422R82K019k60j305r66L17J352R01j215j785O37J669
6217H43J37p73j347J4J306J415j209j407JJ505N07l03j309n34J205J341r20j246
6235g74j15Q99Q92L1j352p96R43J511m55j307l53P43R66N8j232r68J153J106j93
6254G57q08j009M58J024M16j350r66J075R78j15q97n86J2J412O35j313j089N08
6272h58J295K96o62j165j21J759O92j284j246M99J054P66n62j464r4J643J146
6289A694j196j286m4R89J323l85j730m62J414J273o94j174p24Q58J740j07j724
6306b35q83Q51J525j34j198j029L77J736O10j582j406O03J456N70j252j389jJ875
6324D94J016j467j206K9J123J069m59j552o03J607J180r44j354m32J223J346j33
$$ plain form
6200 -1084 -112 1327 1553 -81 -1503 -521 1498 1238 -67 -1033 -716 636 1537 322 -1463 -826 843
6217 843 980 207 -1140 -1126 180 1595 386 -1021 -1020 485 992 689 -620 -1154 51 1392 472 -774
6235 -774 -889 10 902 933 -419 -1215 -272 1239 784 -523 -876 -133 833 891 -341 -1309 -156 950 757
6254 757 -51 -1060 -602 422 838 -512 -1478 -403 575 460 -437 -1023 -1011 401 1036 -277 -1366 -858
6272 -858 437 733 71 -1094 -1215 544 1236 -48 -1294 -795 259 1025 463 -1001 -1095 548 1694
6289 1694 498 -788 -832 157 1480 1095 -635 -1097 317 1590 896 -278 -1002 -144 1596 1489 -235
6306 -235 -1118 -267 1258 1124 -74 -1103 -726 1010 1620 38 -1368 -765 691 1261 9 -1380 -1381 494
6324 494 1510 43 -1163 -1134 -11 1058 599 -953 -1556 51 1231 287 -1067 -1499 -276 1070 937
6341I37j707q35J342J254r0j049r41M33J747K47j593q63R85R97J87q22j139K27
6359f83J458O37j474p56L89Q83M80m05j204n4J263N78r71p35j2N70R27o24j346
6378a079J31J385L90p19o20k38O22R25k17j541j9J353L90m66p89l41P72J127l93
6397F73j514p7J125Q89k59j108p03O36J507k83j240k70N30R08M13j189j167O77
6415d52J561oj413p55O30J124N51j047j510L91J827K84j105j054J7J177J004q78
6433C46j601N7J748M45n63j424o60J560J228k91j696m63J284J069j8j343j192
6450a514J079J652N6j900n79Q33J534J44j344j428O82J835K28j323r96M34R31
6467C24R46p15j718K91J332N61r09r96oJ167R42p31j736Q6J034O50j00j171o37
$$ plain form
6341 937 -770 -1605 -263 991 901 -148 -1089 -656 1091 1338 -255 -1118 -133 864 1051 229 -910 -683
6359 -683 775 1412 -62 -818 -429 454 934 529 -675 -729 534 1112 141 -594 -606 -36 891 267 -1079
6378 -1079 -948 437 827 108 -512 -750 -128 797 580 -961 -980 373 763 297 -492 -833 -61 1066 673
6397 673 -841 -918 207 1096 837 -271 -974 -338 1169 886 -354 -624 -94 814 1227 38 -1129 -452
6415 -452 1109 1103 -310 -1065 -435 689 1240 193 -1317 -926 901 1185 80 -974 -957 220 1224 346
6433 346 -1255 -1198 550 995 432 -992 -1652 -92 1136 845 -851 -1314 -30 1039 1021 -322 -1514
6450 -1514 -435 1217 1273 -627 -1206 -373 1161 1305 -39 -1467 -785 1050 1278 -45 -1041 -607 324
6467 324 1270 555 -1163 -872 460 1021 112 -884 -890 277 1219 488 -1248 -1162 -128 522 422 -749 -1386
6486a386Q48J183l53j189j66R01P40j88j005q73J105J343m56j166k14M24R93N30
6504A071r37r41M66J139r2o01m31L14P65N19j008q71N34J390r7p88q67J73J250
6523I88L55o36j099L26R74J31n71q47l35J604N73j021j301L05Q65O78n19j411
6541i41l57J124J264p36j436K4O84R15j24j421p67J457R27l75j258m42P08J214
6559D60L03j663r31J119J286Oj067q13K72J565O48j312j439R33J109M84p68j228
6577a036k45J786J018j099j277n1J210Q67j53j392o70J434J032p08j158l36O73
6594a05J189K36j469j013R91J220j82q86q41J78J657J68j158j142R09P94K68o08
6612B06r93O1J239P10j290p92M56R40N48n89j036k20J074P08n77p42j35O88N43
$$ plain form
6486 -1386 -538 645 292 -897 -1063 -162 578 390 -615 -1488 -383 960 504 -662 -876 -452 541 1071
6504 1071 134 -807 -341 798 706 105 -326 -12 753 1272 264 -607 -73 1317 1220 432 -435 -262 988
6523 988 1343 707 -392 -66 908 1039 468 -379 -714 890 1463 442 -859 -554 311 989 470 -941
6541 -941 -1298 -174 1090 354 -1082 -1058 -374 541 417 -1004 -1771 -314 613 238 -1020 -1462 -754 460
6559 460 763 -900 -1831 -712 574 580 -487 -1300 -1028 537 1185 -127 -1566 -633 476 960 192 -1036
6577 -1036 -1281 505 1523 424 -853 -904 306 1173 1020 -372 -1042 392 1424 716 -442 -778 -105
6594 -105 1084 1320 -149 -1162 -171 1049 867 -19 -860 -682 975 1143 -15 -1157 -248 546 814 206
6612 206 -787 -726 513 1223 -67 -859 -403 537 1085 496 -540 -760 314 1022 445 -297 -432 256 799
6631G99q5j157j45J386M50q06o88j81P37O18j99j040l99R55O25l49q12l09M65
6650a35R34q0j310l83Q11O28O3j017q70N80J438q3j326l27L43Q41L10q50r46M63
6670i16J376Q6j122p41M26J196N48q97j346J13J567O00r77r20J78R37R62m08j368
6689g06k51J387Q32o51r34n07J058J263l65j490m51J071R21P4j328p65N45J535
6707A238K0j507o63P15J104J65q19j390K99J714K31j309p47nJ202P73q18j402
6725a199K30J056N41m36j109j03Q18R66l90j098l87J048N73j35q21o31P06J140
6743G69L9j296l04P61P46r7m91r60O51J142Q6j363q3L11Q40O8n19r83O31R77J06
6764A031r21l00l7N98P65r17r13J49J251o2n44p97K08R39P54q83j138J19J043
$$ plain form
6631 799 714 -443 -588 798 1248 442 -246 -427 310 928 729 -311 -710 245 870 521 -291 -600 -135
6650 -135 799 719 -591 -974 -163 465 528 -489 -1359 -779 659 576 -750 -1077 -734 107 417 -433 -1379 -916
6670 -916 460 546 -576 -1317 -891 305 853 -44 -1390 -1277 290 890 -87 -1007 -829 108 1070 662 -706
6689 -706 -957 430 1262 611 -323 -830 228 1491 1126 -364 -815 256 1177 1251 -77 -842 -297 1238
6707 1238 1258 -249 -912 -197 907 1072 253 -1137 -838 876 1107 -202 -949 -954 248 1021 203 -1199
6725 -1199 -969 87 628 192 -917 -1020 -202 764 374 -724 -1111 -63 510 375 -446 -1077 -371 769
6743 769 808 -488 -792 -31 715 618 127 -833 -182 960 1046 -317 -400 -89 751 819 300 -683 -52 925 1031
6764 1031 110 -190 -227 371 1136 219 -694 -545 706 644 100 -697 -489 450 1204 321 -817 -698 345
6783C45J59m22q42mR24Q04p04j037M6Q56O32j57j062o42J334R13n23j165m44J048
6803E9P65m6j074o20Q32J204m23j029l70N37J051R3j062j068P20J268J04r06p73
6822g38q2J243O90q92j409O12R08L42n57j003m35J342Q75o92j424N8R32R47l64
6841C53j353n83J249J195l89j152m23P48R52J95j319p20Q97Q88K48r47p68K72
6859f57J195O49r41j166N82J018J54n72p43Q0R27M60n35r90J08J021K89k59q15
6878a95m77R97R23p78r25J48M33L12J38r47p1P05O58p49n29j40M42N71N5q83m58
6899g70Q90P93n09q05j25K24R95j07j010l19M99Q36j04n69o63N31Q95K18j241
6918c41m04O20O00J63o04r27L90J070L25r44p91M41N92N70n96r69R8J056O97q40
$$ plain form
6783 345 504 82 -760 -764 160 964 260 -777 -731 125 757 600 -462 -1104 230 1143 620 -545 -989 59
6803 59 824 778 -296 -916 -84 1120 697 -332 -702 -165 886 979 -83 -1151 -431 837 941 35 -738
6822 -738 -820 423 1113 221 -1188 -576 332 674 117 -886 -1321 21 896 204 -1220 -1162 -230 717 353
6841 353 -1000 -1583 -334 861 472 -680 -1103 -355 597 792 -527 -1247 -350 538 786 -161 -929 -657
6859 -657 538 1187 246 -920 -338 680 834 262 -481 -401 526 986 451 -539 -431 590 879 620 -195
6878 -195 -672 325 1248 470 -455 -307 126 438 576 -371 -442 263 921 172 -357 -497 -55 516 571 -312 -770
6899 -770 120 913 404 -401 -526 -302 693 586 -424 -743 -244 592 488 -81 -744 -213 682 900 -341
6918 -341 -745 -125 475 638 34 -893 -503 567 892 -52 -843 -402 190 760 164 -805 -707 349 1046 206
6938B06r56o3Q66Q23k76j387l16J060P14l73r04o01O79J200j17j305m55O86J010
6957D91k0o01j022N17J348J73j159p81O51O67O65o59j124J38J468M94j048p93
6975e95l6J135N91m50j211j47J239P53o23q08l12M30J452n48j111l22R71N32j26
6994H14p11p26M81J174q9j272k86N33N27J96q05o41L69J091j53j189j66J40Q24
7013A11J74l94q91J12R38J68o29m06J95N06L90j95j028K81R41J45o13m18P7N46
7033A0O85n49r00K22Q79K95k65o72k23P28P37l29j013p3Q55M39j87q74l34P41
7053A72Q81k33j271l44Q83Q17Q2j144p14O39J206l93q18n64M27Q98K60p66j249
7072a231P79Q94M81r32n80l03J069P75q82r60J26R46M88q9j337j78R55J026p09
$$ plain form
6938 206 -750 -813 53 876 600 -787 -1103 -43 671 298 -606 -1207 -528 672 555 -750 -1205 -519 491
6957 491 471 -130 -1152 -635 713 886 -273 -1054 -403 264 929 270 -854 -716 752 1246 198 -595
6975 -595 -631 504 1095 645 -566 -713 526 1279 656 -152 -464 -34 1418 870 -241 -563 408 940 814
6994 814 103 -623 -142 1032 943 -329 -615 -82 445 641 -164 -805 -436 655 502 -687 -853 -713 111
7013 111 285 -109 -1000 -888 50 218 -411 -817 -622 -116 274 79 -949 -668 273 418 -195 -613 -536 10
7033 10 695 146 -754 -532 347 642 377 -295 -518 210 947 618 -395 -468 387 826 639 -235 -569 172
7053 172 1053 820 -451 -795 88 905 987 -157 -871 -232 974 581 -237 -801 -374 524 784 18 -1231
7072 -1231 -452 442 923 -9 -589 -892 177 952 70 -890 -764 182 670 581 -756 -934 21 1047 338
7091C38r79j03P95P20Mj084n20Q94R58j93j129k21M24Q95J95r90q45P08Q53p3
7111F47n34o35P6O51P97q29j043M10R86p2j14q80l74R20O98q42o13o6Q05L43q5
7132B46q56m17O57R57l63j004J04N75O11j11q80l72O37O88k89o82Q1K17O01M9
7152D49o42p01P02P03Q8p49j94K35P21J38o65q21O94Q84k71l20r10M20Q49K42
7172H52r02n02K74R80k4m67o28k92J120M89p17q72N06P02K27m91q49j89J237L75
7192H29m92q12n0Q20O29l36j032l39R88P10l89r20k52N37R54N0j084q94R18O79
7212E14J34n52p50J49J008M49r29j049M76P40K89k91j174o3J294L56m59j111O6
7231i03O37P50j72j113l82J021O99q13n07j64L65R29j55r02m33P54O35q3m21n24
$$ plain form
7091 338 -641 -744 51 771 775 -309 -829 65 1023 830 -299 -520 -96 799 994 4 -841 -133 720 647
7111 647 113 -522 -446 205 1002 173 -870 -460 526 454 340 -540 -914 6 704 -138 -751 -817 -12 331 246
7132 246 -610 -1027 -370 587 224 -780 -676 -101 510 399 -481 -853 -216 472 183 -499 -418 -201 400 449
7152 449 -193 -894 -192 511 599 -150 -344 -109 612 750 85 -736 -42 842 571 251 -659 -239 610 852
7172 852 -50 -552 -278 702 678 211 -417 -709 411 900 183 -689 -183 519 746 255 -594 -783 454 829
7192 829 337 -475 -525 295 924 588 -444 -783 205 915 526 -394 -646 -109 845 895 -189 -1083 -165 514
7212 514 648 96 -654 -505 503 952 23 -1026 -550 190 479 188 -986 -1049 245 601 142 -969 -903
7231 -903 -266 484 312 -801 -1183 -162 537 -276 -783 -947 -582 347 192 -710 -1143 -389 246 163 -258 -782
7251g82J89Q22L15o23o81O28M02K74k60j032N25P30J76p15l62L18N03L88l82o64
7271b31Q0P61K37n09m57j97P48L86l19p96R2P86K9n57l33k6N14O04k99j002n0
7292e39P38M09l46m75k52M89P17k65j044n1P30M62l6o28p38O00J144k70j121o1
7312e37O25N01K43n64o86J92J050Qp80o82N53O70O32j016r71qJ434J13o58p34
7332f15q2P30Q75p40j017p2R93M32k90q00n49Q02R94j87j437j01Q04M99J16p48
7352c93q33N63J038o2r73k3L36M38M92o56j084N91R79J64n24n49q6O16R94n70
7372D58j077Q1J083J83l88o92k22R01M89m14q52J30O95K32k44o63k89L81N98r5
7392B95n89l72P63J68J69p45l36N62O11l39o01p6n0O68J73n30q05O93P09k91o35
$$ plain form
7251 -782 -593 229 544 -79 -760 -132 270 544 284 -748 -223 507 683 -32 -394 -76 427 815 433 -231
7271 -231 -151 610 847 338 -119 -316 432 818 499 -297 -205 581 610 53 -280 -306 208 812 513 -489 -539
7292 -539 199 608 262 -213 -465 24 741 476 -568 -619 111 573 537 -91 -829 -229 915 645 -476 -537
7312 -537 88 589 832 268 -418 -226 824 832 52 -630 -77 593 1225 209 -762 -770 664 777 119 -615
7332 -615 -697 33 908 168 -849 -921 72 504 214 -586 -1135 -333 661 474 -963 -1064 -260 239 355 -393
7352 -393 -1226 -663 375 313 -660 -683 -347 91 583 -73 -1157 -566 413 577 53 -496 -582 34 1028 458
7372 458 -619 -538 545 728 340 -352 -574 327 816 402 -450 -320 375 607 363 -300 -589 -208 390 295
7392 295 -294 -666 97 265 434 -311 -647 -85 526 187 -414 -490 -540 128 301 -229 -1034 -341 368 77 -558
7413e58q2K52P06K86q74l20O40L68k9n76k14J18P17O36o42r28M74O89K5k95o79
7434b86Q5Q84N07q88m92K80N05N47n21r13rO12Q33o16o95k38N21O70J64j162o67
7455h79J088O15k93p75m14L85Q63K17r40p93O83P79o1m58q44K33R47M56q84p09
7475g84L08N71N44m30q77l35J213N39o53o81j23N80O56O5j185l97N98J001l55
7494B55p79j62J14Q21J36q69o62Q00M72j25j22p91K51R59K33p66o57N92N07m1
7514A66j79o46RQ63L10q73k73K52L64N11k72p08L8P82L27n66m23L73L50J54j23
7535D36n06j62R36L6l41k70m03N62O23k9q63l38O82L10j92q36j03M80O37k96p83
7556d20n8L38N74j17n21o06M58Q36k49o79m86N73O50J76p37o58M61R69m4p12n80
$$ plain form
7413 -558 -640 -388 318 604 -270 -590 50 418 389 -187 -401 -283 434 1070 428 -500 -26 663 688 393 -286
7434 -286 -201 683 1190 302 -190 90 595 1142 621 -292 -301 311 1144 528 -167 -405 116 786 950 -212 -879
7455 -879 209 824 531 -244 -658 -273 590 807 -133 -926 -243 536 475 17 -827 -594 353 809 -75 -784
7475 -784 -476 95 639 209 -668 -1003 210 749 96 -585 -708 -128 528 593 -592 -989 -391 610 255
7494 255 -524 -686 -572 249 385 -484 -1146 -346 126 1 -121 -912 -661 298 531 -235 -892 -300 207 166
7514 166 -13 -659 -650 213 523 -350 -623 -371 -7 504 232 -476 -438 344 671 105 -318 55 405 559 436
7535 436 -70 -232 704 740 399 129 -274 288 911 882 19 -319 363 673 481 -355 -458 22 659 363 -420
7556 -420 -478 -140 434 317 -204 -810 -352 484 235 -444 -930 -357 293 469 -268 -926 -465 504 460 -252 -832
7577h32N42M75L37k63j108M03Q09M68p35o28N6P62O56l31j043n1R10K49j03q27
7597b54k74O47O79j95n86o35O31M19K64p25n93J52J090N1r03m40K70N49J83n02
7617a72q61M12P54K24p23m06n0O18N77m31q65J41O60L25k76n26RM84O91k79o88
7638c82J31L05M33J6m25l53M29P75l25p59P8K57M72m9l30m84K70P72P1p11j92
7659aJ12M15J54n66p29P02M22qm76m09J71M59K63p48n53M54L28K73l89l52o2N53
7681A3L57n26o18P8N30L48k89n17k07R01K60l74o93J29O60K99l1o73j87O28Q23
7702I11l75p28m1L43P01J81j055m55O16R08l12p56k08L37P26R7j029n95N92O35
7722D93J61o74n05P0P83N33p66q36J72O74N26l42q72l66Q07O81n99o92j07N71
$$ plain form
7577 -832 -290 185 522 259 -849 -446 363 831 96 -532 -476 286 942 611 -432 -483 427 676 573 -254
7597 -254 -528 119 798 603 17 -618 13 432 696 -29 -622 -470 620 671 -232 -672 -402 147 330 -172
7617 -172 -1033 -621 133 357 -366 -772 -822 -204 373 -58 -923 -782 -122 203 -73 -599 -590 -106 585 306 -382
7638 -382 -251 54 487 503 78 -275 154 929 604 -155 -77 180 652 603 273 -211 59 831 902 191 -1
7659 -1 111 526 680 114 -615 87 509 501 25 -384 -213 246 509 -239 -792 -338 -10 263 -126 -478 -540 13
7681 13 370 -156 -774 -696 -166 182 -107 -624 -831 70 330 -44 -737 -608 52 351 320 -353 -540 88 911
7702 911 536 -192 -233 110 811 992 -63 -518 98 1006 694 -62 -270 67 793 890 -139 -734 -142 493
7722 493 654 -20 -525 -455 328 861 95 -741 -569 105 631 289 -583 -949 -142 539 -60 -752 -859 -288
7742b88P04p5r67k35M99P31j96m68k04J56O54L19q73n25Q58L45J81m71m23K07
7762g1N43M29o17n72M12L47J26j94n89RN98K98m97n25J90L17L11j54n89j95O63
7783B40L71n41o29QM84L27k11p03j15P08K19m35j96n9J34L43L9p54K08M44L44
7804B26m05k6l49K91O44j22n57k85N05M62n3k06m05J77Q35j40o28k15K97N51K53
7825H50n32o28j0J021J36r25r9M6N46L58l56r06L6Q32L21m42q15J9M83O69j44
7846D60j081k38R63L31j58l42n55M55P67k66o39k52N52L40J46m56o93M93O80J78
7866F85o06n21K48N18M37m05r59M27N91L79n18l93l0K56M76Kq79k55P49L43m80
7887F5k13o15O04P66n03o58k49N18L84j02k92m18J74O99k56n69j60L83K46K41
$$ plain form
7742 -288 416 341 -626 -861 -362 369 173 -295 -499 -343 311 630 -243 -768 90 435 616 145 -278 -71
7762 -71 472 901 284 -288 124 471 597 403 -186 -177 421 719 222 -303 -113 204 515 361 -228 -423 240
7783 240 611 70 -559 -551 -67 260 49 -654 -769 -61 158 -277 -473 -532 -398 -55 -16 -770 -562 -118 226
7804 226 -179 -205 -554 -263 381 259 -298 -583 -78 384 331 125 -280 -103 732 592 -36 -251 46 597 850
7825 850 318 -310 -320 701 837 -88 -187 -141 405 763 407 -499 -463 369 690 248 -567 -548 -65 604 460
7846 460 -621 -859 104 435 277 -65 -620 -165 602 336 -303 -555 -3 337 483 27 -666 -173 507 685
7866 685 79 -442 -194 324 761 356 -603 -176 415 794 276 -117 -147 109 585 587 -292 -547 202 545 65
7887 65 -148 -763 -159 607 104 -554 -803 -285 99 -3 -295 -713 -539 160 -96 -665 -825 -442 -196 45
7907D5m31m81K49N07k7m46k03K88N26J54m66l19K32O04m8l71k54K58N05J79l94
7928A07n49K30O39K52n44j26n1M67M57m69n51J86N14J27l62l03k14M97O13m55
7948D65o39k38O32L02j63o86j15M09O50k10o75k30M65L88K87p88o97P71M96k0
7968D04o25k29J46N72K17m08o80M39O97lk38o34R6O51K40m99n39j8P82L58r9q22
7990a92l51P95O60k16r37j72L95N64j47k98m53P2R88j96o10l44J16N91J29m31
8010c7o81K28P16j05l11l87j42P16L58p87l24L16L28L77j59n98j44L40N02l25
8030a19o34K97M68n8J16k60m67O80L82l16l12p2K52M61j41m42j54N20N13m74m05
8051a65o1K52L64l5o63l96Q41L15j90m20l5j28N42L4m96j07K73K40J6n14k07J78
$$ plain form
7907 45 -386 -867 -618 -111 -138 -584 -787 -499 27 181 -285 -604 -372 232 184 -187 -441 -183 322 501 107
7928 107 -442 -212 427 679 135 9 -42 425 882 413 -138 48 562 689 327 24 -190 307 920 465
7948 465 -174 -412 220 522 359 -327 -442 -33 617 407 -268 -498 -33 355 642 -146 -843 -72 424 404
7968 404 -221 -450 -304 268 485 77 -603 -164 533 530 292 -342 -246 405 645 146 -393 -411 371 729 630 -192
7990 -192 -543 252 912 696 -241 -413 -18 546 399 101 -352 -280 708 512 -98 -442 -326 265 394 -37
8010 -37 -718 -490 226 121 -190 -577 -719 -3 355 -432 -756 -440 -112 265 106 -492 -636 -296 206 -119
8030 -119 -753 -456 12 -46 70 -190 -657 23 405 89 -223 -295 -43 418 277 -165 -319 201 714 240 -165
8051 -165 -226 26 390 355 -308 -704 137 452 262 -158 -193 -321 221 255 -241 -348 -75 165 181 -333 -540 -362
8073c62N09L65p71l79K50N58J23j55o67L0P49J55n08m86K47O12J56q8o09k35Q04
8094B98L95o53l26j28N28O75l37o63l87R09M02k60m43k54K51M83K01o10m70L32
8114e7O10p7j66q40J59P61M51o27n87J36M57M65m32p07O6N85M19n88m64L9L85
8135a2L12k62n52j25O24L58k46n03j12K23M76L5q08k3M06L09o5j94l33J57N72
8156B37ql24m59M81J11N4j97m21P7O40M1l89j41J58J97K19l43j98j51M34K54n07
8178b35j14J02K31M59m98m59J89O03q6l58J23k35K02
$$ plain form
8073 -362 147 512 -259 -638 -388 170 293 138 -529 -499 250 405 -103 -589 -342 270 426 338 -271 -506 298
8094 298 693 40 -286 -414 114 789 452 -211 -598 311 713 453 10 -244 7 490 691 81 -389 -57
8114 -57 553 476 310 -530 -371 390 841 214 -373 -237 220 685 253 -454 -388 197 616 28 -436 -397 -12
8135 -12 300 38 -514 -639 -15 343 97 -406 -518 -295 181 216 -592 -615 -209 100 35 -159 -492 -335 237
8156 237 229 -95 -554 -73 38 92 -105 -526 -449 191 232 -157 -298 -140 57 276 -67 -265 -416 18 272 -235
8178 -235 -349 -247 -16 443 -55 -514 -325 278 192 -166 -43 -278 -76
8191g6
$$ Imaginary data points
##PAGE= N=2
##DATA TABLE= (X++(I..I)), XYDATA
0@%%%%%%qJ6j6J6k4L2m0M8n6P2q8J04j22J43j70J99k29K64l04L49l99M52n11N79
30C07o53P32q21R23j031J147j276J417j572J744j933K139k369K626k907L222l581
47a886L986m450M993n629O388p320Q492j0013J2082j5079J9828k8548M9813j95600
61a62943l26574K32465K14394L0287j27900n4663J3129M1000n0943o4383M2893
72b13238J49272N7164q5947j40859m0095J03973J45012J7264o8947l3180J910
83a07671n482M3772N9294j0738l8020K5032M4150L027l9654m3930K3902J04412
95E8094L4596j03308p0701Q3091J06629j3099j11719p6983P2050J53721J5258
106A47629j58774j06430P2475J17658J6906p0284l4968P2383N7577j00639j34049
$$ plain form
0 0 0 0 0 0 0 0 -8 8 -8 8 -16 16 -24 24 -32 40 -48 56 -66 77 -93 106 -123 141 -163 186 -213 239 -272 307
30 307 -346 386 -435 488 -543 604 -672 745 -827 917 -1016 1123 -1246 1380 -1527 1695 -1886
47 -1886 2100 -2350 2643 -2986 3402 -3918 4574 -5439 6643 -8436 11392 -17156 32657 -162943
61 -162943 -489517 -257052 -42658 -12371 -140271 -194934 -181805 -140805 -191748 -256131 -213238
72 -213238 -63966 -6802 -92749 -233608 -273703 -169730 -24718 -7454 -76401 -109581 -107671
83 -107671 -113153 -69381 -10087 -20825 -58845 -33813 10337 13364 -26290 -70220 -46318 58094
95 58094 92690 -10618 -81319 1772 108401 95302 -16417 -93400 -21350 132371 147629
106 147629 -11145 -117575 -45100 72558 89464 19180 -15788 56595 114172 13533 -120516
117a20516M7221J64539P2037o1401j12364p5800L6081J08573N0150j9063p237
128H2220j1714n1168l7828J6151N6155P2853L5231m3602p6947n7798j4127P7546
140D6972J31123J8409j23607q7947L3477O1108J1677l3557k6924M2685N5402o4876
152F3942j32826o650J28431Q7492n1377j28275o0588Q4104R8247n6333j29468
163a03301q959J00646N9018m2665q9878l5569N8006N1279m2480n2148K5849N2920
175b7282J8085k9094p5668m7659O7790J10877K0146o3332o9960l2041M4026R0946
187F834K6329n3570k7744L1147K4415k5412n0343Q030J13029R0882p8955j53729
199h9087k4894J15183J14778J0216r7053q6009L8691Q3511j5072o5244J4926P5106
$$ plain form
117 -120516 -73295 91244 163281 101880 -10484 -86284 -50203 58370 108520 89457 82220
128 82220 70506 19338 -18490 -2339 53816 126669 161900 118298 41351 -16447 -30574 46972
140 46972 178095 196504 72897 -15050 18427 79535 91212 57655 30731 73416 128818 63942
152 63942 -68884 -75534 52897 140389 89012 -39263 -99851 -15747 82500 26167 -103301
163 -103301 -112260 -11614 47404 4739 -85139 -120708 -62702 -11423 -53903 -106051 -80202 -27282
175 -27282 -9197 -38291 -113959 -161618 -93828 17049 37195 -26137 -96097 -128138 -84112 6834
187 6834 33163 -20407 -48151 -17004 7411 -18001 -68344 -60314 52715 143597 64642 -89087
199 -89087 -113981 1202 115980 126196 29143 -56866 -18175 65336 50264 -14980 -54 75052
211G5052L1005n9943j05095k9448R9173J00375k3261q4591m2674Q415L7845K7525
223C4378k8307l9009K0827L9954p098l4651l0355m098M4231M0848l3619n4375
235e1274J1094M5103J6617k3689n2589k1880P1400Q1514l2124r4391k7072M8243
247b9048N1209M482m0457j4200N0304K6956o0049n8702K5961P5258N0416k8764
259E3366r5905m6988O9487P7369j1829m4713j1756J0957J1449j1489l7580K521
271c5111O4829L7496m1253o4545k8756L1736P5852L0047o3738o1714J8515M6565
283I923J2921j9577l0653M462N4437J9776o1695n2479K9823O6094L0475l8499
295B5008p5351p128Q7370N3434n4465o8349L732N3096M3312j8214o8286j8812
$$ plain form
211 75052 106057 46114 -58981 -88429 10744 111119 87858 3267 -39407 -30992 6853 34378
223 34378 6071 -32938 -12111 27843 20745 -13906 -44261 -48359 -4128 36720 3101 -51274
235 -51274 -40180 4923 21540 -2149 -54738 -76618 -5218 76296 44172 -50219 -77291 -29048
247 -29048 22161 26643 -13814 -28014 22290 49246 -10803 -69505 -43544 31714 82130 53366
259 53366 -42539 -89527 -20040 57329 45500 787 -10969 -12 11437 -52 -37632 -35111
271 -35111 29718 67214 25961 -38584 -67340 -35604 40248 70295 6557 -55157 -36642 9923
283 9923 22844 3267 -27386 -22924 31513 51289 -10406 -62885 -33062 33032 63507 25008
295 25008 -50343 -57471 29899 83333 28868 -39481 -35749 17347 60659 42445 -25841 -44653
307d4653O8080N1139l3996n7972j3154M1168N2233j5778p8499k2798P0393N9412
319G5575j8254o0673m8549J3064P1370L1540n4987m8848K1610M1405L940l8015
331a0822m2600K0850P6480K0178p1845o3550J1743N7019M5679j6529o7978k0119
343f1494O0253L9132l7379m7291m22M0405L9205j9274o3649r271O2110M0160k6220
356A6265m7788k3481K7757N7210M150n9926k5968M2568L8300p588l3776k5115
368c7392J9883M8959l2n3173k1859L3542L7798P888l1209m2137J2794N9067R758
381D3887n2163k9833K1520L5807J7527k4025m1417R205N0718Q149m2992k9555
393c3172J1474L9977L0512k9687n8377O004O0539K0818l4851l6841n678L3741
$$ plain form
307 -44653 23427 74566 40570 -17402 -30556 10612 62845 47067 -31432 -54230 16163 75575
319 75575 57321 -3352 -51901 -38837 32533 64073 9086 -39762 -18152 23253 27193 -10822
331 -10822 -53422 -32572 43908 64086 -7759 -71309 -59566 -2547 43132 26603 -41375 -61494
343 -61494 -1241 37891 512 -46779 -47201 -6796 32409 13135 -50514 -59785 2325 42485 16265
356 16265 -31523 -55004 -27247 29963 34113 -25813 -51781 -9213 29087 21499 -12277 -37392
368 -37392 -17509 31450 31418 -21755 -43614 -10072 27726 35614 4405 -37732 -24938 34129 43887
381 43887 -8276 -38109 -16589 19218 36745 12720 -28697 -19492 31226 39375 -3617 -33172
393 -33172 -21698 18279 48791 19104 -39273 -33269 27270 48088 13237 -23604 -29282 4459
405D459L8050k0137n4777P74N3412K8154k4676m7454k1954M1032N6471j7750o4226
418b8622j1149M6567L7589n642m5317l7533L0380O1471l917n9027k6217L1949
430i468M9114J4395m8258n2810K4427O5090P079m9398l5588J1569M8667L4452
442E9271l7262o3855O259O0406K4262l3720m6408r835M6677M6410k8894o3772
454d0461n096M7601L1295j3318m7266l1426L6142N7267j3540o1001j9429L4545
466b4687M0229L052m6053m1417K8426N5052j955m5472k5116J5889M1863K2865
478B2676l8413m9597J8984N5000Q796l3934k7214O433M2391L0902l0894m7321
490d2191J0162M5825J9868j5589l0642q823L9913L8180k5840m5267P261L9865
$$ plain form
405 4459 42509 22372 -32405 -31631 21781 49935 25259 -22195 -44149 -3117 53354 35604 -28622
418 -28622 -39771 6796 44385 38743 -6574 -44107 -13727 47744 43827 -15200 -41417 -9468
430 -9468 39646 54041 5783 -47027 -22600 42490 49569 171 -35417 -23848 24819 59271
442 59271 22009 -41846 -35587 24819 49081 15361 -31047 -40882 5795 52205 23311 -40461
454 -40461 -45557 2044 33339 20021 -27245 -58671 -22529 34738 21198 -39803 -59232 -24687
466 -24687 15542 18594 -27459 -68876 -40450 14602 12647 -32825 -57941 -42052 -189 22676
478 22676 -15737 -65334 -46350 8650 17446 -16488 -43702 -37269 5122 36024 5130 -42191
490 -42191 -32029 13796 33664 18075 -12567 -21390 18523 56703 30863 -14404 -7143 32722
502C2722K0714j1763l4720j5072L8089M0242j9604m3276o422K4931K5316k252
514D8905l8769k2683L6794L8499k2229m4885j2271K0026K9983L677m2343l2703
526c7999K8030L8852q919l7646k3340J2156L9090R889m9757l8857K8859M6149
538F507M559k9843l3629o85M3147K3391m0068m0360K1295M8848J9689k6571m7949
551e1669o749N5818L9154l0723m3806K998L6484L2621p451m7485j6549N1765M6197
564F0605k3416n0199j6095L1745M9988O897n2244l2091L6177M4260o124l8925
576A0578l0116J4094N2535J7403n2731m5443K3605M8096J3440k9704m3197l152
588b4592M5719K1924m0219l8856J3276M0390K4612k0731n4271j6874M7746L8117
$$ plain form
502 32722 53436 41673 6953 -8119 29970 70212 50608 7332 910 25841 51157 48905
514 48905 10136 -12547 24247 62746 40517 -4368 -16639 3387 33370 37047 -5296 -37999
526 -37999 -9969 28883 19964 -17682 -41022 -28866 10224 20113 -29644 -68501 -39642 6507
538 6507 11066 -18777 -52406 -53091 -9944 13447 -26621 -66981 -45686 3162 22851 -3720 -51669
551 -51669 -58418 -2600 36554 5831 -37975 -34977 1507 34128 26677 -20808 -37357 14408 60605
564 60605 37189 -13010 -29105 2640 52628 59525 7281 -24810 11367 55627 49503 10578
576 10578 -19538 -5444 47091 64494 11763 -33680 -10075 38021 51461 21757 -21440 -24592
588 -24592 21127 43051 2832 -36024 -22748 17642 42254 21523 -32748 -49622 -1876 36241
600C6241k2321l7543o697K1636K7494l302l8555j2673M0099L0382k0290m0039
612b5568k0005K3129N1449J5488m3308l3153J9022K5084k702j8852j5696J5171
624i941L9954L406m9831l1663K4734L9942J2625k5001l9975j329L9704J0128l6732
637b3979k0133K2272K9370O346k8557m1514K353M5721J7479k8985k3358O612K2659
650a3714J4120k1382l7267Q743M8803J8662k6984l1780j0078K2785L8949L621
662A4478l4783j0417K7723J6485j4087k4443n999L7262N1096r065o1893k8812
674d2455L4240N0902J9745k7907m2274P258M5615M750m0217j1285L7936M1542
686G7850k052n4030m9220K6250P1657K1141m1809m0430k956K8222K5028j6962
$$ plain form
600 36241 13920 -23623 -30320 -8684 18810 15508 -23047 -35720 4379 34761 14471 -25568
612 -25568 -45573 -22444 29005 44493 1185 -31968 -12946 12138 9436 -9416 -25112 -9941
624 -9941 30013 33419 -16412 -48075 -23341 16601 29226 4225 -35750 -37079 2625 12753 -23979
637 -23979 -44112 -21840 7530 13876 -14681 -56195 -53842 -8121 9358 -19627 -42985 -36373 -13714
650 -13714 406 -20976 -58243 -49500 -697 17965 -9019 -40799 -50877 -28092 10857 14478
662 14478 -20305 -30722 -2999 13486 -601 -25044 -31043 6219 57315 48250 -13643 -42455
674 -42455 -8215 42687 62432 34525 -7749 -491 45124 49874 9657 -1628 36308 77850
686 77850 75798 21768 -27452 -1202 70455 91596 49787 9357 6401 34623 59651 42689
698D2689l4059J0215M0390M155l6186l4025m044L5051M1069j1395n1365k0602
710a8107K3482K5788K45k9598l0005J9940N0205j101n6240l6256J7984M1743K0321
723B8401k9591m3524Q711M2363l394m7576k2545K9542N0897J3979n3874o2560
735h9171J1098N7850K2180k0728k0281m086R285L833k0565j4095L1305L9240m494
748A371l5499l1607m816L4669M3903J243l1502j7902K648J2137J5377Mj1498J3728
762g744K5645j2614l8475q813L3009M4024J2553m2352m5505K0523N3032O074l4656
775D701j6663K1288L4604K631m4903l0480L6967M9513r187m2304j4372K4605L2518
788D8918n538m7006k1092M1047M3307o890l4528k8878n279K5734K6720o838j5828
$$ plain form
698 42689 8630 18845 59235 63390 27204 -6821 -10865 24186 65255 53860 2495 -18107
710 -18107 5375 31163 31408 1810 -28195 -8255 41950 40849 -15391 -51647 -33663 8080 28401
723 28401 -1190 -44714 -36003 6360 2966 -44610 -67155 -37613 13284 27263 -26611 -89171
735 -89171 -78073 -20223 1957 -18771 -39052 -43138 -33853 -30020 -50585 -64680 -33375 5865 1371
748 1371 -34128 -65735 -70551 -35882 8021 9264 -22238 -40140 -37492 -25355 -9978 -9974 -21472 -7744
762 -7744 17901 5287 -33188 -42001 -8992 35032 47585 5233 -40272 -19749 33283 39357 4701
775 4701 -11962 9326 43930 46561 1658 -28822 8145 57658 48471 6167 -8205 16400 48918
788 48918 43380 -3626 -24718 16329 59636 52746 18218 -10660 -15939 9795 36515 29677 13849
801A3849L410K554j1233j2830j2017O107M1524L2575k8908o1785k9247K7895O1823
814C3717L0747m1371n3708Q453L7076m197l1536m411L7252M2677j4897p6359m1366
827g7923N5057P4342K717n3839m2342R346M3538J3301l5330j8565L1336K5736
839B7374j7174l2029j5184J5382L5706J2103k9206k5812N244J7990J5709n55k9406
852a9858k2171K4712L6608j727l1349k5904M545L7524K4970k8349l4182J7123
864a8058L3011q922l7985j5491L6360N8318J617o9692m8491L3673N9054J6511
876C9905k3728k7280j00J9915n712l0205Q238N1974K5017l1008m8598k3474K3798
889b1258N0977K1772k1787k3041r744p463M365J4016L436K091J1415l412k5015
$$ plain form
801 13849 17259 19813 8580 -4250 -16267 -10160 31364 63939 35031 -26754 -56001 -28106 33717
814 33717 64464 23093 -30615 -22162 14914 10717 -20819 -25230 12022 54699 39802 -36557 -77923
827 -77923 -22866 51476 54193 354 -41988 -32642 10896 24197 -11133 -29698 1638 27374
839 27374 10200 -21829 -37013 -21631 14075 26178 -3028 -28840 -23596 -5606 10103 9548 -19858
852 -19858 -42029 -17317 19291 17564 -13785 -39689 -35144 2380 27350 -999 -35181 -18058
864 -18058 14953 6031 -31954 -47445 -11085 47233 48850 -20842 -69333 -35660 23394 39905
876 39905 16177 -11103 -11203 8712 3000 -27205 -18967 33007 58024 27016 -21582 -45056 -21258
889 -21258 29719 51491 29704 6663 -3081 -10544 -6179 7837 11273 13364 24779 21367 -3648
902c648j7009M519K3693L0935k866m7719k9630K8084L6966j853l0736k2821J6784
915a5301M1179J79m9270k0242L8798L2558j8050l9481j1075L6969M1379k0074
927A7569o0545j2431M9653M1947o926l9941l0213J5759L9462N241k4439m291J4970
940E815L610j0702j6562r570K4331M2686O364l8027l8805p241L2544M8457N942
953D8842m6478l2560J5805K5456K414j4338p186K3393K9289k3095o1535j3507
965e3500N4192N1945n850n3343m3474J9353N2925O851l8496j4433K3845J9431
977A9446p713k7968j6316K4588L7095p463l9085j5249J8418K6458J1463j9596
989D078l0715M366L3419J4321j2670k0270j4952Q627K7094L124k3384l377K1354
$$ plain form
902 -3648 -20657 -16138 7555 38490 35624 -12095 -41725 -13641 23325 21472 -9264 -32085 -15301
915 -15301 25878 26057 -23213 -43455 -4657 27901 9851 -29630 -40705 -3736 37643 17569
927 17569 -42976 -55407 -5754 36193 29267 -10674 -40887 -25128 14334 19575 -4864 -9155 5815
940 5815 9425 -1277 -17839 -27409 -3078 39608 45972 7945 -30860 -38101 -5557 42900 48842
953 48842 2364 -30196 -14391 11065 13479 -859 -8045 15348 44637 21542 -39993 -53500
965 -53500 692 52637 46787 -6556 -50030 -30677 22248 29099 -9397 -23830 15 19446
977 19446 11733 -16235 -32551 -7963 29132 21669 -17416 -32665 -14247 12211 23674 4078
989 4078 -26637 -22271 11148 25469 12799 -7471 -22423 -13796 13298 16422 -6962 -10339 11015
1002A1015P812j6317k3265n259L3011L9274j4020n3080k0958K6919L3957Q951
1014B8040k1993k4514J0106K3300j2203k6958Q447L2949J5188j8927l9797j8681
1026d5043L3352M4149l890l4799j7259O282J7416J2236r840j3440J3714J6796
1038A9674j4500k4774l614J8288K8532J0859l0089l5678Q900L5711J6036j3234
1050A6111k6383j1151K4987K6956j7198l2686M047K8203J2028j5038k8961o530
1062b5615L6048K9988k6393m5625k857L5868L2085n448m2475k7901K6167L6853
1074B0695n388k6506p299J4120J8407k566l3052j8103L2373L9239n586l5750k6668
1087c6084P038L9942K6672k4027l6588K755K5596J2502q223j8973k581K8104J9305
$$ plain form
1002 11015 18827 2510 -20755 -26014 6997 46271 32251 -20829 -41787 -14868 19089 28040
1014 28040 6047 -18467 -8361 14939 2736 -24222 -15775 17174 32362 13435 -26362 -45043
1026 -45043 -11691 32458 28568 -6231 -23490 -17208 208 12444 2604 -10836 2878 19674
1038 19674 5174 -19600 -23214 -4926 23606 34465 4376 -31302 -22402 13309 29345 16111
1050 16111 -10272 -21423 3564 30520 13322 -19364 -15317 12886 24914 9876 -19085 -25615
1062 -25615 10433 40421 14028 -31597 -34454 1414 33499 28051 -14424 -42325 -16158 20695
1074 20695 15307 -11199 -18498 -4378 14029 11463 -21589 -39692 -7319 31920 26334 -9416 -36084
1087 -36084 -29046 10896 37568 13541 -23047 -20292 5304 17806 9583 -9390 -11971 16133 35438
1100C5438k6276l3831P380L4331K2819j1877l9356j8728L1934L5767r750l0718
1112b867j1367J2224K0406K366k6419j5563K4525K4037j4804k9390j0305J5677
1124a1480K8233M527l3711k6184J6982K7790K801j6410j8989j566K2565J1415
1136E973k2733j7747J5264K0184J6j6112j9005M765L3279J5975k5756k6701O518
1149b6080K2686J6993l888k3139n873K5421J4349j8373j5674R607K1058J3853
1161C0940j1545l0840m510L4399K3017j4796k4906p966J4588K5121n06k9779j0555
1174g338K5061J7379j2070k1672j0302J5171K8057k751l7749j8022K3089K6860
1186B5713Q89k4438k7213N702L4316Q611l0335k1238J2274K1816P770j9345k9317
$$ plain form
1100 35438 9162 -24669 -17289 17042 39861 27984 -11372 -30100 1834 37601 27851 -2867
1112 -2867 -14234 -2010 18396 20762 -5657 -21220 3305 27342 12538 -16852 -27157 -11480
1124 -11480 16753 21280 -12431 -38615 -21633 6157 8958 -7452 -26441 -28007 -5442 5973
1136 5973 -16760 -34507 -19243 941 957 -15155 -34160 -29395 3884 19859 -5897 -32598 -26080
1149 -26080 -3394 13599 9711 -13428 -19301 6120 20469 2096 -13578 -3971 17087 30940
1161 30940 19395 -11445 -15955 18444 41461 26665 1759 -6207 8381 33502 32996 3217 -7338
1174 -7338 17723 35102 23032 1360 -8942 6229 34286 31535 -6214 -24236 -1147 25713
1186 25713 26602 2164 -25049 -19347 14969 23580 -6755 -27993 -15719 6097 13867 -5478 -34795
1199c4795M503L8112J3733k8863k7906L223K7615K4137j2229l7610o280L3499
1211b861K1401j3616k3860q227J9275K8943n017l5699r571K9913K4584o249k6119
1224g103j9460J5221L6760M440l2969j8583J5233K2726P300j7284k4833O313L2800
1237B0561O665k7828j9280Q410K2330J4462j5172l0768J37L0409J2625j7515j9423
1250a4387k630J7324K0485r295k9606k453K6714J3309j1493j7618p488J6138K3373
1263B2373o451k8166m062K2190J5087m479j8411j3728J4457K6600m047k6114o193
1276a0944J5948J4024j64j7315j6374J3617K6255m023k6812j0584J1600J8381
1288A3609O947j9590k3875R739K6390o70k2226j2720O001J9511J1003k1333k8033
$$ plain form
1199 -34795 -30292 7820 21553 -7310 -35216 -31993 -4378 19759 7530 -30080 -36360 -2861
1211 -2861 18540 4924 -18936 -27163 -7888 21055 16038 -19661 -29232 681 25265 19016 -7103
1224 -7103 -26563 -11342 25418 29858 -3111 -21694 -6461 16265 23565 6281 -18552 -12239 20561
1237 20561 27226 -602 -19882 -11472 10858 25320 10148 -20620 -20483 9926 22551 5036 -14387
1250 -14387 -17017 307 20792 11497 -18109 -20562 6152 19461 7968 -9650 -17138 -1000 22373
1263 22373 15922 -12244 -16306 5884 20971 16492 -1919 -15647 -1190 25410 21363 -4751 -10944
1276 -10944 5004 19028 18864 1549 -14825 -1208 25047 21024 -5788 -16372 -4772 13609
1288 13609 20556 966 -22909 -13170 13220 12550 -9676 -22396 -16395 3116 14119 -7214 -35247
1301c5247Q538K9172O635j7645k0011k798K2182J9261j7328k8315N608K6920J1565
1314H537j2361k3523r429K5844K8712j1181l0363l866K1257J8815q97k3588j4931
1327b6974K3375L0823p629k9313j0791J5729K7351J0177k5521k6503J4380L1105
1339B6209K313k1322j6033N787K6156J4397k5094l0045R375L0567J1277j4937
1351A8650k4898p721K4269K2440j6239k8234J988K2501J3607q298k6077j3095
1363b1107K3849K7514r181k6787q362J2818J7799L551k1967j6233J9369K4847
1375B6110p297k3689j1474Q836K3565J0547k1082k1959J0244K0537o7j3720j1321
1388a0770L815K0790Q687k4051k2153J0973K1820N620r942j7968o333J7795J2359
$$ plain form
1301 -35247 -26709 2463 9098 -8547 -28558 -31356 -9174 10087 -7241 -35556 -29948 -3028 8537
1314 8537 -3824 -27347 -36776 -10932 17780 6599 -23764 -27630 -6373 12442 11545 -12043 -26974
1327 -26974 -3599 27224 19595 -9718 -20509 -4780 22571 32748 7227 -19276 -4896 26209
1339 26209 28522 7200 -8833 -3046 23110 37507 12413 -17632 -8257 22310 33587 18650
1351 18650 -6248 -13969 10300 32740 16501 -11733 -9745 12756 26363 18065 -8012 -21107
1363 -21107 2742 30256 21075 -5712 -14074 -1256 16543 20094 -1873 -18106 1263 26110
1375 26110 18813 -4876 -16350 -7514 16051 26598 5516 -16443 -6199 14338 14271 551 -10770
1388 -10770 -6955 13835 22522 -1529 -23682 -12709 9111 14731 4789 -13179 -19512 -1717 10642
1401A0642j7324j6756Q501J6500N148j1358k2342m988K4392J7931j4669j9703
1413b4026p52J1396J1439k900j9669m683K5117J5955j6060k2392l477J6077K3883
1426I908L058k5348j3469J9131J7972n789j4887o004J3566K4809Q16l1164j7149
1439b4550K0976K7280N160j6443k1442J272K5894R354k2480j4705J4174K1007
1451B5497N085j8870k8400M10L4066J8293j9936k4531k681J5114J5961o344k5345
1464a1681m400K6261J5402j6993k4961q973J6318K8418K279k9704j6652J6324
1476h362J7920k188j5824j2543J0986K8307K664l1957k0078J5222K6715J1826
1488B2688j3153k5265j657K5320R955j8828j2905J1275J8691Q108j7410k8520
$$ plain form
1401 10642 -6682 -23438 -14937 1563 6711 -4647 -26989 -31977 -7585 10346 -4323 -24026
1413 -24026 -24778 -13382 -1943 -4843 -24512 -29195 -4078 11877 -4183 -26575 -30052 -13975 9908
1426 9908 12966 -12382 -25851 -6720 11252 5463 -9424 -15428 -1862 22947 23763 -7401 -24550
1439 -24550 -3574 23706 28866 12423 -9019 -7747 18147 27501 5021 -9684 4490 25497
1451 25497 30582 11712 -16688 -16278 17788 36081 16145 -8386 -11067 4047 20008 13664 -11681
1464 -11681 -16081 10180 25582 8589 -16372 -25345 -9027 19391 21670 -8034 -24686 -8362
1476 -8362 9558 7370 -8454 -20997 -10011 18296 20960 -10997 -31075 -15853 10862 22688
1488 22688 9535 -15730 -17387 7933 17888 -940 -13845 -2570 16121 24229 6819 -21701
1500b1701J209L2662J7725j4018j9351o633Q500J4904k367j8061J56J9712N360
1513A8097j6221j6175m577J4845K3382n01k5748j3089J0415J1545J043p859j0237
1526a5080O239J8092l520k4074q289J5228J7846N238j4147k0335M739K4005K506
1539H448k0592q026J3112J7880M631j9319k2366R941L0176O397j7162j1711L980
1552d611J2321O506j4310j6262J4032K7417J404k1925j8719p31K0615K2733o271
1565B2199k3878n412J1497N506l952r088m309J6223J9182j3980l2206p963K1910
1578d271K5911N585k4813k8247P233K8496L308k0880j0023J1249J8880L286k6298
1591a0584k3583J8366L5272K852k5917j9993L901K2819J4753j6466k2496Q679
$$ plain form
1500 -21701 -20492 12170 29895 15877 -3474 -10107 -1607 13297 10930 -7131 -6975 12737 18097
1513 18097 1876 -14299 -18876 -4031 19351 18850 -6898 -19987 -9572 1973 3016 -4843 -15080
1526 -15080 -8841 9251 5731 -18343 -26632 -11404 6442 11680 -2467 -22802 -18063 5942 8448
1539 8448 -12144 -20170 -7058 10822 15453 -3866 -26232 -16291 13885 20282 3120 -8591 -4611
1552 -4611 7710 14216 -94 -16356 -2324 25093 26497 4572 -14147 -14878 5737 28470 22199
1565 22199 -1679 -7091 4406 9912 5960 -3128 -7437 8786 27968 13988 -18218 -26181 -4271
1578 -4271 21640 27225 2412 -25835 -18602 9894 13202 -7678 -17701 -6452 12428 15714 -10584
1591 -10584 -34167 -15801 19471 22323 -3594 -23587 -19686 3133 17886 1420 -21076 -12397
1603a2397K3634M728j3590j5944l450J8111J9190q547k0191j617J2280Q352j768
1616H791j3258j0375J6460K3891n774k7169j4107R837K3687J4254j6494k5159
1628a5416L894J9718j85j5648n580J2155J9693J996l0022k5658J6595L3644P166
1641B2352j7662j9212m162J4332J1058j1084q842J3714J2757q405j6481r094O459
1654a4270K2217J2577j5819j9426J127J0923Q222K527q661q194R789J1067p835
1667D244j2700J63R739J2257J206j9082j2887J7104K0285p279k0696p760J2344
1680c062K2346L274k7070j9152J6816K3382j792j6432r569P872J7514k219k5854
1693a3946r528K4956K3403o295k4211j9632N733K8521J4501j6177j7413K175P770
$$ plain form
1603 -12397 11237 15965 2375 -13569 -17019 1092 20282 11735 -8456 -10073 2207 10559 8791
1616 8791 -4467 -14842 1618 25509 19735 -7434 -21541 -11704 11983 26237 9743 -15416
1628 -15416 -11522 8196 8011 -7637 -13217 -1062 18631 20627 -9395 -35053 -18458 15186 22352
1641 22352 4690 -14522 -18684 -4352 6706 -4378 -13220 494 13251 4846 -11635 -20729 -14270
1654 -14270 7947 20524 4705 -14721 -13594 -2671 5551 8078 -583 -8777 1012 12079 4244
1667 4244 -8456 -8293 1446 13703 14909 -4173 -17060 44 20329 13050 -7646 -15406 -3062
1680 -3062 19284 22558 -4512 -23664 -6848 16534 14742 -1690 -11259 -3387 14127 11908 -13946
1693 -13946 -23474 1482 24885 18590 -5621 -25253 -19520 9001 23502 7325 -10088 -7913 -143
1706a43L608l154q879L295J9565O587k1398k0724K752K1297K3040q94l0278j9903
1720b5229J6288K4250N83j4892j1138O522J9028L76k6316j1912K2908K3240n052
1733A8656k3973j8091R644K9738P534k6670j9032J2134J9407M459j2163j7178
1745a5535R60K0310O613j6204j0445P460J0863M468q727j7569J13K3320J2880
1758A8507j2179j8156p627Q467K0219O902j6707j2275R378Q948m175p363k178
1771h239J1086J6801n368k8330j0800K1377K2811J616j6628j9233K165K0272N131
1784A2661j4722m538J1865O470o676j4509q414J3750K4111k082k4595j2066Q885
1797i860J4521P690p761j6273J17J5595K575j1414n701M523R553O692j0256j8314
$$ plain form
1706 -143 3465 311 -8568 -5273 14292 20879 -519 -21243 -18491 2806 25846 24952 -5326 -25229
1720 -25229 -8941 15309 15892 1000 -10138 -3616 15412 15788 -10528 -22440 468 23708 18656
1733 18656 -5317 -23408 -13764 15974 23508 -3162 -22194 -10060 9347 13806 1643 -15535
1745 -15535 -14575 5735 12348 -3856 -14301 -6841 4022 8490 -237 -17806 -17693 5627 18507
1758 18507 6328 -11828 -19455 -10988 9231 16133 -574 -12849 -3471 5477 1302 -6061 -8239
1771 -8239 2847 19648 14280 -14050 -24850 -3473 19338 20954 4326 -14907 -12742 7530 12661
1784 12661 -2061 -6599 5266 11736 5060 -9449 -17863 -4113 19998 17916 -6679 -18745 -9860
1797 -9860 4661 12351 4590 -11683 -11566 4029 6604 -4810 -10511 -5988 3565 10257 1 -18313
1811a8313M254K2553Q034j3415j7045n088J5926K1742m110k4744p093J6625J3189
1824A2515k543j2666q053J2781J8004r157k5280j927K2426J7701l674k3744j8965
1837b2582J3412K9499L765k0613j3232M321J2423O581j1597j4403R476K0493j859
1850A5684k0539j3135O065K1108J5490j4715k8497k915K1522J3917n049j5521
1862f585r810J0693J6943o543j9596k56J8040J0441o638j9563j1649J7267K5475
1875A8219l636k4378j0411R964J7018P327j2691j6189P143J7222q51j3733m873
1888i869O900J2669M566j5743j6733R748K2086M164j3255j3781l085J3699J4547
1901A5913p403j5862J507J1054K356o843q115j49J4622J0742j4272j9628K911
$$ plain form
1811 -18313 -14059 8494 16528 3113 -13932 -19020 -3094 18648 14538 -10206 -17299 -674 12515
1824 12515 9972 -2694 -10747 2034 20038 10881 -14399 -16326 6100 23801 20127 -3617 -22582
1837 -22582 -9170 20329 24094 3481 -9751 -5430 6993 13574 1977 -12426 -2950 17543 15684
1850 15684 -4855 -17990 -11925 9183 24673 9958 -18539 -21454 68 13985 8936 -6585
1862 -6585 -16395 -5702 11241 4698 -14898 -15154 2886 13327 6689 -12874 -24523 -7256 18219
1875 18219 14583 -9795 -20206 -10242 6776 14103 1412 -14777 -7634 9588 8737 -4996 -9869
1888 -9869 -2969 9700 14266 -1477 -18210 -8462 13624 17788 4533 -9248 -12333 1366 15913
1901 15913 8510 -7352 -5845 5209 7565 722 -7393 -7542 7080 17822 3550 -16078 -13167
1914a3167J6986J0195m204j6331j0331J2470J5852n684j3458k0Q605O340l122
1927D131j4575n086J7853J5803j0524j9232m840J0980J7116M366j7471j4707J1059
1940e127J6169j592j1654o564N471J4622L307j8655j3145J3827J9221P26j5007
1953A599j6311J103K2193J3324j5859j9310K570J4820Q040n805j5954l862J8997
1966E545J1932j4989j8928J625J6334J4474m794k3638j1259J9182K0155n310j7956
1979g627q887P421J7209L998j8969j1684J3873J6571k875j5042j1171O409K2190
1992A1416Q153k0384j7995Q254J8017P500q276j6448k657J8451J0748j2831j4152
2005a0204L659J3294Q479o068j8282m225J9627J3192j0775j6139l374R825J4251
$$ plain form
1914 -13167 3819 14014 9810 -6521 -16852 -4382 11470 5786 -7672 -7692 913 7253 4131
1927 4131 -10444 -15530 2323 18126 7602 -11630 -16470 -5490 11626 15992 -1479 -16186 -5127
1940 -5127 11042 9450 -2204 -8768 -3297 11325 14632 -4023 -17168 -3341 15880 16606 1599
1953 1599 -14712 -13609 8584 21908 6049 -13261 -10691 4129 12169 6364 -9590 -13452 5545
1966 5545 17477 2488 -16440 -14815 1519 15993 11199 -12439 -23698 -4516 15639 10329 -7627
1979 -7627 -16514 -9093 8116 12114 -6855 -18539 -4666 11905 9030 -6012 -17183 -10774 11416
1992 11416 19569 -815 -18810 -10556 7461 14961 6685 -9763 -12420 6031 16779 3948 -10204
2005 -10204 -6545 6749 15228 9160 -9122 -13347 6280 19472 8697 -7442 -10816 -991 13260
2018A3260J70j7771q896J3390J1542n567j0773m951O470J3224l03j8110p992J3292
2032c015J2530k133j1479r944L893J6494M276j4967q954Q140R341J066p708j0016
2046a2476M552J6886K665j6512r625P653J3219O665p961j5925M15J7587O280j2030
2060A393r786L199J1489Q536q881j7655J627J9391Q381j1564j3599k501J2013
2073B043J4375o054k0378k888J7035J0118o798j4198p342J0965J8374l413k1106
2086i267o905J2645J2424O13j3847j3369Q304K0928Q85j9242j1102P963J5898
2099E928Q190j1864j9064K604K0597O359j3169j2097J726J5020J2512j0192k1757
2112a5207L00K1006J1107p865j5300o642J1604J7316m704j9018l254J4553J1093
$$ plain form
2018 13260 13430 -4341 -13237 153 11695 6128 -4645 -9596 -3126 10098 9795 -8315 -16307 -3015
2032 -3015 9515 7382 -4097 -14041 -10148 6346 10622 -4345 -13299 -5159 4182 5248 -2460 -12476
2046 -12476 -7924 8962 11627 -4885 -14510 -6857 6362 13027 5066 -10859 -10444 7143 13423 1393
2060 1393 -8393 -5194 6295 14831 5950 -11705 -10078 9313 17694 6130 -7469 -9970 2043
2073 2043 16418 10364 -10014 -12902 4133 14251 7453 -6745 -14087 -3122 15252 11839 -9267
2086 -9267 -16172 -3527 8897 9510 -4337 -17706 -9402 11526 12411 -6831 -17933 -9970 5928
2099 5928 14118 2254 -16810 -14206 6391 12750 -419 -12516 -10790 4230 16742 6550 -15207
2112 -15207 -14907 6099 17206 9341 -5959 -12601 -997 16319 11615 -7403 -10657 3896 14989
2125A4989l443j4226j0940J0789J9684j471j8589q370P971J1611L945j1109j3423
2138a2582O407J7240J96j5326r133M815J3233Q105j0943j7083K541J5655L754
2151F879q871q059M64J0770Q330j0053j6046L763J6010O115o467j0810m880R969
2165b886J1925o029j2556K151J1645M957m622j1286n433J2642J4630n592j5002
2178e456k143Q577Q529J62j1192p771J1683J3499o079j4929m163Q498J2748K881
2192A4844j4564j2573R145J4844k342j2163o005N332J3603L845j6817j4448Q879
2205h420J7763L497j0354j2981j649J4129R706j1753j3618N610J4755N276r322
2218B639j6479m057J8759J6630q816j8006l904J0227J1925j95j4721p939J4953
$$ plain form
2125 14989 11546 -2680 -13620 -2831 16853 15382 -3207 -11577 -3606 8005 11950 841 -12582
2138 -12582 -6175 11065 11261 -4065 -13198 -8383 4850 12955 2012 -15071 -12530 3125 6879
2151 6879 -1992 -10051 -9587 1183 9513 -540 -16586 -12823 3187 9302 2835 -7975 -12855 -2886
2165 -2886 9039 3010 -9546 -7395 4250 9207 4585 -6701 -12134 508 15138 9546 -5456
2178 -5456 -7599 978 9507 9669 -1523 -9294 2389 15888 9809 -5120 -9283 -785 11963 14844
2192 14844 280 -12293 -3148 11696 9354 -2809 -8814 -3482 10121 13966 -2851 -17299 -8420
2205 -8420 9343 12840 2486 -10495 -12144 1985 11691 -62 -13680 -8070 6685 11961 2639
2218 2639 -13840 -17897 862 17492 8676 -9330 -13234 -3007 8918 8723 -5998 -13937 1016
2231A016J4970p528j7315o324J0097J7913M225j7927j5276R169J6006J312j0894
2244e56r367K952J5444N592j6457j4743P883J6295N973q313j5191m257J4593J0939
2258A0787r176j2233K429J1006O402n740j5622m785J6786J3916o514j3467m983
2271a1194O055J0704J640j1962n453J2405J0254o692j2264m680P628J5100L515
2284A5056j4666j0508Q179R933j26o530n169L870J1500J164j5203q384R434J2472
2298A1022K434q203j1965m04J2996N098j0706o879N808Q514J607q611j3123J349
2312a1063J7525P736j1215j2023k34P639P833l583j2604N63J4811N272j1263j2256
2326a2862j287J1692J4594k391j7950o435J1873R478l164q737m665P906J4259
$$ plain form
2231 1016 15986 8458 -8857 -15181 -5084 12829 17054 -873 -16149 -6980 9026 10338 -556
2244 -556 -9923 -6971 8473 14065 -2392 -17135 -9252 7043 13016 4703 -10488 -14745 -152 10787
2258 10787 1611 -10622 -8193 2813 9215 3475 -12147 -16932 -146 13770 7256 -6211 -11194
2271 -11194 -5139 5565 7205 -4757 -10210 2195 12449 5757 -6507 -11187 -3559 11541 15056
2284 15056 390 -10118 -1939 7994 7868 1338 -3831 39 11539 12703 -2500 -10884 -1450 11022
2298 11022 13456 5253 -6712 -7116 5880 10978 272 -6607 -799 7715 9322 711 -12412 -11063
2312 -11063 6462 14198 2983 -9040 -9274 -1635 6198 2615 -9989 -9426 5385 10657 -606 -12862
2326 -12862 -14149 -2457 12137 9746 -8204 -14639 -2766 6712 3548 -5189 -9854 -1948 12311
2339A2311k752j8966p090J3065J4890K080j2615j4363L996J7503M298j4363q394
2352a0400P037J2020L964j1837j6387M012K0617P151j3145j3530o15J1222J0912
2365A1021n686j5625l03J5886O859r534j3185m314J1575J6244j965j7844o958
2378a3829R927R601j46q197p593P362J4748j668j7358p958R398J3982N946r647
2392D568j5336J348J5678M523r563o484L826Q901M163j0154j3720M654J7649M647
2406A4700j0191j0816j869Q936R919m432j1937J338J0216J428p737p375q26R560
2420I14J0209n863j3801j363Q980N660j605p063n695P233J0631n063j2829k336
2434a1991Q483Q891J584r437r044O930J2576k775j1660k535P832J0660J691j4093
$$ plain form
2339 12311 9559 -9407 -16497 -3432 11458 13538 923 -13440 -9444 8059 12357 -2006 -10400
2352 -10400 -3363 8657 12621 784 -15603 -11591 9026 16177 3032 -10498 -11113 109 11021
2365 11021 5335 -10290 -10593 5293 12152 2618 -10567 -14881 -3306 12938 10973 -6871 -13829
2378 -13829 -3902 5699 5553 -2644 -10237 -2875 11873 10205 -7153 -15111 -5713 8269 14215 4568
2392 4568 -10768 -9420 6258 10781 1218 -5266 -1440 7461 11624 1470 -12250 -7596 10053 14700
2406 14700 4509 -6307 -8176 760 10679 6247 -5690 -4352 5864 7292 -445 -7820 -8646 914
2420 914 11123 5260 -8541 -9904 -924 4736 3131 -3932 -9627 -2394 8237 3174 -9655 -11991
2434 -11991 -3508 5383 6967 -2470 -11514 -4584 7992 5217 -6443 -8978 -1146 9514 11205 -2888
2448b888j2320R307J7622J814j1115q205K099J0257N509j0069j0131Q297J3677
2461A3854j052j2525r867K372J5814J0755j0553j6320k33J0674O669k723r731
2474b866m945R907R697q380j4373m87J1594J0963j286j6112j1718J0828J6266
2487I088j479j3748p837M907J3184M445j4118j2188R025J5733M30j1785r346L026
2501a0663J4767O528j3596j3252P012J5160M022p802j2249k272J3632J1258p210
2514E335j1829K50P708N041j715q820l275J1620R465p651j2760k570Q022J2095
2528A0916K641j2730j1419O476J0960k17o530m039K641Q238R01j2762p346J0482
2542a788J2550j275j0557r417J567J3171O269j0344q684N278P529J15n191o163
$$ plain form
2448 -2888 -15208 -5901 11721 13535 2420 -5785 -3686 6571 12080 2011 -8120 177 13854
2461 13854 12802 277 -9590 -7218 8596 19351 8798 -7522 -7755 2919 9588 6865 -2866
2474 -2866 -7811 2096 11793 3413 -10960 -11447 147 11110 9824 -6288 -18006 -7178 9088
2487 9088 7609 -6139 -13976 -9069 4115 8560 -5558 -17746 -8721 7012 7442 -4343 -13689 -10663
2501 -10663 4104 10632 -2964 -16216 -9204 5956 9978 2176 -10073 -12345 1287 12545 5335
2514 5335 -6494 -6244 1464 6505 4790 -4030 -7305 4315 13780 6129 -6631 -9201 -1179 10916
2528 10916 13557 827 -10592 -4116 6844 6627 97 -3942 -1301 6937 7838 -4924 -12270 -1788
2542 -1788 10762 9487 -1070 -10487 -8920 4251 10520 176 -8508 -3230 4299 4414 -777 -6940
2556f940K108J1530K944j1904q031O538R697L703n722j1175q74J2669P125q108
2570C560q822K91O351O476k061j0629k147J1858O161q534r965p65R284J1560k978
2585I640j7476p033J2135J2201j776r759p854L753J2218J043j3793n472J0497
2598a676R708k086j1846j0103O318J8472M513j4918j1773L540J1134P689n044
2611C928j2519m92J3184N148r615q455K517J0674Q683n896j6557k358J5316J0915
2625A4473m886j2073p254O401J3963J112j3902o054R092Q550j689q787p224O031
2639b247J3696j64j5735p863Q180J1209L715q602j3038Q63J4140M800q967o869
2653f882J499O133M254n357r914K426J3147L520r660q416r7R023J0213l227j3376
$$ plain form
2556 -6940 -4832 6698 9642 -2262 -10293 -3755 5942 9645 3923 -7252 -8126 4543 11668 3560
2570 3560 -5262 -4971 1380 7856 5795 -4834 -6981 4877 11038 2504 -7461 -8226 1058 12618 9640
2585 9640 -7836 -14869 -2734 9467 7691 -2068 -9922 -6169 6049 7092 -6701 -12173 -1676
2598 -1676 8032 5946 -5900 -16003 -9685 8787 13300 -1618 -13391 -9851 1283 8972 3928
2611 3928 -8591 -9083 4101 9249 -366 -8821 -6304 4370 13053 7157 -9400 -11758 3558 14473
2625 14473 9587 -2486 -9740 -3339 10624 11736 -2166 -8220 872 9422 7733 -1054 -8278 -2247
2639 -2247 11449 11285 -4450 -12313 -4133 7076 10791 2189 -10849 -9986 4154 8954 -13 -6882
2653 -6882 -5383 750 5004 -353 -10267 -7841 5306 8826 -834 -9250 -9347 -324 9889 6662 -6714
2668f714k386R472N505k464n005k653N065P656l842j1326P59J0973O144l816r538
2683b170o522O898J2810j084j1692m176N332N454R66o385o446N855R967l960j1986
2698g139l203P202Q821K077j0788j1595M917J3841J820r084o758Q31P952N921
2712D815p606j0728M950J2382J499q549q404Q32J2119J0303q801j4727M32J2863
2726A380Q468k445j0045o186Q981J1619m240j1803n19R568P982j202j2306q367
2740i115J0200J5108j692j3419p476M200J1667N947j0086j2288M126J1780J217
2753A0169q474p295Q20J0494O218j0698j3469L407J2849N394n852j1841n134R915
2767c497J1265n120j1957q81P591N513j433q859n220R634J0681n320j1234j951
$$ plain form
2668 -6714 -9100 372 5877 3413 -1592 -4245 820 8476 4634 -6692 -5933 5040 11184 7368 -2170
2683 -2170 -8692 -1794 11016 9932 -1760 -5936 -604 4850 5816 -569 -7015 -1160 8807 4847 -7139
2698 -7139 -10342 -3140 5681 7758 -3030 -14625 -9708 4133 5953 -3131 -9889 -9058 -1106 4815
2712 4815 -2791 -13519 -8569 3813 5312 -3237 -11641 -10809 1310 11613 2812 -11915 -11483 1380
2726 1380 9848 7403 -2642 -8828 153 11772 7532 -4271 -4790 4778 12760 11558 -748 -9115
2740 -9115 1085 16193 14501 1082 -6394 -2194 9473 15420 5334 -6954 -2828 8952 10169
2753 10169 1695 -5600 -4780 5714 11932 1234 -12235 -8828 4021 9415 3563 -8278 -13412 -3497
2767 -3497 7768 2648 -9309 -10190 -2599 2914 1481 -7378 -12598 -2964 7717 2397 -8837 -10788
2781a0788P017R265K395j0591q675P201J1164n44p412l581K361P589L334q644
2795I1o947P264R280j024p811n895J322J0189N592q816r543L282P635J827l972
2810B474o696j134Q481M413q967q083M079P783L173m582j0297k718J0852Q019
2824F797p091q893L1O232O083j715j0199l266J1314P778n918q999j261O898R653
2839G444o75j2666n049J1197R992k408q464n818M070J1959L059j1781o950P947
2853A857R219L99p406q655K493J3626M733j1899j0267L575J0094O078n331j3021
2867d505k655J2596P622q456r877l08P616P958m025j4154l808J2265R583n320
2881D532j0921n804N274J1841R18j2384o181Q175Q300j440p763p101L650J2831
$$ plain form
2781 -10788 -3771 5494 7889 -2702 -11377 -4176 6988 6444 -968 -4549 -2188 5401 8735 91
2795 91 -6856 408 9688 8664 853 -5042 -3720 6469 12061 3245 -6298 -3016 4619 6446 2474
2810 2474 -4222 -5356 3125 7538 -1429 -9512 -5433 2350 5523 941 -9356 -12074 -1222 6797
2824 6797 -294 -9187 -9156 -2924 3159 1444 -8755 -12021 -707 7071 1153 -7846 -9107 -2209 7444
2839 7444 6769 -5897 -10946 251 10243 7835 -629 -6447 -2377 9582 12641 860 -6090 1857
2853 1857 11076 11475 4069 -4586 -2093 11533 16266 4367 -5900 -2325 7769 13847 8516 -4505
2867 -4505 -7160 5436 13058 4602 -5275 -5583 2033 9991 5966 -8188 -11996 269 9852 4532
2881 4532 -6389 -12193 -6919 4922 5840 -6544 -12725 -4550 3750 2310 -5453 -12554 -8904 3927
2895C927L080j1699p777M870Q554L549m758r204N03J1794M468q862p521K128P246
2910B98O495l376j0855j348J0821N311o278o547q12O009O983k928j0757j462J0153
2925A707N307m037o940l782M687Q560p33r828j519P879M345k944o672m379N117
2940c232J0679o40j0320l700O058N836J036n315o171M329J0428r73j0405l965
2954f355N309Q002L723o592r608K909J1451J182q148m997K430P713N164p129j1730
2969f676K779J1883M113o736q439k530Q081Q932m566j1510k65R276M874m766r134
2984d684m799Q758J2332l623j3354m440O939Q316J692q372q651O037J1653j487
2998F317j1739n261N417J0251N134r249j1730L509J2315K262p853o718O32R043
$$ plain form
2895 3927 7007 -4692 -12469 -7599 955 4504 -254 -9458 -8955 2839 7307 -1555 -9076 -6948 298
2910 298 6793 3417 -7438 -8786 2035 7346 1068 -5479 -6291 -282 6701 3773 -6984 -8446 1707
2925 1707 7014 2977 -3963 -7745 -3058 5502 4769 -5059 -6578 1301 5646 2702 -3970 -8349 -3232
2940 -3232 7447 6807 -3513 -7213 -1155 4681 5717 402 -5769 -1440 8988 8015 -2390 -6355
2954 -6355 -1046 6956 10679 4087 -5521 -2612 8839 10021 1873 -3124 -694 7019 12183 5054 -6676
2969 -6676 -3897 7986 12099 5363 -3076 -5606 2475 11407 6841 -4669 -4934 4342 9216 4450 -4684
2984 -4684 -9483 -725 11607 7984 -5370 -9810 -2871 5445 7137 -1235 -9886 -3849 7804 6317
2998 6317 -5422 -10683 -5266 4985 10119 870 -10860 -7351 4964 7226 -627 -7345 -6713 2330
3012B330P384p434j1997J711J0993M701m313q561m287P733R612l908j0282q46
3026g164P083M739j755q851o138P649J1334j662j0409m686L490O516L209o746
3040c391p277N331Q779k277q381l690L904Q790M375q096r779L528R158J070m294
3055b250l690P75O505L862p138p378N047Q777J755l931o547j436P963O635n628
3070C321p271K560O404K737k916p002k106Q926P331n905q253p6N552N690q63q957
3086h28m274Q476P633n274q880j976N641Q804Q35j0942p363O888Q266j537o684
3101a215m078L427R261J296j1710p804P098J0808J888o451r032r40J0374O098
3115I020p519p554L080P613L740m593r959j676J2395Q057o574j0157j779O254
$$ plain form
3012 2330 9714 2280 -9717 -8006 2987 7688 3375 -5186 -9473 -1740 7872 3964 -6318 -7164
3026 -7164 -81 4658 2903 -5948 -12086 -4437 6897 5235 -5174 -9860 -6370 146 3355 -3391
3040 -3391 -10668 -5337 3442 1165 -7216 -10906 -7002 1788 6163 -1933 -11712 -8184 974 2044 -2250
3055 -2250 -5940 -5165 1340 5202 -1936 -9314 -4267 4510 6265 2334 -4213 -5649 2314 8949 3321
3070 3321 -3950 -1390 5014 7751 4835 -2167 -4273 4653 11984 6079 -2174 -2250 3302 8992 8129 -828
3086 -828 -5102 3374 11007 5733 -3147 -5123 518 9322 10157 -785 -8148 -1260 7006 5469 -1215
3101 -1215 -5293 -1866 7395 8691 -3019 -10823 -3725 7083 8971 2520 -6512 -7452 2922 9020
3115 9020 1501 -6053 -2973 4640 8380 3787 -6172 -7848 4547 12604 6030 -4127 -5906 348
3129C48Q511j9j0778m871R029Q015m218q806l960N093J0201J591j1789p853O421
3144c085Q762m3o610o807J643R729K831j0267p739M703P797K951m981q958j498
3159a1572R485M787o658n868J698N531M057k902r388j376R605O175m735o417j731
3174i309M123P432K77q324k328P470M954l333m897k116M672Q591Q8r456l802O643
3190F85N792m62l796m398K813P836k28q966k807O486N978M94o083p252J954R036
3206G082J582p676l583L706N267J385o262q431K243J0585K692p416o110N39N499
3221A102N036m109r428J216R628L001o285o974j333P263Q545l255j1072k144Q864
3236E5N579k159p418m307N684J0283j604j0472l148O821P081Q29p759q383M447
$$ plain form
3129 348 8859 8840 -1938 -6809 2220 10235 6017 -2789 -6749 -1656 8545 10136 -1653 -9506 -3085
3144 -3085 5677 5634 -976 -7783 -6140 3589 6420 -3847 -11586 -6883 914 3865 -1116 -10074 -11572
3159 -11572 -2087 2700 -3958 -9826 -8128 -2597 1460 -1442 -10830 -12206 -2601 3574 -1161 -7578 -9309
3174 -9309 -5186 2246 2523 -5801 -8129 -659 4295 962 -3935 -6051 -1379 7212 7300 -2156 -5958 685
3190 685 6477 6015 2219 -2179 634 8470 8242 -724 -3531 2955 8933 9427 3344 -3908 -1954 7082
3206 7082 8664 988 -2595 1111 6378 7763 1501 -6930 -4687 5898 8590 1174 -4936 -4397 1102
3221 1102 6138 2029 -7399 -6183 3445 6446 161 -6813 -8146 -883 7662 4407 -6665 -8809 55
3236 55 5634 3475 -3943 -8250 -2566 7717 6113 -4359 -7507 -686 6395 7224 -535 -8918 -4471
3251d471J1668J369q822n446K745P767L922o479r939K321J0966L155p104p139
3265e487l98P269O973m773j0531K22Q838L977m144o976l136O830R091k927j0503
3280e675k826N995N560Q0n737n094M816Q669j953q784k494M904O325J985o497
3295g26p839L209R471R36n636l106J253N372K985n398p222L487Q401Q84n113m607
3311c649j64O462N001n121q042K444P032J627l278n000j649N733N717m845p162
3326d894J485N762K275k556o014k057P060O908m479q046p25M657M459k32o616
3341c013m283O481P275k947p129j617L879O047R09q686o041O971Q977p63p339
3356a279n311J753Q264M278p454p332M061P347M38n257n924R74R679N044q666
$$ plain form
3251 -4471 7197 8566 -256 -5702 -2957 4810 8732 2253 -7686 -5365 5601 8756 1652 -5487
3265 -5487 -5885 1384 8357 3584 -6947 -6725 2113 6090 1946 -5030 -8166 -1336 7755 4828 -5675
3280 -5675 -8501 -2506 3054 3134 -2603 -7697 -2881 5788 3835 -4949 -7443 -2539 3786 5771 -726
3295 -726 -8565 -5356 4115 5051 -585 -3691 -2438 2934 5919 521 -6701 -3214 5187 6071 958 -3649
3311 -3649 -3813 2649 7650 2529 -5513 -3069 3963 5590 2312 -2688 -4337 1396 7113 2268 -4894
3326 -4894 -3409 2353 4628 2072 -3942 -5999 1061 7969 3490 -4556 -5281 -624 3835 3603 -3013
3341 -3013 -7296 -815 6460 3513 -3616 -5233 -1354 4693 5602 -3084 -9125 -2154 6823 6060 -1279
3356 -1279 -6590 -4837 3427 7705 251 -7081 -3020 4327 4765 -492 -6416 -5442 4237 9281 615
3371F15r286J878Q185N038k400q647l314Q250O939m959q032r54N527O578m52q899
3387c933m852P807Q205k855p868l723L884R085K750r110p478M694Q112J389m789
3402A318n180O26Q011L394p763o407M073P153K684m144p999j297Q368O345n449
3417C733o949J58M272M135j226o855k516P011M656m615n726l74M108N418j087
3432D143q672l815O759O104k174n060k984J443O229J083p044k492N597M044k149
3447A012m740l634L142Q016J523p915m262M271M735J349l391m976J240P237K104
3462E711o985l450L189N204J828m264o924J534R422L243o662o029J41N541N534
3477G033k733q502j194P526L624m471m844o25N833O343l570j0693k382Q094O167
$$ plain form
3371 615 -8671 -6793 1392 6430 4030 -4617 -7931 319 7258 2299 -5733 -6687 -1160 5418 4966 -3933
3387 -3933 -8785 -978 7227 4372 -3496 -7219 -3335 5750 8500 -610 -8088 -3394 4718 6107 1318
3402 1318 -3862 -3236 4775 8169 406 -6001 -1928 5225 7909 3765 -4234 -5531 2837 9182 3733
3417 3733 -3216 -3058 1214 5349 4123 -2732 -5248 1763 6419 1804 -3922 -4296 -188 5230 4143
3432 4143 -4529 -8344 -1585 4519 2345 -2715 -5699 -4256 1973 3056 -3988 -6480 -883 3161 1012
3447 1012 -3728 -7362 -4220 3796 5319 -2596 -6858 -2587 2148 3497 106 -4870 -3630 3607 5711
3462 5711 -1274 -4724 -1535 3669 5497 1233 -5691 -4157 5265 8508 1846 -4183 -4042 1499 7033
3477 7033 4300 -4202 -5396 2130 5754 1283 -3561 -4186 1647 7990 4420 -6273 -8655 -561 5606
3492E606j567o536n017M127Q844j4q996l547M954N840N71n369o127L462R829Q79
3508F939q690m980L126P572M814n223r190J97R799L967m970n329q40N367N759
3523H318l723q775J82Q900M709l709o755l858M933Q343j159r372l156N318M921
3538E117K40m963n284K934P695q15p563l043L561M617J243n451o469K590Q735
3553C144J210o097m363j81M656L694l051n898J822O298N99m785l872P09N055M664
3569C604l622p155R36O656K390k087m457j913M234N176k940o148R02N556K509
3584C641j774n080k233N710O301l662p646j002M978M526M22n644m526M570O425
3599E006k131o339j434L599N328Q78o860n734N066P907k59o073m204J356O700
$$ plain form
3492 5606 4039 -2497 -7514 -3387 5457 5443 -3553 -7100 -2146 3694 4265 -1104 -7231 -3769 6060 6939
3508 6939 -1751 -6731 -3605 3967 8781 3558 -5632 -5435 4364 8331 3361 -1968 -2808 2559 8318
3523 8318 4595 -4180 -3998 4902 9611 5902 -853 -4711 222 8565 7406 -1966 -5122 196 5117
3538 5117 5357 394 -4890 -1956 5739 4924 -2639 -5682 -2121 2496 3739 -1712 -8181 -5591 3144
3553 3144 4354 -1743 -6106 -6287 -1631 2063 -988 -6886 -5064 1234 1833 -2952 -6824 -6115 -1060 3604
3569 3604 -18 -7173 -6237 419 2809 722 -3735 -5648 -1414 3762 822 -5326 -4424 1132 3641
3584 3641 1867 -3213 -5446 264 6565 2903 -4743 -5745 -767 3759 4181 -1463 -5989 -1419 5006
3599 5006 2875 -3464 -4898 -1299 4029 4907 -1953 -7687 -2621 5286 5027 -1046 -5250 -3894 2806
3614B806L910n987o969K925O927J937l646n466o45P285N288n800p982J492P801
3629C876M634k270p883m078O939P749k948p276j307M436N330l2p500m808O664
3644A526P914j996p454m066K846P205K690o984o499L779O896L92m601n358L79
3659c331O799L825n472o747J832O065K212k665o148j831O844N342m382o539m33
3674d629M699M092m52o214l223N686M970l093n389j274L581M929j94o573l860
3689f944N647N108j779m955k583J591N126J372n893l856M322L973j456l632l213
3704g172J899N839J419o709m405L410M411J003k880m224L38O132J901n895l739
3719h672K796M926K510l058o048p0P826L515m924m122P72M909M091k365o883n65
$$ plain form
3614 2806 6716 729 -6240 -3315 3612 5549 1903 -3563 -4208 3077 8365 2565 -5417 -3925 3876
3629 3876 8510 6240 -1643 -5721 1218 8967 6019 -1257 -2564 1872 7202 7170 -330 -5138 1526
3644 1526 9440 7444 -10 -4076 -1230 5975 8665 1681 -4818 -1039 5857 6249 1648 -3710 -3331
3659 -3331 3468 7293 1821 -4926 -3094 2971 5183 2518 -3630 -5461 1383 6725 2343 -4196 -4629
3674 -4629 70 4162 3710 -2504 -5727 -41 4929 1836 -3553 -4827 -1246 3683 3489 -3084 -6944
3689 -6944 -1297 3811 2032 -2923 -5506 -3915 1211 2583 -3310 -7166 -2844 1129 -327 -3959 -7172
3704 -7172 -5273 566 1985 -4724 -9129 -5719 -1308 -305 -3185 -7409 -7071 -939 962 -4933 -8672
3719 -8672 -5876 -950 1560 -1498 -7546 -7616 210 3725 -1199 -5321 -4549 360 4451 2086 -4797 -5362
3735e362Q122M565l525n092j673M281O396n95p617k359O658N258j833n425l688
3750a889L474P974M86q096m274L904N843J086m400o155J225Q279J467p202n456
3765c734J966N776L787l878q099m45P746L746m925n621o13M538N374k528q323
3780e233j141P122M924k273n732l580L239O939N9p070k318N042M370k20m546m436
3796d854K796P462P25o724l842K476N146K430k932n879Q04O417Q24n466l419J406
3812b630M405L051l513o697N14O189J782m004m043o07L141L932k547n999O07N186
3828a233J848l062l923k146L751N037j986n659J83M820K586j433l962k719M107
3843c791O274j410n806j093M246M042O78l981l489M021O567j400o193k047M344
$$ plain form
3735 -5362 2760 7325 3800 -1292 -2965 1316 7712 7117 -500 -2859 3799 9057 7224 1799 -1889
3750 -1889 1585 9559 10045 1949 -2325 1579 7422 8508 4108 -2047 -822 7457 8924 1722 -3734
3765 -3734 -1768 4008 7795 3917 -4182 -4627 3119 6865 1940 -3681 -4294 244 5618 3090 -5233
3780 -5233 -6374 748 5672 3399 -2333 -5913 -2674 4265 4324 -2746 -5064 -22 4348 4128 -418 -4854
3796 -4854 -2058 5404 6129 -595 -4437 -1961 3185 5615 2683 -3196 -2392 4025 4849 -617 -4036 -2630
3812 -2630 1775 4826 1313 -5384 -4870 1319 3101 -903 -4946 -5553 -2412 1520 -1027 -7026 -6419 -1233
3828 -1233 615 -2447 -6370 -8516 -4765 272 -1714 -7373 -7190 -2370 216 -1217 -5179 -7898 -3791
3843 -3791 2483 1073 -4733 -5826 -1580 2462 3140 -841 -4330 -309 6258 4858 -1335 -3382 962
3858I62N855K160n356o124L056O918M07m832l105J308N470K628n599o540K759
3873c3P118J605m914n877j551N665N223l656p050m3M887K868k138o275l321N511
3889a981O501k999p267j943M324N231P32o561n554M425P406j80n915l472K297
3904d956O397L025n754n920L123P018J261m001m300P92O245M539n097o304J876
3919b056N970K722k165n159j968N215N046k563n588J89L073K628r39n149k805
3934c549N167N303k391o066k260K159M105J180m602m022L191M031j694m221j683
3949e352J924M514J449n920m537L587N083l8l114l042J009M643K120n074l496
3964f244L387M511Q73k733l477M40N478K490m772l659K506M414K095k039n256
$$ plain form
3858 962 6817 8977 3621 -2503 553 7471 7878 3046 -59 1249 6719 9347 3748 -2792 -33
3873 -33 7085 8690 3776 -2101 -3652 2013 7236 3580 -3470 -3513 1374 4242 2104 -4171 -7492 -1981
3889 -1981 4520 1521 -5746 -7689 -3365 1866 2598 -3963 -9517 -5092 2314 2134 -3781 -7253 -4956
3904 -4956 1441 4466 -1288 -7208 -4085 2933 4194 193 -4107 -3315 2930 7469 2372 -3932 -2056
3919 -2056 3914 6636 4471 -688 -2656 2559 7605 5042 -546 -357 2716 5344 4405 -744 -3549
3934 -3549 1618 6921 4530 -1536 -3796 -1637 2468 3648 -954 -4976 -1785 2246 552 -3669 -5352
3949 -5352 -3428 1086 2535 -3385 -7922 -4335 748 710 -2404 -5446 -4437 206 2326 -2748 -6244
3964 -6244 -2857 1654 2527 -206 -3683 -3243 2235 4725 -47 -3706 -1200 3214 5309 3270 -1986
3979a986o92N876L340l706m285L77L297L417j127o055j586N711M186l427n530
3994b190j665L457N612m11p198l535N265M779j003n143l529K096O407L83o643
4009c318l531M415N362N96m854n628Q86P892K940n623m447J310M701L193k456
4024A438o188j44O908L723m199n199k26M041N606p92o744k512N437M438k009m847
$$ plain form
3979 -1986 -2678 3198 6538 2832 -1453 -1076 2221 5638 4511 -1544 -3130 2581 6767 3340 -2190
3994 -2190 -3855 -398 5214 4803 -2395 -5930 -665 4114 3111 -2032 -5561 -3465 2942 3325 -3318
4009 -3318 -6849 -2434 2928 3524 -1330 -6958 -6072 1820 4760 -863 -5310 -4000 701 3894 1438
4024 1438 -4750 -4894 2014 5737 1538 -3661 -3887 154 5760 4968 -1776 -4288 1149 5587 3578 -1269
$$ [...]
8191D66
##END NTUPLES=NMR FID
##END=
