##TITLE=1H_CG-1113-3
 CDCl3, 8 sc, 
 24.7.2019
##JCAMPDX= 6.0         $$ Bruker NMR JCAMP-DX V2.0
##DATA TYPE= NMR FID
##DATA CLASS= NTUPLES
##ORIGIN= UXNMR, Bruker Analytische Messtechnik GmbH
##OWNER= root
$$ XWIN-NMR		Version 3.5
$$ Wed Jul 24 15:29:57 2019 Russian Standard Time (UT+4h)  she@DPX200
##.OBSERVE FREQUENCY= 200.13155
##.OBSERVE NUCLEUS= ^1H
##.DELAY= (6, 6)
##.ACQUISITION MODE= SIMULTANEOUS
##.ACQUISITION SCHEME= undefined
##.AVERAGES= 8
##.DIGITISER RES= 18
##SPECTROMETER/DATA SYSTEM= spect
##.PULSE SEQUENCE= zg30
##.SOLVENT NAME= CDCl3
##.SHIFT REFERENCE= (INTERNAL, CDCl3, 0, 15.7039)
##AUDIT TRAIL= $$ (NUMBER, WHEN, WHO, WHERE, WHAT)
$$ ##TITLE= Audit trail, XWIN-NMR		Version 3.5
$$ ##JCAMPDX= 5.01
$$ ##ORIGIN= Bruker BioSpin GmbH
$$ ##OWNER= she
$$ F:/spectra/data/she/nmr/H-F/1/audita.txt
$$ ##AUDIT TRAIL=  $$ (NUMBER, WHEN, WHO, WHERE, WHAT)
(   1,<2019-07-24 15:28:42.26 +0400>,<she>,<DPX200>,
      <created by zg, POWCHK disabled, PULCHK disabled
       configuration hash MD5:
       00 E9 B6 7A A2 85 ED C7 34 08 36 98 17 FE 4E 26
       data hash MD5: 16K
       AA F2 4A F2 9C C9 92 55 D3 96 CA 45 23 B6 A3 69>)
$$ ##END=
$$ 
$$ hash MD5
$$ 55 6B 7D CF C1 92 4B EA BA C3 3A 8E 5B 12 27 F8
##$RELAX= 
##$RELAX= 
##$RELAX= 
##$RELAX= 
##$RELAX= 
##$RELAX= 
$$ Bruker specific parameters
$$ --------------------------
##$DU= <F:/spectra>
##$EXPNO= 1
##$NAME= <H-F>
##$PROCNO= 1
##$TYPE= <nmr>
##$USER= <she>
##$AMP= (0..31)
100 100 100 100 100 100 100 100 100 100 100 100 100 100 100 100 100 100 
100 100 100 100 100 100 100 100 100 100 100 100 100 100 
##$AQSEQ= 0
##$AQ_mod= 1
##$AUNM= <au_zg>
##$AUTOPOS= <>
##$BF1= 200.13
##$BF2= 200.13
##$BF3= 200.13
##$BF4= 200.13
##$BF5= 200.13
##$BF6= 200.13
##$BF7= 200.13
##$BF8= 200.13
##$BYTORDA= 1
##$CFDGTYP= 0
##$CFRGTYP= 5
##$CHEMSTR= <none>
##$CNST= (0..31)
1 1 145 1 1 1 1 1 1 1 1 1 1 1 1 1 1 1 1 1 1 1 1 1 1 1 1 1 1 1 1 1 
##$CPDPRG= <>
##$CPDPRG1= <>
##$CPDPRG2= <>
##$CPDPRG3= <>
##$CPDPRG4= <mlev>
##$CPDPRG5= <mlev>
##$CPDPRG6= <mlev>
##$CPDPRG7= <mlev>
##$CPDPRG8= <mlev>
##$CPDPRGB= <>
##$CPDPRGT= <>
##$D= (0..31)
0 1.2 0 0 0 0 0 0 0 0 0 0.03 0 0 0 0 0 0 0 0 0 0 0 0 0 0 0 0 0 0 0 0 
##$DATE= 1563967721
##$DBL= (0..7)
120 120 120 120 120 120 120 120 
##$DBP= (0..7)
150 150 150 150 150 150 150 150 
##$DBP07= 0
##$DBPNAM0= <>
##$DBPNAM1= <>
##$DBPNAM2= <>
##$DBPNAM3= <>
##$DBPNAM4= <>
##$DBPNAM5= <>
##$DBPNAM6= <>
##$DBPNAM7= <>
##$DBPOAL= (0..7)
0.5 0.5 0.5 0.5 0.5 0.5 0.5 0.5 
##$DBPOFFS= (0..7)
0 0 0 0 0 0 0 0 
##$DE= 6
##$DECBNUC= <off>
##$DECIM= 24
##$DECNUC= <off>
##$DECSTAT= 4
##$DIGMOD= 1
##$DIGTYP= 9
##$DL= (0..7)
0 120 120 120 120 120 120 120 
##$DP= (0..7)
150 150 150 150 150 150 150 150 
##$DP07= 0
##$DPNAME0= <>
##$DPNAME1= <>
##$DPNAME2= <>
##$DPNAME3= <>
##$DPNAME4= <>
##$DPNAME5= <>
##$DPNAME6= <>
##$DPNAME7= <>
##$DPOAL= (0..7)
0.5 0.5 0.5 0.5 0.5 0.5 0.5 0.5 
##$DPOFFS= (0..7)
0 0 0 0 0 0 0 0 
##$DQDMODE= 0
##$DR= 18
##$DS= 0
##$DSLIST= <SSSSSSSSSSSSSSS>
##$DSPFIRM= 0
$$ [...]
##$SUBNAM2= <"">
##$SUBNAM3= <"">
##$SUBNAM4= <"">
##$SUBNAM5= <"">
##$SUBNAM6= <"">
##$SUBNAM7= <"">
##$SUBNAM8= <"">
##$SUBNAM9= <"">
##$SW= 24.9336996594482
##$SWIBOX= (0..15)
0 0 2 0 0 0 0 0 0 0 0 0 0 0 0 0 
##$SW_h= 4990.01996007984
##$TD= 16384
##$TD0= 1
##$TE= 0
##$TE2= 300
##$TE3= 300
##$TEG= 300
##$TL= (0..7)
0 120 120 120 120 120 120 120 
##$TP= (0..7)
150 150 150 150 150 150 150 150 
##$TP07= 0
##$TPNAME0= <>
##$TPNAME1= <>
##$TPNAME2= <>
##$TPNAME3= <>
##$TPNAME4= <>
##$TPNAME5= <>
##$TPNAME6= <>
##$TPNAME7= <>
##$TPOAL= (0..7)
0.5 0.5 0.5 0.5 0.5 0.5 0.5 0.5 
##$TPOFFS= (0..7)
0 0 0 0 0 0 0 0 
##$TUNHIN= 0
##$TUNHOUT= 0
##$TUNXOUT= 0
##$USERA1= <user>
##$USERA2= <user>
##$USERA3= <user>
##$USERA4= <user>
##$USERA5= <user>
##$V9= 5
##$VALIST= <valist>
##$VCLIST= <CCCCCCCCCCCCCCC>
##$VD= 0
##$VDLIST= <DDDDDDDDDDDDDDD>
##$VPLIST= <PPPPPPPPPPPPPPP>
##$VTLIST= <TTTTTTTTTTTTTTT>
##$WBST= 1024
##$WBSW= 4
##$XGAIN= (0..3)
0 0 0 0 
##$XL= 0
##$YL= 0
##$YMAX_a= 309308
##$YMIN_a= -518806
##$ZGOPTNS= <>
##$ZL1= 120
##$ZL2= 120
##$ZL3= 120
##$ZL4= 120
##$ABSF1= 10
##$ABSF2= 0
##$ABSG= 5
##$ABSL= 3
##$ALPHA= 0
##$AQORDER= 0
##$ASSFAC= 0
##$ASSFACI= 0
##$ASSFACX= 0
##$ASSWID= 0
##$AUNMP= <proc_1d>
##$AZFE= 0.1
##$AZFW= 0.1
##$BCFW= 1
##$BC_mod= 2
##$BYTORDP= 1
##$COROFFS= 0
##$CY= 11.3945322036743
##$DATMOD= 1
##$DC= 2
##$DFILT= <>
##$DTYPP= 0
##$F1P= 18.9103706918063
##$F2P= -1.10871071338519
##$FCOR= 0.5
##$FTSIZE= 0
##$FT_mod= 4
##$GAMMA= 1
##$GB= 0.15
##$INTBC= 1
##$INTSCL= 1
##$ISEN= 128
##$LB= 0.24
##$LEV0= 0
##$LPBIN= 0
##$MAXI= 10000
##$MC2= 0
##$MEAN= 0
##$ME_mod= 0
##$MI= 1.114404
##$NCOEF= 0
##$NC_proc= 0
##$NLEV= 6
##$NOISF1= 3.799351
##$NOISF2= 2.8
##$NSP= 1
##$NTH_PI= 0
##$NZP= 0
##$OFFSET= 15.70392
##$PC= 1
##$PHC0= -8863.621
##$PHC1= 19.60096
##$PH_mod= 1
##$PKNL= yes
##$PPARMOD= 0
##$PSCAL= 0
##$PSIGN= 0
##$REVERSE= no
##$SF= 200.130013532006
##$SI= 16384
##$SIGF1= 3
##$SIGF2= 2
##$SINO= 400
##$SIOLD= 16384
##$SREGLST= <1H.CDCl3>
##$SSB= 0
##$STSI= 0
##$STSR= 0
##$SW_p= 3612.71676300578
##$SYMM= 0
##$S_DEV= 0
##$TDeff= 0
##$TDoff= 0
##$TI= <>
##$TILT= no
##$TM1= 0
##$TM2= 0
##$TOPLEV= 0
##$USERP1= <user>
##$USERP2= <user>
##$USERP3= <user>
##$USERP4= <user>
##$USERP5= <user>
##$WDW= 1
##$XDIM= 8192
##$YMAX_p= 0
##$YMIN_p= 0
$$ End of Bruker specific parameters
$$ ---------------------------------
##NTUPLES= NMR FID
##VAR_NAME=  TIME,          FID/REAL,        FID/IMAG
##SYMBOL=    X,             R,               I
##VAR_TYPE=  INDEPENDENT,   DEPENDENT,       DEPENDENT
##VAR_FORM=  AFFN,          ASDF,            ASDF
##VAR_DIM=   8192,          8192,            8192
##UNITS=     SECONDS,       ARBITRARY UNITS, ARBITRARY UNITS
##FACTOR=    0.0002004,     1,               1
##FIRST=     0,             0,               0
##LAST=      1.6414764,     0,               0
##MIN=       0,             -518806,         0
##MAX=       1.6414764,     309308,          0
$$ Real data points
##PAGE= N=1
##DATA TABLE= (X++(R..R)), XYDATA
0@%%%qJ6j6J6j6K4m0M8n6P2q9J13j37J62j95K34k78L27l84M45n11N88o77P73q80
$$ 0 0 0 0 -8 8 -8 8 -8 16 -24 24 -32 40 -49 64 -73 89 -106 128 -150 177 -207 238 -273 315 -362 411 -469
28d69R98j131J276j435J613j805K016k249K504k785L093l431L803m211M661n160
$$ -469 529 -602 674 -761 852 -953 1063 -1186 1318 -1467 1626 -1805 1998 -2213 2448 -2712
44b712N716o336P031p818Q720r764J0985j2434J4191j6377J9177k2915K8204l6314
$$ -2712 3004 -3332 3699 -4119 4601 -5163 5822 -6612 7579 -8798 10379 -12536 15668 -20646
58b0646N0483q2418K81246K7935l03981K79474M2700j73164k4644K32323k4268
$$ -20646 29837 -52581 228665 256600 -47381 232093 274793 101629 76985 309308 285040
69B85040j78478m7007P8364r0585r9983P8158J16072j28516j60360O0257J15615
$$ 285040 106562 59555 137919 47334 -52649 25509 141581 13065 -147295 -87038 28577
80B8577j07102j21982M8081L7163j03245k9739Q9024M1401l8993j7583p973j6693
$$ 28577 -78525 -200507 -152426 -115263 -218508 -248247 -159223 -117822 -156815 -174398 -182371 -199064
92a99064k4108l2055R251R0556N2459n0620k8499M1816N164j6495M8511N2049
$$ -199064 -223172 -255227 -245976 -155420 -102961 -153581 -182080 -140264 -135100 -151595 -103084 -51035
104e1035j3610O309O8761J9366q4453n1810R4925J09278m9261q2977Q3326R8767
$$ -51035 -64645 -58336 10425 29791 -54662 -106472 -11547 97731 48470 -34507 48819 147586
116A47586q9503q7922R4939O7120p0635L489P6693p1529j23249N7797J03904n7901
$$ 147586 58083 -29839 65100 132220 61585 65074 141767 70238 -53011 4786 108690 50789
128E0789q3365N6779O8278o3829q6956L1143O1280m3466o3280L7922K9685p1429
$$ 50789 -32576 24203 92481 28652 -58304 -27161 34119 -9347 -72627 -34705 -5020 -76449
140g6449j7595R6835J3055j09024l1382O4985J6406j5068L2844L0030q239j1344
$$ -76449 -94044 2791 15846 -93178 -124560 -59575 -43169 -58237 -25393 4637 -3602 -14946
152a4946j8120k4942N872L2623L8504M5427M719n6039j3961O6321K7607n3181
$$ -14946 -33066 -58008 -52136 -19513 18991 64418 69137 13098 -863 65458 93065 39884
164C9884k3846M9662M5564j0440k9335P907K6729k2558m4299J6647K8611k9063
$$ 39884 16038 65700 111264 100824 71489 79396 106125 83567 39268 55915 84526 55463
176E5463Q264P8873j7022j26825l0284P7480O505m8357K1938L2074m6866m9273
$$ 55463 63727 142600 125578 -1247 -31531 45949 52454 4097 26035 58109 11243 -38030
188c8030J3677J0474l4875j2876N2002L4277o6869p6863L7631P0050k8316n2276
$$ -38030 -24353 -13879 -48754 -61630 -9628 24649 -42220 -119083 -81452 -11402 -39718 -91994
200i1994K2387K1174j7790J8348K8509l5200k9970M0704K8798l1553k0265L3698
$$ -91994 -69607 -48433 -66223 -47875 -19366 -54566 -84536 -43832 -15034 -46587 -66852 -33154
212c3154N1295J6200m0174m2235J9366L7633j947Q05L0660P573j5415M346o53
$$ -33154 18141 34341 -5833 -48068 -28702 8931 6984 7789 38449 46022 30607 34953 34300
225C4300k9169j0817K9262L5184J3382j7092k5177N120N463l5716j6655M1985
$$ 34300 5131 -5686 23576 58760 72142 55050 29873 34993 40456 4740 -11915 30070
237C0070K0375k1977R250J0892n6916m1958M8541M3762l0875l0903J9876J9974
$$ 30070 50445 28468 37718 48610 -8306 -50264 -1723 42039 11164 -19739 137 20111
249B0111j9790l2334Q78K6807L921j9197K270N623j9460J2006M9573j3591p1833
$$ 20111 321 -32013 -31135 -4328 -407 -19604 -17334 -11711 -31171 -19165 30408 16817 -55016
262e5016l136N7657R564k6135R119K2567n329k2094k1083m358K2867K7575J5888
$$ -55016 -58152 -495 9069 -17066 -7947 14620 9291 -12803 -33886 -38244 -15377 12198 28086
275B8086L723k7574m3313N135M0734k290k6068J7773L1942q605k5636j4919o772
$$ 28086 31809 4235 -39078 -33943 6791 4501 -21567 -3794 28148 19543 -6093 -21012 -27784
288b7784Q346J6728M150k623l228p042J0820J8334l0107m9378J9287N5676j38
$$ -27784 -19438 -2710 1440 -1183 -4411 -11453 -633 17701 -12406 -61784 -42497 13179 13041
301A3041k6359Q251J1660j1360p360m450j4849J07K9490L0335J665l0033k2214
$$ 13041 -13318 -5067 6593 -4767 -12127 -16577 -31426 -31319 -1829 28506 30171 138 -22076
314b2076K3019K3174l0750k8043L3575L6403m478l611m66k7727j5080K6463J6295
$$ -22076 943 24117 -6633 -34676 -1101 35302 30824 27213 26747 -980 -16060 10403 26698
327B6698j5958m663K2287J9467r469l7349k3411K2797K7601p808q288Q604o831
$$ 26698 10740 6077 28364 47831 38362 1013 -22398 399 28000 20192 11904 20508 13677
340A3677q536J3766l311l2998k474L4609J2871j9964j7137K226J4381K779k3091
$$ 13677 5141 18907 15596 -17402 -19876 14733 27604 7640 -9497 -7271 7110 9889 -13202
353a3202j4155J8997J5500l961L513k914k6012k735L0295R77k9651J444K8194
$$ -13202 -27357 -8360 7140 3179 6692 3778 -22234 -24969 5326 6303 -23348 -21904 6290
366F290N534j7221j5408L87J6626R795q933m483N970m067J065J4408j1364k9111
$$ 6290 11824 -5397 -20805 -20418 -3792 6003 -2930 -7413 -1443 -5510 -4445 9963 -1401 -30512
380c0512J4049L7269m897k7067K213J5400J063o827q659k514J2666J0697k852
$$ -30512 -16463 20806 15909 -11158 -8945 6455 7518 691 -7968 -10482 2184 12881 10029
393A0029m887j0228j2274J5201K4588j7144k8869J6152K7863r164j8997r47L323
$$ 10029 5142 -5086 -17360 -2159 22429 5285 -23584 -7432 20431 11267 -7730 -8677 -5354
406e354O031Q589o550j4371j992R045J1409K453k0479j5274K7221K7369k2251
$$ -5354 677 9266 2716 -11655 -13647 -4602 6807 9260 -11219 -26493 728 28097 5846
419E846k9211Q334J3880j350K070j352j0330O536J9784j385k1337j5696N281K5345
$$ 5846 -23365 -15031 -1151 -2501 -431 -1783 -12113 -5577 14207 12822 -8515 -24211 -18930 6415
433F415J4262k0840j6664K1442J7677j6965j6160J1j381J1068K4711Q31k2942
$$ 6415 20677 -163 -16827 4615 22292 5327 -10833 -10822 -12203 -1135 23576 24407 1465
446A465m269J5566N470j2186j8265j05K9170K0428j6868j7480N740J678n448N208
$$ 1465 -2804 12762 18232 6046 -12219 -12324 16846 37274 20406 2926 8666 10344 4896 10104
460A0104k805j5067J1203K9874j555k8691j3263P911J0524j399j5097l805J9448
$$ 10104 7299 -7768 3435 33309 31754 3063 -10200 -2289 8235 6836 -8261 -12066 7382
473G382J1493j1534q754o163j2254M492K0129o738k1098J0629K4378m780k1761
$$ 7382 18875 7341 -1413 -7576 -19830 -15338 4791 -1947 -23045 -12416 11962 7182 -14579
486a4579j0088L396J1520P098p646n328P529L131o85L294r042j4027J3977K1761
$$ -14579 -24667 -21271 -9751 -2653 -10299 -15627 -8098 -4967 -5652 -2358 -11400 -25427 -11450 10311
500A0311j2179k0190J0531J9542J877p373r270m768R086R286l653l710J169K072
$$ 10311 -1868 -22058 -11527 8015 9892 2519 -6751 -11519 -2433 6853 3200 -510 659 2731
514B731J0712P344j9557j8019J8850K0576j3767j7515N702J1046O668J851j0728
$$ 2731 13443 20787 1230 -16789 2061 22637 8870 -8645 -2943 8103 14771 16622 5894
527E894j3143K127Q227J455m958q793K321K2845R535k7448k2423J3197J4136m106
$$ 5894 -7249 -5122 3105 4560 -398 -9191 -6870 15975 25510 -1938 -24361 -11164 2972 -1134
541a134k419Q59j751R041J2171j0069k0130l497J3592J4533l78j6535l748K4299
$$ -1134 -3553 -2694 -4445 4596 16767 6698 -13432 -16929 -3337 11196 10818 -5717 -9465 14834
555A4834J3470j8376j7016R71L458Q148J2497m982j3323P819J5650n959k0083
$$ 14834 28304 9928 -7088 -6117 -2659 5489 17986 13004 -319 7500 23150 17191 -2892
568b892j2094Q213K1918Q111j9051j3719J0791P976n259m498q579j0983J0320
$$ -2892 -14986 -6773 15145 23256 4205 -9514 1277 9253 3994 -504 -9083 -20066 -9746
581i746J8067p576j8973K834J5007J356j5943j9889r96K1362J4673p194q813k690
$$ -9746 8321 745 -18228 -15394 -387 969 -14974 -34863 -35859 -14497 176 -7018 -15831 -18521
595a8521m878J562N662r146q543J9634K0619j0247j9131m7J1810Q901p14r165
$$ -18521 -23399 -21837 -16175 -25321 -33864 -14230 6389 -3858 -22989 -23036 -11226 -2325 -3039 -12204
609a2204l118J0608Q736J827K750j862m324P706M979j4461p056K0652J9581k038
$$ -12204 -15322 -4714 4022 5849 8599 6737 2413 10119 15098 637 -6419 14233 33814 31776
623C1776q901q231o145L698P776N60K20M250J751p89n621j5624n397K0888J5843
$$ 31776 22875 14644 8499 12197 19973 20533 20753 25003 26754 25965 20344 4720 -677 20211 36054
638C6054j4130j8562j059M217L374J093o438m561P889N223j0867j5586l635J3440
$$ 36054 21924 3362 2303 6520 9894 10987 4549 -12 7877 13100 2233 -13353 -16988 -3548
652c548K0125j199k8356j4602J7214J3962p649o146L147L449K309m034j4068l708
$$ -3548 16577 15378 -12978 -27580 -10366 3596 -4053 -10199 -7052 -3603 -1294 -5328 -19396 -23104
666b3104J9217J9643j620j9739j8201K792K0741R951p186q99O936l799q756j324
$$ -23104 -3887 15756 14136 -5603 -23804 -21012 -271 9680 2494 1595 8531 4732 -4024 -5348
680e348j161L366J7094J1397j4176k1629n516J2053J6163L667j3531j0282N539
$$ -5348 -6509 -3143 13951 25348 11172 -10457 -15973 -3920 12243 15910 2379 -7903 -2364
693b364N310m071l892j040K350Q888j64k0221j5037J4226K1746J871j4635j4334
$$ -2364 2946 -1125 -5017 -6057 -3707 5181 5017 -15204 -30241 -16015 5731 7602 -7033 -21367
707b1367N47J2982M511j0644m897R285O815j026n987r774j551J7097J2350j0350
$$ -21367 -20820 -7838 -3327 -13971 -18868 -9583 -2768 -3794 -9781 -19555 -21106 -4009 8341 -2009
721b009j3017M661J0664L550m933o388K344J2135N731o736q518l470M331J3245
$$ -2009 -15026 -10365 299 3849 -1084 -7472 -5128 7007 12738 6002 -2516 -5986 -1655 11590
735A1590O394j1693o544J1312O713j1511r941L798R960Q065j577j1536o618P052
$$ 11590 17984 6291 -253 11059 17772 6261 -3680 118 10078 18143 16566 5030 -1588 5464
749E464P449k499q535n835N316J2392M22j3537m528Q070J381p678m141K112O373
$$ 5464 12913 10414 1879 -3956 1360 13752 14174 637 -3891 4179 5560 -2118 -6259 -4147 2226
764B226R103j10j2534r696K230P698Q084J058q983m796P968O010n419n093J880
$$ 2226 11329 11219 -1315 -11011 -8781 -1083 7001 8059 -924 -5720 2248 8258 2839 -2254 -374
779c74M085L905j740r923k697J5078J4172p391k2017j3111J2010K4026N761j7684
$$ -374 3711 7616 5876 -4047 -6744 8334 22506 15115 -6902 -20013 -8003 16023 21784 4100
793D100j0262P298L499r906q527M207J5594J4346p745k8772j6180J4707K2177
$$ 4100 -6162 1136 4635 -5271 -13798 -9591 6003 20349 12604 -16168 -32348 -17641 4536
806D536L762j1130r529J664M236n150p543N112J1690K899m886p560p687J766J3610
$$ 4536 8298 -2832 -12361 -10697 -6461 -11611 -19154 -14042 -2352 547 -4339 -11899 -19586 -17820 -4210
821d210R321m955r885m917K020R772Q683l020o334K536N749j128p364n911P264
$$ -4210 5111 156 -9729 -14646 -12626 -2854 5829 2809 -3525 -989 4760 3632 -3732 -9643 -2379
836b379J9210Q317j6003j7198L912J4486L210q416n027J0217J4993l525k2139
$$ -2379 16831 25148 9145 -8053 -4141 10345 13555 5139 112 10329 25322 21797 -342
849c42j3706Q727J5923O575m957r601j790O209l331j3302n66J5631R447q299j4178
$$ -342 -14048 -5321 10602 17177 12220 2619 829 7038 3707 -9595 -10161 5470 14917 6618 -7560
864g560q224K844R929O332j987n560n618k153M553N455M10R16K702l761r697m536
$$ -7560 -15784 -12940 -3011 3321 1334 -4226 -9844 -11997 -7444 -1989 -1579 -663 2039 -1722 -11419 -15955
880a5955M593J1241J3791K334j6281j6277L554J5739R665r60m614O19M370o579
$$ -15955 -11362 -121 13670 16004 -277 -16554 -13000 2739 12404 11444 6830 7449 11819 5240
894E240j5625k654J7651J6718j426j4138j0076N079J3130J420j3457p322P244
$$ 5240 -10385 -13039 4612 21330 19904 5766 -4310 769 13899 15319 1862 -5460 1784
907A784R066Qr342q580K532R095o43j0042j440Q635O237q63o605j0389m132Q339
$$ 1784 10850 10858 1516 -7064 -4532 4563 3920 -6122 -7562 1073 7310 6447 -158 -10547 -14679 -6340
923f340Q479l294j0639n865O103J2103L201r374o854M409O968L57n452m969M521
$$ -6340 2139 -1155 -11794 -17659 -11556 547 3748 -5626 -12480 -8071 -1103 -746 -6198 -11167 -6646
938f646J2698L01j8851j2279J2736K1309O627r632j2257R3J0831L868p977n194
$$ -6646 6052 6353 -12498 -24777 -12041 9268 15895 6263 -5994 -5901 4930 8798 821 -4373
952d373O270O784j853r972q066N948J5970O436q743r070L41N031M084j651p615
$$ -4373 1897 8681 6828 -3144 -11210 -5262 10708 17144 8401 -669 -328 4703 8787 7136 -479
967d79l419M634L373j923k586j982J023N873K693p097m522P668Q451k619j0930
$$ -479 -3898 736 4109 2186 -400 -2382 -1359 4514 7207 110 -4412 3256 11707 9088 -1842
982a842r156J240J0514N475o320o940L428Q467M304m797q473J030R098n68j2233
$$ -1842 -10998 -9758 756 6231 -89 -7029 -3601 4866 9170 4373 -4100 -3070 6028 5460 -6773
997f773l807J1390R965j858j0900j0291J207J3224R475k417m819j87N76k758o342
$$ -6773 -10580 810 10775 8917 -1983 -12274 -11067 2157 11632 9215 4396 4209 4785 2027 -4315
1012d315m744N830J1741K105r144o891Q27O459P412n8r338n647N235O204j026
$$ -4315 -9059 -3229 8512 10617 1473 -5418 -4591 1868 9280 9222 -116 -5763 -528 5676 4650
1027D650n803n258J096O872n2r174j871J0257Q751l216j1095r387L076J3039M982
$$ 4650 -1153 -6411 -5315 1557 1505 -7669 -9540 717 9468 6252 -4843 -14230 -11154 1885 6867
1042F867j0528j0474K627R635L729o518q585L494J1734K268r735o066L968O822
$$ 6867 -3661 -14135 -11508 -1873 1856 -4662 -13247 -9753 1981 4249 -5486 -11552 -7584 -762
1056g62L609n766j0926m40J4394J0093n613j0811l489N436Q578J733n882j523
$$ -762 2847 -2919 -13845 -14285 109 10202 4589 -6222 -9711 -4275 4303 6036 154 -1369
1070a369N868L577m020o759k856O902J3058K806j2244q749N194Q827K428n030
$$ -1369 4499 8076 4056 -2703 -5559 1343 14401 17207 4963 -3786 1408 10235 12663 7633
1084G633p912K30Q935L883o503n686K095M745J445n296q565P83J1307M958q387
$$ 7633 -279 -49 8886 12769 6266 580 2675 7420 8865 3569 -4996 -4213 7094 12052 3665
1099C665r361p97N287N142j701p064j078O558L348m208n783k072L206O097r66
$$ 3665 -5696 -6493 -1206 3936 2235 -4829 -5907 651 3999 -209 -5992 -8064 -4858 1239 273
1114B73q043j91R158M769m562o283k786L806P988K004o868m881L220M322L95l737
$$ 273 -7770 -7961 1197 5966 1404 -4879 -7665 -3859 4129 6133 -735 -5616 -2396 1926 2321 -1416
1130a416l002M975Q690q86j0135m033N689O065O39n736p992J99R193M045o895
$$ -1416 -4418 557 9247 8361 -1774 -5807 -118 5947 6586 850 -7142 -6943 2250 6295 -600
1145f00n849J534N500K693m952p523J789R479J177r368q290L44P479Q292j477
$$ -600 -6449 -4915 585 3278 -1674 -9197 -7408 2071 3248 -6120 -14410 -14066 -6587 1705 228
1160B28r836l028Q059N990k875o456k131O392Q010k144j0267k017Q657P230M6
$$ 228 -9608 -12636 -4577 1413 -1462 -7918 -10049 -3657 4353 2209 -8058 -10075 -1418 5812 5858
1175E858n445m902M677J2219L082r638p266L674P955L068m688o770K272R337K254
$$ 5858 413 -4489 188 12407 15489 5851 -1415 2259 10214 13282 8594 1824 4096 13433 15687
1190A5687p140n980J580P220N830m198j2149l155R052N349n445q267k259M343
$$ 15687 8547 2567 4147 11367 17197 12999 850 -2305 6747 12096 6651 -1616 -3875 468
1204D68O129j569q864k953N576M469l009p015n218L428Q677K64j0328n230N268
$$ 468 6597 5028 -3836 -6789 -1213 3256 247 -6768 -11986 -8558 119 383 -9945 -15175 -9907
1219i907O497R99l606m663J655P044J012o580m183L536O120L360l350o853J175
$$ -9907 -3410 -2411 -6017 -10680 -9025 -1981 -969 -7549 -11732 -8196 -2076 1284 -2066 -8919 -7744
1234g744R005L093n467l501K422M855L213k845o736j4P443L408m264m695p35M589
$$ -7744 1261 4354 -1113 -4614 -2192 2663 5876 3031 -3705 -3719 3724 7132 2868 -1827 -2562 2027
1250B027N697k897p876p40P054K029m834m448j150M509N980j946r161k919N884
$$ 2027 7724 4827 -3049 -3789 3265 5294 460 -3988 -5138 -629 5351 3405 -5756 -8675 -2791
1265b791N368j16n014l936L529P061j859q142j321O669N788Q29n312o987K470
$$ -2791 2577 2461 -2553 -6489 -2960 4101 2242 -5900 -7221 -552 5236 6065 753 -6234 -3764
1280c764J0064L193o805m676K576O199L170m401p097K687R373K551o506o254n80
$$ -3764 6300 9493 2688 -1988 588 6787 9957 5556 -1541 1146 10519 13070 6564 310 -270
1295b70O473P644l036j0293k919P263N190l138o326k758M743O932l116j0803l694
$$ -270 6203 13847 10811 518 -2401 4862 10052 6914 588 -2170 2573 9505 6389 -4414 -8108
1310h108O645O036K83o831p921J362R338J476q199m362M044N604J154o209o926
$$ -8108 -1463 4573 4856 -1975 -9896 -8534 804 2280 -5919 -10281 -6237 -633 521 -5688 -12614
1325a2614K533R488K368o050n128P3N606O536j924p968K94P707K775m144l544
$$ -12614 -10081 -593 1775 -4275 -9403 -9330 -3724 2812 888 -7080 -6786 921 3696 -448 -3992
1340c992L54N092N387j787p722j558O041N070j71m157m643K535O311q56o353j085
$$ -3992 -3638 1454 6841 5054 -2668 -4226 1815 6885 6714 2557 -2086 449 6760 5904 -449 -1534
1356a534M472K523r81m512m858K587P647R02o913m478J321M010K710l176n685
$$ -1534 2938 5461 4480 -32 -4890 -2303 5344 6246 -667 -5145 -3824 186 2896 -280 -5965
1371e965K108O628r51o904k208L267N657L206m703q065M67Q144L232l204l730
$$ -5965 -3857 2771 1820 -5084 -7292 -4025 1632 4838 135 -7930 -7463 681 3913 709 -3021
1386c021o0M588L629m907o655L750R099K001m763n943k808N270P914o95p299j339
$$ -3021 -3081 1507 5136 229 -6426 -2676 6423 8424 3661 -2282 -5090 180 8094 7399 100 -1239
1402a239M802K156k607m735j676O248O879l701r492l502L574O040L606l980p798
$$ -1239 3563 5719 3112 -1623 -3299 2949 9828 6127 -3365 -6867 -3293 2747 6353 2373 -5425
1417e425K60O382j97n652k446K837N629K253o977r820J304J0045N182k512o384
$$ -5425 -5165 1217 1020 -4632 -7078 -4241 1388 3641 -3336 -13156 -11852 -1807 3375 863 -5521
1432e521m260L702O782j870o673P61P940L347m345p274l024P615J0650j38q158
$$ -5521 -9781 -6079 703 -1167 -7840 -7079 861 4208 -137 -7411 -10435 -2820 7830 7692 -466
1447d66m245K655M790K667k991m246M182P407k416q692k595N070O950L686m044
$$ -466 -4711 -2056 2734 5401 2410 -1836 2346 9753 7337 -1355 -3950 1120 8070 11756 7712
1462G712q088p8N628J662k408j757ML374K523n787o910K364P898K457k915m835
$$ 7712 -376 -454 5174 6836 4428 2671 2675 6049 8572 2785 -4125 -1761 6137 8594 5679 844
1478H44m178J838N270q91m738M31L722O41l240n237j915O176P036k559p395j893
$$ 844 -3334 -1496 3774 2883 -1855 -1424 2298 2939 -301 -5538 -7453 -1277 5759 3200 -4195 -6088
1494f088K209L114J233k577k979L005M445k912n771n08M471N210J187o020n664
$$ -6088 -3879 -765 468 -2109 -5088 -2083 2362 -550 -6321 -6829 -2358 2852 4039 -1981 -7645
1509g645L602O433m95l689j681P21L674K741m438n784L091P201J235m383n083
$$ -7645 -4043 2390 1895 -1794 -3475 -2754 920 3661 -777 -6561 -3470 3731 4966 583 -4500
1524d500L7O225M114n266o408J960O142K633k809o038k704O239O992l688p346
$$ -4500 -4463 1762 5876 610 -5798 -3838 2304 4937 2128 -3910 -6614 -375 6617 2929 -4417
1539d417J03N166K773k182n759k262O501O335k738p090k867K787O408K883n314
$$ -4417 -4314 852 3625 1443 -4316 -6578 -77 6258 3520 -3570 -6437 -3650 2758 5641 327
1554C27n727K825N400n15m102j904J755N764L033n508p268J534P033L965j679
$$ 327 -5400 -2575 2825 2310 -1792 -3696 -1941 3823 6856 1348 -5920 -4386 2647 6612 4933
1569D933n578l461N214N853l138o913Q53N951L614j911o536l550N486O611j938
$$ 4933 -645 -4106 1108 6961 3823 -3090 -2237 3714 7328 5417 -1119 -4669 817 7428 5490
1584E490o283j510L355L962r32o430l299O028O278k550n742k141P20L604K289
$$ 5490 -793 -2303 1052 5014 4082 -2348 -5647 381 6659 4109 -1633 -3774 -3054 550 2839
1599B839k753l192J733K789j722l627j430K228N313K199n139n637N66L714K954
$$ 2839 86 -3106 -1373 1416 -306 -3933 -5363 -3135 2178 4377 -762 -6399 -5833 -2119 835
1614H35R95k701k868K216K683l111l474K719N538K338k992o958k486O622O646
$$ 835 1830 -871 -3739 -1523 1160 -1951 -5425 -2706 2832 5170 2178 -4780 -7266 -644 6002
1629F002j997n141j407K401K823p48m613n81O591M096m884o585o14M814N197r52
$$ 6002 4005 -1136 -2543 -142 2681 1933 -2680 -3261 3330 7426 2542 -4043 -4657 157 5354 4402
1645D402o090k825M570L614k012l774j830J666M698J570n334m300K625M378L70
$$ 4402 -1688 -4513 57 3671 1659 -2115 -3945 -2279 2419 3989 -1345 -5645 -3020 1358 1728
1660A728k502l160L45N153K331m738n379R74N850N203j582p693l832N814O272
$$ 1728 -774 -3934 -3589 1564 3895 -843 -6222 -5248 602 5805 4223 -3470 -7302 -1488 4784
1675D784j889m766k33L644L358k097o648j725P768P361k667p772m451K782P191
$$ 4784 2895 -1871 -2104 1540 4898 2801 -3847 -5572 2196 9557 6890 -882 -5333 -2551 4640
1690D640K323m905l691K590L178j859l134j551K579N118R64o127n015J764M832
$$ 4640 6963 2058 -1633 957 4135 2276 -858 -2409 170 5288 6252 125 -4890 -3126 1706
1705A706K889j334n123k446M033L493k735l477j8K429K913p94n103k365M460M623
$$ 1706 4595 3261 -1862 -4308 -275 3218 483 -2994 -3012 -583 2330 1536 -3567 -5932 -1472 3151
1721C151j689m537j883L110M635o85n997k390N196M977j031m073k770J090M544
$$ 3151 1462 -3075 -4958 -1848 2787 2102 -3895 -6285 -1089 3888 2857 -1216 -3986 -2896 1648
1736A648J116l939j224L953K760l003m339j722L996N959N14n314l691J313K323
$$ 1648 2764 -1175 -2399 1554 4314 1311 -3028 -4750 -754 5205 5719 405 -3286 -1973 350
1751C50J735l96j843j68K316p9m013j801L160L820J561l423n902j073N976M189
$$ 350 2085 1689 -154 -322 1994 1915 -2098 -3899 -739 3081 4642 1219 -4683 -5756 220 4409
1767D409j799m334k244J986L681k86m658m44N383L035l946n831j302N371O293
$$ 4409 2610 -1724 -3968 -1982 1699 1413 -3245 -3689 1694 4729 783 -5048 -6350 -979 5314
1782E314r45p029l109M116M777j5m173l057K445N832L1n551k476L450L753K07
$$ 5314 4369 -2660 -5769 -1653 3124 3109 -1064 -4121 -1676 4156 4187 -1364 -3840 -390 3363 3570
1798C570l829l606J942O156J854m690m923P6M283M460j559n464j233L818K612
$$ 3570 -259 -3865 -1923 4233 6087 1397 -3526 -3450 833 5293 3734 -1730 -2963 855 3467
1813C467k067l421j022L353M044j108o092j971M844M608j017n202m020K198O335
$$ 3467 1400 -2021 -3043 310 4354 3246 -2846 -4817 27 4635 3618 -1584 -5604 -3406 2929
1828B929J136m952l220K054L088K80k495k475K168M906J35n081l915K084M427
$$ 2929 4065 -887 -4107 -2053 1035 1315 -1180 -3655 -1487 3419 3554 -1527 -5442 -3358 1069
1843A069K012k346m591N27M455J996k319k825PK137K303j005l240l19M436J148
$$ 1069 3081 735 -3856 -3329 1126 3122 803 -2022 -2015 122 2425 1420 -1820 -2139 2297 3445
1859C445l304l153p5M206M133j065m712j880K579K152p5k105j777K170K918j390
$$ 3445 141 -3012 -3087 1119 5252 4187 -525 -2405 174 2326 2251 146 -1631 539 3457 2067
1875B067m203q28M036L012j038l881k778K864M688k39m956k992J269L548J530
$$ 2067 -2136 -2964 1072 4084 3046 -835 -3613 -749 3939 3700 -1256 -4248 -2979 569 2099
1890B099k496k724K044L946j001m531k320K254N001K154m060n315K42M629K720
$$ 2099 -397 -3121 -1077 2869 1868 -2663 -4983 -2729 2272 4426 366 -4949 -4707 -78 2642
1905B642k061l261n93L839L523k229m757k67M065K282j855l965p85M189M992j725
$$ 2642 581 -2680 -3273 566 4089 1860 -2897 -3164 901 3183 1328 -2637 -3422 767 5759 4034
1921D034o001k651L200N189J254l495m009K115L787m30m654k063K439M829J513
$$ 4034 -1967 -4618 -1418 3771 5025 1530 -2479 -364 3423 2993 -1661 -3724 -1285 3544 5057
1936E057m024n011J131N113J658l449m018j44M304L426k501m901p26L357K106
$$ 5057 1033 -3978 -2847 2266 3924 475 -3543 -3687 617 4043 1542 -3359 -4085 -728 1378
1951A378r81l199o60L494L589k005n703j208L252M077N45l272k554K167L705q09
$$ 1378 397 -2802 -3462 32 3621 1616 -4087 -5295 -2043 2034 2579 -693 -3247 -1080 2625 1816
1967A816l669j536K022L785J368k945l095J432L319j60k974j521K127L732J090
$$ 1816 -1853 -3389 -1367 2418 3786 841 -2254 -822 2497 2337 -637 -2158 -31 3701 4791
1982D791l583m017Q47L349J226j619j961J68K947J662l298l305J000L087Q93j681
$$ 4791 1208 -2809 -1962 1387 2613 994 -967 -799 2148 3810 512 -2793 -1793 1294 2187 506
1998E06k857j2L397J820k767m341J30L008L408K9k915k149K511J446k496l073
$$ 506 -2351 -2363 1034 2854 87 -4254 -4124 -1116 2292 2321 -594 -2743 -232 1214 -1282 -4355
2014d355K98M062L751o95m780l467L022M428M12k658j947J605L355M69m641l106
$$ -4355 -4057 5 3756 3061 -1719 -5186 -2164 2264 2676 18 -1929 -324 3031 3500 -1141 -4247
2030d247K820M045Q52l068k747J576M818J923m414m807L65M235K735j580l736
$$ -4247 -1427 2618 3470 402 -2345 -769 4049 5972 1558 -3249 -2884 1351 4086 2506 -1230
2045a230j121L364J963l034l918R16M567L662j163n312l503K691L479r56l042
$$ -1230 -2351 1013 2976 -58 -3976 -3060 1507 5169 4006 -1306 -4809 -2118 1361 405 -2637
2060b637j073K720L613j93m955k826L013M329J096k862k934M65L191J491l846
$$ -2637 -3710 -990 2623 2430 -2525 -5351 -2338 1991 3087 225 -2709 -2244 947 2438 -1408
2075a408l429J714M096J902j144k715l10L484J851l014l514R2L047L367n04l775
$$ -1408 -4837 -3123 973 2875 1731 -984 -1294 2190 4041 1027 -2487 -2395 652 4019 3515 -260
2091b60k319K306K714j062k243Q35K852K300j123n042l053K133L319L21j929j021
$$ -260 -2579 -273 2441 1379 -864 -29 2823 5123 4000 -1042 -4095 -1962 1357 1678 -251 -1272
2107a272R97K382k44l865j687K812L416k84k553k173N14K481J52l334j804K326
$$ -1272 -275 2107 1863 -2002 -3689 -877 2539 2255 -298 -2471 -1957 524 676 -2658 -4462 -2136
2123b136L605J372j795k844j47K649M59l138j195K123L229J165k265m056p00L786
$$ -2136 1469 2841 1046 -1798 -1945 704 1163 -1975 -3170 -1047 2182 3347 1082 -2974 -3674 112
2139A12K597j284j713O56J912J595k445m655n88M034L430j055k736j528J730L125
$$ 112 2709 1425 -288 368 2280 3875 1430 -3225 -3813 221 3651 2596 -140 -1668 62 3187
2155C187m27m510j829L109L799j02k866l025N36L586O0m164j789L146M512J311
$$ 3187 2760 -1750 -3579 -470 3329 3227 361 -2664 -2128 1458 1518 -2646 -4435 -1289 3223 4534
2171D534l498n027q33M218K267k200j794J057K759J313l071m659K6M970L660r41
$$ 4534 1036 -3991 -4824 -606 1661 -539 -2333 -1276 1483 2796 -275 -4934 -4908 62 3722 2781
2187B781l234j824J671K940o03l999q58L579L244p37k888k061J557L445L7l787
$$ 2781 -453 -2277 -606 2334 1731 -2268 -3126 453 3697 2960 72 -1989 -432 3013 3050 -737
2203g37k055K525L482J181k609l545k48K915O90k054r47J930K397O34l050m484
$$ -737 -2792 -267 3215 4396 1787 -1758 -2006 909 1599 -455 -1402 528 2925 3559 509 -3975
2219c975m77M182K731r15j702n29M70O92j609l135Q13M209K316j378l018j678
$$ -3975 -4452 -270 2461 1546 -156 -685 -215 477 -1132 -4267 -3454 755 3071 1693 -1325 -3003
2235c003Q02K316J62k435k04L127J792j548k364j629J716L154k33l116m68K967
$$ -3003 -2201 115 277 -2158 -2362 765 2557 1009 -1355 -2984 -1268 1886 1653 -1463 -1931 1036
2251A036K009m03k344k647Q12L541N71k356p76K237J733k37l505l372J344M597
$$ 1036 3045 2642 298 -2349 -1537 2004 2575 219 -557 1680 3413 3176 -329 -3701 -2357 2240
2267B240J905j988k312n01J318P74k180k974J879M569J919k854m149j552K105
$$ 2240 4145 2157 -155 -656 662 1436 -744 -3718 -1839 2730 4649 1795 -2354 -3906 -1801
2282a801L076p42l037K47L035J691j799l603k076K636M476L35l889j610K124K487
$$ -1801 1275 533 -2504 -2257 778 2469 670 -2933 -5009 -2373 2103 2438 -1451 -3061 -937 1550
2298A550j71l293k426K119M463R91l311k026R40K836J199k494l637Q10M800K176
$$ 1550 1379 -1914 -4340 -2221 2242 3233 -78 -2104 -1164 1672 2871 377 -3260 -2450 2350 4526
2314D526k234l304o32J762K163j259k698P67L879J887k107l980k464K093L806
$$ 4526 2292 -1012 -1644 118 2281 1022 -1676 -909 2970 4857 2750 -1230 -3694 -1601 2205
2329B205M16k570o54J800Q21j458k368j918K232M139P73l214k281K60J374P86
$$ 2205 2621 51 -603 1197 2018 560 -1808 -3726 -1494 2645 3418 204 -2077 -1817 -443 343
2345C43j600j841J693L154P22l049j873N19J800J574j523k543O24L434Q87k062
$$ 343 -1257 -3098 -1405 1749 2471 -578 -2451 -1932 -132 1442 -81 -2624 -2000 1434 2321 259
2361B59j788n32J633K081r17k208J154L502O4k233l189j017K426L487J9k908J43
$$ 259 -1529 -2061 -428 1653 736 -1472 -318 3184 3248 1015 -2174 -3191 -765 2722 2741 -167 -24
2378b4J756K85j728k312q8K832L476j169m109j213J253J552L94j783j393K034
$$ -24 1732 2017 289 -2023 -2111 721 4197 3028 -1081 -2294 -1041 511 905 -878 -2271 -237
2394b37L066m09l498j945J084K410J229j897k537R63L427J25k644k352M99K521
$$ -237 2829 2420 -1078 -3023 -1939 471 1700 -197 -2734 -1771 1656 1781 -863 -3215 -2716 -195
2410a95L269j875l769L59L447R55j950k690q32L284L380r66l721p10K409J848
$$ -195 3074 1199 -2570 -2211 1236 2191 241 -2449 -3281 3 3383 2417 -1304 -2014 395 2243
2426B243r88k567j343L101L982j003m346j703J235K371J243j507k050J418K986
$$ 2243 1255 -1312 -2655 446 4428 3425 -921 -2624 -1389 982 2225 718 -1332 86 3072
2441C072n91l203k232P84L006K423j944l538L53K761O89j931j796p8K277K850
$$ 3072 2481 -722 -2954 -2170 836 3259 1315 -2223 -1870 891 1580 -351 -2147 -2225 52 2902
2457B902j093l968m11K268J092m87j982q83K249K877j152l366l31J806J590K07
$$ 2902 1809 -2159 -2570 -302 790 303 -1679 -2562 -313 2564 1412 -1954 -2285 -479 1111 1318
2473A318j838j878J999K821n69k592r95J010J687O08j079j352J450K497j296k672
$$ 1318 -520 -2398 -399 2422 1853 -739 -1734 -724 963 1571 492 -860 590 3087 1791 -881
2489h81r82Q24K415K102j767k940L50J941k36j132p43M97K465R56k554l272O38
$$ -881 -1863 -1039 1376 3478 1711 -1229 -879 1062 826 -306 -1049 -552 1913 2869 315 -2957 -2319
2506b319K943R47p66k211r32K215K181j633k947J47K297J348q00k447p08K647
$$ -2319 624 1571 805 -1406 -2338 -123 2058 425 -2522 -2375 -78 1270 470 -1977 -2685 -38
2522c8K538j751l581l04K139K453P23k622k297K102K859j055k676l39J223K314
$$ -38 2500 749 -2832 -3136 -997 1456 2179 -443 -2740 -638 2221 1166 -1510 -1849 -626 1688
2538A688J302k057l176J260K861L17j764j555j53L006K151k467l692J16L075J477
$$ 1688 2990 933 -2243 -983 1878 2195 431 -1124 -1277 1729 3880 1413 -2279 -2163 912 2389
2554B389n52k257j430K127K598j783l051p9K475J657l51k949k350K660L455j023
$$ 2389 1837 -420 -1850 277 2875 1092 -1959 -2038 437 2094 1743 -1206 -3556 -896 2559 1536
2570A536k685j273P05K271Q51j840k284J354K678m73j918j179O53K396J481j991
$$ 1536 -1149 -2422 -1717 554 1405 -435 -2719 -1365 1313 840 -1078 -2257 -1604 792 2273 282
2586B82k999J249K307O60p05j536q15J975J833j021k493N47J990N22l64j797p58
$$ 282 -2717 -1468 839 1499 794 -742 -1557 418 2251 1230 -1263 -716 1274 1796 1432 -365 -1123
2603a123J958J937j530k400K11J484J342K95k159j818J931K039j245j880j93J053
$$ -1123 835 2772 1242 -1158 -947 537 1879 2174 15 -1803 128 2167 922 -958 -1151 -98
2619i8J148K91k278j521K084K341j289k111r18N32K113J443k067k397J475J656
$$ -98 1050 1341 -937 -2458 -374 1967 678 -1433 -2351 -1819 294 1737 -330 -2727 -1252 404
2635D04k94j368o44L88K678R78k696k389J345K379O14r11k110o32K782K409j672
$$ 404 110 -1258 -1902 -1514 1164 2142 -554 -2943 -1598 781 1395 484 -1626 -2258 524 2933 1261
2652A261k728M90J552J038l77k054o40K968K163j955l220p10J577K838O69k708
$$ 1261 -1467 -977 575 1613 1236 -818 -1458 1510 3673 1718 -1502 -2212 -635 2203 2872 164
2668A64j962J750K256j087j983j116P06K576J490k672k605J207K366L11j733k263
$$ 164 -1798 -48 2208 1121 -862 -1978 -1272 1304 2794 122 -2483 -1276 1090 1401 -332 -2595
2684b595k9L144K308k354k973M13K011Q83l18j964j055K946K197j745k750K0J217
$$ -2595 -2624 520 2828 474 -2499 -2086 -75 808 490 -1474 -2529 417 2614 869 -1881 -1861 -644
2701f44J841N79k345j327K509J875j126k099q04O43K502J313j896k323J258J794
$$ -644 1197 1776 -569 -1896 613 2488 1362 -737 -1541 -898 1604 2917 1021 -1302 -44 1750
2717A750q06j188n67K78K177J403k625k636J418J352K35j58j598n83J678J584
$$ 1750 944 -244 -811 -533 1644 3047 422 -2214 -796 556 791 633 -965 -1548 130 1714
2733A714j996j875Q51J236L64l71j444m30K497J114j913k262QJ480J893O22j865
$$ 1714 -282 -2157 -1306 -70 294 -77 -1521 -1951 546 1660 -253 -2515 -2507 -1027 866 1488 -377
2750c77j716K020R98j605j227P91J491J916N7k907j994K179J986k94j190n50K89
$$ -377 -2093 -73 925 -680 -1907 -1116 375 2291 2348 -559 -2553 -374 1612 1318 128 -422 -133
2767a33K412M19k931j694J775J781L65j321j180J48K238R99l197k239J078K470
$$ -133 2279 2698 -233 -1927 -152 1629 1994 673 -507 -359 1879 2878 -319 -2558 -1480 990
2783I90J249o95k283r34K301R91k462j740Q11K128J804L7l384j743J793J890q51
$$ 990 2239 1544 -739 -1673 628 1619 -843 -2583 -1772 356 2160 2197 -1187 -2930 -1137 753 -98
2800i8j437q3J429K108J4l040k489J849K583J55q84j092L80K241N43k792k228
$$ -98 -1535 -1618 -189 1919 1933 -1107 -3596 -1747 836 991 107 -985 -605 1636 2179 -613 -2841
2817b841J604K230J081n77j681q77K370J155k556j773P26J852J799n0k516j585
$$ -2841 -1237 993 2074 1497 -184 -1061 1309 2464 -92 -1865 -1139 713 2512 2462 -54 -1639
2833a639J621J126j600j109Q19J617J239n55l005j586J792J980n52n07l77K15
$$ -1639 -18 1108 -492 -1601 -782 835 2074 1519 -1486 -3072 -1280 700 148 -359 -736 -521
2849e21R49J60k406j173K151J801o2r64r09j54J790K07k328p41J794J661N82o45
$$ -521 428 588 -1818 -2991 -840 961 899 -65 -974 -1128 662 869 -1459 -2200 -406 1255 1837 1192
2867A192j597o76J762O67j939o23K186J530J74j030k361q29K220J300q77n82Q33
$$ 1192 -405 -1081 681 1348 -591 -1214 972 2502 2676 1646 -715 -1544 676 1976 1099 517 1350
2884A350R15L76j168l061o41K771J801o52r81l56K90O06n59k941n15K655K222
$$ 1350 2265 2641 1473 -1588 -2229 542 2343 1691 710 354 644 1250 691 -2250 -2765 -110 2112
2901B112l79j638j692j08J622M6k386n85K320K089p6j520k475l83K491Q82k005
$$ 2112 1733 95 -1597 -1705 -83 -37 -2423 -3008 -688 1401 1325 -195 -2670 -3053 -562 320 -1685
2918a685n44J479J453M54j282l061k40L069J657j001j119M03N80J305r05k779
$$ -1685 -2229 -750 703 1157 -125 -3186 -3426 -357 1300 299 -820 -417 163 1468 563 -2216
2934b216o48K762K193m56j341q99J99J434L53k228q35K495J861n20j529k307m85
$$ -2216 -2864 -102 2091 1635 294 -605 -406 1028 1381 -847 -1682 813 2674 2154 625 -1682 -2167
2951b167K325J228j511m86J359J156j68j280k226n93K647J365j284r80M54J90
$$ -2167 158 1386 -125 -611 748 1904 1736 456 -1770 -2363 284 1649 365 -615 -161 29
2967B9L24m56j968j7K885J520j264r28o67j11Q51m0j900J89K614J031o30j096
$$ 29 353 -103 -2071 -2088 797 2317 1053 125 -542 -653 198 158 -1742 -1553 1061 2092 1462 366
2985C66r65k47J698L82j680R6K011J096j344j397j645K26K351Q43j216k91J437
$$ 366 -599 -846 852 1234 -446 -350 1661 2757 1413 16 -1629 -1403 948 1791 575 284 1721
3002A721J37o70j447j706P47L125L91j900j021M43M75lm17j592P07K949O46k117
$$ 1721 1858 1188 -259 -1965 -1218 1907 2298 398 -623 -180 295 292 -125 -1717 -1010 1939 2585 468
3020D68j488n50O47J330o6k040L90K698O81j827j744p03R72K457K87k272l75J756
$$ 468 -1020 -1570 -923 407 341 -1699 -1309 1389 2070 243 -1501 -2204 -1232 1225 1512 -760 -1135 621
3038F21P18j134j549j518J095L441R45k409j009R97K50l96r98j436Q82L317Q00
$$ 621 1339 205 -1344 -2862 -1767 1674 2619 210 -799 198 448 52 -946 -2382 -1500 1817 2617
3055B617k051k059k21N39J082J08j432N47K761L89k247k248o60N77K664L68j660
$$ 2617 566 -1493 -1714 -1175 -93 15 -1417 -870 1891 2280 33 -2215 -2875 -2298 366 734 -926
3072i26l33J742L12j241j225r93J072K561M62j990q27J109M65m29o71j269P76
$$ -926 -1259 483 795 -446 -1671 -2664 -1592 969 1431 -559 -1386 -277 188 -241 -912 -2181 -1405
3089a405K847Q24j659r85K05J91L67j62j309Q46K608L16j925j248j35M95J317
$$ -1405 1442 2266 607 -378 -173 18 385 223 -1086 -240 2368 2684 759 -489 -624 -129 1188
3106A188K08j013K31J765k63j975j061RR11J836M66k023m77J232l26j071n58k11
$$ 1188 1396 383 614 2379 2116 141 -920 -911 0 1836 2302 279 -198 1034 708 -363 -921 -1132
3124a132J338J976m67k577m17Q92L29q0l84p50O40K221j07k493p42Q56O97N03
$$ -1132 206 2182 1715 -862 -1279 -387 -58 -138 -522 -1272 -632 1589 1482 -1011 -1753 -897 -200 303
3142C03m83j048R10K361l04k637r18M68J243J561o5j640q4K116o09j897p10L19
$$ 303 -180 -1228 -318 2043 1739 -898 -1816 -1348 -105 1456 1391 -249 -333 1783 1174 -723 -1433 -1114
3160a114J989K056m62k614m93J393K77o68p33m15J327K252o57k813j023J241Q49
$$ -1114 875 2931 2469 -145 -638 755 1032 364 -369 -784 543 2795 2138 -675 -1698 -457 392
3177C92L03o58j398R83J978l31k752q83N82J053J271l32k022J65K257l55j877
$$ 392 695 37 -1361 -378 1600 1269 -1483 -2366 -1784 -731 540 208 -1814 -1649 608 253 -1624
3194a624r39J97J264J860j21k227l72J427K65r14l37l4J034K184m30k386m47J250
$$ -1624 -2563 -2366 -1102 758 637 -1590 -1962 -535 -270 -1184 -1521 -1555 -521 1663 1233 -1153 -1600 -350
3212c50M07J39p6m46N94J868m32k395l54J182Q35O38R3j273J51J368l98j831l24
$$ -350 57 196 120 -326 268 2136 1704 -691 -1045 137 972 1610 1703 430 581 1949 1551 -280 -604
3231f04J060O98J089m91j880k26J300k29j146j33O56O75R56r15k426K42J636k19
$$ -604 456 1154 2243 1752 -128 -354 946 717 -429 -562 94 769 1725 810 -1616 -1374 262 43
3249D3q56p8J22O44J252r45k534M0J837O42j27l95o54M86J243j068j801J95J763
$$ 43 -813 -891 -769 -125 1127 182 -2352 -2312 -475 167 40 -355 -1009 -523 720 -348 -2149 -1954 -191
3268a91R81M22o83j723O46J759o92j636M03J439R32L61j326j838N06K038j09r85
$$ -191 790 1212 529 -1194 -548 1211 519 -1117 -714 725 1657 2018 692 -1146 -640 1398 1289 304
3286C04k29M01J334O33j545k256L9K083M52l65q38l19J122R77q86k746L04J547
$$ 304 75 476 1810 2443 898 -1358 -1319 764 1216 851 13 -306 816 1793 907 -1839 -1535 12
3304A2J148j48q20j353L71J633r04j850n1J581J012O95j344j746K17J864k85j597
$$ 12 1160 1012 192 -1161 -790 843 -61 -1911 -1962 -381 631 1326 -18 -1764 -1547 317 32 -1565
3322a565J65P50J028Q00j028k274N54J727K98p60j53J94M61J104j018j911K06
$$ -1565 -1400 -650 378 1178 150 -2124 -1570 157 455 -305 -458 -264 197 1301 283 -1628 -1422
3339a422J819N89j51n13n61L57J274p70j713M24J507M10l00p31j099M25J512l13
$$ -1422 397 986 835 322 -239 118 1392 622 -1091 -667 840 1250 950 219 -880 -455 1057 744
3357G44j423M10P05M81j44q06j203O95J835p13r30j30N54M53L99j140j292P07
$$ 744 -679 -269 436 917 773 -33 -1236 -541 1294 581 -349 -479 75 528 927 -213 -1505 -798
3375g98J868j72p35j94k79N51K69r15j405J222J764N2n92r52n77Q48R64p18j479
$$ -798 1070 898 163 -31 -310 241 510 -405 -1810 -588 1176 1228 636 -316 -893 -45 919 201 -1278
3394a278N33J647j41k31j182q04J023J629o58j531L53J087L89j73j083j383Q43
$$ -1278 -745 902 761 530 -652 -1456 -433 1196 538 -993 -640 447 836 663 -420 -1803 -960
3411i60J772j6j428m00N54J118L16j232j677R52K076k34r34o09k00J053J012r57
$$ -960 812 796 -632 -1032 -478 640 956 -276 -1953 -1001 1075 841 -93 -702 -902 151 1163 206
3429B06j779P69J728K55o89r21p30J002J762q50j325P7J104M89p4p66j166R22
$$ 206 -1573 -804 924 1179 490 -431 -1161 -159 1603 753 -572 -495 609 1098 1024 258 -908 14
3447A4J779n54j425j25N13O10L57o20j389P38J442j32j226k03k08N70O51q03j422
$$ 14 1793 1239 -186 -311 202 812 1169 549 -840 -102 1340 1208 -18 -221 -429 141 792 -11 -1433
3466a433O78J617O4r83r03m03O11J182l90j341N04R62q2n70p05k63P29J067n81
$$ -1433 -755 862 926 -57 -960 -1363 -752 430 40 -1301 -797 165 83 -487 -1192 -1455 -726 341 -240
3485b40j136M77N03K75j03n04p30J101R40o21r70K32P76K24J54q87p86J112J433
$$ -240 -1376 -899 -396 -121 -224 -728 -1458 -357 583 -38 -1008 -776 0 224 378 -509 -1295 -183 1250
3504A250m37j208j69N68M62L95p82j305J200J297l29r44p57M69R72N19r03j158
$$ 1250 813 -395 -564 4 466 861 79 -1226 -26 1271 942 -2 -759 -290 682 1201 298 -860
3522h60P02J008k8o29p02l05J226J253j352j591O16Q85N19q8j007p84J194J347
$$ -860 -158 850 822 193 -509 -814 412 1665 313 -1278 -662 223 742 654 -353 -1137 57 1404
3540A404r65j264N4O18J004J35j120q05J025J441l87j471l86K77J113J069r49
$$ 1404 439 -825 -771 -153 851 986 -134 -939 86 1527 1140 -331 -717 -440 673 1742 793
3557G93j295O83J224m62n15p24l8J220J011r08j563N61Q44L52n98o85o19J101
$$ 793 -502 181 1405 943 428 -296 -334 886 1897 989 -574 -13 831 1183 585 -100 -719 382
3575C82J313q66j227m3O73L08Kq62j058J205J167n27r92j87K65L25M46r85p38
$$ 382 1695 829 -398 -441 232 540 542 -320 -1378 -173 994 467 -525 -712 -447 -122 324 -661 -1399
3594a399R24J130o52n61m06l4O90M71p35p40N09J344k60o89l46k08Q46Q57r78
$$ -1399 -475 655 3 -558 -964 -998 -308 163 -572 -1312 -803 541 281 -408 -754 -962 -116 741 -237
3613b37q77O72P60J29l24p82m82J118P49p61p80J43P78N26l73j010m79J146Q27
$$ -237 -1114 -442 318 447 123 -659 -1141 -23 726 -35 -815 -672 106 632 259 -751 -1230 -84 743
3632G43q49q68R3M76N55J86j260o81J248Q99p52q15j43M58R81P8j369q12R12J370
$$ 743 -106 -974 -881 -405 150 336 -924 -1605 -357 542 -210 -1025 -1168 -710 271 349 -1020 -1832 -920 450
3652D50j43q99l98J32J141N56j399p21R46R18K98l65p40m31J424R84r87q94J98
$$ 450 307 -592 -990 -858 283 839 -560 -1281 -335 583 881 516 -224 -655 769 1753 766 -128 70
3671G0J059L57j46j293k99J187J275p69r42l42O01R80j36j117q72Q91J062k48
$$ 70 1129 1486 1340 47 -252 935 2210 1441 499 157 758 1738 1602 485 -387 504 1566 1318
3689A318q77o61k1J236M15j219q41M05R66J5n04q49j74R89O61q87r83N02N51L81
$$ 1318 441 -220 -241 995 1410 191 -650 -245 721 736 232 -617 -791 198 859 -28 -1011 -509 42 423
3709D23l36q02m54J087O86m54r52M24L39M21N7p62m44R90R26n52o54k35L83O90
$$ 423 87 -715 -1169 -82 604 150 -802 -378 -39 382 439 -323 -767 223 1149 597 -57 -292 91 781
3729G81P4n78l92O90N49l01o41k01Q3Q07J19q15q34P13Q02l98o60o05K44Q18L96
$$ 781 855 277 -115 575 1124 823 182 -19 64 871 990 175 -659 54 856 458 -202 -807 -563 255 651
3750F51j087q21M69O16j06o41n77k52J038N22p08r45N4R04J58m21p97%J154P28
$$ 651 -436 -1257 -788 -172 -278 -919 -1496 -1748 -710 -188 -896 -1841 -1787 -883 -725 -1146 -1943 -1943 -789 -61
3770f1p80p75J19M11P81Qj029q6R66R09l47q09k25N42J139M4q17n86Q57Q98L4
$$ -61 -841 -1616 -1497 -1086 -305 -297 -1326 -1412 -446 463 116 -693 -918 -376 763 807 -10 -596 261 1159 1193
3791A193p79m55J30J250N20j006p28L75J023L06n29r71j84J199N19p09r66N5N32
$$ 1193 414 -41 89 1339 1859 853 125 500 1523 1829 1300 329 145 1344 1863 1154 188 243 775
3810G75O11l34r11l39O18Q74m76r51k61M66N64p9q52p50O30O35J62j094k31L06
$$ 775 1386 1052 141 -198 420 1294 818 -133 -394 72 636 557 -295 -1045 -415 220 382 -712 -943 -637
3830f37Q43j7q13m49K48P98J48m22m62R4O00N50q43q75O01Q41J97j04n78r2P18
$$ -637 206 189 -624 -1073 -825 -27 121 -301 -763 -669 -69 481 -362 -1237 -636 205 402 298 -280 -372 346
3851C46N74p37q12L76N76N51k93m59o8N60N72n30n64r0N19N50m05n36n60Q41N94
$$ 346 920 183 -629 -253 323 874 581 122 54 614 1186 656 92 2 521 1071 666 130 -430 411 1005
3872A005m80q01R1L63M38Np49n22M26L61M1p41m23M82N14K38q83m42K05R65L1
$$ 1005 525 -276 -185 178 616 621 -128 -650 -224 137 178 -563 -986 -504 10 248 -635 -1077 -872 93 124
3893A24n89m57j8P74J85q36n35M71R04J19m15n75j48R28O82n60p91l2R28O83k71
$$ 124 -465 -922 -940 -166 19 -817 -1352 -881 23 142 -273 -848 -996 -68 614 54 -737 -769 159 842 571
3914E71j014k50P74P57l34o48m7M92P35j25p73q15N81R09J5p22l64Q1Q72M29q34
$$ 571 -443 -693 81 838 504 -144 -191 301 1036 911 138 -677 -96 813 828 106 -258 -177 695 1124 290
3935B90q54K61Q96J03j43q84k55O60Q92q98r56M86M67O38l82p56k63O31P49m60
$$ 290 -564 -303 593 696 553 -331 -586 74 966 68 -888 -402 65 703 321 -435 -698 -67 682 222
3955B22p33J62K29N95qp16n48O63P34j56o32k02K98M02M26p02n15M90M25l09j59
$$ 222 -511 -349 -120 475 467 -249 -797 -134 600 444 -188 -390 -92 310 736 34 -481 9 434 125 -34
3976c4r9j36O26M85q50m76K93O68j17k73o97N6Q05M30r41p28O20N21j8l8p20k21
$$ -34 -133 -269 357 842 -8 -484 -191 477 360 87 -610 -554 251 681 -260 -988 -368 153 135 97 -623 -844
3998h44Q53N37o00p04L39L09K67r8o58j78J023N30n90o19J11K55N99k0q59j74
$$ -844 9 546 -54 -758 -419 -110 157 59 -599 -777 246 776 186 -433 -322 -67 532 512 -347 -521
4018e21Q05O51k06q10m5K44O22J31o87o64O14Q71k10m29n12Q8O90L92r54q84O80
$$ -521 284 935 729 -81 -126 118 740 871 184 -480 134 1005 795 366 -146 -58 632 1024 70 -814 -134
4039a34P37pl05r77j55Q96N48m73q79k0L46O71j24o67o45P40R80n14o30k60L53
$$ -134 603 596 291 -686 -841 55 603 130 -749 -769 -423 248 124 -543 -1188 -448 532 18 -612 -872 -519
4060e19O49L50j068l65N23Q33j24n21k71L4R57N4n61n72L79Q67Q8l48l43l96P74
$$ -519 130 480 -588 -953 -430 403 279 -242 -513 -479 478 532 -29 -601 -222 645 733 385 42 -354 420
4081D20N66n89n31R4N32L6K7m30k89O84L75p04m09j53N24L05qn15n35P20L36l86
$$ 420 986 397 -134 -40 492 528 555 125 -164 520 895 191 -218 -371 153 458 450 -65 -600 120 456 70
4103G0o23J31R0M39J60o61o55O92N86m83l17J9l6O10K61o02n10O57M31j64Mm44
$$ 70 -553 -422 -332 107 267 -394 -1049 -357 229 -254 -571 -552 -588 22 283 -319 -829 -172 259 95 99 -345
4125c45j1N36L92p27m08R05J44M2k77k87L9P16N58q12m66J16M21M48j37p81l33
$$ -345 -356 180 572 -155 -563 342 486 528 251 -36 3 719 1277 465 -1 115 536 984 847 66 -267
4146b67P85O76o58n87O7J66M10j7q65m08Q76N11n88m20k38j14Q50K07q39o89O56
$$ -267 518 1194 536 -51 16 182 592 575 -290 -698 178 689 101 -319 -557 -671 179 386 -453 -1142 -486
4167d86O59m42l15m33K3J027K62j047n11K67N02K56J19p26m87R28P57p84m86K60
$$ -486 173 -269 -584 -1017 -994 33 295 -752 -1263 -996 -494 -238 -119 -845 -1332 -404 353 -431 -917 -657
4187f57K96L31K60q60m8P86O33m52m31j36n1P24L90q10m01P62K33L6j69j45k76
$$ -657 -361 -30 230 -630 -678 108 741 289 -142 -278 -329 395 785 -25 -426 336 569 605 436 291 15
4208A5N87N16r55m01O51K81j69L7l15j51N12M27q93l11M79L59N9j84m32l62P64
$$ 15 602 1118 163 -238 413 694 525 562 247 96 608 1035 142 -169 310 669 728 544 112 -250 514
4229E14N25p65j34L62j00L30jp21k80Q02L23p16p6J95j74M76J45j005k13J064
$$ 514 1039 274 140 502 402 732 731 10 -270 532 855 139 63 258 84 560 705 -300 -513 551
4249E51J31n47O1k21k90P50J3j075K0O63R0k70J42o42l3Q60L2p97k47K98Q9J68
$$ 551 682 135 196 -25 -315 435 448 -627 -607 56 146 -124 18 -624 -657 203 235 -562 -809 -511 -422 -254
4271b54k03m71k55J067M53j160l70M97R0M94l6p07l55R16M29o60k65J07N9P45
$$ -254 -457 -928 -1183 -116 337 -823 -1193 -696 -606 -112 -148 -855 -1210 -294 135 -525 -790 -683 -624 121
4291A21K39j026m06J091L33m64j26j49k9P39M69j068j79M54N30k52J02p10k72
$$ 121 360 -666 -1072 19 352 -112 -238 -387 -416 323 792 -276 -455 -1 529 277 379 -331 -603
4310f03J126M50q53l40K81L13J55j96o34k12Q79L71p14r5O7k36M80J77p83k26
$$ -603 523 973 120 -220 61 374 529 333 -301 -513 366 737 23 -72 -5 -241 239 416 -367 -593
4330e93O15M79o14j44m5n18R00J41q34k15O25L81l33K9l27j66P93J68o34j02M97
$$ -593 22 501 -113 -257 -302 -820 80 221 -613 -828 -203 178 -155 -126 -453 -619 174 342 -292 -394 103
4351A03J42n6n7l78j59R01J04n88j95P39p0J00K25p66qR00k56n58J67J48j15L81
$$ 103 245 189 132 -246 -405 496 600 12 -183 556 486 586 811 45 37 937 681 123 290 438 323 704
4373G04J80p77m4R30q9n20j48k1k03O27N2j074L35M93L8m66K60m39K48N91p6r97
$$ 704 884 107 63 993 904 384 236 215 12 639 691 -383 -48 445 483 17 277 -162 86 677 601 -396
4395c96J36M71L6r6Ln86n8J065q0o26k68M82p1M65K8j067l15J245J36q21j8L43
$$ -396 -260 211 247 151 154 -432 -490 575 495 -131 -399 83 12 477 505 -562 -877 368 504 -317 -335 8
4417Ho7M88J05j112o4J007j69l46n4j57j98O75J89j181J9P12k5Q5pn46p4O86O8
$$ 8 -59 429 534 -578 -642 365 196 -150 -204 -361 -559 116 305 -876 -857 -145 -170 -85 -92 -638 -712 -26 42
4440D2r48kM15k6K19K42j022p8Q15K26q01j4M23k60M16L36j073M5P86m9l05O5
$$ 42 -906 -908 -493 -519 -300 -58 -1080 -1158 -343 -117 -918 -932 -509 -769 -353 -17 -1090 -1045 -259 -308 -613 -548
4462e48p5l4N58K33q15K10M78K3j32K87n32q2P13K61q94o5Q17k33nN00o20p5Q65
$$ -548 -623 -657 -99 134 -681 -471 7 30 -102 185 -347 -429 284 545 -349 -414 403 170 165 665 45 -30 835
4485H35J86j108J92N73k90J88J08n03N9J159m70p73N97j54j71O14j52n80r1J136
$$ 835 1021 -87 105 678 388 576 684 181 240 1399 929 156 753 599 428 1042 890 310 219 1355
4505A355n35n12K22n7j42O99j61r60K99Q59n01k98k08j26JR25k82r79K02P20l91
$$ 1355 820 308 530 473 331 1030 869 -91 208 1067 566 268 60 -66 -65 860 578 -401 -199 521 130
4526A30j13j94n10J54Q63m4j169J13N52k86L95j45r35L10R60l42n69J34k27J50
$$ 130 17 -177 -687 -533 330 286 -883 -770 -218 -504 -109 -254 -1189 -879 81 -261 -830 -696 -923 -773
4546g73P13k00p66K63Q91j63n07L51l65M3Q37j47q60L27N33Q6j33J17o68j3J192
$$ -773 -60 -260 -1026 -763 128 -35 -542 -191 -556 -513 324 177 -683 -356 177 263 130 247 -421 -434 758
4567G58j15j003K13O93j13p6K54q23J30P80k22o41J29L44k44K15R6q91Q9R11l40
$$ 758 643 -360 -147 546 433 357 611 -212 -82 698 476 -165 -36 308 64 279 375 -516 -427 484 144
4588A44m44J93j41j3M27j25o85K50O76n31q4M23m62j38R35j86p15K41N63l32%
$$ 144 -300 -107 -248 -261 166 41 -644 -394 282 -249 -333 90 -372 -510 425 239 -476 -235 328 -4 -4
4609dJ36m02K35Q34n55m60M47L37k77R4R3n30K62Q21n90n97M44R5j74M49k02o59
$$ -4 132 -270 -35 799 244 -216 231 568 291 385 478 -52 210 1031 441 -156 288 383 209 658 456 -203
4631b03M42O41k93q05J81K16k04N45l92o06M29N08m34k19rl12J22R51n65r01N69
$$ -203 239 880 587 -218 -37 179 -25 520 128 -478 -49 459 25 -194 -203 -515 -393 558 -7 -908 -339
4652c39L88k73k42qm72O45P25m45p80K50M82j52J59j68m77L78Q44n11k35j94M10
$$ -339 49 -224 -466 -474 -946 -301 424 -21 -801 -551 -69 -221 -62 -230 -707 -329 515 4 -231 -425 -15
4673a5j80M23k48n53K63Q31k95m08Q6l20K29O56m02o71L34P86m42p7j41k86J37
$$ -15 -195 228 -20 -573 -310 521 226 -182 -96 -416 -187 469 67 -604 -270 516 74 -3 -144 -430 -293
4694b93Q73m53n41K44L85j26J69k3o75M72P41l87m41L79N8m21M14q6n81K58O20
$$ -293 580 127 -414 -170 215 89 258 235 -440 32 773 386 -55 324 382 -39 375 289 -292 -34 586
4715E86O1o03L34k93K16M62l51q40P01K82m74J5J33m9j79N59l78o14M74K91l30
$$ 586 647 44 378 85 301 763 412 -428 273 555 81 96 229 180 1 560 182 -432 42 333 3
4736Cr3K28m87J81N22m91k56K90L09m75L70m21k53M58M01p58k67P11K17k5q6j67
$$ 3 -90 138 -349 -168 354 -137 -393 -103 206 -269 101 -320 -573 -115 286 -472 -739 -28 189 164 78 -89
4758h9l73M12M76n13l27M10J59J41J17l77m89M33L56l16l38L54p7R1N89o17n91
$$ -89 -462 -50 426 -87 -414 -4 155 296 413 36 -453 -20 336 20 -318 36 -41 50 639 22 -569
4779e69M84L36j75n3p5m11L97N88p22o33N31K77j28J42k74k37M96L39m80l22K90
$$ -569 -85 251 76 23 -52 -463 -66 522 -200 -833 -302 -25 -153 -11 -285 -522 -26 313 -167 -489 -199
4800a99J2K17N51o43n09O82N17l17l34L37k48K68N64o46l91O21J94j79J42j62
$$ -199 -187 30 581 -62 -571 111 628 311 -23 314 66 334 898 252 -139 482 676 497 639 477
4820D77j68K99M93l86n85L00J86j33J45k97k92M89M44o81n25L75R0j35L13k52
$$ 477 309 608 1101 715 130 430 616 483 628 331 39 528 972 291 -234 141 231 96 409 157
4840A57o53M91L8m66J77J73m75K5M57j27o24N77J92m67j35L52m08K43N84o82p2
$$ 157 -496 -5 33 -433 -256 -83 -558 -533 -76 -203 -827 -250 -58 -525 -660 -308 -716 -473 111 -571 -643
4861f43K92J81l80J34k4l01M70N91o58l01O10j57j04j1K6J11K94K27l84o59N84
$$ -643 -351 -170 -550 -416 -440 -741 -271 320 -338 -639 -29 -186 -290 -301 -275 -164 130 357 -27 -686 -102
4882a02K15j44K2j26l31L87M58o53n4J04j22J77L49n02k71P53O6m26j76M7jK18
$$ -102 113 -31 -9 -135 -466 -79 379 -274 -328 -224 -346 -169 180 -322 -593 160 226 -200 -376 -329 -330 -112
4904a12N21n81l82Q15k0k08j63n1k26N62L15m30m25N94J34M5J72l47n69N59N00
$$ -112 409 -172 -554 261 241 33 -130 -181 -407 155 470 40 -385 209 343 388 560 213 -356 203 703
4925G03o98j97K61L35L1K09o31j43K90K12p3j73m3J0L30K27q87j88N23J90l88
$$ 703 5 -192 69 404 435 644 13 -130 160 372 299 126 83 93 423 650 -237 -425 98 288 -100
4946a00Q5J30M0K81J59n52m59M01J40K7L9J10j10L45K01o57j58K46o3K91J57j7
$$ -100 -15 115 155 436 595 43 -416 -15 125 152 191 301 191 536 737 80 -78 168 105 396 553 536
4968E36k68K58K03o05o5LK29L0K17o0j92L82j7n55j60j9QJ73K08k30j76L90Q2
$$ 536 268 526 729 124 59 62 291 321 538 478 286 668 651 96 -64 -83 -75 98 306 76 -100 290 372
4991C72n28m6J04k18K93M54m84m56K82q2J02k60m6M0N51J84l90j27J57j4k46L1
$$ 372 -156 -202 -98 -316 -23 431 -53 -509 -227 -309 -207 -467 -513 -473 78 262 -128 -255 -98 -112 -358 -327
5013c27k88K12M65K97o29mL8j51P0J53k91k18Q05L4n30k07K40k61K01L44p56K2
$$ -327 -615 -403 62 359 -270 -274 -236 -387 -317 -164 -455 -673 132 166 -364 -571 -331 -592 -391 -47 -803 -781
5035g81N74K21k71j73k14j4L34K60p75L9N18J84M3j25j56n09O67K45k93M7K28
$$ -781 -207 14 -257 -430 -644 -658 -324 -64 -839 -800 -282 -98 -55 -180 -336 -845 -178 67 -226 -179 49
5056D9M7J84J35r22nP30J70k96J83J69j74L81J61n77kK92N3k04L05j40k26M15
$$ 49 96 280 415 -507 -512 218 388 92 275 444 270 651 812 235 233 525 578 374 679 539 313 728
5078G28Ko89L8K86k18L41N5l80n9M5K99n25l8L67q7O7K48m53k52N28k36j56j87
$$ 728 730 41 79 365 147 488 543 163 104 149 448 -77 -115 252 165 232 480 27 -225 303 67 -89 -276
5101b76M32l5J31l2k93LJ35J57j58M8L45L07K4m66l57P4M51q4r0Rj2J45J02k95
$$ -276 156 121 252 220 -73 -70 65 222 64 112 457 764 788 322 -35 39 490 406 316 325 313 458 560 265
5125B65l35J3K61J80o5k68j47J47R5k41l48nJ37J55N0j69k47j86L61N1n99K84
$$ 265 -70 -57 204 384 319 51 -96 51 146 -95 -443 -448 -311 -156 -106 -275 -522 -708 -347 -296 -895 -611
5147f11j35L21J43k48k58r8P23j14l78K01O6LM65j0n56K76J83K04j65n3J41J8
$$ -611 -746 -425 -282 -530 -788 -886 -163 -277 -655 -454 -388 -385 80 70 -486 -210 -27 177 12 -41 100 118
5169A18M64j34k82j13L24L10k51p6k69QN16Mk57j83M8O3K22m12k56J09K65P1l56
$$ 118 582 448 166 53 377 687 436 360 91 99 615 619 362 179 227 290 512 100 -156 -47 218 289 -67
5192f7J49k12Q8J18m14j61NK79M1j44J55j22k76K20m3j53K59O9L23m2k60J57N1
$$ -67 82 -130 -42 76 -338 -499 -494 -215 -174 -318 -163 -285 -561 -341 -384 -537 -278 -209 114 72 -188 -31 20
5215B0K02k19k81K84L87M6P3p7j15k61J42L1n0J64K4J51Mj29k49J36qj37j51J13
$$ 20 222 3 -278 6 393 439 512 435 320 59 201 232 182 346 370 521 525 396 147 283 275 138 -13 100
5239A00J43K9j15j14k69J15J46j10j97N1Q1m5J30n55l16M00J25L5J5j5j7K17q9
$$ 100 243 272 157 43 -226 -111 35 -75 -272 -221 -140 -185 -55 -610 -926 -526 -401 -366 -351 -366 -383 -166 -255
5262b55O2l45l1N12j01N0k20K61K65J42k95j16MM20J73k36j19j54L56L90l09l14
$$ -255 -193 -538 -569 -57 -158 -108 -328 -67 198 340 45 -71 -67 353 526 290 171 17 373 763 454 140
5284A40j7K9RQJ47l26K27L13r8k94k06k20K15j0mk67L70J05k74j22p7j93K59L49
$$ 140 123 152 161 169 316 -10 217 530 432 138 -68 -288 -73 -83 -87 -354 16 121 -153 -275 -352 -545 -286 63
5308F3k85j99m1J64O1P6k06k05L17K67J43k91O1o6J89P7K12k58j66L96j34j13
$$ 63 -222 -421 -462 -298 -237 -161 -367 -572 -255 12 155 -136 -75 -141 48 125 337 79 -87 309 175 62
5330F2J02k6J11K45r8j90L63nk00m2k57j48K64K23k62J0J31n4j74j17L4L2L52
$$ 62 164 138 249 494 396 206 569 564 364 322 65 -83 181 404 142 152 283 229 55 -62 -28 4 356
5353C56kk25n2j30k52j03J18q7J27K08K64l10j8j55M0J20l2n0K9K32J51j01j37
$$ 356 354 129 77 -53 -305 -408 -290 -377 -250 -42 222 -88 -106 -261 -221 -101 -133 -183 -154 78 229 128 -9
5376ij94J84J19Mj04P2L84J51m14q0m38K35K27kL6O2K5P7j21k94l05Q8K12K73
$$ -9 -203 -19 100 104 0 72 456 607 193 113 -325 -90 137 135 171 233 258 335 214 -80 -385 -297 -85 188
5400A88j94J2lj24K1l8m48l9L49K55M5j92l0N6J27p4m38l12N26K52Q7j18j64P1
$$ 188 -6 6 3 -121 -100 -138 -586 -625 -276 -21 24 -168 -198 -142 -15 -89 -527 -839 -313 -61 26 -92 -256 -185
5424a85L36K9m82j38K88K10K1K06q8j45J23J85l50j72K85r2L26J14k37L6J04J32
$$ -185 151 180 -302 -440 -152 58 79 285 197 52 175 360 10 -162 123 31 357 471 234 270 374 506
5446E06l95L1j76q3M81O1j99j04J22j18j27o3l2N2L15n7q1q1K24k97J32k11p6
$$ 506 111 142 -34 -117 364 425 226 122 244 126 -1 -64 -96 -44 271 214 133 52 276 -21 111 -100 -176
5469a76j25M41N3j52k28K32j55j25J14l18K81L34p4p7p1N5j83K11j07j79P3K85
$$ -176 -301 140 193 41 -187 45 -110 -235 -121 -439 -158 176 102 25 -46 9 -174 37 -70 -249 -176 109
5491A09P0k60O3O9j22J22l16Q4K55P2J83l54k3K6J80r7p3j73J33J86J52j05j52
$$ 109 179 -81 -18 51 -71 51 -265 -181 74 146 329 -25 -48 -22 158 61 -12 -185 -52 134 286 181 29
5514B9l01K76p1N6j55k2R6M05Q2k52k79kJ75k08lQ3J80J39Rp8m64K62J17p1k5
$$ 29 -272 4 -67 -11 -166 -188 -92 313 395 143 -136 -138 37 -171 -174 -91 89 228 237 159 -305 -43 74 3 -22
5539b2N7k50K70K34j93k23j45K72N6O0M6k72K96J79k77p0M5J2j8J67j43k8K8J99
$$ -22 35 -215 55 289 96 -127 -272 0 56 116 162 -110 186 365 88 18 63 75 57 224 81 53 81 280
5563B80J04k81k06J14QK49o8j84n7J44k49K8J78j46M4P0j0j35k7J47r7p8J43k83
$$ 280 384 103 -103 11 19 268 200 16 -41 103 -146 -118 60 -86 -42 28 18 -117 -144 3 -94 -172 -29 -312
5587c12K22MO8n2j50L5O0l06J02K60q8J82r5n2K3J21P2j66n4P4P7J94j89k04n2
$$ -312 -90 -86 -18 -70 -220 -185 -125 -431 -329 -69 -157 25 -70 -122 -99 22 94 -72 -126 -52 25 219 30 -174 -226
5612b26K90q0K48j48Q5JK02k43P8k59p9L43K53j28l15O7K58j45j60j76q5M28J13
$$ -226 64 -16 232 84 169 170 372 129 207 -52 -131 212 465 337 22 89 347 202 42 -134 -219 209 322
5635C22j49j31K2J85j60r5k71K27Q2L43k53k57K05j23R3j69p7N9K12L3n3q9o1
$$ 322 173 42 64 249 89 -6 -277 -50 32 375 122 -135 70 -53 40 -129 -206 -147 65 98 45 -44 -105
5658a05j81J52M3q4j03L57K78k52p7l7j71J78K11j24l94M09Q6q3Q3k34L0j82L57
$$ -105 -286 -134 -91 -175 -278 79 357 105 28 -9 -180 -2 209 85 -309 100 186 103 186 -48 -18 -200 157
5681A57j13L9k30K58J29k05j51k78N65l05J79Lk78L6J00j31j65l9L65j05J2P9
$$ 157 44 83 -147 111 240 35 -116 -394 171 -134 45 48 -230 -194 -94 -225 -390 -429 -64 -169 -157 -78
5703g8k8j3l5K34k01j41K39J03r8j75J87j53K88J31k81j29L19j0j79m5K79L1J97
$$ -78 -106 -119 -154 80 -121 -262 -23 80 -18 -193 -6 -159 129 260 -21 -150 169 159 -20 -65 214 245 442
5726D42m3k18p4R7M4o7O1j58O6K10j62q6J3q6J40j69rK9j54L39o5j58ln5m1n1
$$ 442 399 181 107 204 248 181 242 84 150 360 198 112 125 39 179 10 1 30 -124 215 150 -8 -11 -66 -107 -158
5752a58K10k80J17m8J09q1n7j76M7L34k39m6j21L57j20J1J54m61M1L47L99l97
$$ -158 52 -228 -111 -159 -50 -131 -188 -364 -317 17 -222 -268 -389 -32 -152 -141 13 -448 -407 -60 339 -58
5774e8l6J88%j9K23m95J45J17J44N6k15J58PJ4K66o46O6K81j8N5j85R3l4K28J8
$$ -58 -94 94 94 75 298 -197 -52 65 209 265 50 208 215 229 495 -151 -85 196 178 233 48 141 107 335 353
5799C53k05k78K63j13k22K08J20o3m5K48l77o9m9J27K8K1r3k89J37K95j82J22
$$ 353 148 -130 133 20 -202 6 126 63 18 266 -111 -180 -229 -102 -74 -53 -146 -435 -298 -3 -185 -63
5821f3j24J1J45p9J24l14K66J51k21L6L9j77K38L6K17k43N4K08l49k5J75J29p4
$$ -63 -187 -176 -31 -110 14 -300 -34 117 -104 -68 -29 -206 32 68 285 42 96 304 -45 -70 105 234 160
5844A60k0j31J17L51k87j08j46k8J6N01l00RK3J27k22M7m7j02J99j95M5l3j39
$$ 160 140 9 126 477 190 82 -64 -92 -76 425 125 134 157 284 62 109 62 -40 159 -36 9 -24 -163
5867a63K97qk1l23j3Q8J24j18j41L91q0N4O9q8k32n4K31Jj43J0K36k18L43j77
$$ -163 134 126 105 -218 -231 -143 -19 -137 -278 113 33 87 156 68 -164 -218 13 14 -129 -119 117 -101 242 65
5891F5m27J15J54J01L20k41J02k28K47O2n43Q9K38J7J85M8k58lL00q5j92r3j2
$$ 65 -362 -247 -93 8 328 87 189 -39 208 270 -273 -184 54 71 256 304 46 43 343 258 66 -27 -39
5914c9J27L11k72j68j6j26K39q6j95K92k2K27J19l30k05J57k79M9L2PQ8O6Kk16
$$ -39 88 399 127 -41 -57 -183 56 -30 -225 67 45 272 391 61 -144 13 -266 -217 -185 -178 -90 -24 -22 -238
5938b38J96J0j12L5Q6j04O0K46j49j56m0J62p9r0L17l8jR8k5j78N7p4OJ27k52
$$ -238 -42 -32 -144 -109 -23 -127 -67 179 30 -126 -166 -4 -83 -173 144 106 105 203 178 0 57 -17 -11 116 -136
5963a36J18J58j65J80k49Q0L8L26m8l71j05K44R3j29J58m17K28J42p6K0k60J53
$$ -136 -18 140 -25 155 -94 -14 24 350 302 -69 -174 70 163 34 192 -225 3 145 69 89 -171 -18
5985a8J69o6po7J0j79L57k64n0k3K83j42M1q5l2J12M7k05m3J56Q6K57l00K4j93
$$ -18 151 85 78 11 21 -158 199 -65 -115 -138 145 3 44 -41 -73 39 86 -119 -162 -6 80 337 37 61 -132
6010a32r7K20J27r2P4o9J61R7j87k69J57n1J71k05K87j85P0J41L4o39M00m0J25
$$ -132 -229 -9 118 26 100 31 192 289 102 -167 -10 -61 110 -95 192 7 77 218 252 -387 13 -27 98
6033I8p4j83P2j43L18L7k60o3J25P0Q5K1n60L29J19j4j7K3K1n7k6R6k3O9J4j70
$$ 98 24 -159 -87 -230 88 125 -135 -198 -73 -3 82 103 -457 -128 -9 -23 -40 -17 4 -53 -79 17 -6 63 77 -93
6059i3J15R4m9j66L18k02j25K77j00M5J2j06k8M5Q8j6l41K20L13l24J91j81J22
$$ -93 22 116 67 -99 219 17 -108 169 69 114 126 20 -8 37 125 109 -232 -12 301 -23 168 -13 109
6082A09j51K92k21j30K12Rk6n3j34L7J1J77O2m15K39L2L0j77R3J35o6lol3j44
$$ 109 -42 250 29 -101 111 120 94 41 -93 -56 -45 132 194 -221 18 50 80 -97 -4 131 65 62 56 23 -121
6107a21n7J18J59k05o7L98j14q7N7k74J7J54k8j55J46J08jP5n5k74P4K5K27o0
$$ -121 -178 -60 99 -106 -173 225 111 24 81 -193 -176 -22 -50 -205 -59 49 48 123 68 -206 -132 -107 120 60
6131F0K9j95K41j98P3Kk50lL91p3k57%P6J95k9j06k76L25J72j63N4j44K2K9J37
$$ 60 89 -106 135 -63 10 12 -238 -241 150 77 -180 -180 -104 91 62 -44 -320 5 177 14 68 -76 -54 -25 112
6156A12l79J73n1K32kj11R8j75P4K45l18L2K04o2L2l4J8r7m2J05K63k23J84j26
$$ 112 -267 -94 -145 87 85 -26 72 -103 -29 216 -102 -70 134 72 104 70 88 -9 -51 54 317 94 278 152
6180A52R1K5l1l07K26N2k35K19m0k05L18M2j37j08J61k2J6k63M2l5O6j24N9j12
$$ 152 243 268 237 -70 156 208 -27 192 152 -53 265 307 170 62 223 201 217 -46 -4 -39 27 -97 -38 -150
6204a50K21j7N5j28p4J8p3K31k12k39K70k1k32J01M4m4k1L41m6k58M1J34J78l45
$$ -150 71 54 109 -19 -93 -75 -148 83 -129 -368 -98 -119 -351 -250 -206 -250 -271 70 24 -234 -193 -59 119 -226
6228b26p1O2J79N0m44K85RK00j45N9k1OL02mk82j69J19k34K48P3k0m4J34J61P1
$$ -226 -297 -235 -56 -6 -450 -165 -156 44 -101 -42 -63 -57 245 241 -41 -210 -91 -325 -77 -4 -24 -68 66 227 298
6253B98l46K09m0o4K44j27j32j64O1L01k67L7j16K85Q6j86J79k51j2N9J4k08L3
$$ 298 -48 161 121 57 301 174 42 -122 -61 240 -27 10 -106 179 265 79 258 7 -5 54 68 -140 -107
6276a07R8J17o4j33J58j25R0K0J15j75p0l9J7Pk44J89N8J45j19M8L5r0J75j0K
$$ -107 -9 108 44 -89 69 -56 34 54 169 -6 -76 -115 -98 -91 -335 -146 -88 57 -62 -14 21 -69 106 96 98
6301I8p4p3J21j2k42P9P6J56Pr5j09J85m6mJ3J22k97K18k88p2K36k12J47j49P2
$$ 98 24 -49 72 60 -182 -103 -27 129 136 41 -68 117 71 67 80 202 -95 123 -165 -237 -1 -213 -66 -215 -143
6326a43O8m4J79p2k29J44q9J16J82l71N1R9Q2J18l40K0J75J07j03j12M3O6R5J10
$$ -143 -75 -119 60 -12 -241 -97 -186 -70 112 -259 -208 -109 -27 91 -249 -229 -54 53 -50 -162 -119 -53 42 152
6350A52q2k5P8n2J7J15l11J15J6J75k21j29J65J18J18l6k37Q1lrj01L2k76L46
$$ 152 70 45 123 71 88 203 -108 7 23 198 -23 -152 13 131 249 213 -24 57 54 45 -56 -24 -300 46
6374D6J78k87L6L4J19o2J12k78m0M33l19K3K8p4P4N6Rj5j01K50k37J61J7k7J2
$$ 46 224 -63 -27 7 126 64 176 -102 -142 291 -28 -5 23 -51 23 79 88 73 -28 222 -15 146 163 136 148
6399A48n6Mk43K16k8kk6k8%J20P1j12Q2l58J41R7J47j50k86k0K03l7M9q5r0M6
$$ 148 92 96 -147 69 41 39 13 -15 -15 105 176 64 146 -212 -71 26 173 23 -263 -283 -80 -117 -68 -153 -243 -197
6425a97K37k40O3j7M6J36l06L1N7m0J64j53l3J09J08r9J88nk72M4J11J14J3N7
$$ -197 40 -200 -137 -154 -108 28 -278 -247 -190 -230 -66 -219 -252 -143 -35 -134 54 49 -223 -179 -68 46 59 116
6449A16J4M3j04K2nJ54J21r4r1M2l58K94J94l04O9K6K1N1JN3p8q1r9M7k32K15
$$ 116 130 173 69 91 86 240 361 267 176 218 -140 154 348 44 113 139 160 211 212 265 187 106 7 54 -178 37
6475C7l5m0K8l1j86J12J86J14m85M2K03j49J20m6k47J72J54k3k50J04j38L10j5
$$ 37 2 -38 -10 -41 -227 -115 71 185 -300 -258 -55 -204 -84 -130 -377 -205 -51 -74 -324 -220 -358 -48 -63
6498f3J60l88P7K07k1Lj14O3k2K26k4k79K18K10P8j92n9j44K06K27q2j62j07K87
$$ -63 97 -291 -214 -7 -28 -25 -139 -76 -98 128 104 -175 43 253 331 139 80 -64 142 369 287 125 18 305
6522C05n7j1N3j41k33L43qk80J24J03l3r7J28j94p8J97Rk05N8o9k21J60J17l42
$$ 305 248 237 290 149 -84 259 251 -29 95 198 165 68 196 2 -76 121 130 -75 -17 -86 -307 -147 -30 -372
6546c72K15J12k18J99n6j03n4J49N0q0j3K07n6J75k1l36m3L21P4k44KK35l3j62
$$ -372 -157 -45 -263 -64 -120 -223 -277 -128 -78 -158 -171 36 -20 155 134 -202 -245 76 150 -94 -92 143 110 -52
6570e2K22Pr0L56k39j9qQ7j31K42q6k70J64J53m03J10J42j19O4j31J38k80L77
$$ -52 170 177 87 443 204 185 177 264 133 375 289 19 183 336 -67 43 185 66 130 -1 137 -143 234
6593B34q8m3k37j22J35j07J82j14k46J63J68j77p3q4o2Q0J71k6m09K47P8j71K55
$$ 234 146 103 -134 -256 -121 -228 -46 -160 -406 -243 -75 -252 -325 -409 -471 -391 -220 -246 -655 -408 -330 -501 -246
6616b46j23m4lJ54J0j69K09J89j24O7M7j25J84O6k76K31m1oO3L96m18K5j16M27
$$ -246 -369 -413 -416 -262 -252 -421 -212 -23 -147 -80 -33 -158 26 92 -184 47 6 0 63 459 41 66 -50 377
6640C77O4n8k57j78K46J02k74m7J61J46j88J86j24j77J04J13K1j52j08Q1J60p5
$$ 377 441 383 126 -52 194 296 22 -25 136 282 94 280 156 -21 83 196 217 65 -43 38 198 123
6662A23J65l59K59j16Kj02J9Q6n1K14j09k02K8R5R3q1Q9j16K9J06j36j6O6P7k45
$$ 123 288 -71 188 72 74 -28 -9 77 26 240 131 -71 -43 52 145 64 153 37 66 172 36 20 86 163 -82
6687h2O8J8J37p5L00m58O3J84O1j60k4R3j47j48L57j98j54J66N6o9j06P4q6K11
$$ -82 -14 4 141 66 366 -92 -29 155 216 56 32 125 -22 -170 187 -11 -165 1 57 -12 -118 -44 -130 81
6711H1M0k44q3J69j94J07J7Rk00L17k7k9r1J84l06O8J09N1j96J79L3k25l3K52
$$ 81 121 -123 -206 -37 -231 -124 -107 -98 -298 19 -8 -37 -128 56 -250 -182 -73 -22 -218 -39 -6 -231 -264 -12
6735a2n0m2K08k20j54J75R9j97K50m2j40K43J11k30m8J87K8q9J05N8k04l3J65
$$ -12 -62 -104 104 -116 -270 -95 4 -193 57 15 -125 118 229 -1 -49 138 166 77 182 240 36 3 168
6758A68r8o0R0M4l06L97o9l35R4K26j16l3j01J70j52R8k22j33K44J44j32K9J19
$$ 168 70 10 100 144 -162 235 166 -169 -75 151 35 2 -99 71 -81 17 -205 -338 -94 50 -82 -53 66
6781F6k63K15J43j04l07J39Q1j63N4L9j05K47o9j71R0J25Q9o9J24r5j15J34R5
$$ 66 -197 18 161 57 -250 -111 -30 -193 -139 -100 -205 42 -27 -198 -108 17 106 37 161 66 -49 85 180
6804A80k45nK5r7K78o2j02q2L29J37m94K84Q1k39J55J24k99j49M40j39k81J52
$$ 180 -65 -70 -45 -142 136 74 -28 -110 219 356 -138 146 227 -12 143 267 -32 -181 259 120 -161 -9
6826iQ6n0QK73k04j59J68l7j88J89j38l25M88J1k27rJ55P5k24K54j79j40L13k8
$$ -9 77 27 35 308 104 -55 113 76 -112 77 -61 -386 102 113 -114 -123 32 107 -117 137 -42 -182 131 103
6850A03p8k91M16k86P3L40k26j56J88J91k35p7q4R1J9Q2j43j4M08l08K1l6J44
$$ 103 25 -266 150 -136 -63 277 51 -105 83 274 39 -38 -122 -31 -12 70 -73 -87 321 13 34 -2 142
6873A42r9J46J8j08l84L48P5k66L11k58j67M21j79j26J51j09k4nK36j90m7O0K08
$$ 142 43 189 207 99 -285 63 138 -128 183 -75 -242 179 0 -126 25 -84 -108 -113 123 -67 -114 -54 154
6896A54j85j11N5Q3o8J39j30k34L72K9k90K16j9j59K00J55l30R7J18j05J05k3
$$ 154 -31 -142 -87 -4 -72 67 -63 -297 75 104 -186 30 11 -148 52 207 -123 -26 92 -13 92 69
6918F9P4j7M3M1k75R5O2J39l72M3O2n0L74m4k26oj1q2k8J91j5k24L72j91k17O4
$$ 69 143 126 169 210 -65 30 92 231 -141 -98 -36 -86 288 244 18 12 1 -81 -109 82 67 -157 215 24 -193 -129
6944a29K4N6p9J09l54J82K53p6j51Q4Q6pO1J10l54n5K57j33j52M83k59j42L81
$$ -129 -105 -49 -128 -19 -373 -191 62 -14 -165 -81 5 -2 59 169 -185 -240 17 -116 -268 215 -44 -186 195
6967A95M5m20j24N74k10P4m3k45K5M94K9m73J96L1j45M1L75k51k64L86p9k68J62
$$ 195 240 -180 -304 270 60 134 91 -154 -129 365 394 -79 117 148 3 44 419 168 -96 290 211 -57 105
6990A05l7j09K40O9k55p8J69o9jJ35Mj03M5k6j91m8L97n01J95K26l65j20J99L40
$$ 105 68 -41 199 268 13 -65 104 35 34 169 173 70 115 89 -102 -150 247 -254 -59 167 -198 -318 -119 221
7014B21l93J05J81O8k02j59K13m20N88j56l04L13j76M4Q7Q8k22K41j20M7j72K51
$$ 221 -172 -67 114 182 -20 -179 34 -386 202 46 -258 55 -121 -77 10 98 -124 117 -3 44 -128 123
7036A23pk12K72J2j08K1K60r2j40O8k13j41K49J11l33J82Q7r5j04J76j3k25L01
$$ 123 116 -96 176 188 80 101 361 269 129 197 -16 -157 92 203 -130 52 139 44 -60 116 103 -122 179
7059A79k60l44J80M16k61J73r8k98O7M55q3m56L00J35n3j92K26j70r3J47N6l40
$$ 179 -81 -425 -245 171 -90 83 -15 -313 -246 209 126 -330 -30 105 52 -140 86 -84 -177 -30 26 -314
7081c14K68o5J63K15k65j23n5M67k62j53J19l6k34M11j34k31M4K02q5K52k02j24
$$ -314 -46 -111 52 267 2 -121 -176 291 29 -124 -5 -41 -275 136 2 -229 -185 17 -68 184 -18 -142
7103a42MK14M2n22M14L1o3q3K25k53J19J02n3n1o2j3j0J56J9l85K32J31k7j61
$$ -142 -138 76 118 -404 10 41 -22 -105 120 -133 -14 88 35 -16 -78 -91 -101 55 74 -311 -79 52 25 -136
7127a36K22j58j0L36k66q5n2L53j75P5P8O6l11L72o2k45J61K6L3mj9j50j49L29
$$ -136 86 -72 -82 254 -12 -97 -149 204 29 104 182 248 -63 309 247 2 163 189 222 218 199 49 -100 229
7151B29j29j84K20J14k17j36K96l00R4K98k70j62K84j45k27K48J42m45N1L76k95
$$ 229 100 -84 136 250 33 -103 193 -107 -13 285 15 -147 137 -8 -235 13 155 -290 -239 137 -158
7172a58MJ50m3j72J35K42n23J23K88l31J15J69k92K51N2Q6m13K14L54l34MJ44
$$ -158 -154 -4 -47 -219 -84 158 -365 -242 46 -285 -170 -1 -293 -42 10 96 -317 -103 251 -83 -79 65
7194F5k21n7N55l25k94K55o0O6J44l2k49K80L7j94j59L73m5k76K77r5j67J54L36
$$ 65 -156 -213 342 17 -277 -22 -82 -16 128 96 -153 127 164 -30 -189 184 139 -137 140 45 -122 32 368
7217C68k76j92P9k16M3N07j97l84L18K2j27o7K37k83J66O2n0l23L18Q6l12K38
$$ 368 92 -100 -21 -237 -194 313 116 -268 50 72 -55 -122 115 -168 -2 60 10 -313 5 91 -221 17
7239A7J35l05J8L79p5j77L7mj28L80j86k89J16L78j56j97M46l17j18J21J76k13
$$ 17 152 -153 -135 244 169 -8 29 25 -103 277 91 -198 -82 296 140 -57 389 72 -46 75 251 38
7261C8N2N3j18l6K89n02J10K40M8l65J44Q6k28K87R9m42m5L98k69j36K89J50k06
$$ 38 90 143 25 -11 278 -224 -114 126 174 -191 -47 39 -189 98 197 -245 -290 108 -161 -297 -8 142 -64
7284f4J26J1k51J79J03m38j37N25k87kL06j5j01L5L33m24j07L27N1k75K11j57
$$ -64 62 73 -178 1 104 -334 -471 54 -233 -235 71 56 -45 -10 323 -101 -208 119 170 -105 106 -51
7306e1r0J92K21l36J74J78j54K6N35m15o10M02J85m41J12O8k08L90J49j09m07
$$ -51 -141 51 272 -64 110 288 134 160 695 280 -330 72 257 -184 -72 -4 -212 178 327 218 -189
7327a89K15O6k98N10l64k39K47M63n28k10J39J40j11J61k8l94L89K31k84j50P5
$$ -189 26 92 -206 304 -60 -299 -52 411 -117 -327 -188 -48 -159 2 -26 -420 -31 200 -84 -234 -159
7348a59M7k79O19l87j75L45J51r5P8N9k82ML56k56j30J93r2q3K53j48k75K03N20
$$ -159 -112 -391 228 -159 -334 11 162 67 145 204 -78 -74 282 26 -104 89 -3 -86 167 19 -256 -53 467
7371D67l08k83K79J38l16L43j89k68J82L6K6j59J70K4k31K74n5k33N1K84l13J79
$$ 467 159 -124 155 293 -23 320 131 -137 45 81 107 -52 118 142 -89 185 130 -103 -52 232 -81 98
7393I8J94m77o3O36m18q5J46N0k19O3L20l03j67L45k48l1L35k58J0l6P3q3K2L19
$$ 98 292 -185 -248 388 -30 -115 31 81 -138 -75 245 -58 -225 120 -128 -159 176 -82 -72 -108 -35 -118 -96 223
7417B23k74j21J10Q5j20J84p2k79J54L33m10k60K99o9K76l7k57L7K44K32n86J93
$$ 223 -51 -172 -62 23 -97 87 15 -264 -110 223 -187 -447 -148 -217 59 22 -235 -198 46 278 -308 -115
7439a15Kj15K13M2p4j68K52J51n15K07%j51J01J24k40j49K24J26O5J75k51l75
$$ -115 -113 -228 -15 27 -47 -215 37 188 -327 -120 -120 -271 -170 -46 -286 -435 -211 -85 -20 155 -96 -471
7461d71P23Q1m08K8K21p8j79K88m40K4M25o5l08O0J77k48J13K88K8l04J17J03
$$ -471 252 333 -75 -47 174 96 -83 205 -235 -211 214 149 -159 -99 78 -170 -57 231 259 -45 72 175
7483A75n5o1R8j62M4L80m54n5L50M3k49J75j78j12J04K18l82j02M29j46lK23k01
$$ 175 120 59 157 -5 39 419 -35 -90 260 303 54 229 51 -61 43 261 -121 -223 206 60 57 280 79
7506G9k59K11L58m55J6l5O8p1J42n6KL0R3j56k02L16Jj17L16n73L9K71L7k58K93
$$ 79 -180 31 389 -66 -50 -85 -17 -88 54 -2 0 30 123 -33 -235 81 82 -35 281 -292 -253 18 55 -203 90
7531I0K4l11P8J63n9j18J18M1k3P0q7k00M71j06k41Q6K77j44m3J4j40ML9K36l94
$$ 90 114 -197 -119 44 -15 -133 -15 26 3 73 -14 -214 257 151 -90 -4 273 129 86 100 -40 -36 3 239 -155
7556a55J73K38k26k08K05j1j38K01L0j13j53L35k63K47j07r8k89K97Q4k64N26
$$ -155 18 256 30 -178 27 16 -122 79 109 -4 -157 178 -85 162 55 -43 -332 -35 49 -215 311
7577C11l38j00P2K85m47L1K49j50j06L27p1k29L09p1j57N0J65k18J29K15j36j71
$$ 311 -27 -127 -55 230 -217 -186 63 -87 -193 134 63 -166 143 72 -85 -35 130 -88 41 256 120 -51
7599e1M42j45k97R2R4j98L28J34l48k5R7J57j91j91J71j56L08J62m42k47L20M29
$$ -51 391 246 -51 41 135 -63 265 399 51 26 123 280 89 -102 69 -87 221 383 -59 -306 14 443
7621D43m94L9nl26K82K90m82J63M7M3k21K48k42j71M22j3j72L6r3j32K10L93m04
$$ 443 -51 -12 -17 -343 -61 229 -253 -90 -43 0 -221 27 -215 -386 36 23 -149 -113 -206 -338 -128 265 -139
7644a39p2M21l05j59K48k3k56K22K81l95J09L47l61j21L17l07mK06K90l14n0M11
$$ -139 -211 210 -95 -254 -6 -29 -285 -63 218 -177 -68 279 -82 -203 114 -193 -197 9 299 -15 -65 346
7666C46L6n76M30k86o0L28j31j06n3K10k06L0lo5j0K34Q7k14P1k12P7L6J41j66
$$ 346 382 -194 236 -50 -110 218 87 -19 -72 138 -68 -38 -41 -106 -116 118 205 -9 62 -150 -73 -37 104 -62
7690f2qJ04P0l27J62k08J64J48J03l13K19J70j34j74K46j54n8K39P7l55J32K02
$$ -62 -70 34 104 -223 -61 -269 -105 43 146 -167 52 222 88 -86 160 6 -52 187 264 -91 41 243
7712B43K8k34p0M7j82N18k39k06J62L06j85r9M8k73o8K71M5k37J19M7l7M1J8k80
$$ 243 271 37 -33 14 -168 350 111 -95 67 373 188 89 137 -136 -204 67 112 -125 -6 41 4 45 63 -217
7736b17o6J98J33l9j52j38J70qJ90k37OK59j86j72L24l92J19L46j45l09J31J63
$$ -217 -283 -85 48 9 -143 -281 -111 -119 71 -166 -160 99 -87 -259 65 -327 -208 138 -7 -316 -185 -22
7758b2l5R6Lk15Q9K26j72N2K30k49j9K58j79j35M8J44J65m20J74o0j63J03K94
$$ -22 -57 39 42 -173 -84 142 -30 22 252 3 -16 242 63 -72 -24 120 285 -135 39 -21 -184 -81 213
7781B13k85k0M65l55q0J0J15k71K64l5K3q0N4j9r7J01mr1L18J28n68P5K72j67
$$ 213 -72 -92 373 18 -62 -52 63 -208 56 21 44 -36 18 -1 -98 3 -1 -92 226 354 -214 -139 133 -34
7805c4r5J85l12O5N18k42r2K24k3j33K30k08l06K96K57j96j29J48j6j65K38k40
$$ -34 -129 56 -256 -191 327 85 -7 217 194 61 291 83 -223 73 330 134 5 153 137 -28 210 -30
7827c0kJ24K01k56j03q5k0J55J08qk90J08J90o8M0j42j63J25K24j27k61m0J99
$$ -30 -32 92 293 37 -66 -151 -171 -16 92 84 -206 -98 92 24 64 -78 -241 -116 108 -19 -280 -320 -121
7850a21j3R0jl88J48K38J5j52P0K2q7K01j71j54l9K17R4j88J13n9J92n9o3j84
$$ -121 -134 -44 -45 -433 -285 -47 -32 -184 -114 -92 -179 22 -149 -303 -342 -125 -31 -219 -106 -165 27 -32 -95 -279
7874b79J96J77K8j23J45l29J27J52p8q2J27K72j89j08L0k05J43N52n69lN3L5K0
$$ -279 -83 94 122 -1 144 -185 -58 94 16 -66 61 333 144 36 66 -139 4 556 -13 -16 37 72 92
7897I2M6O0rk21L61j90q6j06J41o9K12j72k48K18J47k67j45K30n2J39Q4k8k91
$$ 92 138 198 189 -32 329 139 53 -53 88 19 231 59 -189 29 176 -91 -236 -6 -58 81 165 137 -154
7920a54J58l1P9j0n7m8J44Q9j22k14J5K13m1O7O1k7j21J5L1o4m2K96j27j0n7n4
$$ -154 4 -27 52 42 -15 -63 81 170 48 -166 -151 62 21 88 149 122 1 16 47 -17 -59 237 110 100 43 -11
7946a1J4K01j05j82P6m7J88K73m53PP2J76j33j71j3l9J34J91n7n02J92M8J3lJ5
$$ -11 3 204 99 -83 -7 -54 134 407 -46 -39 33 209 76 -95 -108 -147 -13 178 121 -381 -189 -141 -128 -131 -116
7971a16l56L44K59l83j33J47lK03J22j17k07M2L67k04p2l8j37K64K04j39QM5k
$$ -116 -472 -128 131 -252 -385 -238 -241 -38 84 -33 -240 -198 169 -35 -107 -145 -282 -18 186 47 55 100 98
7994I8o6p4rM3J96j54J12l39K57J36j21J17j87j0J63J01J3l07J44P7j01N6j84
$$ 98 32 -42 -51 -8 188 34 146 -193 64 200 79 196 9 -1 162 263 276 -31 113 190 89 145 -39
8017c9o8L30r8l8k37K49p8P4p1k08o2L63r6j10O6j97J83j86K46M4k11J65L7k88
$$ -39 -107 223 125 87 -150 99 21 95 24 -184 -246 117 21 -89 -23 -220 -37 -223 23 67 -144 21 58 -230
8041b30K63j64L2J49m9l6l7R0K18m80J79J57J1N1J25j85j06J05m9M5j09J58k98
$$ -230 33 -131 -99 50 1 -35 -72 18 236 -244 -65 92 103 154 279 94 -12 93 44 89 -20 138 -160
8064a60K99R9lk57k5J08j2m5j10l6K42M1k62j2K53J10q5J5l80K0J14J65J22j45
$$ -160 139 238 235 -22 -47 61 49 4 -106 -142 100 141 -121 -133 120 230 145 160 -220 -200 -86 79 201 56
8088E6k56J68k5K38j54l80K49J64J27j22o3m9K51k25Q3r8j40K12lL9r5J4J82j25
$$ 56 -200 -32 -57 181 27 -353 -104 60 187 65 2 -47 204 -21 62 -36 -176 36 33 72 -23 -9 173 48
8112D8j22K4P8j30M50k14j80j79LK13J13k31K41k11R7N9k92q9K80Q4m9j23j21
$$ 48 -74 -50 28 -102 348 134 -46 -225 -222 -9 104 -127 114 -97 0 59 -233 -322 -42 42 -7 -130 -251
8135b51k3L04j19j90J49J11r3j65J82j80K86j00M3J05l00L27j6j57K83l97J76
$$ -251 -274 30 -89 -279 -130 -19 -112 -277 -95 -275 11 -89 -46 59 -241 86 70 -87 196 -201 -25
8156b5J89k03r3K42K2o3j34J63j17k6R6p6J63j45N5o3K06o3l4M5j32J40n1k09
$$ -25 164 -39 -132 110 132 69 -65 98 -19 -45 51 -25 138 -7 48 -15 191 128 94 139 7 147 96 -113
8180a13OJ79N1j3j59%K07O1j36K3M2
$$ -113 -107 72 123 110 -49 -49 158 219 83 106 148
8191A48
$$ Imaginary data points
##PAGE= N=2
##DATA TABLE= (X++(I..I)), XYDATA
0@%%%%lLqJ6j6J6k4L3m1N6o9P7r5J19j36J58j87K17k50K89l34L82m34M93n60O34
$$ 0 0 0 0 0 -3 0 -8 8 -8 8 -16 17 -24 32 -37 40 -55 64 -72 86 -101 116 -134 155 -179 203 -231 262 -298 336
30C36p14Q03q99J005j123J252j394J551j721J905k110K336k585K862l171L518
$$ 336 -378 425 -474 531 -592 660 -734 817 -904 1001 -1109 1227 -1358 1504 -1667 1851
46A851l911M357m864N456o155O992q021R312j0993J3290j6625K1928l1692N5515
$$ 1851 -2060 2297 -2567 2889 -3266 3726 -4295 5017 -5976 7314 -9311 12617 -19075 36440
60C6440k15854l39392L50145J41297j73202l6151K24843j9755k04990k8639J34098
$$ 36440 -179414 -518806 -168661 -27364 -200566 -236717 -11874 -31629 -236619 -265258 -131160
71a31160j9882o6483R2479J19198j06013j34080R4472J48257q1600j13437Q1155
$$ -131160 -151042 -217525 -125046 -5848 -111861 -245941 -151469 -3212 -84812 -198249 -117094
82a17094R0768o5540j5787J09128M2490o6932l3593O282n058m821L583K8029P3075
$$ -117094 -26326 -91866 -107653 1475 43965 -22967 -56560 -50278 -55336 -60157 -56574 -28545 44530
95D4530K6257p4276m7191M4914J9237k3653K8147L9336l1293k4684L5426j242
$$ 44530 70787 -3489 -50680 -5766 13471 -10182 17965 57301 26008 1324 36750 35508
107C5508p9514l0269R8482R0681o4766r5116O5922R2408q5416r1732R9123Q6010
$$ 35508 -44006 -74275 24207 114888 50122 -44994 20928 113336 27920 -63812 35311 121321
119A21321p9988l3357P0571m1571r8077P4774J24647n0367q8903N9041P4492o2861
$$ 121321 41333 7976 78547 36976 -61101 13673 138320 87953 -950 58091 132583 69722
131F9722p8686M6274P4802l5944o4071L8067M5820n4766k5023Q1350P911j12802
$$ 69722 -8964 37310 112112 76168 12097 50164 95984 41218 16195 97545 105456 -7346
143g346k7092Q8089K5570l9470N375J2614l5105l3815j4566j2197J5426L6129
$$ -7346 -34438 53651 79221 39751 45126 57740 22635 -11180 -25746 -37943 -22517 13612
155A3612J9273K842k4710o0177j5860N9703K0513o0238k4066N4889L6808k9384
$$ 13612 32885 35727 11017 -49160 -65020 -5317 15196 -45042 -69108 -14219 22589 -6795
167f795l8990N452K6071j3666l2676K4555M5659j4653o925N2023j8710j09390
$$ -6795 -45785 -40333 -14262 -27928 -60604 -36049 9610 -5043 -11968 40055 21345 -88045
179h8045n884J11127K8007n6610R654L6884l9440m3439L0330L1642j9252p556
$$ -88045 -93929 17198 45205 -11405 -1751 35133 -4307 -47746 -17416 14226 -5026 -12582
191a2582M2823J8371o5619o0749N1484P5842l3232o4208K3244L6034k1300l351
$$ -12582 30241 48612 -17007 -77756 -26272 49570 16338 -47870 -24626 11408 -9892 -13243
203a3243K0339l1612l2193L8504K9758l5396k1623L6200L5785j1774n0112l2290
$$ -13243 7096 -24516 -56709 -18205 11553 -23843 -45466 -9266 26519 14745 -35367 -67657
215f7657L2099M8114k521j3831J9105L327k5056k730Q267j3308L114L9437K9936
$$ -67657 -35558 12556 10035 -3796 15309 18636 -6420 -9150 -883 -14191 -11077 28360 58296
228E8296n698k7497k3487P900J6187j6818n739M5176K2749l3938j1498J0160l8390
$$ 58296 52598 25101 1614 9514 25701 8883 3144 48320 71069 37131 25633 35793 -2597
241b597k7202N5863M5136m2100m1559J9859J8439k5079k9954O858K7713M44k6961
$$ -2597 -29799 26064 71200 29100 -12459 7400 25839 760 -29194 -22336 5377 5821 -21140
254b1140n386J0200j2474Q61L0567j8172o6015M661O8398R491m0623j168K1440
$$ -21140 -26526 -16326 -28800 -27939 2628 -15544 -81559 -76898 -8500 991 -39632 -40800 -19360
267a9360j1392k3510o102J4149L0220K3373k191j5057k5186k4038K0445N0392
$$ -19360 -30752 -54262 -60364 -46215 -15995 7378 5187 -9870 -35056 -59094 -38649 11743
279A1743M447k7832J4182L0644j4189l0142k249J2520J7767J8901J239q713l195
$$ 11743 16190 -11642 2540 33184 18995 -11147 -13396 -876 16891 35792 37031 28318 25123
292B5123k810M777J0522k1597l3737K8951N7832q237m3588K34J3828j5118j2418
$$ 25123 22313 27090 37612 16015 -17722 11229 69061 60824 17236 17470 31298 16180 3762
305C762J783l335N581K5232J3721j9262l6580j7603K3148K2121k6680k4553L5161
$$ 3762 5545 2210 7791 33023 46744 27482 -9098 -26701 -3553 18568 -8112 -32665 2496
318B496L4091k0546k4761k992j5945p202L0980J9354j8920q347J9230Q740j9463
$$ 2496 36587 16041 -8720 -11712 -27657 -34859 -3879 15475 -3445 -11792 7438 16178 -3285
331c285l0867p389L4033L0975j2522j8181P011q83r926R288K132k3278K778L6955
$$ -3285 -34152 -41541 -7508 23467 10945 -7236 -225 -1108 -11034 -1746 386 -22892 -20114 16841
345A6841P882k8881j6607R392J4532N39j8624p925K3247J7089j1662q428j739
$$ 16841 24723 -4158 -20765 -11373 3159 3698 -14926 -22851 396 17485 5823 -2605 -4344
358d344j6663M79K9955K875k9635J134K9751J313k3728j1289R370J7606P009j2779
$$ -4344 -21007 -20528 9427 12302 -17333 -16199 13552 14865 -8863 -20152 -10782 6824 13833 1054
372A054q185P177J96l187Q475o229k1318J4594L5349r325l3914K822K0361j641
$$ 1054 -7131 46 242 -2945 5530 -699 -22017 -7423 27926 18601 -15313 -12491 7870 6229
386F229j1146m617K492J1660P504r470j0033m495l718J3576J9429j6202k7470
$$ 6229 -4917 -9534 -7042 4618 12122 2652 -7381 -11876 -15594 -2018 17411 1209 -26261
399b6261J7176K8774j3594k4174M122J1422M574L445o614j2284M042J3577P557
$$ -26261 -9085 19689 6095 -18079 -13957 -2535 2039 5484 -1130 -13414 -9372 4205 11762
412A1762k480j5055p787K5635K2648k5681k9374J6056K3881k670l884Q33o018
$$ 11762 9282 -5773 -13560 12075 34723 9042 -20332 -4276 19605 16935 13051 13884 7866
425G866M775J5110n992k2314o842J5132K2118N297k4314j8281J9094J5339k2416
$$ 7866 12641 27751 21759 -555 -7397 7735 29853 35150 10836 -7445 11649 26988 4572
438D572j9571P913Q149O993J3342p926k8264o114J6657K823j5165j1536P521K5088
$$ 4572 -14999 -7086 1063 8056 21398 13472 -14792 -20906 -4249 -1426 -16591 -28127 -20606 4482
452D482J1103k4868k2927R402R681m890L537L762p773R643K4520p492l1233o293
$$ 4482 15585 -9283 -32210 -22808 -13127 -18017 -14480 -10718 -18491 -8848 15672 8180 -23053 -29346
466b9346J9986J4514j172j0040J418J9559Q959j6626j2025K355r31P526J8955
$$ -29346 -9360 5154 3982 -6058 -4640 14919 23878 7252 -4773 -2418 -3349 4177 23132
479B3132l924k0682R000K2056j0426k5781m065J2106J1607K434j0729q047N793
$$ 23132 19208 -1474 7526 29582 19156 -6625 -10690 1416 13023 15457 4728 -3319 2474
492B474K180o914k629o274j0152J1115J7538j4419k2595J1242J9469n620j5016
$$ 2474 4654 -2260 -4889 -11163 -21315 -10200 7338 -7081 -29676 -18434 1035 -4585 -19601
505a9601p160Q44J0875R490n294n366M573M500O002L442j3958j1167K2565K3400
$$ -19601 -26761 -25917 -15042 -5552 -10846 -16212 -11639 -7139 -1137 2305 -11653 -22820 -255 23145
519B3145j4294j6727J3126J7451K549l301q571p621Q394J3406J517n358l398M305
$$ 23145 8851 -7876 5250 22701 25250 21949 13378 5757 14151 27557 29074 23716 20318 24623
533B4623J5323J637k8969j9019J9832J8582r299r353M18k900R98K871j5020k0743
$$ 24623 39946 41583 12614 -6405 13427 32009 22710 13357 13775 10875 11873 14744 -276 -21019
547b1019J003J5989P139q407j8067m634J8479N870k5433j8748R223J1641N273
$$ -21019 -20016 -4027 3112 -5295 -23362 -27996 -9517 -3647 -29080 -47828 -38605 -26964 -21691
560b1691O106o283j3537O515J4556p634j6895m8J8300K1650L439j9273r829J7282
$$ -21691 -15585 -21868 -35405 -28890 -14334 -21968 -38863 -38911 -20611 1039 4478 -14795 -24624 -7342
574g342J3600n710m402Q95M02J3235J8077p254j7690O318J7832j580j6069r853
$$ -7342 6258 548 -3854 -2959 -2557 10678 28755 21501 3811 10129 27961 26381 10312 459
588D59R172K3431R344j5907j5612r20p16L68M696n656p711J3776J2565j8801k3891
$$ 459 9631 33062 42406 26499 10887 9967 9251 9619 14315 8659 948 14724 27289 8488 -15403
603a5403K523J3946L310o872j0817k506J0261O387m826m040l187m184M516N660
$$ -15403 -12880 1066 4376 -2496 -13313 -15819 -5558 829 -3997 -8037 -11224 -15408 -10892 -5232
617e232r345l032K1445J5973j0903j5103l290K459R220J1592J855j172L675R11
$$ -5232 -14577 -17609 3836 19809 8906 -6197 -9487 -7028 2192 13784 15639 14467 18142 19053
631A9053l174l468o342K190K0785J1490j8923j9750M970J0998K068k122o183n234
$$ 19053 15879 12411 6069 8259 29044 40534 21611 1861 6831 17829 19897 17775 11592 6358
645F358M604J709j3412j2831K991J3234R984j1163k9174j0596K2208J3747j3425
$$ 6358 10962 12671 -741 -13572 -10581 2653 12637 1474 -27700 -38296 -16088 -2341 -15766
658a5766j2151L650K289k432n007q456J440J8918J2554j2463k1330q837J3936
$$ -15766 -27917 -24267 -21978 -24410 -29417 -37873 -36433 -17515 -4961 -17424 -38754 -47591 -33655
671c3655K4479Q369j2201m659P907m87n995M651Q421P104J2988N435j6608j6358
$$ -33655 -9176 -807 -13008 -17667 -9760 -10247 -16242 -11591 -3170 3934 16922 22357 5749 -10609
685a0609P282K0767J4467k191j5178p685R852Q376m869m656J511K061L424m089
$$ -10609 -3327 17440 31907 29716 14538 6853 16705 25081 20212 15556 17067 19128 22552 18463
699A8463j7087q594J7797J8182q599k2312j1938N228J2282J263j3293o612Q600
$$ 18463 1376 -7218 10579 28761 20162 -2150 -14088 -8860 3422 4685 -8608 -15220 -6620
712f620M396p459q063n294K745J4720P775j4320j3556Q259J3137R86o108l655
$$ -6620 -2224 -9683 -17746 -23040 -20295 -5575 2200 -12120 -25676 -17417 -4280 -3294 -9402 -13057
726a3057N640J1628L298r078n691M171R626J1726L084j1215o057J2288P976j1102
$$ -13057 -7417 4211 7509 -1569 -7260 -3089 6537 18263 21347 10132 4075 16363 24339 13237
740A3237p345R724J1843K814o098j1637l510R293O965o065r135k524O150Q033
$$ 13237 5892 15616 27459 30273 24175 12538 9028 18321 25286 19221 10086 7562 13712 21745
754B1745m643j5855n351Q740J000r716l909M201M025J569o193j4317p075P118
$$ 21745 17102 1247 -4104 4636 5636 -4080 -7989 -3788 237 1806 -4387 -18704 -25779 -18661
768a8661R687L102m269r787m040Q732N529o563n077M646N540J993k161n659J361
$$ -18661 -8974 -5872 -10141 -19928 -23968 -15236 -9707 -16270 -21347 -16701 -11161 -9168 -11329 -16988 -15627
783a5627J4717R400j1782j8784j018K0768K2151j150k1331r335J2171P380p249
$$ -15627 -910 8490 -3292 -22076 -23094 -2326 19825 18675 -2656 -11991 180 7560 311
796C11l706J0060J3340M118j4775k4474m220K4083K2034n173j8264r487M191N650
$$ 311 -3395 6665 20005 24123 9348 -15126 -19346 4737 26771 21598 3334 -6153 -1962 3688
810C688k985n591N365R647j996j0622p002k050N373J2061L865j0740j1097k71
$$ 3688 703 -4888 477 10124 8128 -2494 -9496 -11546 -6173 5888 9753 -987 -12084 -12355
824a2355P075Q857M450o427q398K665N792j745n811l90R587J3847q7j9128j3805
$$ -12355 -5280 3577 8027 1600 -6798 -4133 1659 -86 -5897 -6287 3300 17147 17060 -2068 -15873
839a5873J0544J7725J613j0406l395R364R177q472k0714n170J7440J7573Q0j1316
$$ -15873 -5329 12396 14009 3603 208 9572 18749 10277 -10437 -15607 1833 19406 19486 8170
853H170j0164m01O680j459r365K119J5058M001j4191j4163j361R373J0459K575
$$ 8170 -1994 -2395 4285 2826 -6539 -4420 10638 14639 448 -13715 -15076 -5703 4756 7331
867G331o753q053k974J787N557M943k102k990J9l670o696J201R938J0355N175
$$ 7331 578 -7475 -10449 -8662 -3105 1838 -264 -3254 -3235 -6905 -13601 -12400 -2462 7893 13068
882A3068n795j7417r873J1955J8750N317p812q027r46K761m087r219M210J9969
$$ 13068 7273 -10144 -20017 -8062 10688 16005 8193 166 -780 1981 -2106 -11325 -7115 12854
896A2854J1082j0223j7383n701Q974J1881k126j4377m757J0224Q217m594j0168
$$ 12854 23936 13713 -3670 -9371 -397 11484 9358 -5019 -9776 448 8665 4071 -6097
909f097n421N690R187j477r441l14R457L347o444q194o322J569J0162P116n892
$$ -6097 -11518 -5828 3359 1882 -7559 -7873 1584 4931 -1513 -9707 -16029 -14460 -4298 2818 -3074
924c074r922n31R831J0167q96j1399n758P445P283j824n875k170N755R039k476
$$ -3074 -12996 -13527 -3696 6471 5575 -5824 -11582 -4137 3146 1322 -4553 -6723 -968 8071 5595
939E595j5981m809J9027J9592k164j6827j1149M210J1852K701r213m512P127N807
$$ 5595 -10386 -15195 3832 23424 21260 4433 -6716 -2506 9346 12047 2834 -1678 5449 11256
953A1256m350q554k317R595J3399L77j4236r922L361O670J777m043o819j521N923
$$ 11256 6906 -1648 -3965 5630 19029 19406 5170 -4752 -1391 5279 7056 3013 -3806 -5327 596
968E96L511l231l266o5J943L768R07p096l896O960N746o683j1455l496P287J1428
$$ 596 4107 876 -2390 -2455 -512 3256 4163 -2933 -6829 131 5877 -806 -12261 -15757 -8470 2958
984B958L510q054o021N405Q075R4o885p260K149Q893n57j0484r40J2958P300p098
$$ 2958 6468 -1586 -7607 -2202 5873 5967 -918 -8178 -6029 2864 2307 -8177 -9117 3841 11141 4043
1000D043j1544m360P362J3793N755q404q695q75J045k560l067K56P553R448k097
$$ 4043 -7501 -11861 -4499 9294 15049 6645 -2050 -2925 -1880 -4440 -7507 -7251 302 9750 7653
1015G653j1479n465N318P592L373l725r684l406P088O367l721o487k502L848O242
$$ 7653 -3826 -9291 -3973 3619 6992 3267 -6417 -9823 -2735 3632 -89 -6576 -9078 -5230 1012
1030A012j51p569k86J0503N327q346j1327l539P986J2285J460j2346q179P250
$$ 1012 861 -6708 -6994 3509 8836 490 -10837 -14376 -6390 5895 7355 -4991 -13170 -5920
1044e920J1122J238p475o000N316J0867m00j1283m366P542O934n8o494o992L896
$$ -5920 5202 6440 -1035 -7035 -1719 9148 8748 -2535 -6901 641 7575 7517 1023 -5969 -2073
1059b073J4188O004j1058j1370O93Q763O945j190p244k559N511J938n530n332
$$ -2073 12115 18119 7061 -4309 -3616 5147 12092 10902 3658 1099 6610 8548 3018 -2314
1073b314J200P830Q897l002j4054o990Q632R091j289p522n734K382Q463K036q590
$$ -2314 -1114 6716 15613 12611 -1443 -8433 199 9290 8001 479 -5255 -2873 5590 7626 -964
1088i64n442M134M611q25n538n367L555J0567J774j1076q230L865P969L084l084
$$ -964 -6406 -2272 2339 1514 -4024 -9391 -5836 4731 6505 -4571 -12801 -8936 -967 2117 -967
1103i67o506m5P084K270o035m797Q99M992M842j599o803N38R328K367p369o060
$$ -967 -7473 -7518 -434 1836 -4199 -8996 -8097 -3105 1737 138 -6665 -6127 3201 5568 -1801 -7861
1119g861J262N608O047o99q100l805N204M993j139l626j000M341N767l509j0257
$$ -7861 -6599 -991 5056 4357 -3743 -7548 -2344 2649 1510 -2116 -3116 1225 6992 3483 -6774
1134f774j903P969N757k876o424m724L601R527J945q213m992M186O009Q48n527
$$ -6774 -8677 -708 5049 2173 -4251 -8975 -5374 4153 6098 -2115 -7107 -2921 3088 3936 -1591
1149a591n289L596R031o65j0370m207N981R186N179m644r321j132R642M920n783
$$ -1591 -6880 -3284 5747 5082 -5288 -9495 -3514 5672 10851 6207 -3114 -4246 5396 10316 4533
1164D533o009O04O697N257m227r564K76J0445N377m386o599k618N630Q405j134
$$ 4533 -1476 -872 5825 11082 6855 -2709 -2433 8012 13389 9003 2404 -214 5416 13821 12687
1179A2687j2256o375O772P667j72o620n549L324Q126p88r142m807M381O483J325
$$ 12687 431 -5944 828 8495 8323 1703 -3846 -522 7604 6816 -2326 -7133 -2752 3731 5056
1194E056o850j0225j35J0490M099p631p141J574O417M602l185p914j341P809L454
$$ 5056 -1794 -12019 -12154 -1664 2435 -5196 -12337 -10763 -4346 256 -2929 -10843 -12184 -4375 -921
1209i21m589n933p47N835P687j522r741k170Q851O609j383m671k941K631O613
$$ -921 -5510 -11443 -12190 -6355 1332 -190 -9931 -12101 -3250 3359 1976 -2695 -5636 -3005 3608
1224C608j00o817k349N964N601K70m526n281K409Q551J360p249l463L998M074
$$ 3608 3508 -3309 -5658 306 5907 6177 1651 -3630 -1221 7330 8690 1441 -2022 1976 6050
1239F050L35m071n385J395P540J932o073m411J780M883L375l836p489Q13P983
$$ 6050 6385 2314 -3071 -1676 5864 7796 1723 -2688 -908 3975 7350 3514 -3975 -3162 4821
1254D821J269o131l286K184M759L564l356q051o11Q040M895l031n436k004M378
$$ 4821 6090 -41 -3327 -1143 3616 7180 3824 -4227 -4838 3202 8097 5066 -370 -2374 2004
1269B004N751k959p581P79Q100L883l438o523m108M114R124M14q720m665M543
$$ 2004 7755 4796 -2785 -2006 6094 9977 6539 16 -4092 22 9146 9560 840 -3825 718
1284G18N564J78n633n432L336Q284o35r312m991K952O566L859n313j0041q09R524
$$ 718 6282 6460 827 -4605 -1269 7015 6380 -2932 -7923 -4971 1595 5454 141 -9900 -10709 -1185
1300a185L879n589n816k82N756M809m586r531K27R209N627l391o755m237M383
$$ -1185 2694 -2895 -8711 -8993 -3237 1572 -3014 -12545 -12318 -3109 2518 -873 -7628 -11865 -7482
1315g482R721M75q476k958O803N537j560n682l657M997Q936K89p877m010L797
$$ -7482 2239 2714 -5762 -8720 -1917 3620 2060 -3622 -7279 -2282 6654 6943 -934 -4944 -1147
1330a147O081L760l845p582J088Q265J357o456l059K556M223K638m132p172M5
$$ -1147 4934 8694 4849 -2733 -1645 6620 7977 1521 -1538 1018 5241 7879 3747 -3425 -3380
1345c380P657L429l778n080k985K925N815j504p049m41N573J758l252l987j897
$$ -3380 4277 7706 3928 -1152 -4137 -1212 4603 3099 -3950 -4391 1182 2940 -312 -4299 -6196
1360f196L956O769j065p844l100M267M676R77l383m457K862O505j512o610n12
$$ -6196 -2240 4529 3464 -4380 -7480 -3213 1463 2440 -943 -5400 -2538 3967 2455 -4155 -4667
1375d667N700M494R1n606o091L008Q955J749n372l688J368L714J797m802n333
$$ -4667 1033 5527 5618 12 -6079 -3071 5884 7633 2261 -1427 -59 3655 5452 650 -4683
1390d683N018Q108j429p887m573R54N752N875k957q451p74N540J357m037l126
$$ -4683 335 8443 7014 -873 -5446 -4492 1260 7135 4178 -4273 -5047 493 1850 -2187 -5313
1405e313L16N851M116n861r173pP427N408M39n595o364K020P185J62n674o18M768
$$ -5313 -4997 854 4970 -891 -10064 -10071 -2644 2764 3203 -2392 -8756 -6736 449 611 -5063 -5681 -913
1422i13M234p74o691o042N356J1359K549o559o354j080N327O245k130o472J892
$$ -913 3321 2547 -4144 -10186 -4830 6529 9078 2519 -3835 -4915 412 6657 4527 -1945 -53
1437e3P431J102o562n515J175Q700P842m271j0446k644N638M711L31l766l867
$$ -53 7378 8480 1918 -3597 -2422 6278 14120 9849 -597 -3241 2397 7108 7439 3673 -194
1452a94L508N252m187q567J02P530N130j022o636o906J347O899J259m072k191
$$ -194 3314 8566 4379 -4188 -4086 3444 8574 7552 916 -5990 -4643 2256 3515 -557 -2748
1467b748R49K130O49n024m877M698Q163l9o392m426r14L204N325r71m855K50M376
$$ -2748 -1799 331 980 -4044 -8921 -4223 3940 3901 -2491 -6917 -7831 -4627 698 -273 -5128 -4878 -502
1484e02r6l961k461J061O504M688m509q141J71N187K942j15k469k149K733M122
$$ -502 -598 -4559 -7020 -5959 545 5233 724 -7417 -7246 -2059 883 768 -1701 -3850 -1117 3005
1500C005l333n019J772N756L187j904o046l793N006O685j786n255m24K269K712
$$ 3005 -328 -5347 -3575 2181 5368 3464 -2582 -6375 -1369 5316 3530 -1725 -2149 120 2832
1515B832R72m220m089L958P197j315o461l355K259N917K136n993n675M073O536
$$ 2832 3804 -416 -4505 -547 6650 5335 -1126 -4481 -2222 3695 5831 -162 -5837 -1764 4772
1530D772J86m777m784M6O492N211m984p753J711O703J171l906m251L31O743M708
$$ 4772 4958 181 -4603 -4557 1935 7146 2162 -5591 -3880 2823 3994 88 -4163 -3832 2911 7619
1546G619n340p363J95N552N011K40n862m825L833N969j592m845n34L396M102M88
$$ 7619 2279 -5084 -4889 663 5674 5914 52 -4773 -940 5029 3437 -1408 -1942 1454 5556 6044
1562F044o324n491L994P764J395m655n432j189N559M722m237o676K343O476J325
$$ 6044 -280 -5771 -1777 5987 7382 2727 -2705 -3894 1665 6387 2150 -4526 -2183 4293 5618
1577E618m524n673r99O266N441l891p198Q2M490K645k079n376j405O745M796m788
$$ 5618 1094 -4579 -5578 688 6129 2238 -4960 -4878 -388 2257 178 -5198 -6603 142 4938 150
1593A50o565m9L438L209J237l313l205K649K927k109k965Q81L215L680l2n828
$$ 150 -6415 -6464 -3026 183 1420 -1893 -5098 -2449 478 -1631 -4596 -3715 -500 3180 3148 -2680
1609b680m081L158N702J635r35l269k144K219L144k488k618L695M583m99m997
$$ -2680 -6761 -3603 2099 3734 2799 -470 -2614 -395 2749 261 -2357 1338 5921 5422 425
1624D25n038M72P648M959m477o581J36L824J753j336l729J29N890K069o475o009
$$ 425 -4613 -4141 3507 8466 3989 -2592 -2456 1368 3121 1785 -1944 -1815 4075 6144 -331 -6340
1640f340K424O398L062k999o578j296N714L430l664l625L07K694L419L3n487l046
$$ -6340 -3916 2482 5544 2545 -4033 -5329 385 3815 151 -3474 -3167 -473 2946 2979 -2508 -5554
1656e554M405M403j032l260j895J530M363J039n278l855L203O587K256m153o875
$$ -5554 -1149 3254 2222 -1038 -2933 -1403 2960 3999 -1279 -5134 -1931 4656 6912 2759 -4116
1671d116j495P595N489l604n795P08M129J439k949n339O24Q046M587n935q461
$$ -4116 -5611 1984 7473 3869 -1926 -1218 2911 4350 1401 -3938 -3314 4732 9319 3384 -5077
1686e077j497N880O236j8o315l638L581L015k484l293M74L127L385j162o396l316
$$ -5077 -6574 -694 5542 5524 -791 -4429 -848 2167 -317 -3610 -3136 -9 3376 2214 -4182 -7498
1702g498M104N689Q81l398m639o39M940L370l455l555J461L412J372j686m104
$$ -7498 -3394 2295 3176 -222 -4861 -5500 -560 2810 -645 -4200 -2739 673 2045 359 -3745
1717c745r72N275M184l171m908K6L986L275j703n401r47O219L760l278m794j363
$$ -3745 -4717 558 4742 1571 -3337 -3311 675 3950 2247 -3154 -4101 2118 5878 2600 -2194 -3557
1733c557L019L814J41m084j243M090J434l866l820J260M564M105k034o391k896
$$ -3557 -538 3276 3417 -667 -1910 2180 3614 -252 -4072 -2812 1752 5857 3823 -2568 -5464
1748e464L568L520O30j217k298j11J899m19l039m64L791L108q61m284m067J540
$$ -5464 -1896 1624 2254 1037 -1261 -1372 527 108 -2931 -3395 396 3504 2643 -1641 -5708 -4168
1764d168O481L250m220m697n35L314L317r94l700m8N231J555n393m510J941O182
$$ -4168 2313 5563 1343 -3354 -3889 -575 2742 1748 -1952 -2000 3231 4786 -607 -5117 -3176 3006
1780C006M124l664p000j481N807M430k033m587j889L704M582j567o053j221M657
$$ 3006 7130 3466 -3534 -5015 792 5222 3189 -1398 -3287 417 4999 3432 -2621 -3842 815
1795H15L162j852l854j894K913N290l46n871l844K515M868K503k795n577l2M861
$$ 815 3977 2125 -1729 -3623 -710 4580 4234 -1637 -5481 -2966 1902 4405 1610 -3967 -3999 862
1811H62K151l194l134O63L561K597k311n256p32O068L452l405n337j612M530N240
$$ 862 3013 -181 -3315 -2652 909 3506 1195 -4061 -4793 1275 4727 1322 -4015 -5627 -1097 4143
1827D143l12n748k373L391L125m74k647j362K710L435j180n557j991L873M674
$$ 4143 3831 -1917 -4290 -899 2226 1752 -895 -2257 453 3888 2708 -2849 -4840 -967 3707
1842C707M64l896l560J633M852P55l652k219R31K331J346j581l033N53L864M00
$$ 3707 4171 275 -3285 -1652 3200 3955 303 -1916 -985 1346 2692 1111 -1922 -1369 2495 2895
1858B895l525k322J693M071K432l068n084m36L620K161j144k501p84K150K352
$$ 2895 -630 -2952 -1259 2812 5244 2176 -2908 -3344 276 2437 1293 -1208 -1992 158 2510
1873B510j789l900O76M182J995k564m151q55L472M042j926n230j396L165L532
$$ 2510 721 -3179 -2503 1679 3674 1110 -3041 -3896 -424 3618 1692 -3538 -4934 -1769 1763
1888A763N51k844k257K073L440j646m486n77M151L751m46m790m064K083N864J532
$$ 1763 2314 -530 -2787 -714 2726 1080 -3406 -3983 168 3919 3473 -1317 -5381 -3298 2566 4098
1904D098l298l112Q06L709K170k998m760J166M566J255l002l360P40M586K890
$$ 4098 800 -2312 -1506 2203 4373 1375 -3385 -2219 2347 3602 600 -2760 -2020 2566 5456
1919E456l212o047o39N169M152q08m730l120K533L918j334m267o46L865L361l32
$$ 5456 2244 -3803 -4442 727 4879 4071 -659 -3779 -1246 2672 1338 -2929 -3575 290 3651 3319
1935C319m804l966K936N144M32m532l082J979M202J967l659m395J024M362J466
$$ 3319 -1485 -5451 -2515 2629 3061 -1471 -4553 -2574 1628 3595 -64 -4459 -3435 927 2393
$$ [...]
8191a58
##END NTUPLES=NMR FID
##END=
