##TITLE=1H_CG-1113-2
 CDCl3, 8 sc, 
 23.7.2019
##JCAMPDX= 6.0         $$ Bruker NMR JCAMP-DX V2.0
##DATA TYPE= NMR FID
##DATA CLASS= NTUPLES
##ORIGIN= UXNMR, Bruker Analytische Messtechnik GmbH
##OWNER= root
$$ XWIN-NMR		Version 3.5
$$ Tue Jul 23 14:08:04 2019 Russian Standard Time (UT+4h)  she@DPX200
##.OBSERVE FREQUENCY= 200.13155
##.OBSERVE NUCLEUS= ^1H
##.DELAY= (6, 6)
##.ACQUISITION MODE= SIMULTANEOUS
##.ACQUISITION SCHEME= undefined
##.AVERAGES= 8
##.DIGITISER RES= 18
##SPECTROMETER/DATA SYSTEM= spect
##.PULSE SEQUENCE= zg30
##.SOLVENT NAME= D2O
##.SHIFT REFERENCE= (INTERNAL, D2O, 0, 15.7039)
##AUDIT TRAIL= $$ (NUMBER, WHEN, WHO, WHERE, WHAT)
$$ ##TITLE= Audit trail, XWIN-NMR		Version 3.5
$$ ##JCAMPDX= 5.01
$$ ##ORIGIN= Bruker BioSpin GmbH
$$ ##OWNER= she
$$ F:/spectra/data/she/nmr/H-F/1/audita.txt
$$ ##AUDIT TRAIL=  $$ (NUMBER, WHEN, WHO, WHERE, WHAT)
(   1,<2019-07-23 14:07:08.68 +0400>,<she>,<DPX200>,
      <created by zg, POWCHK disabled, PULCHK disabled
       configuration hash MD5:
       00 E9 B6 7A A2 85 ED C7 34 08 36 98 17 FE 4E 26
       data hash MD5: 16K
       66 AD FE 05 4D 2C 4B 17 58 02 8B 2B 75 12 94 39>)
$$ ##END=
$$ 
$$ hash MD5
$$ 98 A2 A3 1E AC 1D E0 4F BA 65 B9 9E 16 56 02 2D
##$RELAX= 
##$RELAX= 
##$RELAX= 
##$RELAX= 
##$RELAX= 
##$RELAX= 
$$ Bruker specific parameters
$$ --------------------------
##$DU= <F:/spectra>
##$EXPNO= 1
##$NAME= <H-F>
##$PROCNO= 1
##$TYPE= <nmr>
##$USER= <she>
##$AMP= (0..31)
100 100 100 100 100 100 100 100 100 100 100 100 100 100 100 100 100 100 
100 100 100 100 100 100 100 100 100 100 100 100 100 100 
##$AQSEQ= 0
##$AQ_mod= 1
##$AUNM= <au_zg>
##$AUTOPOS= <>
##$BF1= 200.13
##$BF2= 200.13
##$BF3= 200.13
##$BF4= 200.13
##$BF5= 200.13
##$BF6= 200.13
##$BF7= 200.13
##$BF8= 200.13
##$BYTORDA= 1
##$CFDGTYP= 0
##$CFRGTYP= 5
##$CHEMSTR= <none>
##$CNST= (0..31)
1 1 145 1 1 1 1 1 1 1 1 1 1 1 1 1 1 1 1 1 1 1 1 1 1 1 1 1 1 1 1 1 
##$CPDPRG= <>
##$CPDPRG1= <>
##$CPDPRG2= <>
##$CPDPRG3= <>
##$CPDPRG4= <mlev>
##$CPDPRG5= <mlev>
##$CPDPRG6= <mlev>
##$CPDPRG7= <mlev>
##$CPDPRG8= <mlev>
##$CPDPRGB= <>
##$CPDPRGT= <>
##$D= (0..31)
0 1.2 0 0 0 0 0 0 0 0 0 0.03 0 0 0 0 0 0 0 0 0 0 0 0 0 0 0 0 0 0 0 0 
##$DATE= 1563876428
##$DBL= (0..7)
120 120 120 120 120 120 120 120 
##$DBP= (0..7)
150 150 150 150 150 150 150 150 
##$DBP07= 0
##$DBPNAM0= <>
##$DBPNAM1= <>
##$DBPNAM2= <>
##$DBPNAM3= <>
##$DBPNAM4= <>
##$DBPNAM5= <>
##$DBPNAM6= <>
##$DBPNAM7= <>
##$DBPOAL= (0..7)
0.5 0.5 0.5 0.5 0.5 0.5 0.5 0.5 
##$DBPOFFS= (0..7)
0 0 0 0 0 0 0 0 
##$DE= 6
##$DECBNUC= <off>
##$DECIM= 24
##$DECNUC= <off>
##$DECSTAT= 4
##$DIGMOD= 1
##$DIGTYP= 9
##$DL= (0..7)
0 120 120 120 120 120 120 120 
##$DP= (0..7)
150 150 150 150 150 150 150 150 
##$DP07= 0
##$DPNAME0= <>
##$DPNAME1= <>
##$DPNAME2= <>
##$DPNAME3= <>
##$DPNAME4= <>
##$DPNAME5= <>
##$DPNAME6= <>
##$DPNAME7= <>
##$DPOAL= (0..7)
0.5 0.5 0.5 0.5 0.5 0.5 0.5 0.5 
##$DPOFFS= (0..7)
0 0 0 0 0 0 0 0 
##$DQDMODE= 0
##$DR= 18
##$DS= 0
##$DSLIST= <SSSSSSSSSSSSSSS>
##$DSPFIRM= 0
$$ [...]
##$SUBNAM2= <"">
##$SUBNAM3= <"">
##$SUBNAM4= <"">
##$SUBNAM5= <"">
##$SUBNAM6= <"">
##$SUBNAM7= <"">
##$SUBNAM8= <"">
##$SUBNAM9= <"">
##$SW= 24.9336996594482
##$SWIBOX= (0..15)
0 0 2 0 0 0 0 0 0 0 0 0 0 0 0 0 
##$SW_h= 4990.01996007984
##$TD= 16384
##$TD0= 1
##$TE= 0
##$TE2= 300
##$TE3= 300
##$TEG= 300
##$TL= (0..7)
0 120 120 120 120 120 120 120 
##$TP= (0..7)
150 150 150 150 150 150 150 150 
##$TP07= 0
##$TPNAME0= <>
##$TPNAME1= <>
##$TPNAME2= <>
##$TPNAME3= <>
##$TPNAME4= <>
##$TPNAME5= <>
##$TPNAME6= <>
##$TPNAME7= <>
##$TPOAL= (0..7)
0.5 0.5 0.5 0.5 0.5 0.5 0.5 0.5 
##$TPOFFS= (0..7)
0 0 0 0 0 0 0 0 
##$TUNHIN= 0
##$TUNHOUT= 0
##$TUNXOUT= 0
##$USERA1= <user>
##$USERA2= <user>
##$USERA3= <user>
##$USERA4= <user>
##$USERA5= <user>
##$V9= 5
##$VALIST= <valist>
##$VCLIST= <CCCCCCCCCCCCCCC>
##$VD= 0
##$VDLIST= <DDDDDDDDDDDDDDD>
##$VPLIST= <PPPPPPPPPPPPPPP>
##$VTLIST= <TTTTTTTTTTTTTTT>
##$WBST= 1024
##$WBSW= 4
##$XGAIN= (0..3)
0 0 0 0 
##$XL= 0
##$YL= 0
##$YMAX_a= 505507
##$YMIN_a= -932841
##$ZGOPTNS= <>
##$ZL1= 120
##$ZL2= 120
##$ZL3= 120
##$ZL4= 120
##$ABSF1= 10
##$ABSF2= 0
##$ABSG= 5
##$ABSL= 3
##$ALPHA= 0
##$AQORDER= 0
##$ASSFAC= 0
##$ASSFACI= 0
##$ASSFACX= 0
##$ASSWID= 0
##$AUNMP= <proc_1d>
##$AZFE= 0.1
##$AZFW= 0.1
##$BCFW= 1
##$BC_mod= 2
##$BYTORDP= 1
##$COROFFS= 0
##$CY= 11.3945322036743
##$DATMOD= 1
##$DC= 2
##$DFILT= <>
##$DTYPP= 0
##$F1P= 18.9103706918063
##$F2P= -1.10871071338519
##$FCOR= 0.5
##$FTSIZE= 0
##$FT_mod= 4
##$GAMMA= 1
##$GB= 0.15
##$INTBC= 1
##$INTSCL= 1
##$ISEN= 128
##$LB= 0.24
##$LEV0= 0
##$LPBIN= 0
##$MAXI= 10000
##$MC2= 0
##$MEAN= 0
##$ME_mod= 0
##$MI= 1.114404
##$NCOEF= 0
##$NC_proc= 0
##$NLEV= 6
##$NOISF1= 3.799351
##$NOISF2= 2.8
##$NSP= 1
##$NTH_PI= 0
##$NZP= 0
##$OFFSET= 15.70392
##$PC= 1
##$PHC0= -8860.743
##$PHC1= 13.00096
##$PH_mod= 1
##$PKNL= yes
##$PPARMOD= 0
##$PSCAL= 0
##$PSIGN= 0
##$REVERSE= no
##$SF= 200.130013532006
##$SI= 16384
##$SIGF1= 3
##$SIGF2= 2
##$SINO= 400
##$SIOLD= 16384
##$SREGLST= <1H.CDCl3>
##$SSB= 0
##$STSI= 0
##$STSR= 0
##$SW_p= 3612.71676300578
##$SYMM= 0
##$S_DEV= 0
##$TDeff= 0
##$TDoff= 0
##$TI= <>
##$TILT= no
##$TM1= 0
##$TM2= 0
##$TOPLEV= 0
##$USERP1= <user>
##$USERP2= <user>
##$USERP3= <user>
##$USERP4= <user>
##$USERP5= <user>
##$WDW= 1
##$XDIM= 8192
##$YMAX_p= 0
##$YMIN_p= 0
$$ End of Bruker specific parameters
$$ ---------------------------------
##NTUPLES= NMR FID
##VAR_NAME=  TIME,          FID/REAL,        FID/IMAG
##SYMBOL=    X,             R,               I
##VAR_TYPE=  INDEPENDENT,   DEPENDENT,       DEPENDENT
##VAR_FORM=  AFFN,          ASDF,            ASDF
##VAR_DIM=   8192,          8192,            8192
##UNITS=     SECONDS,       ARBITRARY UNITS, ARBITRARY UNITS
##FACTOR=    0.0002004,     1,               1
##FIRST=     0,             0,               0
##LAST=      1.6414764,     0,               0
##MIN=       0,             -932841,         0
##MAX=       1.6414764,     505507,          0
$$ Real data points
##PAGE= N=1
##DATA TABLE= (X++(R..R)), XYDATA
0@%%%qJ6j6K4l9M7n6P3r6J20j45J81k22K66l18L79m46N23o12P10q22R48j086J242
$$ 0 0 0 0 -8 8 -8 16 -23 24 -32 41 -55 65 -80 101 -121 145 -173 206 -240 283 -329 381 -441 507 -579 663
27F63j416J602j814K051k307K589k902L244l615M025m477M967n507O107o764P486
$$ 663 -753 849 -965 1086 -1221 1368 -1534 1710 -1905 2120 -2357 2610 -2897 3210 -3554 3932
43C932q288R181j0178J1300j2571J4021j5694J7655j9988K2817k6333L0843l6874
$$ 3932 -4356 4825 -5353 5947 -6624 7397 -8297 9358 -10630 12187 -14146 16697 -20177
56b0177M5407n8511Q1467j33392M57873K8800o80387K67807L59955J56665k05485
$$ -20177 25230 -33281 48186 -85206 372667 401467 -278920 -11113 348842 505507 300022
67C00022j09581J4202J03538j45341k28437o4264K04664J67007l176k30064k48391
$$ 300022 190441 204643 308181 162840 -65597 -129861 74803 241810 238634 8570 -239821
78b39821p6935J25451J29075R8904l9064k49638k29813J26548K47698j1341j95675
$$ -239821 -316756 -191305 -62230 36674 -2390 -252028 -481841 -355293 -107595 -118936 -314611
89c14611m6252J44332J28773j24872k88548l7319L40793K49222j46447k62921
$$ -314611 -360863 -216531 -87758 -212630 -501178 -538497 -197704 51518 -94929 -357850
99c57850m5796J55471J69629O535j21658o569J51640O5807r1261p7879J1449P0595
$$ -357850 -403646 -248175 -78546 -72011 -193669 -200238 -48598 17209 -74052 -151931 -140482 -69887
111f9887R7385N2264l955p321n1438q1829O3528J67452R286j12548l92N9444l2106
$$ -69887 27498 79762 75807 68486 17048 -64781 -1253 166199 175485 62937 62545 121989 89883
124H9883n5728o195L0997Q4796P0990o6752j34950n4828L1680Q3069R0616n606
$$ 89883 34155 27960 58957 143753 214743 147991 13041 -41787 -10107 72962 163578 157972
136A57972j00392q1088l9073J5393J13171P4830r9050r8251N4519M9059n8269
$$ 157972 57580 -23508 -62581 -47188 65983 140813 41763 -56488 -1969 47090 -11179
147a1179m3850L3634Q1601P7875n1492j83976p7975J30357J62940N5490p0351
$$ -11179 -55029 -21395 60206 138081 86589 -97387 -175362 -45005 117935 173425 103074
158A03074j57595o9721J37473J50188l6249j25348n1394N9599J13858J6351j40152
$$ 103074 -54521 -124242 13231 163419 127170 1822 -49572 10027 123885 140236 84
169H4p5920J37060J42621o1660j92505j16309J18171K74353P3212k60290k37074
$$ 84 -75836 61224 203845 142185 -50320 -166629 -48458 225895 299107 38817 -198257
180a98257N8666J81943Q5374l8345j10577o1333O9681O2446p5471j02258O816
$$ -198257 -139591 42352 127726 89381 -21196 -82529 -12848 49598 -25873 -128131 -121315
191a21315J09938J23964k2916k16444j62979J07900K29535R2951j15436k17110
$$ -121315 -11377 112587 89671 -126773 -289752 -181852 47683 140634 25198 -191912
201a91912p3299J95067J86572j09906k04918K3259J85650Q5916j12273j82759
$$ -191912 -265211 -70144 116428 6522 -198396 -175137 10513 96429 -15844 -198603
211a98603l849K20564J49137j17051j80763k6943R9532J21640L7491q9557p5946
$$ -198603 -202452 18112 167249 50198 -130565 -157508 -57976 63664 101155 11598 -64348
222f4348N1549O8879p938l2507l6439j5793Q3844J10775k7099j27774p6190L2071
$$ -64348 -12799 56080 48142 15635 -20804 -36597 47247 158022 130923 3149 -73041 -40970
234d0970J17774Q7023p5346j20931M1690J05603l7233j09444k0062P5284J01139
$$ -40970 76804 163827 88481 -32450 9240 114843 77610 -31834 -51896 23388 124527
245A24527K4731j14869j22560J7214P7949L3849J6756J604m5505m9946k7708n095
$$ 124527 149258 34389 -88171 -70957 6992 40841 57597 59201 13696 -36250 -63958 -69053
257f9053O2970P3125m0825q0171J6092K8995n2276l3835N1690P8391M4588n2945
$$ -69053 -6083 67042 26217 -53954 -37862 -8867 -61143 -94978 -43288 35103 79691 26746
269B6746j41978o0954J05218J21895K2025m6930p8658m9594M7674O5830j1181
$$ 26746 -115232 -176186 -70968 50927 72952 26022 -52636 -102230 -54556 11274 93
280I3k1617J8192J1668J0170L576o7351o3420P9024J40600K2735j11912j31485
$$ 93 -21524 -3332 8336 18506 22082 -45269 -108689 -29665 110935 133670 21758 -109727
292a09727j0784J55976J30179r1080j63749P391J30499P1870n0786j22021m7228
$$ -109727 -120511 35465 165644 74564 -89185 -81794 48705 120575 69789 -52232 -99460
303i9460J23474J26067o9384j56325l1934J03687J21313J6394j31937j24374N0825
$$ -99460 24014 150081 80697 -75628 -107562 -3875 117438 133832 1895 -122479 -71654
314g1654J33085L7842o9335r8723k8662J16274J25685p4515j84183l2708J38807
$$ -71654 61431 99273 29938 -68785 -97447 18827 144512 69997 -114186 -146894 -8087
325h087J29081j3321j49044j08149R4460J62014j4701j49350o9549Q0017J38641
$$ -8087 120994 107673 -41371 -149520 -55060 106954 92253 -57097 -126646 -46629 92012
336I2012L9936j37931j44698N5266J57387M2915p7855q6902k2197P8845R6314
$$ 92012 131948 -5983 -150681 -95415 61972 104887 27032 -59870 -82067 -3222 93092
347I3092l1573j14402l5108O5248Q0295K3578p8804r4978M4231J26288J2908j03528
$$ 93092 61519 -52883 -87991 -22743 57552 81130 2326 -92652 -48421 77867 90775 -12753
359a2753p5343J8654R4234P9273n3541j21002m930R5019M0288l7099m7771j7388
$$ -12753 -88096 -69442 24792 104065 50524 -70478 -75408 19611 59899 22800 -24971 -42359
371d2359L8733M7467k6150n1166J2111K5486m74J7650P054m6017k4026L4620K7360
$$ -42359 -3626 43841 17691 -33475 -21364 4122 3648 21298 28352 -17665 -41691 -7071 20289
384B0289K942q569m1304k1878N2616M3612k7679l4857q282J050K6599K1413l2166
$$ 20289 23231 14662 -26642 -48520 4096 47708 20029 -14828 -23110 -22060 4539 25952 -6214
397f214k6010K8373J8029m962R940k0013n4841R683P0881K4626m2723n5134j6430
$$ -6214 -32224 -3851 14178 9216 19156 -857 -55698 -46015 24866 49492 6769 -48365 -64795
410f4795O6163Q0018m3320j16935j1681R2761O4139k2839q5860n6265P2378J15817
$$ -64795 1368 81386 38066 -78869 -90550 2211 66350 43511 -42349 -98614 -26236 89581
422H9581k0711j20512m2692O3856Q2619K7147o9748r3207K2419J07738M4136n2696
$$ 89581 68870 -51642 -94334 -30478 52141 79288 9540 -83667 -61248 46490 90626 37930
434C7930q1089l6705P4059J18742j4368j38754n5772R3757J11596Q569j11787
$$ 37930 -43159 -79864 -5805 112937 98569 -40185 -95957 -2200 109396 117965 6178
445F178j09986N5588J60941L1519j32172j01743M2505J23363O3302r1869j39157
$$ 6178 -103808 -48220 112721 144240 12068 -89675 -47170 76193 139495 47626 -91531
456i1531J6040J39501N6398p4720r4418k9429O6250R9267j1059j17578n7231O2233
$$ -91531 -75491 64010 120408 45688 -48730 -78159 -11909 87358 76299 -41279 -98510 -36277
468c6277Q7770K3223p8303j10960J1169J28925N3902q8330r6114q63Q8314Q4485
$$ -36277 51493 74716 -3587 -114547 -103378 25547 79449 -8881 -104995 -105858 -17544 66941
480F6941m5421j35885k5497J17929P7741m7094q4762l0268N9070Q4371j1617q8710
$$ 66941 21520 -114365 -139862 -21933 55808 8714 -76048 -106316 -47246 37125 25508 -63202
492f3202k6816N1349M5957J7759j5422n0140j0066N7722L2967k6199k7179q384
$$ -63202 -90018 -38669 7288 25047 9625 -40515 -50581 7141 40108 13909 -13270 -21654
504b1654J6530N4872K3497n4122m2217L0614M1226J1153j6166l7798o175M9828
$$ -21654 -5124 49748 73245 19123 -23094 7520 48746 59899 43733 5935 -240 49588
516D9588K1775l7679j3494J7322q719j0480J4828K91j4267m417q161O671L4308
$$ 49588 71363 33684 20190 37512 28793 18313 33141 33432 19165 14748 6587 13258 47566
529D7566q104o5231k0656M7215L4533j1742m1962m1540K5425P3570j060p9492
$$ 47566 39462 -25769 -46425 790 35323 23581 -18381 -59921 -34496 39074 38014 -41478
541d1478l2634L9591M1497J4019k8589n5961J343O8414L6270k9931m8192l1864
$$ -41478 -74112 -34521 6976 20995 -7594 -63555 -62212 6202 42472 12541 -35651 -67515
553f7515K8272Q6168K3850q4100n9193M9465Q2618K4797n9829r2109J0323J27578
$$ -67515 -39243 46925 70775 -13325 -72518 -23053 59565 84362 24533 -67576 -57253 70325
565G0325O3168r0594j03379J0660R6234P3327m5540j19142k1180J09046O9458
$$ 70325 133493 42899 -60480 -49820 46414 119741 74201 -44941 -66121 42925 112383
576A12383n2471q9104l9050M3440R1618J7576r5926p4357L5520P4414K7235n2174
$$ 112383 59912 -29192 -68242 -24802 66816 84392 -11534 -85891 -50371 24043 51278 -896
588h96r5136j6196J02330P1819o4714j05593k3338P5446R8554o188j26262p0006
$$ -896 -96032 -112228 -9898 61921 -2793 -108386 -131724 -56278 42276 36088 -90174 -160180
600a60180Q4868R8837j4169p6556l7972M5965Q7290Q812r2273n5633N4710Q1742
$$ -160180 -75312 23525 9356 -67200 -105172 -59207 28083 36895 -55378 -111011 -56301 25441
612B5441L4509k5847o7905k5763O5892O4246j3775m0328j5108J5698M7289K4741
$$ 25441 59950 34103 -33802 -59565 6327 70573 56798 16470 1362 17060 64349 89090
624H9090n0593m5204M4629O8608M487n0859n9253m396P0554M7394m3694m9744
$$ 89090 38497 -6707 37922 106530 111017 60158 905 -3491 67063 114457 70763 21019
636B1019Q727J3372o344l630j1762p750J7136J447k9675j1895m64k3343j440L7937
$$ 21019 29746 43118 36774 33144 21382 13632 30768 32215 2540 -9355 -9819 -33162 -34602 3335
650C335J4434k9279l9082l2087Q448N4737J6846m6640k0577K7387O930j9791j3941
$$ 3335 17769 -11510 -50592 -82679 -74231 -19494 -2648 -49288 -69865 -42478 -35548 -55339 -69280
663f9280p161J9882M9713J3070l8832l4443j1609J6531O5972N2972l6120o6681
$$ -69280 -76441 -56559 -6846 6224 -32608 -67051 -78660 -62129 3843 56815 20695 -45986
675d5986o361M2150M3364P070m2408j4945P5138N6180p0105r9736J0583J09406
$$ -45986 -52347 -10197 33167 40237 -2171 -17116 58022 114202 44097 -55639 -45056 64350
687F4350R5501k4516j28592p0339P6427R4698o443n7624k7820K0472M5612k372
$$ 64350 159851 135335 6743 -63596 12831 107529 101086 43462 15642 36114 81726 79354
699G9354p7090m7942N3997P6338J3779n4824r1783m1967P4706R9379j2136r6228
$$ 79354 2264 -45678 8319 84657 98436 43612 -48171 -90138 -15432 83947 71811 -24417
711b4417o6505K3095Q5858L6681q6921q8119N4058J08091k316j03427p7676L8200
$$ -24417 -90922 -67827 18031 54712 -32209 -120328 -66270 41821 39505 -63922 -141598 -103398
723a03398J22878N4852r5784j08373K4394R4779M1178l6455o5785j3179P1459
$$ -103398 19480 74332 -21452 -129825 -105431 -10652 30526 -5929 -71714 -84893 -13434
734a3434N7569l7500o1892p148L3437N0980L3182l9530o5541R827O4962K9251
$$ -13434 44135 6635 -55257 -62405 -28968 22012 55194 15664 -49877 -40050 24912 54163
746E4163k7634n0648j4553O4168O3654m2520q7784o256O5469N0660q192o1479
$$ 54163 26529 -24119 -38672 25496 89150 46630 -41154 -47410 18059 68719 60527 -952
758i52m4636L7408N4292j8511m2543N21J6319Q282Q31j9627k0104J4342J5657
$$ -952 -45588 -8180 46112 27601 -14942 -14421 1898 10180 11011 -8616 -28720 -14378 1279
771A279q803j026O96k2066j437L4932Q713k5986j7412m079J3055L7028J4516l0276
$$ 1279 -7524 -8550 -7854 -29920 -31357 3575 12288 -13698 -31110 -35189 -22134 14894 29410 -866
785h66k2887K218M804K3697L5760n324l3088p320J0171J0194J5369j609j0190
$$ -866 -23753 -21535 -16731 6966 42726 37402 4314 -3006 7165 17359 32728 31119 20929
798B0929L0750L1750m5635o7784Q917P3855O3257l078q0755p3352K4623P0481
$$ 20929 51679 83429 37794 -29990 -21073 52782 116039 112961 32206 -41146 -16523 53958
810E3958K2814j6191k0293k0066r6Q782k6798l1206K8840N5085J6644l8704q6331
$$ 53958 76772 60581 40288 20222 20126 28908 2110 -29096 -256 54829 71473 32769 -53562
823e3562o4168N6507J25290K6718r9377r6594K71Q0156N2936n5214p6528M0783
$$ -53562 -117730 -61223 64067 90785 -8592 -105186 -104915 -24759 28177 -27037 -103565 -62782
835f2782R4762j3694j08261o3194N1915J15205N3403p6569j03453p17O6479M1097
$$ -62782 31980 18286 -89975 -153169 -101254 13951 67354 -9215 -112668 -113385 -46906 -5809
847e809L596k0081k5766J2968L7569k630l9104k1500J9325O8073O9218l6452j22990
$$ -5809 -2213 -22294 -48060 -35092 2477 -153 -39257 -60757 -41432 26641 95859 59407 -63583
860f3583l8622R7920R4910j5444q3148l3964P0456P4089n6369j12986R570J20994
$$ -63583 -102205 -4285 90625 75181 -7967 -41931 28525 102614 46245 -66741 -57171 63823
872F3823P0832m9025j02189m7688N4274P2448n029l3584Q776M423l5012k0876
$$ 63823 134655 85630 -16559 -64247 -9973 62475 57446 23862 32638 37061 2049 -18827
884a8827J1684J6954K0688J4379o903j7651l4508n0193J1615R5994N5861o0417
$$ -18827 -7143 9811 30499 44878 37975 20324 -14184 -64377 -52762 43232 99093 38676
896C8676q7837k2059M3787N5049N942l3503L981L0217l1757o4721L835O5035M6470
$$ 38676 -49161 -71220 -27433 27616 33558 55 4036 34253 2496 -62225 -58390 6645 53115
909E3115n902m6182l8329J0719J8607r491J9982N8658k214p8788n0802K6979O4418
$$ 53115 47213 1031 -37298 -26579 -7972 -17463 2519 61177 58963 -19825 -70627 -43648 20770
922B0770L6805l2474n5858N777M2586p915l5390L199L1519K3197l814m3181l9851
$$ 20770 57575 25101 -30757 -24980 17606 9691 -25699 -22500 9019 32216 28402 -14779 -54630
935e4630K0661M5305J2465r451k3641m0840m90N9724L4692l6323m8684n794M2880
$$ -54630 -33969 11336 23801 14350 -9291 -50131 -50621 9103 43795 7472 -41212 -47006 -4126
948d126M4774k7631p7984n977Q2110M4976m5178o4027r347O0051O3393k5982q5447
$$ -4126 40648 13017 -64967 -70944 11166 56142 10964 -53063 -62410 -2359 61034 35052 -50395
961e0395j7933O4804N0614q724m9616m6867J9857P2723K3691n3023m9563N059
$$ -50395 -68328 -3524 47090 38366 -11250 -58117 -38260 34463 58154 5131 -44432 -39373
973c9373N1573N5987j6604q5600k9608P0131N8279k8213o5052k0761N5946P3017
$$ -39373 12200 68187 51583 -34017 -63625 6506 64785 36572 -28480 -49241 6705 79722
985G9722k1257r7903l2378P2090P3419J432n9799o4865N154O5499K9097k9434
$$ 79722 58465 -39438 -71816 274 73693 75125 15326 -49539 -44385 21114 50211 20777
997B0777k3132K660Q034J5019n318l7989q140N3423M2198k2639o3122n0506K3985
$$ 20777 -2355 305 8339 23358 18040 -19949 -28089 25334 67532 44893 -18229 -68735 -44750
1010d4750R0096M0226o2407o6121N383L8025K1839q557k2631Q813L3638j5499
$$ -44750 45346 85572 23165 -42956 -37573 452 22291 13734 -8897 -84 33554 18055
1022A8055n8999j2545M2449L6763R007j7484m0179k0309J2450J4549K1445L0728
$$ 18055 -40944 -53489 -11040 25723 34730 17246 -22933 -43242 -30792 -16243 5202 35930
1034C5930j2807n5231k0568K4292K1225Q630l59j0377J714O473k3635k3001K5161
$$ 35930 23123 -32108 -52676 -28384 -7159 1471 1112 -9265 -7551 -1078 -24713 -47714 -22553
1047b2553L4248K677r573j6881k4135J340K5008J5333R152l77l3562k3249L5481
$$ -22553 11695 14372 4799 -12082 -36217 -34877 -9869 5464 14616 14239 -19323 -42572 -7091
1060g091L7322j9462l3929J812L3372L2475j9461o5976j4740P0344N3178k8875
$$ -7091 30231 10769 -23160 -21348 12024 44499 25038 -40938 -55678 14666 67844 38969
1072C8969n4849j9485L1373M9813l139n8780j8624N0581L8668j4588m1311l6739
$$ 38969 -15880 -35365 -3992 45821 42682 -16098 -34722 15859 54527 39939 -1372 -38111
1084c8111J1115O3217L5666m0642n6070j4500K9375N1441J2461n6768m1479M1236
$$ -38111 -26996 36221 71887 31245 -24825 -39325 -9950 41491 53952 -2816 -44295 -3059
1096c059N2609j6431n8294l1721L8557Q0444J2839r1005p1894M0009Q3603L0162
$$ -3059 49550 33119 -25175 -56896 -18339 62105 74944 -16061 -87955 -47946 35657 65819
1108F5819m3671o8085j0460O1409L6539l9912l8892J5620L6910K0394k0555n7554
$$ 65819 22148 -45937 -56397 5012 41551 1639 -37253 -21633 15277 35671 15116 -42438
1120d2438k1288N6250O0489n658n1424m7315J985O2364M5348l7429n6031M848
$$ -42438 -63726 -7476 53013 47355 -4069 -51384 -49399 12965 58313 20884 -35147 -30299
1132c0299M0410K1784j8757m4865p422N7772L9129m3537n6672L215M1044L5539
$$ -30299 10111 31895 13138 -31727 -39149 18623 57752 14215 -42457 -39242 1802 37341
1144C7341m561m6712k6950K8996K8122q889j1177m238o376R707J3337j4043j4738
$$ 37341 32780 -13932 -40882 -11886 16236 7347 -3830 -8068 -14444 -4737 8600 -5443 -20181
1157b0181R113Q828L977P685j4215k5551R830K8522Q64j2166n916m879Q289J6433
$$ -20181 -11068 -2240 1737 9422 -4793 -30344 -20514 8008 8872 -3294 -9210 -14089 -5800 10633
1171A0633p868j3677J2874P269j2814L061J5575o570j2994J162P582J8006J1772
$$ 10633 2765 -10912 1962 9231 -3583 -522 15053 8483 -4511 -3349 4233 22239 34011
1184C4011k7280k9051K4267L6745m896k7841j6062R022L3224J2308m0744l2346
$$ 34011 6731 -22320 1947 38692 33796 5955 -10107 -1085 32139 44447 3703 -28643
1196b8643K9478L8835j300k6820l0317o205L7211L2452k1704m0318j0459J5409
$$ -28643 835 39670 38370 11550 -18767 -24972 12239 44691 22987 -17331 -27790 -12381
1208a2381K8443J3619l6258m1796K1968N0700L419m2352m0770M801O0008M0173
$$ -12381 16062 29681 -6577 -48373 -26405 24295 27714 -14638 -55408 -50607 9401 49574
1220D9574n0231p2897R041O5985L4169k7688n7504j8747N4907N0950k9538n5356
$$ 49574 -657 -73554 -64513 1472 35641 7953 -49551 -68298 -13391 37559 8021 -47335
1232d7335k962L7807L5466J581m5701l8361L1154N7212Q797l3939l7210p170M5053
$$ -47335 -50297 -12490 22976 24557 -21144 -59505 -28351 28861 37658 3719 -33491 -40661 4392
1245D392M8422k2878n9459n755M6918L7680r200n2196l1410M6586O3516j6344
$$ 4392 52814 29936 -29523 -35278 11640 49320 40120 -12076 -43486 3100 66616 50272
1257E0272o3468j8985L4777M2482O952m3293l7921K6122M3846l055k9261j6891
$$ 50272 -13196 -32181 2596 45078 52030 8737 -29184 -3062 40784 37729 8468 -8423
1269h423J41K2362K3699j6127l3837j902J8465J2955O289j6149l1147N940L5505
$$ -8423 -8282 14080 37779 21652 -12185 -14087 4378 17333 23622 7473 -23674 -17734 17771
1282A7771M678k6324j5712L795J9303J7268j7983l2040Q929K8196r41j3343j492
$$ 17771 22449 -3875 -19587 -15792 3511 20779 2796 -29244 -20315 7881 6940 -6403 -7895
1295g895j523J335P059m828l659J3528j122j9885N438K1700l205j5668m749N548
$$ -7895 -9418 -8083 -1024 -5852 -9511 4017 2895 -16990 -11552 10148 6943 -8725 -13474 -7926
1309g926J7657J3524k3638k7209J7370K9834k176j4504j0659n601J5653K0588
$$ -7926 9731 23255 -383 -27592 -10222 19612 17436 2932 -7727 -13328 2325 22913
1321B2913j1355k3622L29J1302J2708J1786j7626l6032M813M1375J5532k3561
$$ 22913 11558 -12064 -11735 -433 12275 24061 6435 -29597 -24784 16591 32123 8562
1333H562l2880j3094L3380M3083j9521n9154n962M9723L0783j9624m8036k4038
$$ 8562 -24318 -37412 -4032 39051 19530 -39624 -45586 4137 34920 15296 -32740 -56778
1345e6778M0627N5765j3417n6845j9234K7664L5427J1816l0575m0486J2557M8909
$$ -56778 -16151 39614 26197 -30648 -49882 -22218 13209 25025 -5550 -46036 -33479 15430
1357A5430J3231k9484l2514p361L4936M8720j0065o1566k0819M1404M6001L255
$$ 15430 28661 -823 -33337 -40698 -5762 42958 32893 -28673 -49492 -8088 37913 41168
1369D1168m4315m1573K7392O6086L046o0299l1640L0251M8958J7403l9207n0548
$$ 41168 -3147 -44720 -17328 48758 51804 -8495 -40135 -9884 39074 56477 17270 -33278
1381c3278J2304N3521J4019k9451k5558l122K2268K8862j0836m0028q739K6575
$$ -33278 -20974 32547 46566 17115 -8443 -11565 10703 39565 28729 -11299 -20038 6537
1393F537K2154L993k1757l7165K35M4820J8948k9828k8647J274K3546K1703j5866
$$ 6537 28691 32684 10927 -26238 -26003 18817 37765 7937 -20710 -19436 4110 25813 9947
1406I947m1113J663M1851J3719k4524k1858m934J4163K2471l527k2525J528J3477
$$ 9947 -31166 -29503 12348 26067 1543 -20315 -25249 -11086 11385 7858 -14667 -13139 338
1419C38o238n106Q591j298l807P309J909l850K003p429j1751J6483K3563q737
$$ 338 -5900 -11006 -2415 -3713 -7520 -211 1698 -2152 -149 -7578 -19329 -2846 20717 11980
1433A1980j7415k728n71O006J4288j093j1958K642K765o306M828M212j4076j003
$$ 11980 -5435 -8163 -8734 -2728 11560 10467 -1491 1151 3916 -2390 2438 6650 -7426 -8429
1447h429K3623Q297j8319k1540j1079J8187M1041K567m6742k3249K6341K6861
$$ -8429 15194 23491 5172 -16368 -27447 -9260 31781 34348 -12394 -35643 -9302 17559
1459A7559l630k4617j8895J9447M0511n697m9008j9855K6365L3505J5214k0099
$$ 17559 13929 -10688 -29583 -10136 30375 24678 -24330 -44185 -17820 15685 30899 10800
1471A0800m2106p539L6777K2174j2221k0387j1710J2939L5182K486m7944k6852
$$ 10800 -31306 -38845 -2068 20106 7885 -12502 -24212 -11273 23909 26395 -21549 -48401
1483d8401L4106M7882J0814l9297n2080N152O4370K8692m4479m1329J3753M1732
$$ -48401 -14295 33587 44401 5104 -46976 -41824 22546 51238 6759 -34570 -20817 20915
1495B0915K0780k9086n0663M365O0006K8396l3917m1522j1008K3628L9138O037
$$ 20915 41695 12609 -38054 -33689 26317 54713 20796 -20726 -31734 -8106 31032 37069
1507C7069l6082k1377J7824J9841L858j3425k7078j390M2369K4422l3492m4542
$$ 37069 987 -20390 -2566 17275 21133 7708 -19370 -20760 21609 46031 12539 -32003
1519c2003m137L4524M0965k442n1049k6267L4828L1699j3811k6889o920J9125
$$ -32003 -36140 -1616 39349 36907 -14142 -40409 -5581 26118 12307 -14582 -21502 -2377
1531b377K6857q207m1503j0304L2569K1275p016j1866j3561n180J5167J0855n472
$$ -2377 24480 16273 -25230 -35534 -2965 18310 11294 -572 -14133 -19313 -4146 6709 1237
1544A237k049j530r702M532J5138o341j3717O964J1152Q3k162r233p385J5350
$$ 1237 -812 -2342 -12044 -7512 7626 1285 -12432 -5468 5684 5767 3605 -5628 -13013 2337
1558B337J4590j4243j2694Q396M083k305N595J696n330j229n858m893K0009J7081
$$ 2337 16927 2684 -10010 -1614 2469 164 5759 7455 2125 896 -4962 -9855 10154 27235
1572B7235k1783k5489Q447K0350O662q172j9983j887K8412J1336l1151k1951J5973
$$ 27235 5452 -20037 -11590 8760 15422 7250 -12733 -14620 13792 25128 -6023 -27974 -12001
1585a2001K5577J1316j2592l3816j2317K9960K5119q894j7758j1413R42K3159
$$ -12001 13576 24892 12300 -21516 -33833 -3873 21246 12352 -5406 -16819 -15877 7282
1597G282J5108k6395k7481J4223L3275J3533j9753m0988j1613M5870M0187k3580
$$ 7282 22390 -4005 -31486 -17263 16012 29545 9792 -31196 -42809 3061 43248 19668
1609A9668m4632m340L0517K8738q120m3550j6211M3497L9192j7300m1692j9383
$$ 19668 -24964 -29304 1213 29951 21831 -21719 -37930 5567 44759 27459 -14233 -33616
1621c3616J3861L9945K2378k7484l5343M207K3153J2520o528k5275j0017L5966
$$ -33616 -19755 20190 42568 15084 -20259 -16052 7101 19621 13093 -12182 -22199 13767
1633A3767L3916k7756n3220j2751L8899N1848Q735n3941m7787K2871M4646J897
$$ 13767 47683 19927 -33293 -46044 -7145 44703 53438 -503 -48290 -25419 19227 21124
1645B1124k4151r631J2311K0712n158l9933j7535L4432L5992J211j9567k8688
$$ 21124 -3027 -12658 -347 20365 15207 -24726 -42261 -7829 28163 29374 9807 -18881
1657a8881k0834J5716L4624J2988j0267j7982j7234N555K0623m622j9007J3274
$$ -18881 -39715 -23999 10625 23613 13346 -4636 -21870 -16315 4308 -314 -19321 -6047
1669f047K8790j336k9729k7596K288L9311L1862k0881l5242K346J4453k344k094
$$ -6047 22743 21407 -8322 -35918 -33630 5681 37543 16662 -18580 -16234 -1781 -4125 -6219
1682f219P017Q661N049j1266k2376M737K3835j071j5403Q249J6121o450j9228
$$ -6219 798 9459 14508 3242 -19134 -14397 9438 8367 -7036 1213 17334 10884 -8344
1695h344j2603Q226L1419J2285k8983k2023J4782J5069m648n674j918L324J2308
$$ -8344 -20947 -12721 18698 30983 2000 -20023 -5241 9828 5180 -494 -2412 912 13220
1708A3220J99j6397n953M204j393J1551K3357q201l5684j3067K0966K8657P485
$$ 13220 13419 -2978 -8931 -4727 -6120 5431 28788 20587 -15097 -28164 -7198 21459 28944
1721B8944k7253k7586K1395L5851j5659m3630k910M0108L4253j0492n3181l1470
$$ 28944 1691 -25895 -4500 31351 15692 -27938 -30848 9260 43513 33021 -20160 -51630
1733e1630L6445N1038j987l3250j8775K293J6625J4374j1619j7380R218J7493
$$ -51630 -15185 35853 33866 616 -18159 -15866 759 15133 3514 -13866 -4648 12845
1745A2845K591j0614k2716j6275K7996M6884j770n0118l5089J4545M7626K8967
$$ 12845 15436 4822 -17894 -34169 -6173 40711 38941 -11177 -46266 -31721 15905 44872
1757D4872l0372m8985O812M3360P185l1597j9927J4559L6436J2452l9027m1931
$$ 44872 14500 -34485 -27673 15687 22872 -8725 -28652 -14093 22343 34795 -4232 -46163
1769d6163J5238M4235J7667j3119k8505k3018J1268L2765Q768j6912j2971k020
$$ -46163 -30925 13310 30977 17858 -10647 -33665 -22397 10368 19136 2224 -10747 -12767
1781a2767J0257J4343j1040k6300Q330L6619J0299k6629k9745n578L0569L4268
$$ -12767 -2510 11833 793 -25507 -17177 19442 29741 3112 -26633 -32211 -1642 32626
1793C2626j1204l6697n052K1759P640o069n613k253R932J0364j1166j3233N510
$$ 32626 21422 -15275 -20327 1432 9072 3003 -2610 -4863 5069 15433 4267 -8966 -3456
1806c456N001j121Q499N972j2407j0075K878N248Q033N220j1904q817J2765M401
$$ -3456 1545 424 8923 14895 2488 -7587 -4709 539 8572 13792 1888 -6929 5836 10237
1820A0237j3476l988P626L661M510J417j0690o494K582k148M860K0786J021k7401
$$ 10237 -3239 -7227 399 4060 8570 9987 -703 -7197 -4615 -6763 -1903 18883 19904 -7497
1834g497j5548J1496J7081P642r699j7024Q067K3086r912l2163k233K9758K5496
$$ -7497 -23045 -11549 5532 13174 3475 -13549 -5482 17604 7692 -24471 -26704 3054 28550
1847B8550k435l2936l2156J2931L9043J1359j6323j4765p069M888J5513m43j6397
$$ 28550 26115 -6821 -38977 -26046 12997 24356 8033 -6732 -13801 -8913 6600 6157 -10240
1860a0240J016J9234R821r333k5257k2389J8715N0505J3471m2143l9506L138L6442
$$ -10240 -9224 10010 19831 10498 -14759 -37148 -18433 32072 45543 3400 -36106 -32968 3474
1873C474L1183j3930m1299k598L7204J2077k9581k5274P745L5294K5815k1781
$$ 3474 34657 20727 -20572 -23170 14034 26111 -3470 -28744 -20999 14295 40110 18329
1885A8329m7247q300L5220K7779j57k1520k5985J222K9823J2125k0123j7022M625
$$ 18329 -28918 -37218 -1998 25781 25624 4104 -21881 -20659 9164 21289 1166 -15856 -11231
1898a1231J8137J7282j2100l6641o255L8286K7306j5639l3010j6797J8903L6432
$$ -11231 6906 24188 12088 -24553 -30808 7478 34784 19145 -13865 -30662 -11759 24673
1910B4673O28l6810j4028K4960J9588o220j9415j5232J1266K8577K768k3536j1941
$$ 24673 25301 -11509 -25537 -577 19011 12791 -6624 -21856 -10590 17987 20755 -2781 -14722
1923a4722M756P021R717L119j3548o405J0082M909m239l848o462j8J8020R425
$$ -14722 -9966 -2945 6772 9891 -3657 -10062 20 4929 690 -3158 -9620 -9638 8382 17807
1937A7807j9088j6311M995J1112J0226K488j2986q698Q051L395o868N243R742
$$ 17807 -1281 -17592 -12597 -1485 8741 11229 -1757 -10455 -2404 991 -5877 -634 9108
1950I108n134o967l82q36L044N282m513j346J3586N29k2136r074J4845J8903Q117
$$ 9108 3974 -2993 -3375 -4211 -1167 4115 -398 -1744 11842 12371 -9765 -18839 -3994 14909 23026
1965B3026j3435k6317k988K5892J2124j2325r776J37N032Q916l164j8085k719
$$ 23026 9591 -16726 -19714 6178 18302 5977 -3799 -3662 1370 10286 7122 -10963 -13682
1978a3682J9447J2155m907j4962j9446J402L1776J8602k1884k8507k923K0257
$$ -13682 5765 17920 13013 -1949 -21395 -19993 11783 30385 8501 -20006 -22929 -2672
1990b672K4234m011l4689j2221L2336K4906j8286l1328p788K4778L3871l251m2334
$$ -2672 21562 17551 -17138 -29359 2977 27883 9597 -21731 -29519 -4741 29130 25879 -16455
2003a6455k0827K5966K9816J835k0008k2501K342K9719J4432k2179k2736L198
$$ -16455 -37282 -11316 18500 20335 327 -22174 -19832 9887 24319 2140 -20596 -17398
2015a7398K0200K0564k977l3857j9162K7166L2600l533k9081k0901J1171L7010
$$ -17398 2802 23366 20389 -13468 -32630 -5464 27136 23603 -5478 -26379 -15208 21802
2027B1802J1542l5718k8335J9611L2698M829k2671k7212K737L3716J6330k3303
$$ 21802 33344 -2374 -30709 -11098 21600 26429 3758 -23454 -20717 12999 29329 6026
2039F026k2997L286J5004J3209n40j8297j1565J4245J4409m187j1679j0844p90
$$ 6026 -16971 -13685 1319 14528 13988 -4309 -15874 -1629 12780 8593 -3086 -13930 -14720
2052a4720K0841J6542j6458k4435J105J7529J2601j389j8452j0244J6477J4118
$$ -14720 6121 22663 6205 -18230 -17125 404 13005 11616 -6836 -17080 -603 13515
2064A3515j2167j3814M970Q790N233o0j0717n494R903M212m916L537L893j0779
$$ 13515 1348 -12466 -7496 1294 6527 6467 -4250 -9744 159 4371 -545 2992 6885 -3894
2078c894o267Q131P623K018l384j1322j859J6200N542j4570n993Q036O043K347
$$ -3894 -10161 -2030 5593 7611 4227 -7095 -8954 7246 12788 -1782 -7775 261 6304 8651
2092H651l806j3111l227J3535P417l157l332q022o685J2682J4765r216j6907k460
$$ 8651 4845 -8266 -11493 2042 9459 6302 2970 -5052 -11737 945 15710 6494 -10413 -12873
2106a2873J1675J5911N71k6399j8049K3086K9728o044k7888j3350J3573K7209
$$ -12873 -1198 14713 15284 -11115 -29164 -6078 23650 17606 -10282 -23632 -10059 17150
2118A7150N973l0207k1808J8694K7068O32j8387j9339M42K6145J8281j6432k4419
$$ 17150 23123 -7084 -28892 -10198 16870 17502 -885 -20224 -19782 6363 24644 8212 -16207
2131a6207k014J5701J8670M165k4594k2930J5999L2058J938k5979k2069O715L4926
$$ -16207 -18221 -2520 16150 20315 -4279 -27209 -11210 20848 22786 -3193 -25262 -18547 16379
2144A6379J9613k9918l6562Q343L6123J4108j8276k8549m605L0583K1939k0434
$$ 16379 35992 6074 -30488 -22145 13978 28086 9810 -18739 -23344 7239 29178 8744
2156H744k9505J807K1543J7513p62k3254j9361J2653K3053L317j3134j3492l877
$$ 8744 -20761 -18954 2589 20102 19340 -3914 -23275 -10622 12431 15748 2614 -10878 -14755
2169a4755J6945J8737j2613k6859j76K3115J5923n804k4593j5543J9791K6954
$$ -14755 2190 20927 8314 -18545 -18721 4394 20317 14513 -10080 -25623 -5832 21122
2181B1122o793k4247m912J1737J2427J707j4308j0463J2405J3677o790r069n40
$$ 21122 14329 -9918 -14830 -3093 9334 11041 -3267 -13730 -1325 12352 5562 -3507 -4047
2194d047j086L017R524O06p870l382j875O66J0567L246j2177m147J0028L324n078
$$ -4047 -5133 -2116 7408 8014 144 -3238 -5113 -4447 6120 9366 -2811 -6958 3070 6394 1316
2209A316m204l926K954J0967J675j0141k549J909l823K726J0587j489j0049k673
$$ 1316 -2888 -6814 -3860 7107 8782 -1359 -3908 -1999 -5822 -3096 7491 6002 -4047 -6720
2223f720K559P149N983j1595j5456J0758K3426j931k1266j2185O732K1466J1674
$$ -6720 -4161 2988 8971 -2624 -18080 -7322 16104 14173 -7093 -19278 -12546 8920 20594
2236B0594j8936k3223Q255K2794M140j2144j3483k329J6971J6640j1195k1990
$$ 20594 1658 -21565 -13310 9484 13624 1480 -12003 -14332 2639 19279 8084 -13906
2248a3906k620J3339J6293P423j7306k5283N253K8773J0546j7111k0464k454K4645
$$ -13906 -16526 -3187 13106 20529 3223 -22060 -16807 11966 22512 5401 -15063 -17517 7128
2261G128K2407j8021l7079P00L4803K0793j3221l0914j4796K4170L0951q403l0670
$$ 7128 29535 11514 -25565 -24865 9938 30731 17510 -13404 -28200 -4030 26921 18518 -12152
2274a2152p115J8675J8139Q44k1097k1316J0783K9210P564j7258k0236o152J7818
$$ -12152 -19267 -592 17547 18391 -2706 -24022 -13239 15971 23535 6277 -13959 -20111 -2293
2287b293K4660m833l0179q941K1110J9637l030k3540j8089J6892L3424j366l2209
$$ -2293 22367 17534 -12645 -21586 -476 19161 16131 -7409 -25498 -8606 24818 23452 -8757
2300h757j5992J4165K2310R076j6345k1877N244K1332K052j3396o602J638Q063
$$ -8757 -24749 -10584 11726 20802 4457 -17420 -12176 9156 11208 -2188 -8790 -7152 911
2313I11J0957m259j7126n193Q300R515P212l476j6585n378J4725Q492q125q381
$$ 911 11868 7609 -9517 -14710 -6410 3105 10317 6841 -9744 -15122 -397 8095 -30 -8411
2327h411l43O921R965l580j6702k315J4549N147m643j562k321k197L461J550p53
$$ -8411 -8754 -1833 8132 4552 -12150 -14465 84 5231 588 -974 -3295 -5492 -2031 -481 -1234
2342a234M614m90j0166L94J3615J662j0474m630M463J0049O726j1046j7479O650
$$ -1234 3380 2890 -7276 -6882 6733 8395 -2079 -6709 -2246 7803 14529 3483 -13996 -7346
2356g346K0485L027j1482r732k647R877J3371m635j5089j909R066O679K477p240
$$ -7346 13139 16166 4684 -5048 -7695 2182 15553 10918 -4171 -6080 2986 9665 12142 4902
2370D902j6405Q5K1030R818j2532j7875n627J5290K2459n577l0960r736K4884
$$ 4902 -11503 -11418 9612 19430 6898 -10977 -16604 -1314 21145 15568 -15392 -25128 -244
2383b44K1790o674k5254j7793J5242L0867P47k9278j3379J5819J9103L494j6472
$$ -244 21546 14872 -10382 -28175 -12933 17934 18681 -10597 -23976 -8157 10946 14440 -2032
2396b032k0807N463K7620J1126j6300k0781o646J4709K5665K784k6850j6086J5559
$$ -2032 -22839 -17376 10244 21370 5070 -15711 -22357 -7648 18017 20801 -6049 -22135 -6576
2409f576K1745L535j8280k0599Q948L2622P251l1298k3198J2317K8025J4705j5608
$$ -6576 15169 18704 424 -20175 -11227 21395 28646 -2652 -25850 -13533 14492 29197 13589
2422A3589k9907l081K6108J3128j2362j3677j760Q902J2569l687k0142p524J4544
$$ 13589 -16318 -19399 6709 19837 7475 -6202 -7962 940 13509 9822 -10320 -17844 -3300
2435c300J5310L091j0323j9718o019K0182J6364r781j5736k780Q843J1380k859
$$ -3300 12010 15101 4778 -14940 -20959 -777 15587 5806 -9930 -12710 -3867 7513 4654
2448D654j9383m487K1114J2857r590j3325m833M240J1655M281q212k515M178l840
$$ 4654 -14729 -19216 1898 14755 5165 -8160 -12993 -8753 2902 7183 -1029 -3544 634 -3206
2462c206l044P017K936m073J096L742m15j087o102p288R849J7155j897j6499p597
$$ -3206 -6250 767 3703 -370 726 4468 4053 2966 -3136 -10424 -575 16580 14683 -1816 -9413
2477i413K706P153R320K64q119j285J032m835M75M794k439k254Q637M183j0699
$$ -9413 -6707 446 9766 10030 1911 626 1658 -3177 -2702 2092 -347 -2601 6036 10219 -480
2492d80j2883l479J2786K2524K442k8939j9482J5919K2864J748j5263j3347O873
$$ -480 -13363 -16842 -4056 18468 20910 -8029 -27511 -11592 11272 13020 -2243 -15590 -8717
2505h717K0377K59k4743q794J8904J9208P31j5611k0442j282K2623J6805o147
$$ -8717 11660 11919 -12824 -21618 -2714 16494 17225 1614 -18828 -20110 2513 19318 13171
2518A3171j4633j0400J982J8247J0882j6274j7690R827K1206N574j8130k4933
$$ 13171 -1462 -11862 -9880 8367 19249 2975 -14715 -4888 16318 21892 3762 -21171
2530b1171K550L5121J9933k5878l2592K400K6363J8281j0283k6875o058K4208
$$ -21171 -18621 16500 36433 10555 -22037 -19637 6726 25007 14724 -12151 -18209 5999
2542E999J5552j5097j9257j334J2152J6122J953j9891j5508P582J6302P683n217
$$ 5999 21551 6454 -12803 -14137 -1985 14137 16090 -3801 -19309 -11727 4575 12258 7041
2555G041j7026j0457J6481J8893q525k1075m228J5787J8452j947k6252j5858K1014
$$ 7041 -9985 -20442 -3961 14932 6407 -14668 -18896 -3109 15343 13396 -12856 -28714 -7700
2568g700K5122m089j9318r371N830J3264M499j2081n717J0698O503n518m425l403
$$ -7700 17422 13333 -5985 -15356 -9526 3738 8237 -3844 -9561 1137 7640 2122 -2303 -5706
2582e706k190Q137J0866k166q415p138m518Q655J6263n5j5175m852M982K292M07
$$ -5706 -7896 241 11107 8941 526 -6612 -11130 -2475 13788 13733 -1442 -6294 -1312 980 1387
2597A387m39j177N844M458r642r789M502O509J314M742J981q762r072k458N416
$$ 1387 948 -229 5615 10073 431 -9358 -4856 1653 2967 7709 9690 928 -8144 -10602 -5186
2612e186J4832Q309j5422j7734N676J4809K143o841o013K329J2309J339j8768
$$ -5186 9646 17955 2533 -15201 -9525 5284 7427 586 -5427 -3098 9211 10550 -8218
2625h218j0690J3540J7726K786q967j6741q120J4044J6991q49j0603q782j229
$$ -8218 -18908 -5368 12358 15144 6177 -10564 -18684 -4640 12351 11502 899 -7883 -9112
2638i112J0493J0595j1523j6937O780K1370O845j4672k3096m124K6989K3895j4540
$$ -9112 1381 11976 453 -16484 -9704 11666 18511 3839 -19257 -23381 3608 27503 12963
2651A2963l0205l296J9524J7206m301k1360j0147J9392K0462r044k1710p575J0244
$$ 12963 -17242 -20538 -1014 16192 11891 -9469 -19616 -224 20238 11194 -10516 -18091 -7847
2664g847J8826J0227j5685k2256J238J8131J1284l187j5655j0749J4308K1396
$$ -7847 10979 21206 5521 -16735 -15497 2634 13918 10731 -4924 -15673 -1365 20031
2676B0031p399k5072p535J8024K2600K604k5508k3844J2371K8604M286j7195j2693
$$ 20031 12632 -12440 -19975 -1951 20649 23253 -2255 -26099 -13728 14876 19162 1967 -10726
2689a0726K434J3832P570j3409j4219Q719J6366J842j0180j2128o898J1497J8817
$$ -10726 -8292 5540 13110 -299 -14518 -5799 10567 12409 2229 -9899 -16797 -5300 13517
2702A3517J143j4639j0863j550Q649J2689j315j3786j239J1087K098q642o865
$$ 13517 14660 21 -10842 -12392 -3743 8946 7631 -6155 -7394 3693 5791 -2851 -9716
2715i716R77J1811J2198p736j8051k429J0193O954K644p31p086l289K082k69K013
$$ -9716 -8739 3072 15270 7534 -10517 -12946 -2753 4201 6845 6114 -972 -4261 -2179 -2448 -435
2730d35O858j115q307K103N307l533m251M07L697P417K900j2943j1409P498J3105
$$ -435 6423 5308 -2999 -896 4411 878 -3373 -2966 731 8148 11048 -1895 -13304 -5806 7299
2745G299K101m781q251o138O882R832l165p338q90J334L683N982n936j3500K584
$$ 7299 9400 4619 -3632 -9770 -2888 6944 3779 -3559 -4449 -3115 568 6550 614 -12886 -10302
2760a0302J5419O781o605j4781r608J3137K0932l184k1940o264J4162J3930q70
$$ -10302 5117 11898 5293 -9488 -19096 -5959 14973 11789 -10151 -16415 -2253 11677 10807
2773A0807j7670j4097J4218K4143n04k0881j2223O121J6270J1730j0399j8966
$$ 10807 -6863 -20960 -6742 17401 16897 -3984 -16207 -10086 6184 17914 7515 -11451
2785a1451K5J6646Q166m772j2449q676J0953K0231j325k3533j1679J2397K0378
$$ -11451 -11426 5220 13386 8614 -3835 -12511 -1558 18673 17348 -6185 -17864 -5467 14911
2798A4911Q720j7151k5593K625K7139J0640j6357j6525P73J6003J2451j1876k2847
$$ 14911 23631 6480 -19113 -16488 10651 21291 4934 -11591 -10818 5185 17636 5760 -17087
2811a7087J559K1857J0268q561j5955j0033Q672J9254K784j4916r601K219Q447
$$ -17087 -15528 6329 16597 8036 -7919 -17952 -9280 9974 12758 -2158 -11759 -9540 -1093
2824a093Q701l284j5254k436J5764Q425q552j2897m270J0784J7794j892k0615
$$ -1093 7608 4324 -10930 -13366 2398 10823 2271 -10626 -14896 -4112 13682 11790 -8825
2837h825q032J2752J1182J55o379q137K045J0188J63r298l9N626J253J668P02
$$ -8825 -16857 -4105 7077 7232 853 -7284 -5239 4949 5112 -4186 -4225 1401 2654 4322 5024
2852E024o145m534L803L735L250K923p206q430N635R045k652n512j494P61M472
$$ 5024 -1121 -5655 -1852 1883 5133 8056 850 -7580 -1945 7100 4448 -1064 -2558 -1797 2675
2867B675M428n925p281M137M509l69J294j244p428j007Q586M222k613n635q186
$$ 2675 7103 1178 -6103 -1966 2543 2174 3468 2224 -5204 -6211 2375 6597 3984 -1651 -9837
2882i837L464J5153K146j5584p426J0152J1600J001j1891j4671O417K1437M271
$$ -9837 -6373 8780 10926 -4658 -12084 -1932 9668 10669 -1222 -15893 -9476 11961 16232
2895A6232j6522j0834L327J0960Q859n041j5041j758J3998Q018n052j0001q976
$$ 16232 -290 -11124 -7797 3163 12022 6981 -8060 -9818 4180 12198 7146 -2855 -11831
2908a1831M771J8848O177j6849j5547M907J6474J0634q905k2474k959K4028J4070
$$ -11831 -7060 11788 17965 1116 -14431 -9524 6950 17584 8679 -13795 -16754 7274 21344
2921B1344j5101k0395j798J6681J7209n864k4402o577J9429J4600n677j4818r775
$$ 21344 6243 -14152 -15950 731 17940 12076 -12326 -18903 526 15126 9449 -5369 -15144
2934a5144N426J7062M672j5267j0944M585J1439R058m558j8182q156J6762J6269
$$ -15144 -9718 7344 12016 -3251 -14195 -9610 1829 10887 6329 -11853 -20009 -3247 13022
2947A3022n083j5180q921O991J8191K755k0470j1667J4280J6819m8j2580j2169
$$ 13022 7939 -7241 -16162 -9171 9020 11775 -8695 -20362 -6082 10737 10689 -1891 -14060
2960a4060K202J6540O054j1805q319M897N528L499o47p133m307P080O854o89l244
$$ -14060 -11858 4682 10736 -1069 -9388 -4491 1037 4536 3889 -3244 -7551 -471 6383 5694 2450
2975B450n088l263P707R602n690j0018L0N830N319J417o830n662P314P320n906
$$ 2450 -2638 -5901 1806 11408 5718 -4300 -4270 1560 6879 8296 1466 -4196 3118 10438 4532
2990D532n577J183J073J321L688o79l639l96k404j181Q092M808r801p201N570
$$ 4532 -1045 138 1211 2532 6220 5541 1902 1506 -898 -2079 6013 10821 1020 -6181 -611
3005f11O282J105n191q784J606J3540L481j3987q964N335R449O208k647j2528
$$ -611 5671 6776 1585 -7199 -5593 7947 11428 -2559 -11523 -6188 3261 9469 6822 -5706
3019e706m708R416O910l360n070m702k88J1552P270j0572j2950K295J2279R777
$$ -5706 -10414 -998 5912 2552 -2518 -7220 -7508 4044 11314 742 -12208 -9913 2366 12143
3033A2143l865j8128p935J7750J7536q593j9157n864J1942J7621L79k0262j1458
$$ 12143 8278 -9850 -17785 -35 17501 8908 -10249 -16113 -4171 13450 13829 -6433 -17891
3046a7891J4902J7101k988j4532j0670L699J6476Q587j2724j4494K221J0792Q452
$$ -17891 -2989 14112 11124 -3408 -14078 -10379 6097 14684 1960 -12534 -10313 479 8931
3059H931j946j5043j0326J3249J8184k130j6762j2032N041J7933R137j7329j7915
$$ 8931 6985 -8058 -18384 -5135 13049 10919 -5843 -17875 -12834 5099 14236 -3093 -21008
3072b1008R863J9548L299j3733j4663Q92J8882J1420j2873j5456K429J1319O568
$$ -21008 -11145 8403 11702 -2031 -16694 -15802 3080 14500 1627 -13829 -11400 -81 6487
3085F487r17r765p136Q559J1475j484p290m866j062Q984J0500o210j3369K07J0268
$$ 6487 5570 -4195 -11331 -2772 8703 7219 -71 -4937 -5999 2985 13485 7275 -6094 -5887 4381
3100D381P359j502r707p628R086J2085l988j1121p02N943M187O78o058o178M073
$$ 4381 11740 10238 531 -7097 1989 14074 10086 -1035 -1737 4206 8393 9071 3013 -3165 908
3115I08N700j941o28Q92m436l115L918K896j773j352l214o82O557K241r657n562
$$ 908 6608 4667 4039 4931 495 -2620 1298 4194 2421 1069 -2145 -2827 3730 5971 -3686 -9248
3131i248O029O543J002l139o898l560Q010M651m008k713n27j443M426N892m849
$$ -9248 -3219 3324 4326 1187 -5711 -9271 -1261 3390 -618 -3331 -3858 -5301 -875 5017 168
3146A68q324J550P106N241o31j0466q232J0737J5877l572j4739o503P055J3124
$$ 168 -8156 -6606 500 5741 5110 -5356 -13588 -2851 13026 9454 -5285 -11788 -4733 8391
3160H391M663j3935j2767R517J5280l90j1873q527J522J2758R965q937j4894o95
$$ 8391 13054 -881 -13648 -4131 11149 10759 -1114 -9641 -8119 4639 14604 5667 -9227 -9922
3174i922R475P761J040j1099j0877P380J6445J033j4654j1693K487J5971J1878
$$ -9922 -447 7314 8354 -2745 -13622 -6242 10203 11236 -3418 -15111 -12624 3347 15225
3187A5225j2248k0686K864J9516P350j0738j5057k791J6253J4917q704j8684j460
$$ 15225 2977 -17709 -14845 4671 12021 1283 -13774 -16565 -312 14605 5901 -12783 -14243
3200a4243J2736R683m34j0817r608P376J4030N09r383o729kQ626J1370m635j5369
$$ -14243 -1507 8176 7742 -3075 -12683 -5307 8723 9232 -151 -6880 -6882 1744 13114 8479 -6890
3215f890k424J2791R319k620j1558r416Q262J6265o45j4739m431P278Q112M33
$$ -6890 -9314 3477 12796 10176 -1382 -10798 -2536 13729 13084 -1655 -6086 1192 9304 9737
3229I737q657q941N269J1944l34p304l441q57J258N284J450n172k125P89k04K577
$$ 9737 1080 -7861 -2592 9352 9018 1714 -1727 -2584 -1326 3958 5408 236 -1889 -1100 -1304 1273
3245A273J482n865l087P887M335n338n274j976J584P494L341p231m086K965L01
$$ 1273 2755 -3110 -6197 1690 6025 687 -4587 -6563 -4979 2515 5856 -1375 -5461 -2496 -2195
3260b195k52L558L49m192K87K229K67J196k016n728M169J0823j604j1971n032
$$ -2195 -2447 1111 1460 -2732 -2445 -216 51 1247 -769 -6497 -2328 8495 6891 -5080 -10112
3275a0112N549J0404N826r296j2784L849J3321J236q140n640J139P682O469o143
$$ -10112 -4563 5841 11667 2371 -10413 -6564 6757 7993 -147 -5787 -4648 3034 9503 3360
3289C360j2041M20R575O383O62p550j1256J906J3863N369r280r985m07J0712J0597
$$ 3360 -8681 -8261 1314 7697 8359 809 -10447 -8541 5322 10691 1411 -8574 -8981 1731 12328
3304A2328o750j8075j434J8510J0578r023j5846o191J2871J7598l041j8333n660
$$ 12328 5578 -12497 -13931 4579 15157 6134 -9712 -15903 -3032 14566 11525 -6808 -12468
3317a2468J0083R168j51p972q589N057J4238K264j1743q798k70R319J2797j356
$$ -12468 -2385 6783 6632 -1340 -9929 -4872 9366 11630 -113 -8911 -9181 138 12935 11579
3331A1579j6818q506J0365J2283Q86r543r789N188J5969R43j7995q957J0480J4034
$$ 11579 -5239 -13745 -3380 8903 9789 246 -9543 -4355 11614 12557 -5438 -14395 -3915 10119
3345A0119K595j1024j3442K434J5340M542q887o146Q5K570N388O60o563k151M911
$$ 10119 12714 1690 -11752 -9318 6022 10564 1677 -4469 -4384 -1814 3574 4234 -2329 -4480 431
3360D31K469j213k204o418q52J1253P248p266r803k079M853P806J877p879m197
$$ 431 2900 1687 -517 -6935 -7787 3466 10714 3448 -6355 -8434 -3581 4225 6102 -1777 -5974
3375e974O796K595n216k440K028K160L219r5m698j258J964j733J035O490O94q281
$$ -5974 822 3417 -1799 -4239 -2211 -51 3168 3073 -1625 -2883 -919 -2652 -1617 4873 5567 -2714
3391b714l511K843N129M250k781q321J280Q533K99p770k313K894N533M122l791
$$ -2714 -6225 -3382 1747 5997 3216 -5105 -3825 4708 5007 -2763 -5076 -2182 3351 7473 3682
3406C682q865j254O679L574J072j695p056k482Q229N632n395o300o68O184Q602
$$ 3682 -5183 -6437 242 3816 4888 3193 -3863 -6345 1884 7516 2121 -4179 -4847 1337 9939
3421I939k949j5151m694J4702J2015m783j3341q280O777J5020K031j3953o450
$$ 9939 6990 -8161 -12855 1847 13862 9079 -4262 -12542 -5765 9255 11286 -2667 -9117
3434i117P944P705j080p418p962L349J3361N148j0303j1032j524P269J2792K924
$$ -9117 -1173 6532 5452 -1966 -9928 -6579 6782 11930 1627 -9405 -10929 -3660 9132 12056
3448A2056j4220j0967O398J1771J906p882q704L357J4513L896j6730j2826Q267
$$ 12056 -2164 -13131 -6733 5038 6944 -938 -9642 -6285 8228 12124 -4606 -17432 -9165
3461i165J6279O914q549j5545l231J4187Q586o648p939j77M645O032R1q597m414
$$ -9165 7114 14028 5479 -10066 -13297 890 9476 2828 -5111 -5288 -643 5389 5480 -3117 -7531
3476g531P353P600m33n994q364j822J1635J0301n850j1421k342N770P179N62q685
$$ -7531 -178 7422 6989 995 -7369 -9191 2444 12745 6895 -4526 -6868 -1098 6081 6643 -2042
3491b042m334Q328P426o159q455j08M644O312J557p097n661L535K747n24J918
$$ -2042 -6376 1952 9378 3219 -5236 -5344 -700 5612 7169 72 -5589 -2054 693 169 2087
3506B087K66l805n80K100o7p94J79k173J982N897j845p871j114M820L365K067
$$ 2087 2353 -1452 -2032 68 1 -793 -614 -2787 -805 5092 3247 -4624 -5738 -918 2447 4514
3522D514j674o008j142L770R73p89J814j12k439K310K969l885l406N30L523N299
$$ 4514 2840 -3168 -4310 -540 433 -356 1458 1346 -1093 1217 4186 301 -3105 -2575 948 6247
3538F247N47r703p316Q288J1056o15q205o767R41R515M118r004p254P037P625
$$ 6247 6794 -2909 -10225 -1937 9119 8504 299 -6468 -5527 3988 8106 -898 -8152 -1115 6510
3553F510o97o760p957K00J1330P786o597r974l091M014Q414M893q388j0051L684
$$ 6510 5813 -947 -8904 -8704 2626 10412 3815 -6159 -9250 -5236 3178 8071 -317 -10368 -6684
3568f684R432J792o805p698J146J2960Q090j1606j5372K237J4193Q653m441j3559
$$ -6684 2748 4540 -2265 -9963 -8817 4143 12233 627 -14745 -12508 1685 10338 5897 -7662
3582g662n789J1172J1076m923j0099j334O708P103N56r871p377O274J0714J684
$$ -7662 -13451 -2279 8797 3874 -6225 -7559 -851 6252 6808 -3063 -10440 -4166 6548 8232
3596H232n456p690l259Q264J0192k864j1125k469O524P198Q03r115q067P940J2011
$$ 8232 2776 -4914 -8173 91 10283 7419 -3706 -6175 349 7547 8350 -765 -8832 -892 11119
3611A1119j924j1113m910M378Q566M294p651q461M163O971m58k758k215j042L045
$$ 11119 9195 -1918 -6828 -2450 6116 10410 2759 -5702 -1539 5432 4974 2216 1 -1041 2004
3626B004L905k450m680N1J535K052M314j513p430k121N768K809q47j871l249J322
$$ 2004 5909 3459 -1221 -1170 365 2417 6731 5218 -2212 -4333 1435 4244 3397 1526 -1723 -401
3642d01M813j421n281N16L924M41o26j025l126q27K436K65J317K498l700o488
$$ -401 4412 2991 -2290 -1774 2150 2591 1965 940 -2186 -3013 -577 -312 1005 3503 -197 -6685
3658f685J935O659P76l927l682l37N296L717o213p374M462P826O37m847n788j776
$$ -6685 -4750 1909 2685 -1242 -4924 -5261 35 3752 -2461 -9835 -5373 2453 3090 -1757 -7545 -9321
3674i321O535P278l483p204r01K142M120L716l748p651J493Q153K807m384o888
$$ -9321 -2786 4492 1009 -6195 -7096 -4954 -834 2882 -866 -8517 -7024 1129 3936 -448 -7336
3689g336k225Q420J0851m535j3899k927J0330R247j334j0194o701P738J2521k929
$$ -7336 -9561 -1141 9710 5175 -8724 -11651 -1321 7926 6592 -3602 -10303 -2565 9956 7027
3703G027j1727l366O383Q164K533p692r187K763J0026L674m526o457l123N291
$$ 7027 -4700 -8066 -1683 6481 9014 1322 -7865 -5102 4924 8598 4072 -2385 -5508 -217
3717b17R679j060j1258m184O699Q707K005q533j0796M451J4095K301j0565p415
$$ -217 9462 8402 -2856 -7040 -341 8366 10371 1838 -8958 -4507 9588 11889 1324 -6091
3731f091L079R311M845o955j0404K482J0516K447n949m676j658M241O228j146
$$ -6091 -3012 6299 11144 4189 -6215 -3733 6783 9230 3281 -1395 -3053 1188 7416 6270
3745F270o475j923K725K280K807j463p027r71O961L629l889n263k035L390O932
$$ 6270 -205 -2128 597 2877 5684 4221 -2806 -3777 3184 6813 2924 -2339 -4374 -984 5948
3760E948q65q633j977N703K516k343k454k003J825M091j405m031Q50J507k186
$$ 5948 5083 -3550 -5527 176 2692 349 -2105 -4108 -2283 1808 403 -3628 -2778 -1271 -3457
3775c457M38K562l76k836p16J30K528L598k734n960J964N412j8l436j814K47L082
$$ -3457 -3019 -457 -833 -3669 -4385 -4255 -1727 1871 -863 -6823 -4859 553 535 -2901 -4715 -4468 -1386
3792a386M035k904m574N62K743O86K355q54m921q77N419L229j870l814l500K882
$$ -1386 2649 -255 -4829 -4267 -1524 -838 1517 663 -4258 -5135 284 3513 1643 -2171 -5671 -2789
3808b789Q709k84j0104m208P288Q054j65p128p771L581J1576R71r899n234M356
$$ -2789 5920 5636 -4468 -8676 -1388 6666 6501 -627 -8398 -4817 6759 7730 -2169 -7403 -3047
3823c047O870L099m600q236M40Q954L466l557n526l591L108R183K264q883o482
$$ -3047 3823 6922 2322 -5914 -5474 3480 6946 3389 -2137 -5728 -2620 6563 8827 -56 -6538
3838f538L918P734L919n938j0180O39J3025N874r529r714J605Q625P735m372j1973
$$ -6538 -2620 5114 9033 3095 -7085 -6446 6579 12453 2924 -6790 -5185 3440 11175 6803 -5170
3853e170j977J0504N979m965o290j761L998O805L3q219l555L426L987J978j288
$$ -5170 -7147 3357 9336 4371 -1919 -3680 318 7123 7156 -1063 -4618 -1192 2795 4773 3485
3868C485o785k781P571N813l734o578k840L497P004J113q918n063O751O090k650
$$ 3485 -3300 -6081 1490 7303 3569 -3009 -5849 -2352 4652 5765 -3153 -8216 -1465 4625 1975
3883A975m883l014K470O492O39p239j804L713J847k67P48k470j752J493J106p6
$$ 1975 -2908 -5922 -3452 3040 3679 -3560 -5364 -1651 196 -71 677 -1793 -3545 -2052 -946 -1022
3899a022J353p79k615Q59M086j067l707L40J232J580J968k547m066K433L668j290
$$ -1022 331 -448 -3063 -2204 1882 815 -2892 -2552 -1320 260 2228 -319 -4385 -1952 1716 426
3915D26r22J138j745r19K537J589j086r10k145q18M470L121o003m170M136N292
$$ 426 -496 642 -1103 -2022 515 2104 1018 108 -2037 -2855 1615 4736 -1267 -5437 -1301 3991
3931C991R63m193o446N10Q875L611p588n321K597N211K791j861p154j171P200
$$ 3991 4954 761 -5685 -5175 3700 7311 -277 -5598 -3001 2210 5001 3140 -4014 -5185 2015
3946B015L577k773m140k859R07O932L896o390o823J620O289L984k533q195k723
$$ 2015 5592 2819 -1321 -4180 -3273 3659 7555 1165 -5658 -4038 2251 6235 3702 -4493 -7216
3961g216R997P637o394j0593j123Q088Q322j065j1572m988Q140Q230l108o429
$$ -7216 2781 10418 4024 -6569 -7692 396 8718 7653 -3919 -8907 -767 7463 4355 -2074
3975b074k795K404P427J819p318o114L279N681K749j600o872l841O256P809j983
$$ -2074 -4869 -2465 4962 6781 -537 -6651 -3372 2309 5058 3458 -3414 -7255 -999 6810 4827
3990D827p709l152K847P212K581q289p381N919Q684o82o479m805J600P764L180
$$ 4827 -2882 -6034 -3187 4025 6606 -1683 -9064 -3145 5539 4857 -1622 -6427 -4827 2937 6117
4005F117o996n622L500M611N61j201l027k159L351L139j447k184m9r98K222M023
$$ 6117 -879 -6501 -3001 1610 2171 970 -2057 -4216 -865 2274 827 -1357 -1406 -2404 -182 3841
4021C841k313n092L68L412J593J70k412l046L374M403k525l847O81J750J35P39
$$ 3841 1528 -3564 -3196 216 1809 1979 -433 -3479 -105 4298 1773 -2074 -1393 357 492 1231
4037A231l78j197J214j14k052J783L338k482l490J687K271N67j350l300r92O225
$$ 1231 853 -344 870 756 -1296 487 3825 1343 -2147 -460 1811 2378 1028 -2272 -3264 2961
4053B961L176n193n167J821L946J875j003m223k024M209K926k420k209n16j36
$$ 2961 6137 944 -4223 -2402 1544 3419 2416 -1807 -3831 378 3304 884 -1325 -1841 -1977
4068a977L278L444l321o415Q42M760L708l24o301n201N866Q241k096q807k110
$$ -1977 1301 4745 1424 -4991 -4149 611 4319 3995 -2306 -7507 -1641 6600 4504 -4303 -6413
4083f413M973P216R04q685o537O059Q962j134o828m262J544O503M519n197o866
$$ -6413 -1440 5776 6680 -2005 -8542 -2483 6479 5345 -1483 -5745 -4201 2302 6821 1624 -5242
4098e242J671M674L146p99n206m153M325P967j047p447m660K642P682M967o610
$$ -5242 -3571 1103 4249 3450 -1756 -5909 -1584 6383 5336 -2111 -6771 -4129 3553 8520 1910
4113A910r665J945R715K427n915n724N8P811M694n980q590J824P061K951j450
$$ 1910 -7755 -5810 3905 6332 417 -5307 -5249 2562 7256 1276 -7314 -5490 1571 4522 3072
4128C072m930l500L054N237p11l249j053K0K146L184j961n940L91N505K706j525
$$ 3072 -1858 -5358 -2304 2933 2222 -1027 -2080 -2060 86 3270 1309 -4631 -4240 1265 3971 2446
4144B446m068l469L325O576r71o420o30L433J829l21j995j804K293L090k286k631
$$ 2446 -1622 -5091 -1766 4810 3839 -2581 -3211 222 2051 1730 -265 -2069 224 3314 1028 -1603
4160a603J605O09r66J243R65j009j015o32j235K812L733k882m492J049K812r0
$$ -1603 2 611 -355 888 1853 844 -171 -803 -2038 774 4507 1625 -2867 -1818 994 904
4176I04j69r33r32K474J477l295k261J584RJ384K834r13m746j896L063K949K047
$$ 904 735 -198 -1130 1344 2821 -474 -2735 -1151 -1142 242 3076 2163 -2583 -4479 -1416 1533 3580
4193C580k603n679J490O638K60n996k837L429N819J908o290p483L442Q971J193
$$ 3580 977 -4702 -3212 3426 3686 -2310 -5147 -1718 4101 6009 -281 -7764 -4322 4649 5842
4208E842n181m175k08M244M565k641n531L12M295J972o32l565l931K417P471J674
$$ 5842 661 -3514 -3722 522 5087 2446 -3085 -2773 1522 3494 2862 -703 -4634 -2217 5254 6928
4224F928o663n124K29O181O178l220r615j096Q532M170m672n982q15O333O787
$$ 6928 265 -4859 -4630 1551 7729 4509 -5106 -6202 2330 6500 1828 -4154 -4969 1364 8151
4239H151m167r926j161P317M903o34m536m614J464N615Q52m170j760J010K112
$$ 8151 3984 -5942 -7103 214 5117 4483 -53 -4667 -3203 2412 3264 -906 -2666 -1656 456
4254D56L723j254p049j844O212M998j122m953m498J875P353J096o641k609M332
$$ 456 4179 2925 -4124 -5968 244 5242 4120 -833 -5331 -3456 3897 4993 -1648 -4257 75
4269G5L470j056l302l581K473O162k90n167j440J728O01J311J335k596r41M84
$$ 75 3545 2489 -813 -4394 -1921 4241 3951 -1216 -2656 -928 -327 984 2319 -277 -1218 -734
4285g34o49K34K289j413j927J779J476k447j768N24J489K174P39l735k681K045
$$ -734 -1383 -1149 1140 -273 -2200 -421 1055 -1392 -3160 -2636 -1147 1027 1766 -1969 -4650 -2605
4301b605J771o65J848R37k987j630P38N16J854J494k861j302M132J042m544j617
$$ -2605 -834 -1499 349 1286 -1701 -3331 -2593 -2077 -223 1271 -1590 -2892 1240 2282 -2262 -3879
4317c879K411M339K439l208o784Q4O977K965k798k817o10K104K981o32m878k3
$$ -3879 -1468 2871 5310 2102 -4682 -4598 2379 5344 2546 -271 -881 1223 4204 3572 -1306 -1329
4333a329M151K045n17k218m604p1O695L551m538n427p92L521N516L4p980l103
$$ -1329 2822 4867 4350 2132 -2472 -2543 4152 7703 3165 -2262 -3054 467 5983 6017 -1963 -5066
4349e066O785N046l418o409k694M432P813m81r308l498N307M812P33l413m809
$$ -5066 1719 6765 3347 -3062 -5756 -1324 6489 6008 -3300 -6798 -1491 3321 4054 641 -4168
4364d168K76N509J881m319l050J005K655M277l74p050l775N426O022J98m100m982
$$ -4168 -3892 1617 3498 -821 -3871 -2866 -211 4066 3692 -3358 -7133 -1707 4315 4513 413 -4569
4380d569M52O349L104o146m314L953M850N12l565n577O78P253K870m986l915M23
$$ -4569 -4117 2232 5336 -810 -5124 -1171 3679 4191 626 -4951 -4273 2980 5850 864 -3051 -2628
4396b628J837J893P59l184j147J992J356j744J1r65j626L141K711k851l836J45
$$ -2628 -791 1102 1861 -1323 -2470 -478 878 -866 -855 -1820 -3446 -305 2406 -445 -4281 -4136
4412d136K520J971J148l385l098K544K675j484j227J280L86K17j92j867j81L038
$$ -4136 -1616 355 1503 -1882 -4980 -2436 239 -1245 -2472 -1192 -806 -589 -781 -2648 -2829 209
4428B09K13j769J428J528k226j484J196K193K421l90m311j905M419K635k051k021
$$ 209 422 -1347 81 1609 -617 -2101 -905 1288 3709 3319 -992 -2897 1522 4157 2106 85
4444H5P65R44K240m21l727j088M061J477l86j330k353j921L351L387j909l038
$$ 85 850 1794 4034 3613 -114 -1202 2859 4336 3950 2620 267 -1654 1697 5084 3175 137
4460A37j389J054L707J220n003m397M233N673j021n446l686J838O686K638o593
$$ 137 -1252 -198 3509 4729 -274 -4671 -438 5235 4214 -1232 -4918 -3080 3606 6244 -349
4475c49o022L290N149O42k742l621j007N264L250l772m426P12K523L363J702n381
$$ -349 -6371 -3081 2068 2710 -32 -3653 -4660 604 3854 82 -4344 -3632 -1109 2254 3956 -1425
4491a425m911K574O024J725l384m492p89N757M772n204o409J617O618K474k854
$$ -1425 -6336 -3762 2262 3987 603 -3889 -4678 1079 5851 647 -5762 -4145 2473 4947 2093
4506B093n817k222O167N590l610n351K42K367K470M80l640k323K841K931n17j838
$$ 2093 -3724 -5946 221 5811 2201 -3150 -2908 -541 1929 2409 -1231 -3554 -713 2218 1701 -137
4522a37j651j599K573M048j333m641n13K286K457J168l237l887L060M315j216
$$ -137 -1788 -3387 -814 3234 1901 -2740 -3253 -967 1490 2658 -579 -4466 -1406 2909 1693
4537A693l821n85J967K263R64k597k271K358K043j806m70J345o13n54Q56J29M43
$$ 1693 -2128 -2713 -746 1517 2481 -116 -2387 -29 2014 208 -262 1083 470 -84 772 901 1344
4554A344L97j390j932K924J960k776j610J372J000N96k10k306r88K847P12j657
$$ 1344 1741 351 -1581 1343 3303 527 -1083 289 1289 1885 1675 -631 -1619 1228 1940 283
4570B83l65P8j116M91K550m27k219j087j5K199K592k665m764J451N229P83l682
$$ 283 -82 -4 -1120 -629 1921 1494 -725 -1812 -1827 372 2964 299 -4465 -3014 2215 2998 -684
4587f84l229K83M687L669m404n707K315M998J231j991l386j834L930L570j807
$$ -684 -3913 -3630 1057 4726 322 -5385 -3070 1928 3159 1168 -2218 -4052 -122 3448 1641
4602A641l926j50J710K285K147k681n109J191N194K098k769m220j857M292O327
$$ 1641 -2285 -2435 -725 1560 3707 1026 -4083 -2892 2302 4400 1631 -2589 -4446 -154 6173
4617F173k349p833j030N597L598j169n394l187M378O802k344o083j436L377L153
$$ 6173 3824 -4009 -5039 558 4156 2987 -2407 -5594 -1216 5586 3242 -2841 -4277 -900 2253
4632B253J058l270m263J679M397M99j927k152j225J592M440m58m786j584K976
$$ 2253 3311 41 -4222 -2543 1854 2353 426 -1726 -2951 -1359 3081 2623 -2163 -3747 -771
4647g71K995Q58k940m531J982O290L53n188k100J672L328J681k904m089J926M208
$$ -771 2224 3082 142 -4389 -2407 3883 4236 -952 -3052 -1380 1948 3629 725 -3364 -1438 2770
4663B770l34k872N0K55K75J737m78j811L81N47q53R96J428k239j986K088J445
$$ 2770 2436 -436 -386 -131 144 1881 1403 -408 -27 520 -333 663 2091 -148 -2134 -46 1399
4680A399n12p52q85p60K874R62l192n70J554M59j071J018k04j068N82o42j10K278
$$ 1399 887 135 -750 -1510 1364 2326 -866 -1436 118 577 -494 524 320 -748 -166 -808 -918 1360
4698A360K27l620k33L362Q97j940k125k55K483L494j792n141m2M888J377j599
$$ 1360 1587 -2033 -2266 1096 1993 53 -2072 -2327 156 3650 1858 -3283 -3325 1563 2940 1341
4714A341k488j635K133L173q93l249m25J762P69J424j213l508n46M328K245j568
$$ 1341 -1147 -2782 -649 2524 1631 -1618 -2043 -281 488 1912 699 -2809 -3355 973 3218 1650
4730A650l279k625J950O066J85o008k935L677M395k82l889l938K372O711J59o306
$$ 1650 -1629 -4254 -2304 3762 3947 -2061 -4996 -1319 3076 2794 -1095 -5033 -2661 4050 4209 -2097
4746b097k697K940L999J595k162m914j56M737J363j780j629j565J296L990P42
$$ -2097 -4794 -1854 2145 3740 1578 -3336 -3492 1245 2608 828 -801 -2366 -1070 2920 3662
4761C662m697k881K627L399K112k638n199pO245K528m275l752Q83L054L470j838
$$ 3662 -1035 -3916 -1289 2110 4222 1584 -3615 -3622 2623 5151 876 -2876 -1993 1061 4531 2693
4777B693n480j32M569K009k822k244j44J022K356N77k915j130J356O13L07P49
$$ 2693 -2787 -2919 1650 3659 837 -1407 -1551 -529 1827 2404 -511 -1641 -285 328 635 1384
4793A384k050k047K836K177j532j509j127J03L021J108l039k220K838J463q94
$$ 1384 -666 -2713 123 2300 768 -741 -1868 -1765 1256 2364 -675 -2895 -57 1406 512
4808E12p99n15l42J881m29j572R72J646j373j199K138K44j203j188q8J151K782
$$ 512 -287 -802 -1144 737 308 -1264 -292 1354 -19 -1218 920 1164 -39 -1227 -1315 -164 2618
4825B618n25l792p89L531R78j481j051o40R59K368j50l245q3J543R7R12lk381
$$ 2618 2093 -1699 -2488 1043 2021 540 -511 -1151 -192 2176 2026 -1219 -1302 241 338 1250 1247 -1134
4843a134j434K756K185j047j875k086K11M471J645m268l983K557M121N83k687
$$ -1134 -2568 188 2373 1326 -549 -2635 -2424 2047 3692 -576 -4559 -2002 2119 2702 15
4858A5m184O89N851J914m858l420J403L494J900j672l850j226L872L072j442k478
$$ 15 -4169 -3480 2371 4285 -573 -3993 -2590 904 2804 1132 -2718 -3944 -72 3000 1558 -920
4874i20j472K75L475K426l655l581J551L593J943j517m604j930N571M300l271
$$ -920 -2392 -2117 1358 3784 129 -3452 -1901 1692 3635 2118 -2486 -4416 1155 5455 2184
4889B184n183k67L647L646o49n799j681M415L655k105l184m35Q42L031R06l429
$$ 2184 -2999 -3266 381 4027 3378 -2421 -4102 313 3968 1863 -1321 -1756 -914 2117 3023 -406
4905d06k338J898J539P80P0k606j916K419L203q06k745j207N06K501J761l464
$$ -406 -2744 -846 693 1473 1543 -1063 -2979 -560 2643 1837 -908 -2115 -1609 892 2653 -811
4921h11k936K344L132Nk343j346k51K594J137k101j300J689Q08j132M65p1n85
$$ -811 -3747 -1403 1729 1734 -609 -1955 -2206 388 1525 -576 -1876 -187 621 -511 -46 -117 -702
4938g02o5Q77m92J186J67j992o13K818M97j647j052L6Q75J335n3j875j46J982
$$ -702 -767 110 -382 804 971 -1021 -1634 1184 1681 34 -1018 -982 -107 1228 1175 -700 -846 1136
4956A136k49q67J103p17j334R39J428n44r25q56o03K560K699k862l506N52L547
$$ 1136 887 20 1123 406 -928 11 1439 895 -30 -886 -1489 1071 3770 908 -2598 -2046 1501
4973A501J394j535l153o79L541L007l705l623J337K737K084q69l555k007K923
$$ 1501 2895 1360 -1793 -2472 1069 4076 371 -3252 -1915 822 2906 2037 -1518 -3525 -602
4988f02L074o17k380j201n82K424K713k149l266K06L186K173q61l758l080M058
$$ -602 2472 1855 -525 -1726 -2308 116 2829 680 -2586 -2380 806 2979 2118 -1640 -4720 -662
5004f62N329j845n507j329L025M094L31m280l466L590M309j113l552j537R10L072
$$ -662 4667 2822 -2685 -4014 -989 3105 3436 -844 -4310 -720 3589 2476 -1076 -2613 -1703 1369
5020A369J902k709l204O84K347J683j39k103l345K127L896l29l400j558R90K757
$$ 1369 3271 562 -2642 -1958 389 2072 1933 -170 -3515 -1388 2508 2179 -1221 -2779 -1789 968
5036I68K009l168m586J661M785P57k255k636k32K186K725k325k917J382K413m55
$$ 968 2977 -191 -4777 -3116 1669 2426 171 -2465 -2697 -511 2214 -111 -3028 -1646 767 312
5052C12p12p62o33Q83J696k07r38j22j028M6K443J132k163q32P13Q98J33j6j465
$$ 312 -400 -1162 -1795 -912 784 577 -361 -483 -1511 -1465 978 2110 -53 -885 -172 726 859 843 -622
5071f22O11K524j94k435J14R02jN92J63q38mL4n39L92K377o90k661l89K058P77
$$ -622 -11 2513 2319 -116 -2 900 899 1491 1654 816 812 846 307 699 3076 2386 -275 -664 1394 2171
5091B171p78j213j557K424K426k537l280M98K618J496o9k751k106J516K363n06
$$ 2171 1393 180 -1377 1047 3473 936 -2344 -1846 772 2268 2199 -552 -2658 -1142 1221 715
5107G15j450j86n45J113K096j506l133l86K928K208l53k680l417J779M967P59
$$ 715 -735 -921 -1466 -353 1743 237 -2896 -3282 -354 1854 1501 -1179 -4596 -2817 2150 2909
5123B909m717k288J949L311J410l335l616K073M912K00l790l179J117L531K803
$$ 2909 -1808 -4096 -2147 1164 2574 -761 -4377 -2304 2608 2808 -982 -4161 -3044 487 3290
5138C290k011l509p10K541J713J60j466k534J076L569M94l422j966Q57L208K982
$$ 3290 1279 -2230 -2940 -399 1314 1474 8 -2526 -1450 2119 2613 -809 -2775 -1918 1290 4272
5154D272k485n005l68N129K190k330l157n87K399L165j513l989K74L296J292j328
$$ 4272 1787 -3218 -3586 1543 3733 1403 -1754 -2341 58 3223 1710 -2279 -2005 1291 2583 1255
5170A255j817j231R40K904K96j802r71n97M06K382M84k412j111J832R61J4j697
$$ 1255 -562 -1793 -853 2051 2347 545 -426 -1023 -617 1765 2249 -163 -1274 558 1519 1533 -164
5187a64j727R99L255L61l168j416J131J580j9K27j213o23J518m71j422J021J345
$$ -164 -1891 -892 2363 2724 -444 -1860 -729 851 832 1059 -154 -777 741 270 -1152 -131 1214
5204A214j379k94J102j61p96k18k63M61K111j003l034M12K257J001n96j185j532
$$ 1214 -165 -459 643 482 -314 -532 -795 -334 1777 774 -2260 -1848 409 1410 814 -371 -1903
5221a903P21K215n89j509L26P54P4O11j70k381o02K436J314J61j277l040K30L721
$$ -1903 -1182 1033 444 -1065 -739 15 89 700 530 -1851 -2453 -17 1297 1458 181 -2859 -2629 1092
5239A092J445l069k402J258K939J321k495l665P43M793J457l082l156K01K736
$$ 1092 2537 -532 -2934 -1676 1263 2584 89 -3576 -2833 1960 3417 335 -2821 -2620 116
5254A16K787r22l385p63K412J462k13j365j674M57L321J117k775k971L60L054
$$ 116 2903 1981 -1404 -2167 245 1707 1494 129 -1545 -1088 2233 3350 575 -2396 -2036 1018
5270A018K915q47m824j958M306L121j342l807j135K434L611q35m476j491L635
$$ 1018 3933 3086 -1738 -3696 610 3731 2389 -1418 -2553 -119 3492 2657 -1819 -3310 325
5285C25K836j024k362j941K97L412R32j950j499O2O14J432n9k108j528K087K305
$$ 325 3161 2137 -225 -2166 -1869 1543 2475 525 -974 -912 -298 1134 1075 -1033 -2561 -474 1831
5302A831p01j724j875K39L254J727k724k898J429K105O43r89k287J13K618P71
$$ 1831 1130 -594 -2469 -2230 1024 2751 27 -2871 -1442 663 1306 317 -1970 -1857 761 1532
5318A532k177j134J672J51K02L90n92j238N79P3K70J222j98j763l23K159r6q01
$$ 1532 -645 -1779 -107 44 246 636 44 -1194 -615 -542 -272 950 752 -1011 -1334 825 729 -72
5336g2n50P7R20J439j203j886L96J424l09qJ9j232P5J105M79j46k22j101q23J857
$$ -72 -622 -545 375 1814 611 -1275 -879 545 236 228 247 -985 -910 195 674 528 306 -795 -1618 239
5356B39K006k402k111J126K076R41q51l527l63L770J938k356k425M01J291J922
$$ 239 2245 -157 -2268 -1142 934 1875 1024 -2503 -2866 904 2842 486 -1939 -1538 -247 1675
5372A675Ok996q75K315J475n57q88j337n69K793J829k046k307p3J755K217J77
$$ 1675 1681 -1315 -2190 125 1600 1043 155 -1182 -1751 1042 2871 825 -1482 -1555 200 2417 2594
5389B594l701j876K817L771q69l568j790J625L875N75m256k591L177K932M4k222
$$ 2594 -1107 -2983 -166 3605 2736 -832 -2622 -997 2878 3453 -803 -3394 -217 2715 2759 537
5405E37k393J42K798J588j932k379M07J082J708P03k502k251J519K608K75k032
$$ 537 -1856 -1714 1084 2672 740 -1639 -1232 -150 1558 2261 -241 -2492 -973 1635 1910 -122
5421a22k401J82L242K235k519l572M39L253J016j405k417m67K829J780k051j982
$$ -122 -2523 -2341 901 3136 617 -2955 -2516 737 1753 348 -2069 -2536 293 2073 22 -1960
5437a960Q07J153M46N27j447r16R75Q84L9k04j21j454P23K061l56j589o60P23
$$ -1960 -1153 0 446 973 -474 -1390 -415 469 508 304 183 -1271 -548 1513 1157 -432 -1092 -369
5455c69J018P83j262j706O10K301o05j400K56k04N39O47m33n52L57k67m46K97
$$ -369 649 1432 170 -1536 -926 1375 770 -630 -374 -578 -39 608 175 -377 -20 -287 -733 -436
5473d36J614j161j537O32J067O10m1j869r65K467J861j988k002L5J589J683m79
$$ -436 1178 17 -1520 -888 179 789 748 -1121 -2086 381 2242 254 -1748 -1713 -124 1559 1080
5490A080k042j058J894J791o10j231n25m90J515J733j135j593m24J228J263R21
$$ 1080 -962 -2020 -126 1665 1055 -176 -701 -1191 324 2057 922 -671 -1095 133 1396 2317
5506B317k150k749J848L832O1l369j771P32K922J670k811l244J569L222L70k332
$$ 2317 167 -2582 -734 3098 3159 -210 -1981 -1249 1673 3343 532 -2712 -1143 2079 2449 117
5522A17j914l9K633K083j987k627k1J739J419K06j661k587J368K626N60j993j888
$$ 117 -1797 -1836 797 2880 893 -1734 -1755 -16 1403 1609 -52 -2639 -1271 1355 1915 -78 -1966
5539a966p04K737K259j231m129j1L617J821j170k774j066K014L062j131l212J34
$$ -1966 -2670 67 2326 1095 -3034 -3045 572 2393 1223 -1551 -2617 -603 2459 1328 -1884 -1750
5555a750J683J356K21j672j816R42K283J71j274p70n50O62J956K60k019j059R26
$$ -1750 -67 1289 1510 -162 -1978 -1036 1247 1418 144 -626 -1176 -514 1442 1702 -317 -1376 -450
5572d50J078M42o76k386J115K893k88k216p37N10J199Q15o87j709M38J366m97
$$ -450 628 1070 394 -1992 -877 2016 1728 -488 -1225 -715 484 1299 612 -1097 -659 707 210
5589B10q18Q39k48p49O83J24K86o0p57n06J294J191j111k289Q65J360O68p4j403
$$ 210 -608 231 -17 -766 -83 41 327 267 -490 -996 298 1489 378 -1911 -1046 314 982 908 -495
5608d95q61J389J278r61p71L04j33L48N12k1j360L3P25O37R35j240k063L76K731
$$ -495 -1356 33 1311 350 -421 -117 -250 98 610 589 -771 -738 -13 624 1559 319 -1744 -1368 1363
5627A363Q98k345j660N11K005J767j774l253N92L421R65k053j930m17J947K101
$$ 1363 2261 -84 -1744 -1233 772 2539 765 -2488 -1896 1525 2490 437 -1493 -1910 37 2138
5643B138o81l017k38J824P53P58j153j907P0K414J363j732k358n24K199K740r15
$$ 2138 1457 -1560 -1798 26 779 1537 384 -1523 -1453 961 2324 592 -1766 -2290 -91 2649 1734
5660A734l511j406L265K699j034k781j835K083L262l56l709q26K002J769M23j731
$$ 1734 -1777 -3183 82 2781 1747 -1034 -2869 -786 2476 2120 -1589 -2415 -413 1356 1779 48
5676D8k037Q26K162P51j482p15q53N70J942K53j987j438J448J797J56j157k274
$$ 48 -1989 -1163 999 1750 268 -447 -1300 -730 1212 1465 -522 -1960 -512 1285 1441 284 -1990
5693a990J52L013J016k791j335N29K047Q42n90k641L37J846N50j245j02O0p8P42
$$ -1990 -1838 1175 2191 -600 -1935 -1406 641 1483 893 -1748 -1411 435 985 -260 -362 -302 -380 362
5711C62M15j193k65O20J2N42N92r81j604J283J564k30j007o56m65J817J107j664
$$ 362 777 -416 -681 -61 -49 493 1085 104 -1500 -217 1347 1117 110 -546 -1011 806 1913 249
5729B49r78Q12O13k14l5J7p30K22P17q33P75j9j465J36J724O40j381j605J57J198
$$ 249 -729 83 696 482 447 464 -266 -44 673 -160 615 596 -869 -733 991 1631 250 -1355 -1198 0
5749@J537p52k683o4K469P99j595j067l66R43K395n37k765l82J553Q52J60l14
$$ 0 1537 785 -1898 -1962 507 1306 -289 -1356 -1722 -779 1616 1079 -1686 -2068 -515 337 497 183
5767A83j753k67K081J133j215j160o33P17K560K30l110j613K375K617j45k536
$$ 183 -1570 -1837 244 1377 162 -998 -1631 -914 1646 1876 -1234 -2847 -472 2145 2000 -536
5783e36j671J326L120N76l284j668J582K083K61j331k032N7K699J161j663j434
$$ -536 -2207 -881 2239 2815 -469 -2137 -555 1528 1789 458 -1574 -1517 1182 2343 680 -754
5799g54K5K67K045L97k177j703J036J943N84j101k348j30K893J528k271k454P11
$$ -754 -729 -462 1583 1980 -197 -1900 -864 1079 1663 562 -1786 -1916 977 2505 234 -2220 -1509
5816a509J666J934j177k659j023K889J327j395j161k33Q24J304Pj242r47R33O25
$$ -1509 157 2091 914 -1745 -2768 121 1448 53 -1108 -1341 -517 787 794 -448 -1395 -462 163
5833A63K46j46o47p19Q69J898l39j248j047N14J446Q47j252k134J696R60o4r12
$$ 163 409 263 -384 -1103 -234 1664 1325 77 -970 -456 990 1837 585 -1549 147 1107 1043 131
5851A31n69L0J097M33j341m26O80j90m19P91O88r26p99K7O59Q98l6j731p82K005
$$ 131 -438 -408 689 1122 -219 -645 35 -155 -574 217 905 -21 -820 -793 -134 764 728 -1003 -1785 220
5871B20O96j437p58N6P30J174j75j934l25J417N52q4k20n52o88J282R35o51p33
$$ 220 916 -521 -1279 -1223 -493 681 506 -1428 -1753 -336 216 132 -88 -640 -1328 -46 889 238 -495
5890d95Lj45J480Q15j863j519J474K553k58j588j409j01K685J104k390k220J592
$$ -495 -492 -637 843 1658 -205 -1724 -250 2303 2045 457 -952 -1053 1632 2736 346 -1874 -282
5907b82K117K13j165j599m22K031J613j544j620m88P28J454R83j574k472R14J654
$$ -282 1835 2048 883 -716 -1138 893 2506 962 -658 -1146 -418 1036 2019 445 -2027 -1113 541
5924E41O71q22j652r26K549J830j868k607k25K139J822m45k901j149K200K471
$$ 541 1212 390 -1262 -2188 361 2191 323 -2284 -2509 -370 1452 1007 -1894 -3043 -843 1628
5940A628j111j935l26R49J275J83j324j293J356J636o1o47p60j347J141K240k1
$$ 1628 517 -1418 -1744 -795 480 663 -661 -1954 -598 1038 977 330 -430 -1777 -636 1604 1583
5957A583j600p28O02P69J155j414j838N86K832l51j424q41m6J465J079j247j787
$$ 1583 -17 -745 -143 626 1781 367 -1471 -885 1947 1596 172 -669 -715 750 1829 582 -1205
5974a205R21J264j081J29L51o81k32O77j23j20J17n09l03J208P10j523j272R18
$$ -1205 -284 980 -101 28 379 -302 -534 143 20 -100 17 -492 -795 413 1123 -400 -1672 -754
5992g54P15O45J25j653m97J560L68p31M9L87n14J97O68m59o55L28j2O53R76j460
$$ -754 -39 606 731 -922 -1419 141 509 -222 -173 214 -300 -103 565 106 -549 -221 -233 420 1396 -64
6012f4j237Q01J627O26j406j308k5J689J418j421k254Q91J835N28j081j724n27
$$ -64 -1301 -500 1127 1753 347 -961 -986 703 2121 700 -1554 -663 1172 1700 619 -1105 -1632
6029a632J985J639j239j793j50P92M69J224j142j789M28J446L49l65j319r19J648
$$ -1632 353 1992 753 -1040 -1190 -398 71 1295 153 -1636 -1208 238 587 222 -1097 -2016 -368
6046c68K170r59k834m86J784K150M2k401j776J548L251q85k010n80P20J574Q91
$$ -368 1802 843 -1991 -2477 -693 1457 1499 -902 -2678 -1130 2121 1236 -774 -1354 -634 940 1831
6063A831j696j961J098J688L71o88o46j166P51K093m08r30j210P95J162O56j138
$$ 1831 135 -1826 -728 960 1331 643 -3 -1169 -418 1675 1267 337 -873 -78 1084 1740 602
6080F02k206K66K933O69k050j384k33J596J602j072k264Q47J462j75o60o73k5
$$ 602 -1604 -1338 1595 2264 214 -1170 -1403 193 1795 723 -1541 -694 768 593 -67 -740 -765
6097g65K26J138o0j166l3K29k39Q80N03j148p10P76O54J18m9j281K03J123N18
$$ -765 -539 599 539 -627 -660 -431 -670 210 713 -435 -1145 -369 285 403 354 -927 -724 399 917
6116I17j323l29P67J85K5K28o95m89J269j46l82N55L0j272j64J303M99q10k43
$$ 917 -406 -735 32 217 242 470 -225 -714 555 409 27 582 612 -660 -824 479 978 168 -75
6135g5m49R02J065q43k135N68J962q3o28r19n83Q33J451k50j787j2R32Q6M32m96
$$ -75 -524 378 1443 600 -1535 -967 995 912 284 -635 -1218 -385 1066 816 -971 -983 -51 35 467 -29
6155b9q39o2J215L22l19j026p66P03K114Q6k391q01J450J238K83j091j873Q44
$$ -29 -868 -930 285 607 288 -738 -1504 -801 1313 1399 -992 -1793 -343 895 1178 87 -1786 -942
6173i42K341L69k453r87J077J424P46j187k079P65J674N79r28o12r48M45J727
$$ -942 1399 1768 -685 -1672 -595 829 1575 388 -1691 -926 748 1327 399 -213 -1161 -716 1011
6190A011L13j555j050N84J421P60r27j671k49K142J424k184j309J72J154J670
$$ 1011 1324 -231 -1281 -697 724 1484 557 -1114 -1363 779 2203 19 -1290 -1118 36 1706
6206A706p25k288j90K069O95p25j161o07R60J273j76j261l16P47J47J78N69j340
$$ 1706 981 -1307 -1497 572 1267 542 -619 -1226 -266 1007 831 -430 -746 1 148 326 895 -445
6224d45r71J198J222n40p11p15M23J681J0j442q22N84J412j65m87j083J47J061
$$ -445 -1416 -218 1004 464 -247 -962 -539 1142 1152 -290 -1112 -528 884 719 232 -851 -704 357
6242C57K66j157j65R85l79k55K76J22j90L6N3j0P76l44j191j09J387L45n45p01
$$ 357 623 -534 -699 286 -93 -348 -72 50 -140 -104 -51 -61 715 371 -820 -929 458 803 258 -443
6262d43n19Q27Q48j56j377L75P57J61n06L22j034P5R65M00n40k77p55N09J414
$$ -443 -962 -135 713 557 -820 -445 312 473 -33 289 -745 -670 295 695 155 -122 -877 -368 1046
6281A046M42k068r35J193J379M6j000j665M32K305N48j906j188J086J103N94j046
$$ 1046 1488 -580 -1515 -322 1057 1103 103 -1562 -1130 1175 1723 -183 -1371 -285 818 1412 366
6298C66j372j39J940N40o40j128k11L45J229N53j498j344O54J112P02k39j427
$$ 366 -1006 -1145 795 1335 695 -433 -644 -299 930 1483 -15 -1359 -705 407 1109 870 -557
6315e57j318K043J728j555j800l33J626J602m75k464o65K107J706q40j786k28
$$ -557 -1875 168 1896 341 -1459 -1792 -166 1436 961 -1503 -2168 -61 1645 805 -981 -1209
6331a209O09J155K43j362p57Q31M93K22K77q76q23J001J342p69n82r09M97J204
$$ -1209 -600 555 798 -564 -1321 -490 3 225 502 -374 -1197 -196 1146 377 -205 -1114 -617 587
6349E87O87j365j243Q21J620j80p08j138L81J592O17j322j118R64L86j5m0k75
$$ 587 1274 -91 -1334 -513 1107 927 219 -919 -538 1054 1671 349 -769 195 581 566 526 251
6367B51m45P28n9l24L38j62n60o8J051J51j097j21O0N50M34p20j061N27J114l45
$$ 251 -194 534 475 151 489 327 -233 -301 750 901 -196 -317 -257 293 727 7 -1054 -527 587 242
6387B42p62L30j87j48P79j69l71J68K14o21O20L06q26j042P70J200K88o65j017
$$ 242 -520 -190 -377 -525 254 85 -286 -118 96 -525 95 401 -425 -1467 -697 503 791 126 -891
6406h91n4J102J402j728j207Q29J241L04n62j552L2J787L78p07p93j33K77J194
$$ -891 -945 157 1559 -169 -1376 -547 694 998 436 -1116 -1084 703 1081 374 -419 -552 -275 919
6424I19J77j076q52J19J273K36n58n95j048J632J654o72k184l67P58J835J37k178
$$ 919 1096 20 -832 -713 560 796 238 -357 -1405 227 1881 1209 -975 -1342 -584 1251 1388 -790
6442g90r51J054K111l13k027k92Q09J343K21j449r93P61J034j59n0m61r77Q42
$$ -790 -1741 -687 1424 1111 -916 -1208 -399 944 1165 -284 -1277 -516 518 359 309 -152 -1129 -287
6460b87J495l5j689m46K27J209J389j531j899Q25J990K3j093j186m7J449J295
$$ -287 1208 1173 -516 -962 -735 474 1863 332 -1567 -742 1248 1271 178 -1008 -1055 394 1689
6477A689j295j333O86J058j40k81n85l70O07O97m49o71L73l29J62P63n2o97n92
$$ 1689 394 -939 -253 805 665 384 -201 -571 36 733 284 -387 -14 -343 -181 582 530 -167 -759
6496g59L69O10M2o05o12J03J655n25q68l44M22R02l30l08p27M12Q27o74O7O53
$$ -759 -390 220 262 -343 -955 -852 803 278 -590 -934 -512 390 60 -248 -975 -563 264 -410 -343 310
6516C10o29m22K7P69L34o04l95l40J204N68p43j377N77J229Pk54n72m48J248O59
$$ 310 -319 -741 -714 55 389 -215 -610 -950 254 822 79 -1298 -721 508 515 261 -311 -759 489 1148
6536A148p81o93K33K54M99P6m77o53N4Q25J72K28q35q02Q81J437l23j783n16P64
$$ 1148 367 -326 -93 161 660 736 259 -394 -340 485 657 885 50 -752 129 1566 1243 -540 -1056 -292
6556b92J299L46j254j671J244J820l57j462n22K45P86R61j207r77N71Q24L36l15
$$ -292 1007 1353 99 -1572 -328 1492 1135 -327 -849 -604 182 1143 -64 -1041 -470 354 690 375
6574C75o77l05K71J065J32j410k60J59Q78Q94q18j706N8K218L25p88j450k26J616
$$ 375 -302 -607 -336 729 861 -549 -809 -650 228 1122 304 -1402 -1344 874 1199 411 -1039 -1265 351
6593C51J038j063j366j3J764L98p46p96p81R00R43k19q85j16K10J69O09N7j231
$$ 351 1389 326 -1040 -1053 711 1109 363 -433 -1214 -314 629 410 -475 -591 -381 -212 397 454 -777
6612g77J02Q65J97j6n19r66J6J664K17j499k73N48N75L24o29n82J14J063M8q91
$$ -777 -675 190 387 371 -148 -1114 -1098 566 783 -716 -989 -441 134 458 -171 -753 -639 424 472 -419
6632d19R0M61l54K99j70nJ46J20m66K56O69k14r75L69Q71j77k01l40j82N66R57
$$ -419 -329 132 -222 77 -93 -98 48 168 -298 -42 627 413 -562 -193 678 501 300 -40 -222 344 1301
6653A301j391l31O27L23K4m7j27o15K04N38l53J52K98r75J79Q98K08q71q35P30
$$ 1301 -90 -421 206 529 553 506 379 -236 -32 506 153 305 603 -372 -193 705 913 42 -793 -63
6673f3N32P76j178j454O65J639J02j385m63J43P61R28q16j178J22J239j81K71
$$ -63 469 1245 67 -1387 -722 917 1019 -366 -829 -686 75 1003 187 -991 -869 370 189 460
6691D60n70n75L72J033r3o31q61J37M90R84k44j272j68J132R31r11r16k50Q41
$$ 460 -110 -685 -313 720 627 -4 -865 -728 -238 746 502 -770 -938 194 1125 214 -702 -952 -111
6710a11J252l20j812k68J160R17P7j361n23N84J233j76p84l94J64K97K10M69r93
$$ -111 1141 821 -991 -1259 -99 818 895 -466 -989 -405 828 652 -132 -526 -362 -65 145 614 -379
6729c79n12Q63N55n8l92j044q1J569P63j327o88N48J035j26o63q93K59J643J09
$$ -379 -891 -28 527 469 77 -967 -1048 521 1284 -43 -731 -183 852 726 63 -830 -571 1072 1181
6748A181j391k20K07L68K88K04o97m74P01nj48K91j93p48P21L93r2o33k37J86
$$ 1181 -210 -430 -223 145 433 637 -60 -534 167 162 14 305 112 -636 85 478 386 -247 -484 -298
6768b98N86L91r80n82N01Q65n55m4r6j37L21K94o94K40M42o24J06L61L75m09p69
$$ -298 288 679 -301 -883 -382 483 -72 -116 -212 -349 -28 266 -428 -188 254 -370 -264 97 472 63 -706
6789g06L39N60K40k56r52l26J627M96j273l22N64J62K57j71j025N02J084J51q08
$$ -706 -367 193 433 177 -775 -1101 526 1022 -251 -573 -9 153 410 239 -786 -284 800 951 143
6808A43k33J89l94R02J76m55q82J43M26M76L46j257m74J098J087o79j362j84N06
$$ 143 -90 99 -295 607 783 328 -554 -411 15 491 837 -420 -894 204 1291 612 -750 -934 -428
6827d28J374J90j741o68J304J071n57q00n18L56J130K30j431k10L82N35M13k90
$$ -428 946 1136 -605 -1273 31 1102 545 -255 -773 -417 713 943 -488 -698 -316 219 632 342
6845C42r34o51R39J023l20m24p33J61J146N51j120q08M11J232j99m25j152P5J231
$$ 342 -592 -1243 -304 719 399 -25 -758 -597 549 1100 -20 -828 -417 815 616 191 -961 -886 345
6864C45P90j199q64M90L57K94J7m96j15N14J91n46N5Qj81J73O75q13k30LJ49M27
$$ 345 1135 -64 -928 -438 -81 213 230 -266 -381 133 324 -222 -167 -159 -340 -167 508 -305 -535 -532 -383 44
6886D4M95o93p63Q90O72m30r59K54K69N02k9l02k47O04K86o46K48j29J27j95L00
$$ 44 539 -154 -917 -27 645 215 -744 -490 -221 281 252 -50 -297 307 593 -53 195 66 193 -2 298
6907B98q8K78J85r41p2N19P99o64o65L07M61K06l48n06o35J623J63j085j51J95
$$ 298 210 488 673 -268 -340 179 978 314 -351 -44 417 623 275 -231 -866 757 920 -165 -316 -121
6927a21k5P8Q09m72q18L06j40L05K43m16p81Q95P56k31j075l17N58O81R31j164
$$ -121 -146 -68 741 269 -549 -243 -383 -78 165 -251 -1032 -137 619 388 -687 -1004 -446 235 1166 2
6947Bj248N55J250k8j122l89M49J221J08r70o20O30K63L21J74p31q02O41P83j40
$$ 2 -1246 -691 559 531 -591 -980 -531 690 798 -172 -792 -162 101 422 596 -135 -937 -296 487 347
6967C47k14p60K4M73J376p96j230K28J162N80r36j112k97J353R73p58j563O40
$$ 347 133 -627 -603 -130 1246 450 -780 -552 610 1190 254 -858 -1155 198 1171 413 -1150 -510
6985e10P76N37n95n28n70P10O19m86j92ol84O97N24k93p45l42Q57J99L71o19p33
$$ -510 266 803 208 -320 -890 -180 439 -47 -239 -245 -629 68 592 299 -446 -788 69 268 639 20 -713
7006g13L52J017Q3q48m67P83K17K92o92n82M60J043n22n33N18m07K54J39k99k9
$$ -713 -361 656 739 -109 -576 207 424 716 24 -558 -98 945 423 -110 408 1 255 394 95 66
7026F6K25k33l92M88M88m63q28P79L19m48j02n68K57N63K60o63l84O13j38q0M24
$$ 66 291 58 -334 154 642 179 -649 130 449 1 -101 -669 -412 151 411 -252 -636 -23 -161 -241 183
7047A83l15l00O25k66j35J84P2n81M8Q95J60o64n75K56P49P13j083p73K88J009
$$ 183 -132 -432 193 -73 -208 -24 48 -533 -485 410 570 -94 -669 -413 336 1049 -34 -807 -519 490
7067D90J59p71n47K91R83J76o76p17M06P28j65j19J33p53K33P39k41k50m80k28
$$ 490 649 -122 -669 -378 605 781 105 -612 -206 522 357 238 371 -382 -149 590 349 99 -381 -609
7087f09N21J207o87j122j06J001P86p55q66l06Q59R69k68j478j02J138L67j32
$$ -609 -88 1119 432 -690 -796 205 991 236 -630 -936 -77 892 624 -854 -956 182 549 417
7105D17m03j119Q80P20L2o48k42pK59L65L10j068j28Q18J55J62m50m20j5J268
$$ 417 14 -1105 -225 495 527 -121 -363 -370 -111 254 564 -504 -632 186 341 503 53 -367 -382 886
7125H86L34j200n38K91Q92Mo61n81N17Q52J1j105L7N63n7Q2j90n16K59M43m51
$$ 886 1220 20 -518 -227 665 669 8 -573 -56 796 807 -298 -261 302 245 327 137 -379 -120 323 -128
7146a28J50L04o90r0K86M10l58j05l50l2O33K34m50n84P34J88j55l42J20r2N04
$$ -128 22 326 -364 -454 -168 242 -116 -221 -571 -603 30 264 -186 -770 -36 152 -3 -345 -225 -317 187
7167A87j90j50K37P4k28k29M89K40k48o63L39J19Q35o62o37L54N26m9k20n75L41
$$ 187 -3 -153 84 158 -70 -299 190 430 182 -481 -142 -23 812 150 -487 -133 393 344 124 -451 -110
7188a10L70O06m53q18M70M99J33m97p4n08K50M65J43n22k24r6J12O28L67j054
$$ -110 260 866 413 -405 65 564 697 200 126 -382 -132 333 476 -46 -270 -366 -254 374 741 -313
7208c13m03O32O55k74p53o08P72J136k69j375k6N85Q23k63o01p43M69J084k30
$$ -313 -716 -84 571 297 -456 -1064 -292 844 575 -800 -826 -241 582 319 -282 -1025 -556 528 298
7227B98n74l53L23M1P22m76k41N8J54N43J08j89p87j51R65N33r43p09L38R05N40
$$ 298 -276 -629 -306 -265 457 -19 -260 -202 -48 495 603 414 -373 -524 441 974 31 -678 -340 565 1105
7248A105j116m94j50J167L67r66o72L81N22L07l64k50n07N78J69n71K50qj78L64
$$ 1105 -11 -505 -655 512 879 -87 -759 -378 144 451 87 -163 -670 -92 77 -494 -244 -252 -430 -66
7268f6N86n20l62k19M05K86J44q52j91K81Q99n21o37L56L24M06q6n92M01N27M8
$$ -66 520 0 -362 -581 -176 110 254 -598 -789 -508 391 -130 -767 -411 -87 319 233 -359 42 569 617
7289F17n24M2K09k20K9rQ6L39P9n46j38N11J70m59k29k7M67N60o99m69j77P00
$$ 617 93 135 344 124 153 144 230 569 648 102 -36 475 645 186 -43 -70 397 957 258 -211 -388 312
7311C12p7k68m5j62L96J4J60j03P4l27m47P43N3m35m68O19N20n30k41p36J73J050
$$ 312 235 -33 -78 -240 156 170 330 227 301 -26 -473 270 323 -112 -580 39 559 29 -212 -948 -775 275
7333B75L02j084n72N36Q11l71k50l36J95Q16j19l76n01M55J00L34k42m59K01K98
$$ 275 577 -507 -1079 -543 268 -103 -353 -689 -494 322 203 -173 -674 -219 -119 215 -27 -486 -285 13
7353A3L38k1l52n11%P65N41o57j100L82P70M82O5j236k40J224L81o61q09L14O27
$$ 13 351 330 -22 -533 -533 232 773 116 -984 -602 168 650 715 -521 -761 463 844 183 -626 -312 315
7374C15o6J77r83J63M15K41j63k75K66k34j72L78J84p52M91k66N74J77p94l29
$$ 315 249 426 -557 -394 21 262 99 -176 90 -144 -316 62 246 -506 -15 -281 293 470 -324 -653
7394f53M44Q75m76l57k21L86K77L53o16l70M80O20n67j69P3K09n2k16J16J24Q2
$$ -653 -209 666 190 -167 -388 -2 275 628 12 -358 122 742 175 6 79 288 236 20 136 260 342
7415C42o4o58N14N41n51n0Q7K00J9k49l17j25Q20K00m94o53N59k04M32l12j37
$$ 342 278 -380 134 675 124 74 161 361 380 131 -186 -311 509 709 215 -438 121 -83 349 37 -100
7436a00K39J21n18L44O4k50k51l98R49n1m37J55q54J102M52q33q47R04M09j08
$$ -100 139 260 -258 86 150 -100 -351 -749 200 149 -288 -133 -987 115 567 -266 -1113 -209 200 92
7456I2r8o30PP99L28q21k76N99L29l52K5m91K70J88L94j27l45O4n69O40O32m74
$$ 92 -6 -636 -629 170 498 -323 -599 0 329 -23 2 -489 -219 -31 363 236 -109 -45 -614 26 658 184
7478A84l75k58O21K05j35n87m74J178N15l15j159O3R21RM5o13j16L20K01j56k36
$$ 184 -191 -449 172 377 242 -345 -819 359 874 559 -600 -537 384 393 438 -175 -291 29 230 74 -162
7499a62J67j53L04M19m56k98k15L63L19K04m42o45K42R20L2p24l02J56M44M82
$$ -162 5 -148 156 575 119 -179 -394 -31 288 492 50 -595 -353 567 599 -125 -427 -271 173 655
7519F55r75j54M90N78l86m83M9L09K5M96n41j87Q3L18m24K35J54m56L59J68k15
$$ 655 -320 -474 16 594 208 -275 -226 83 108 604 63 -124 -41 277 -147 88 242 -214 145 313 98
7540I8K73l34j20j20O72j73m94N0M82k02k21K86m89L47R7m00J70k37L33j33j07
$$ 98 371 37 -83 -203 469 296 -198 -148 334 132 -89 197 -292 55 152 -248 -78 -315 18 -115 -222
7561b22J19J03L84n92k4Q2P27q42m56L50N71j25k38l15J77K39M41m34k25k28R52
$$ -222 -103 0 384 -208 -232 -150 577 -265 -721 -371 200 75 -163 -478 -301 -62 379 -55 -280 -508 444
7582D44rj26j58l61K56J57M2Q9l60N1k05J023n54n42l64L08Q54l7o09j87o9J174
$$ 444 435 309 151 -210 46 203 245 334 -26 25 -180 843 289 -253 -617 -309 545 508 -101 -288 -357 817
7604H17j31q87m34O38N63k60n90k48Q6Q12q8o56M20l21K90M90n55l15l14P44J0
$$ 817 686 -201 -635 3 566 306 -284 -532 -446 366 278 -378 42 -279 11 501 -54 -369 -683 61 71
7625G1l0L5p27J30J038J36o70m76K96K85L52k86n92M20O19K31r98j6K14K89p6
$$ 71 41 76 -651 -521 517 653 -17 -493 -197 88 440 154 -438 -18 601 832 -166 -182 32 321 245
7646B45K39p50L56K19j76p1K37n32P2O09k81rp9j99j53M51K71p46l51N87j22L3
$$ 245 484 -266 90 309 133 62 299 -233 -161 448 167 158 79 -120 -273 178 449 -297 -648 -61 -183 -150
7668a50j12k84L47K49j62l37J1N77l02k60L83j33L37M2n40M04K51q7n99R5P04
$$ -150 -262 -546 -199 50 -112 -449 -438 139 -163 -423 -40 -173 164 206 -334 70 321 234 -365 -270 434
7689D34k35L4j51j77K45J80J18o62L65L64n25M3J94j22Q8L80k54l43Q7J16k19
$$ 434 199 233 82 -95 150 330 448 -214 151 515 -10 33 227 105 193 573 319 -24 63 179 -40
7710d0M04K19p09J7j8N23J56m46r03N48P64P5r95l00P76K66k19k17j70j80O71
$$ -40 364 583 -126 -109 -127 396 552 106 -797 -249 515 590 -405 -705 71 337 118 -99 -269 -449 222
7731B22O3o02k55J19N05j5m2k83k47P28R6j81K60q27l02R22K51j49p68m1R20J77
$$ 222 285 -317 -572 -453 52 37 -5 -288 -535 193 289 108 368 -459 -761 161 412 263 -505 -546 374 551
7753E51j08p37J10M97M82n65m37k81O66K25jm78j86O83k05L2j45J14k67O6M31
$$ 551 443 -294 -184 313 795 230 -207 -488 178 403 402 -76 -262 421 216 248 103 217 -50 16 447
7774D47m44j17J87l93N73L98r83l93N41K26j23k82P3L5M13n3l79l49L57p8K16
$$ 447 3 -114 73 -320 253 651 -332 -725 -184 42 -81 -363 -290 -255 158 105 -274 -623 -266 -344 -128
7795a28n3K03n40N08m2n9J93mj30m65P69l02L10m15j00L84K73l12m15M54L05j89
$$ -128 -181 22 -518 -10 -52 -111 82 78 -52 -517 252 -50 260 -155 -255 129 402 90 -325 129 434 245
7817B45l74J58J03J14O5j52O9M9j74k2j15J50k15R3l00N32m0l42ok32Q97M9q64
$$ 245 -129 29 132 246 311 159 228 277 103 81 -34 116 -99 -6 -306 226 186 -156 -162 -394 503 552 -312
7840c12j00K22L31J33m65n50L98K06K66o42L8K96lM82l06l04N0R9J42R1L35n20
$$ -312 -412 -190 141 274 -191 -741 -343 -137 129 -513 -475 -179 -182 300 -6 -310 -260 -161 -19 72 407 -113
7862a13l86N46P31o32k75J90J72J18r4m73l32J104M40q44j67p7L50M8L79o71m
$$ -113 -499 47 778 146 -129 61 233 351 257 -216 -548 556 996 152 -15 -92 258 306 685 14 10
7883A0J97L02l43R3Q4m57p0O57k86n47k00Q3Q62r7m36m74K30N27K95m86l28j23
$$ 10 207 509 166 259 343 -114 -184 473 187 -360 -560 -477 385 288 -148 -622 -392 135 430 -56 -384 -507
7905e07O86R5p69k75O83M38n04n7r7K43L2K34l63J27K08O3k23K11j80J8J02l68
$$ -507 179 274 -495 -770 -87 351 -153 -210 -307 -64 -32 202 -161 -34 174 237 14 225 45 63 165 -203
7927b03K42L10m5n62K44M20k44k89J74K13P3j49j73o2J10J22q10Q56J25k39o41
$$ -203 39 349 304 -258 -14 406 162 -127 47 260 333 184 11 -51 59 181 -629 227 352 113 -528
7948e28L71O2J35p6r5l72M09L24k14o96K60M75J63l20n56R8O81R0m60k54M40r3
$$ -528 -157 -95 40 -36 -131 -503 -94 230 16 -680 -420 55 218 -102 -658 -560 121 211 -249 -503 -63 -156
7970a56K11p4n6l84K96N0k00M73k1j88K02K61l5p00N7L70L31J57p13l44O08O47
$$ -156 55 -19 -75 -459 -163 -113 -313 160 139 -49 153 414 379 -321 -264 106 437 594 -119 -463 145 792
7992G92o81n29J75M45M42l23l03l15K65L10j36l71L03k67J01M27m03l7r5L0J63
$$ 792 111 -418 -243 202 644 321 18 -297 -32 278 142 -229 74 -193 -92 335 -68 -105 -200 -170 -7
8013gK63k1p23K19N79K20p03l56J01O42L43m93k57r8Q82l64Qn99R7N81K15m40
$$ -7 256 235 -488 -269 310 530 -173 -529 -428 214 557 64 -193 -291 591 227 235 -364 -267 314 529 89
8035H9N4J16J96m03J30J05k05j08q4K63O8J34l90j79O33j41o33J1J89L00J61k64
$$ 89 143 259 455 52 182 287 82 -26 -110 153 221 355 -35 -214 419 278 -355 -344 -155 145 306 42
8057D2n16K43M61j99l50J19J42m4l68M96m05L72n1k59J11M27j56o58L95J87nk65
$$ 42 -474 -231 230 31 -319 -200 -58 -102 -470 26 -379 -7 -58 -317 -206 221 65 -593 -198 -11 -16 -281
8079b81J9k11O39R2l60m21K90J54J95j33n5j62J93J37R4n3Ok75j83M14K28l92
$$ -281 -262 -473 166 258 -102 -523 -233 -79 116 -17 -72 -234 -41 96 190 137 143 -132 -315 99 327 -65
8101f5q8L37k67N62k79q06M32N12l7o19j25O86J57J17k55q15N43L69j06l73j20
$$ -65 -153 184 -83 479 200 -606 -174 338 301 -318 -443 243 400 517 262 -553 -10 359 253 -120 -240
8122b40K06J3N95m14m00J30K03O2o1j96o9j39O04K06n74m49L04N30K15l79m65
$$ -240 -34 -21 574 160 -240 -110 93 155 94 -102 -171 -310 294 500 -74 -523 -219 311 526 147 -318
8143c18J24P37m2o30J12n43L50R67j115J02K94L4k1L77l60k52n9J93L08J45p19
$$ -318 -194 543 501 -129 -17 -560 -210 757 -358 -256 38 72 51 428 68 -184 -243 -50 258 403 -316
8164c16l19K97M14L27p14Q6O0M06o0P1q60N45K92Mo37K16J48j7J63l74k86K58
$$ -316 -635 -338 76 403 -311 -225 -165 241 181 252 -608 -63 229 233 -404 -188 -40 -57 106 -268 -554 -296
8186b96N22m76q1N42l17
$$ -296 226 -250 -331 211 -106
8191a06
$$ Imaginary data points
##PAGE= N=2
##DATA TABLE= (X++(I..I)), XYDATA
0@%%%Qj6QqK3l1L5m3N6p2Q8j10J33j58J90k23K61l08L58m14M79n50O31p22Q18
$$ 0 0 0 0 8 -8 0 -8 15 -16 19 -24 32 -40 48 -62 71 -87 103 -120 141 -167 191 -223 256 -294 337 -385 433
28D33r27J050j180J327j490J666j858K070k306K560k839L152l490L861m276M736
$$ 433 -494 556 -624 703 -787 879 -979 1091 -1215 1345 -1494 1658 -1832 2029 -2247 2489
44B489n245N818o466P198q040R020j0173J1553j3244J5370j8139K1916k7394L6105
$$ 2489 -2756 3062 -3404 3794 -4246 4774 -5399 6154 -7090 8280 -9859 12057 -15337 20768
58B0768n2169R1542l60951o32031N06823M94712M0665l08635j29482N7571J09134
$$ 20768 -31401 60141 -300810 -932841 -426018 68694 109359 -199276 -328758 -271187 -162053
69a62053r7302j42003N9608K65363J24971j06703k31988j31822R1443K44913J44712
$$ -162053 -259355 -401358 -341750 -76387 48584 -58119 -290107 -421929 -330486 -85573 59139
80E9139L374j01889j88383r5708K22201K74330m7015k17433j2821J65830Q1955
$$ 59139 62513 -39376 -227759 -323467 -101266 173064 126049 -91384 -104205 61625 143580
91A43580j40624k02332O5685L47714J55593k60579k82562M1993K19897J25672
$$ 143580 2956 -199376 -133691 214023 369616 109037 -173525 -131532 88365 214037
101B14037o6372j53385k0218J28907K6329j35867q0321N5575Q5139N6082p063
$$ 214037 147665 -5720 -25938 102969 129298 -6569 -86890 -31315 53824 109906 102843
112A02843o6750m9603l2981l4855O9301J38686k4637j48312j2117Q3797j3965
$$ 102843 36093 -13510 -46491 -81346 -12045 126641 102004 -46308 -58425 25372 11407
123A1407m6181L1838O0963N7387K2727q6193j12159J5115J07269R4353M4629m7868
$$ 11407 -34774 -2936 58027 115414 138141 51948 -60211 -45096 62173 156526 201155 153287
135A53287j11225m5602M1333O8134R3556L6847j14016r9688P1359P2487n6278
$$ 153287 42062 -3540 37793 105927 199483 236330 122314 22626 93985 166472 110194
146A10194m2551M8995N5313M507r1210j53246j7677J70756J27249n2725j47239
$$ 110194 67643 116638 171951 176458 85248 -67998 -85675 85081 212330 159605 12366
157A2366j37712j6338J48229J09608j03447j60479k3065Q4054P6177k9512j40169
$$ 12366 -125346 -141684 6545 116153 12706 -147773 -170838 -86784 -10607 -40119 -180288
168a80288n4540J37472J02260j16695j78836k0238J74247K09390k9940k93014
$$ -180288 -234828 -97356 4904 -111791 -290627 -310865 -136618 72772 42832 -250182
178b50182j70370J75419K41351L7903j01918j02051j5239R9408P6326o0110o5675
$$ -250182 -420552 -245133 -3782 34121 -67797 -169848 -185087 -85679 -9353 -69463 -135138
189a35138O6155J27567O5845p1203j77148n8940J96601K29873J761j83557j66630
$$ -135138 -68983 58584 124429 53226 -123922 -182862 13739 243612 245373 61816 -104814
200a04814K5635K25481J48139j51658k01475O8807J99340K8177j57682j40552
$$ -104814 -79179 146302 294441 142783 -58692 10115 209455 237632 79950 -60602
210f0602N6438K11573P6082j89329j88937L6533J46069Q1179l5007j22794p7898
$$ -60602 -4164 207409 283491 94162 -94775 -58242 87827 169006 133999 11205 -66693
221f6693O0147O8165l7878n9606j8635P672O0805N8127p3997j39449k9993Q8280
$$ -66693 -6546 61619 23741 -35865 -54500 -46828 13977 72104 -1893 -141342 -171335 -83055
233h3055J07936L2618j01620j15507N3805J14202l8669j03396J9527J05328O7176
$$ -83055 24881 57499 -44121 -159628 -105823 8379 -30290 -133686 -114159 -8831 58345
244E8345k8311j18953q0441P7161J22871K6131k3182j9272m1502k9200J7222L7691
$$ 58345 30034 -88919 -169360 -92199 30672 56803 33621 14349 -27153 -56353 -39131 -1440
256a440N8970M7181n4098q4510K4455N6226k8980k0302O4050N7646j4287q0811
$$ -1440 57530 104711 50613 -33897 -9442 46784 17804 -2498 61552 119198 104911 24100
268B4100j05715j515J40946J04932m4723j00456o7730j1554O6739O6087k7078
$$ 24100 -81615 -83130 57816 162748 118025 17569 -50161 -61715 5024 71111 44033
279D4033m6884R435Q550j4058j1128m1272k9011Q3814J06454m0750j43932q5012
$$ 44033 -2851 6584 15134 1076 -10052 -51324 -80335 3479 109933 69183 -74749 -159761
291a59761N6186J56706P8550j30093j57225N0405J54722L5499r3418j00396L826
$$ -159761 -103575 53131 131681 1588 -155637 -105232 49490 84989 -8429 -108825 -104999
302a04999J31573R3145j00782j47140K4696J43437Q5012m6038j37901p6951J00071
$$ -104999 26574 119719 18937 -128203 -103507 39930 124942 78904 -58997 -135948 -35877
313c5877J43213j881j06291p1387K3407J14042P9065j04878j64571K5808J74793
$$ -35877 107336 105455 -836 -72223 -48816 65226 144291 39413 -125158 -99350 75443
324G5443Q7209q2173j51567n4939J26974J43629n7821j64481k8720J20844J07502
$$ 75443 162652 80479 -71088 -126027 947 144576 86755 -77726 -106446 14398 121900
335A21900k5740j51713j00985J02496J63971l835j26088p3463K5097Q7631O3679
$$ 121900 96160 -55553 -156538 -54042 109929 106094 -19994 -93457 -68360 19271 82950
346H2950n9932j14258j867R7625O3231k1903q4776o3266O4381J16821j7418j23052
$$ 82950 23018 -91240 -93107 4518 67749 45846 -38930 -102196 -37815 79006 61588 -61464
358f1464m5206O8003R3148L4898p9245j08465K3596J15149K7237o6426m6469P466
$$ -61464 -106670 -38667 54481 89379 10134 -98331 -74735 40414 67651 1225 -45244 -37778
370c7778M5140L6746l2440n2172J9881M2018m444m619Q88l5732j5889M5667K7969
$$ -37778 7362 44108 11668 -40504 -20623 21395 16951 12332 13220 -22512 -38401 7266 35235
383C5235j7072k0598k4200n948N1219L5572m4052m3539Q939J9042J9700J3446
$$ 35235 18163 -2435 -26635 -32583 18636 54208 10156 -33383 -24444 -5402 14298 27744
395B7744k9607k5126L2371K4142j8669p269r150l2352J9983O9610P219o1576m0961
$$ 27744 -1863 -26989 5382 29524 10855 3586 -5564 -37916 -17933 51677 58896 -2680 -43641
408d3641J5967O4444M9616n9817j04175J8403J12570M0696o1304p9732j7770Q3749
$$ -43641 -27674 36770 86386 26569 -77606 -59203 53367 94063 32759 -46973 -64743 19006
420A9006R0244n1272j27177j2202R7640O7779j9595q3965o6470M8686J07469J0442
$$ 19006 109250 57978 -69199 -81401 16239 84018 64423 -19542 -86012 -37326 70143 80585
432H0585q8587o9176R163Q3427Q1930m9573j37926k2008J24536Q7787m7627j19244
$$ 80585 -8002 -77178 -68015 15412 97342 47769 -90157 -112165 12371 100158 52531 -66713
444f6713o2916Q9354J45048j2398j55956p0937R2675J20230J2124j13814j07373
$$ -66713 -129629 -40275 104773 92375 -63581 -134518 -41843 78387 90511 -23303 -130676
455a30676N7229J50198K3289j14184q1656K3337Q8193P1243m0891j16423k4491
$$ -130676 -73447 76751 100040 -14144 -95800 -72463 15730 86973 46082 -70341 -94832
466i4832R7674P7914k2042q9848p1665M8985J28927K3456j16240q0422M6166R7279
$$ -94832 2842 80756 58714 -31134 -102799 -53814 75113 98569 -17671 -98093 -51927 45352
478D5352M4248p1458j17985R972J35464N6104q6880q7571O356P4436O1826l6927
$$ 45352 89600 18142 -99843 -89871 45593 101697 14817 -72754 -66398 8038 69864 32937
490C2937r2852r743P5973M2026j6427l3496l8168K173N8572K5070m3777l0645
$$ 32937 -59915 -69658 6315 48341 31914 -1582 -39750 -37577 20995 46065 2288 -28357
502b8357J2155K6178L5651M086n8265l4458M6349M7001p692k8137k4842O151M8314
$$ -28357 -16202 9976 45627 49713 -8552 -43010 3339 50340 42648 14511 -10331 -4180 44134
515D4134J7078m4841j9339K7397K625j2603J3745N870j6284j728M574M486J9054
$$ 44134 61212 16371 -2968 24429 27054 14451 28196 34066 17782 16054 20628 25114 44168
528D4168j1402n4485o773N9877K7530l4385m2014j7474L3282N6989j7303q4150
$$ 44168 32766 -21719 -28492 31385 58915 24530 -17484 -34958 -1676 55313 38010 -46140
540d6140k0000O1151L7407j5434l9977m0070J4271O5032J5452n6782m8403j271
$$ -46140 -66140 -4989 32418 16984 -22993 -63063 -48792 16240 31692 -25090 -73493 -74764
552g4764M1396O2246l681r1490m4799P1441P4224j4751p5853o0041L9922J18356
$$ -74764 -33368 28878 25197 -66293 -111092 -39651 34573 19822 -56031 -116072 -76150 42206
564D2206K8623j15613q7085N6108J08238L6841p1923j00488J5083J23988N0877
$$ 42206 70829 -44784 -131869 -75761 32477 69318 -2605 -103093 -88010 35978 86855
575H6855q3849q2592J0098P5428P4678j0479r9342m7770P1896Q1574k471o6764
$$ 86855 3006 -79586 -69488 5940 80618 70139 -29203 -76973 -5077 76497 74026 7262
587G262o3061K1861J07300M7083q9851r3985K3152R7489O4583m5511j22313l5942
$$ 7262 -55799 -33938 73362 120445 30594 -63391 -40239 57250 121833 76322 -45991 -81933
599h1933J11131R0994n1724r3095j4974O0131O2280k2913r8158l5586P8988P4405
$$ -81933 29198 120192 68468 -24627 -39601 20530 82810 59897 -38261 -73847 5141 79546
$$ [...]
8191a66
##END NTUPLES=NMR FID
##END=
