##TITLE=1H_CG-1113-1
 CDCl3, 8 sc, 
 23.7.2019
##JCAMPDX= 6.0         $$ Bruker NMR JCAMP-DX V2.0
##DATA TYPE= NMR FID
##DATA CLASS= NTUPLES
##ORIGIN= UXNMR, Bruker Analytische Messtechnik GmbH
##OWNER= root
$$ XWIN-NMR		Version 3.5
$$ Tue Jul 23 14:03:38 2019 Russian Standard Time (UT+4h)  she@DPX200
##.OBSERVE FREQUENCY= 200.13155
##.OBSERVE NUCLEUS= ^1H
##.DELAY= (6, 6)
##.ACQUISITION MODE= SIMULTANEOUS
##.ACQUISITION SCHEME= undefined
##.AVERAGES= 8
##.DIGITISER RES= 18
##SPECTROMETER/DATA SYSTEM= spect
##.PULSE SEQUENCE= zg30
##.SOLVENT NAME= D2O
##.SHIFT REFERENCE= (INTERNAL, D2O, 0, 15.7039)
##AUDIT TRAIL= $$ (NUMBER, WHEN, WHO, WHERE, WHAT)
$$ ##TITLE= Audit trail, XWIN-NMR		Version 3.5
$$ ##JCAMPDX= 5.01
$$ ##ORIGIN= Bruker BioSpin GmbH
$$ ##OWNER= she
$$ F:/spectra/data/she/nmr/H-F/1/audita.txt
$$ ##AUDIT TRAIL=  $$ (NUMBER, WHEN, WHO, WHERE, WHAT)
(   1,<2019-07-23 14:02:40.98 +0400>,<she>,<DPX200>,
      <created by zg, POWCHK disabled, PULCHK disabled
       configuration hash MD5:
       00 E9 B6 7A A2 85 ED C7 34 08 36 98 17 FE 4E 26
       data hash MD5: 16K
       EE 2A BF 6E 13 68 31 00 A8 46 ED 31 42 6D 11 13>)
$$ ##END=
$$ 
$$ hash MD5
$$ AF 59 8F 9E F7 DA 60 AB 68 E6 4A 3A AD C4 A2 7D
##$RELAX= 
##$RELAX= 
##$RELAX= 
##$RELAX= 
##$RELAX= 
##$RELAX= 
$$ Bruker specific parameters
$$ --------------------------
##$DU= <F:/spectra>
##$EXPNO= 1
##$NAME= <H-F>
##$PROCNO= 1
##$TYPE= <nmr>
##$USER= <she>
##$AMP= (0..31)
100 100 100 100 100 100 100 100 100 100 100 100 100 100 100 100 100 100 
100 100 100 100 100 100 100 100 100 100 100 100 100 100 
##$AQSEQ= 0
##$AQ_mod= 1
##$AUNM= <au_zg>
##$AUTOPOS= <>
##$BF1= 200.13
##$BF2= 200.13
##$BF3= 200.13
##$BF4= 200.13
##$BF5= 200.13
##$BF6= 200.13
##$BF7= 200.13
##$BF8= 200.13
##$BYTORDA= 1
##$CFDGTYP= 0
##$CFRGTYP= 5
##$CHEMSTR= <none>
##$CNST= (0..31)
1 1 145 1 1 1 1 1 1 1 1 1 1 1 1 1 1 1 1 1 1 1 1 1 1 1 1 1 1 1 1 1 
##$CPDPRG= <>
##$CPDPRG1= <>
##$CPDPRG2= <>
##$CPDPRG3= <>
##$CPDPRG4= <mlev>
##$CPDPRG5= <mlev>
##$CPDPRG6= <mlev>
##$CPDPRG7= <mlev>
##$CPDPRG8= <mlev>
##$CPDPRGB= <>
##$CPDPRGT= <>
##$D= (0..31)
0 1.2 0 0 0 0 0 0 0 0 0 0.03 0 0 0 0 0 0 0 0 0 0 0 0 0 0 0 0 0 0 0 0 
##$DATE= 1563876160
##$DBL= (0..7)
120 120 120 120 120 120 120 120 
##$DBP= (0..7)
150 150 150 150 150 150 150 150 
##$DBP07= 0
##$DBPNAM0= <>
##$DBPNAM1= <>
##$DBPNAM2= <>
##$DBPNAM3= <>
##$DBPNAM4= <>
##$DBPNAM5= <>
##$DBPNAM6= <>
##$DBPNAM7= <>
##$DBPOAL= (0..7)
0.5 0.5 0.5 0.5 0.5 0.5 0.5 0.5 
##$DBPOFFS= (0..7)
0 0 0 0 0 0 0 0 
##$DE= 6
##$DECBNUC= <off>
##$DECIM= 24
##$DECNUC= <off>
##$DECSTAT= 4
##$DIGMOD= 1
##$DIGTYP= 9
##$DL= (0..7)
0 120 120 120 120 120 120 120 
##$DP= (0..7)
150 150 150 150 150 150 150 150 
##$DP07= 0
##$DPNAME0= <>
##$DPNAME1= <>
##$DPNAME2= <>
##$DPNAME3= <>
##$DPNAME4= <>
##$DPNAME5= <>
##$DPNAME6= <>
##$DPNAME7= <>
##$DPOAL= (0..7)
0.5 0.5 0.5 0.5 0.5 0.5 0.5 0.5 
##$DPOFFS= (0..7)
0 0 0 0 0 0 0 0 
##$DQDMODE= 0
##$DR= 18
##$DS= 0
##$DSLIST= <SSSSSSSSSSSSSSS>
##$DSPFIRM= 0
$$ [...]
##$SUBNAM2= <"">
##$SUBNAM3= <"">
##$SUBNAM4= <"">
##$SUBNAM5= <"">
##$SUBNAM6= <"">
##$SUBNAM7= <"">
##$SUBNAM8= <"">
##$SUBNAM9= <"">
##$SW= 24.9336996594482
##$SWIBOX= (0..15)
0 0 2 0 0 0 0 0 0 0 0 0 0 0 0 0 
##$SW_h= 4990.01996007984
##$TD= 16384
##$TD0= 1
##$TE= 0
##$TE2= 300
##$TE3= 300
##$TEG= 300
##$TL= (0..7)
0 120 120 120 120 120 120 120 
##$TP= (0..7)
150 150 150 150 150 150 150 150 
##$TP07= 0
##$TPNAME0= <>
##$TPNAME1= <>
##$TPNAME2= <>
##$TPNAME3= <>
##$TPNAME4= <>
##$TPNAME5= <>
##$TPNAME6= <>
##$TPNAME7= <>
##$TPOAL= (0..7)
0.5 0.5 0.5 0.5 0.5 0.5 0.5 0.5 
##$TPOFFS= (0..7)
0 0 0 0 0 0 0 0 
##$TUNHIN= 0
##$TUNHOUT= 0
##$TUNXOUT= 0
##$USERA1= <user>
##$USERA2= <user>
##$USERA3= <user>
##$USERA4= <user>
##$USERA5= <user>
##$V9= 5
##$VALIST= <valist>
##$VCLIST= <CCCCCCCCCCCCCCC>
##$VD= 0
##$VDLIST= <DDDDDDDDDDDDDDD>
##$VPLIST= <PPPPPPPPPPPPPPP>
##$VTLIST= <TTTTTTTTTTTTTTT>
##$WBST= 1024
##$WBSW= 4
##$XGAIN= (0..3)
0 0 0 0 
##$XL= 0
##$YL= 0
##$YMAX_a= 452777
##$YMIN_a= -955980
##$ZGOPTNS= <>
##$ZL1= 120
##$ZL2= 120
##$ZL3= 120
##$ZL4= 120
##$ABSF1= 10
##$ABSF2= 0
##$ABSG= 5
##$ABSL= 3
##$ALPHA= 0
##$AQORDER= 0
##$ASSFAC= 0
##$ASSFACI= 0
##$ASSFACX= 0
##$ASSWID= 0
##$AUNMP= <proc_1d>
##$AZFE= 0.1
##$AZFW= 0.1
##$BCFW= 1
##$BC_mod= 2
##$BYTORDP= 1
##$COROFFS= 0
##$CY= 11.3945322036743
##$DATMOD= 1
##$DC= 2
##$DFILT= <>
##$DTYPP= 0
##$F1P= 18.9103706918063
##$F2P= -1.10871071338519
##$FCOR= 0.5
##$FTSIZE= 0
##$FT_mod= 4
##$GAMMA= 1
##$GB= 0.15
##$INTBC= 1
##$INTSCL= 1
##$ISEN= 128
##$LB= 0.24
##$LEV0= 0
##$LPBIN= 0
##$MAXI= 10000
##$MC2= 0
##$MEAN= 0
##$ME_mod= 0
##$MI= 1.114404
##$NCOEF= 0
##$NC_proc= 0
##$NLEV= 6
##$NOISF1= 3.799351
##$NOISF2= 2.8
##$NSP= 1
##$NTH_PI= 0
##$NZP= 0
##$OFFSET= 15.70392
##$PC= 1
##$PHC0= -8860.513
##$PHC1= 13.00096
##$PH_mod= 1
##$PKNL= yes
##$PPARMOD= 0
##$PSCAL= 0
##$PSIGN= 0
##$REVERSE= no
##$SF= 200.130013532006
##$SI= 16384
##$SIGF1= 3
##$SIGF2= 2
##$SINO= 400
##$SIOLD= 16384
##$SREGLST= <1H.CDCl3>
##$SSB= 0
##$STSI= 0
##$STSR= 0
##$SW_p= 3612.71676300578
##$SYMM= 0
##$S_DEV= 0
##$TDeff= 0
##$TDoff= 0
##$TI= <>
##$TILT= no
##$TM1= 0
##$TM2= 0
##$TOPLEV= 0
##$USERP1= <user>
##$USERP2= <user>
##$USERP3= <user>
##$USERP4= <user>
##$USERP5= <user>
##$WDW= 1
##$XDIM= 8192
##$YMAX_p= 0
##$YMIN_p= 0
$$ End of Bruker specific parameters
$$ ---------------------------------
##NTUPLES= NMR FID
##VAR_NAME=  TIME,          FID/REAL,        FID/IMAG
##SYMBOL=    X,             R,               I
##VAR_TYPE=  INDEPENDENT,   DEPENDENT,       DEPENDENT
##VAR_FORM=  AFFN,          ASDF,            ASDF
##VAR_DIM=   8192,          8192,            8192
##UNITS=     SECONDS,       ARBITRARY UNITS, ARBITRARY UNITS
##FACTOR=    0.0002004,     1,               1
##FIRST=     0,             0,               0
##LAST=      1.6414764,     0,               0
##MIN=       0,             -955980,         0
##MAX=       1.6414764,     452777,          0
$$ Real data points
##PAGE= N=1
##DATA TABLE= (X++(R..R)), XYDATA
$$ [...]
$$ plain form
3200 -2163 3713 5939 1451 -3569 -1711 4506 7388 3427 -3691 -6450 -805 6390 6901 234 -3985
3215 -3985 -2402 2990 5074 -179 -6773 -4594 3361 7517 2848 -5447 -8719 -2807 4569 4233 -3093
3230 -3093 -7038 -3028 3520 5175 -1305 -8861 -7453 1029 5362 1354 -5496 -6429 -224 6428 3920
3245 3920 -5408 -9479 -3325 5187 7850 1414 -5914 -5232 2395 5442 607 -5289 -4218 3516 9618
3260 9618 6093 -4215 -7796 -1361 6310 6740 320 -5314 -3322 4389 7406 1499 -4347 -3747 1729
3275 1729 6312 3717 -3441 -5547 166 6040 4191 -2579 -7156 -4592 3295 6975 1520 -4931 -4861
3290 -4861 142 3498 1823 -2988 -4556 -275 4472 2791 -3351 -6073 -2947 3909 6989 2841 -4293
3305 -4293 -4976 -451 3416 4057 -252 -3303 -556 3978 3814 -887 -4101 -2153 3766 7111 3190 -4122
$$ packed form
3200b163N876K226m488n020J858O217K882l961p118k759N645P195N11o667m219
3215c985J583N392K084n253o594K179P955M156m669q295l272N912P376l36p326
3230c093l945M010O548J655o480p556J408Q482M333m008o850r33O205O652k508
3245C920r328m071O154Q512K663o436p328O82P627L047m835n896J071P734O102
3260I618l525j0308l581O435P671M30o420n634J992P711L017n907n846O00N476
3275A729M583k595p158k106N713N874j849o770m577K564P887L680n455o451P0
3290d861N003L356j675m811j568M281M747j681o142k722L126O856L080m148p134
3305d293o83M525L867O41m309l051K747M534j64m701l214J948N919L345l921p312
$$ plain form
3321 -4122 -4717 319 4593 4447 -1196 -5043 -3422 2355 4469 708 -3186 -2891 896 3236 403 -5970
3337 -5970 -6635 -340 5905 4663 -2834 -9236 -6980 1284 5689 1240 -4369 -4349 38 3306 216 -5684
3353 -5684 -6014 937 6324 3724 -3645 -7519 -3253 5295 8526 2089 -5172 -4980 1435 6407 4477
3368 4477 -1646 -3817 2040 7461 4649 -3091 -5546 501 9039 9589 147 -6995 -4532 4102 8181
3383 8181 4327 -2636 -4565 89 4584 2112 -3342 -4077 672 5803 4402 -3326 -9629 -6111 2421
3398 2421 6728 1945 -5132 -7541 -2016 3872 1706 -4932 -5845 -1012 3572 2560 -3394 -6727 -2859
3413 -2859 4266 4956 -1223 -6429 -5614 1 5879 5099 -774 -3782 -1765 1440 2444 167 -2479 282
3429 282 5737 6122 159 -5224 -5300 1441 7642 6332 -592 -4666 -1937 2654 3582 1336 -1798 -1337
$$ packed form
3321d122n95N036M274j46n643l847J621N777K114l761l894K95L787K340k833o373
3337e970o65O295O245j242p497o402K256Q264M405m449n609K0M387L268l090n900
3353e684l30O951N387k600p369l874M266Q548L231o437p261J92O415M972j930
3368D477o123k171N857N421k812p740k455O047Q538N50r442p142K463Q634M079
3383H181l854o963j929M654M495k472n454p35M749N131j401p728o303L518Q532
3398B421M307m783p077k409N525N888k166o638r13M833M584j012n954l333L868
3413b859P125O90o179n206Q15N615N878p80n873l008K017L205J004k277k646K761
3429B82N455L85n963n383p6O741O201j310o924m074K729M591R28k246l134M61
$$ plain form
3445 -1337 1954 2914 -421 -4049 -3147 839 4882 3609 -2893 -7712 -4520 2702 5789 2353 -3913
3460 -3913 -5938 -1594 2933 902 -3489 -3518 1117 4116 2555 -3988 -6652 -1819 5357 6626 1251
3475 1251 -5437 -5855 427 6217 5461 -372 -3402 -110 3830 3525 -1207 -4749 74 7763 7955 230
3491 230 -6904 -5072 2872 8425 4595 -3551 -5432 26 5074 3405 -1661 -4450 -1405 3896 3255
3506 3255 -3261 -7177 -3568 3707 7087 1771 -6913 -8990 -2657 4049 3408 -2079 -5612 -2661 2953
3521 2953 2026 -4338 -7479 -2883 4051 5424 114 -6766 -6507 547 5348 3270 -2718 -5304 -2033
3536 -2033 2881 4135 309 -2993 -903 3087 3771 -212 -4427 -3637 3356 8175 4660 -2863 -5748
3551 -5748 -2214 3694 5648 1371 -2384 -1131 2153 2734 -68 -2851 -2004 2139 4994 2112 -3265
$$ packed form
3445a337L291R60l335l628R02L986M043j273o502m819L192P222L087l436o266
3460c913k025M344M527k031m391k9M635K999j561o543k664M833P176J269n375
3475A251o688m18O282N790p56n833l030L292L940l05m732l542M823P689J92p725
3491B30p134J832P944N553l830q146j881N458N048j669n066k789L045N301o41
3506C255o516l916L609P275L380n316q684k077O333O706o41n487l533K951N614
3521B953r27o364l141M596O934J373n310o880K59P054M801k078n988k586L271
3536b033M914J254l826l302K090L990O84l983m215P90O993M819l515p523k885
3551e748L534N908J954m277l755J253L284N81k802k783Q47M143K855k882n377
$$ plain form
3566 -3265 -4884 -1434 3847 5541 1248 -4756 -4690 143 3464 2441 -1111 -2680 293 3567 2042
3581 2042 -3266 -4409 -216 5045 5829 831 -4510 -4083 1766 5793 3855 -702 -3112 -641 4160
3596 4160 4576 -152 -3328 -342 4383 5165 597 -4822 -4043 3367 7821 3530 -3402 -5911 -1928 3989
3612 3989 4269 -1253 -5248 -1971 3320 2684 -1856 -6291 -4699 2179 5132 104 -6907 -7856 -2204 3864
3628 3864 3233 -3476 -7985 -3943 1230 2408 -2423 -6707 -4425 1646 4478 -891 -7493 -6554 340
3643 340 5235 3059 -3780 -6775 -2385 3970 3987 -697 -4058 -2124 2767 4977 560 -4287 -2729 2987
3659 2987 6399 3865 -2248 -4670 12 6086 5560 361 -3282 -1511 2777 5259 2107 -2525 -2015
3674 -2015 2851 5288 2458 -1843 -3626 121 5115 4901 -296 -3796 -2105 2335 4604 2415 -2360
$$ packed form
3566c265j619L450N281J694m293o004O6M833L321j023l552j569K973L274j525
3581B042n308j143M193N261P84m998n341M27N849M027j938m557k410K471M801
3596D160M16m728l176K986M725P82m568n419P79P410M454m291o932k509L983N917
3612C989K80n522l995L277N291o36m540m435J592O878K953n028p011r49N652O068
3628C864o31o709m509M042N173J178m831m284K282O071K832n369o602R39O894
3643C40M895k176o839k995M390O355J7m684l361J934M891K210m417m847J558N716
3659B987L412k534o113k422M682O074n26n199l643J771M288K482l152m632N10
3674b015M866K437k830m301j783L747M994k14n197l500J691M440K269k189m775
$$ plain form
3689 -2360 -2867 730 3873 2178 -1149 -2749 -534 3800 4259 -100 -4019 -2173 2136 4975 2439
3704 2439 -2430 -3852 32 4233 3153 -562 -2886 -895 3581 4199 175 -3894 -2472 2380 5243
3719 5243 2742 -2691 -4630 -537 3996 3261 -1917 -4996 -2733 2212 3900 -238 -5645 -4664 830
3734 830 3548 949 -5309 -6352 -1590 4137 1929 -3548 -6780 -3808 1746 3482 -1386 -6346 -4943
3749 -4943 1092 3946 342 -4852 -5663 -728 4562 2928 -3424 -6016 -1868 3759 4693 -315 -5174
3764 -5174 -3239 3392 5775 1548 -3745 -3629 1793 5962 3931 -2397 -4394 -15 4868 4590 -174
3779 -174 -3940 -1843 3969 5475 970 -3729 -2926 1638 5072 2894 -2524 -4418 -642 4092 3219 -1235
3795 -1235 -4182 -2180 2771 4271 -91 -4028 -2973 923 3769 1966 -2606 -4393 -183 3723 3644
$$ packed form
3689b360n07L597L143j695l327j600K215M334M59m359l919J846M309K839k536
3704B439m869j422L884M201j080l715k324J991M476O18m024m069J422M852K863
3719E243k501n433j939M093M533p35n178l079K263M945J688m138n407R81N494
3734H30K718k599o258j043M762N727k208n477l232K972N554J736m868m960J403
3749d943O035K854l604n194q11M935N290j634o352k592M148N627R34n008m859
3764e174J935O631K383m227n293J16N422M169k031o328j997M379M883k78m764
3779a74l766K097N812J506m505m699Q03M564L434k178n418j894L776M734q73m454
3795a235k947K002M951J500m362l937J055L896K846j803m572j787M210L906p9
$$ plain form
3810 3644 -418 -3383 -2062 2147 4388 1353 -2376 -2036 1676 4477 3085 -1273 -3571 -169 4443
3825 4443 4639 837 -2489 -1616 2139 4571 1916 -2037 -2561 210 3156 2970 -1176 -4093 -1374 3374
3841 3374 3718 -639 -4251 -3594 441 3528 1100 -4085 -5664 -1248 2234 1669 -2425 -5368 -3016 2163
3857 2163 2915 -1783 -5666 -4329 773 3989 1293 -4761 -6217 -793 3714 2823 -1367 -4317 -1679
3872 -1679 3274 4393 -815 -4828 -2733 3183 5723 2390 -3709 -4605 1356 5769 4286 -1178 -3486
3887 -3486 -599 4704 4990 -298 -4189 -1979 3044 4413 717 -4019 -3666 1967 5761 3162 -2780
3902 -2780 -4918 -1360 2957 3640 -1174 -4729 -2428 2285 3173 -365 -4429 -4130 901 4746 2318 -3535
3918 -3535 -4302 -839 2888 3095 -1413 -4785 -1976 2689 3754 658 -2681 -2097 1454 4481 2428 -2455
$$ packed form
3810C644m062k965J321M209K241l035l729L40L712K801j392m358k298L402M612
3825D443J96l802l326Q73L755K432k655l953n24K771K946j86m146k917K719M748
3841C374L44m357l612O57M035L087k428n185j579M416L482n65m094k943K352N179
3857B163P52m698l883J337N102L216k696o054j456N424M507q91m190k950K638
3872a679M953J119n208m013K095N916K540l333o099q96N961M413j483n464k308
3887c486K887N303K86n288l891K210N023J369l696m736L53N633L794k599n942
3902b780k138L558M317O83m814l555K301M713Q88l538m064K99N031L845k428n853
3918c535p67L463L727K07m508l372K809M665J065l096l339N84L551L027k053m883
$$ plain form
3934 -2455 -3247 352 4055 3627 22 -3329 -1909 2824 4312 1413 -1579 -2175 921 3685 2191 -1705
3950 -1705 -3549 -318 2484 2897 -260 -3817 -2835 1937 3584 1109 -2850 -3671 -948 2247 1798 -2372
3966 -2372 -4371 -1856 2067 2279 -505 -4497 -4000 1230 3849 864 -3287 -3778 -687 3333 2925 -1760
3982 -1760 -4832 -1809 3138 3684 395 -2888 -2415 2445 4935 1918 -2955 -3422 815 4905 4022 -1225
3998 -1225 -4368 -1324 4427 4300 -19 -3605 -2248 2523 5148 1269 -3787 -3643 971 4232 2616
4013 2616 -2695 -4932 -1237 3885 3691 -1601 -5212 -3177 1530 3973 522 -4611 -4231 898 3650
4028 3650 1410 -3140 -5062 -1137 3474 2975 -1731 -4332 -2167 2398 4019 290 -3944 -3263 1541
4043 1541 4500 2181 -2080 -3173 -282 3854 3483 -678 -3197 -455 3332 4132 1218 -2838 -2359 1991
$$ packed form
3934b455p92L599L703m28l605l351J420M733J488k899k992n96L096K764j494l896
3950a705j844L231K802M13l157l557R82M772J647k475l959q21K723L195m49m170
3966b372j999K515L923K12k784l992M97N230K619k985m151m91L091M020m08m685
3982a760l072L023M947N46l289l283M73M860K490l017m873m67M237M090q83n247
3998a225l143L044N751j27m319l586J357M771K625l879n056J44M614L261j616
4013B616n311k237L695N122j94n292l611K035M707K443l451n133L80N129K752
4028C650k240m550j922L925M611m99m706k601K165M565J621l729m234O81M804
4043A541K959k319m261j093K891M136l71m161k519K742L787Q00k914m056M79M350
$$ plain form
4059 1991 4411 1808 -2052 -3050 -225 3082 3319 -571 -2671 -1098 2128 2971 394 -2509 -3032 489
4075 489 2889 1261 -2283 -3798 -1311 1847 2690 -747 -3856 -2157 1401 2677 160 -2548 -3543 -740
4091 -740 2695 1617 -2230 -3579 -1157 2663 3477 -230 -3671 -2631 1751 3861 1546 -1951 -2930 -257
4107 -257 3492 2697 -1599 -3054 -285 3488 4083 -100 -3901 -2474 2484 4936 1787 -2632 -3892 -25
4123 -25 3677 2796 -1671 -3630 -638 3014 2844 -1051 -4100 -2755 2435 4216 326 -4365 -4258 180
4139 180 3935 2417 -2531 -4608 -1162 2824 3335 -1093 -3760 -1902 2915 4028 28 -4193 -2897
4154 -2897 1461 4552 2795 -2436 -4034 -362 4231 3322 -419 -3040 -1192 2728 3561 -110 -3084
4169 -3084 -2059 2474 4368 1742 -2602 -4158 -331 3728 3305 -869 -3161 -1974 1308 2393 -273
$$ packed form
4059A991K420k603l860r98K825L307K37l890k100J573L226Q43k577k903n23L521
4075D89K400j628l544j515K487L158Q43l437l109J699L558J276k517k708r95K803
4091g40L435j078l847j349K422L820Q14l707l441J040M382K110k315l497r79K673
4107b57L749p95m296j455K769L773N95m183l801J427M958K452l149m419j260L867
4123b5L702q81m467j959K992L652j70l895l049J345N190J781l890m691J07M438
4139A80L755j518m948k077L446L986N11m428k667J858M817J113m000m221J296
4154b897M358L091j757n231j598L672M593r09l741k621J848L920Q33l671k974
4169c084J025M533J894k626m344j556L827M059m23m174k292J187L282J085k666
$$ plain form
4184 -273 -3256 -1928 1655 2729 291 -3138 -3682 -237 3084 2358 -1154 -3599 -2420 885 2637 556
4200 556 -2468 -2049 457 2185 1460 -1534 -2505 139 3865 2854 -683 -3423 -1677 1949 4039 2006
4216 2006 -1823 -2695 657 2848 1873 -634 -1950 -326 2580 2606 -621 -3025 -1538 2563 3981 1493
4232 1493 -3179 -4223 -446 3469 2746 -678 -3497 -1983 1514 2157 -1323 -3667 -1769 1920 3071
4247 3071 -324 -4418 -4728 -86 3824 2515 -2121 -3945 -2356 1560 2988 -416 -3600 -1630 1738
4262 1738 2684 -84 -3560 -3295 1486 5192 2628 -2663 -4216 -621 3446 4017 251 -3309 -1220 2561
4278 2561 3233 552 -2394 -1390 2138 4463 1457 -2832 -3337 637 4052 3959 -358 -3743 -2135 1922
4294 1922 3053 514 -2131 -1575 1598 2994 517 -3569 -2892 1259 3992 2241 -2040 -4268 -2227
$$ packed form
4184b73k983J328L583J074k438l429n44L445L321p26l512k445J179L305J752k081
4200E56l024M19K506J728p25k994r71K644L726j011l537k740J746L626K090k033
4216B006l829q72L352K191r75k507j316J624K906K6l227k404J487M101J418k488
4232A493m672j044L777L915p23l424k819J514L497O43l480k344J898L689J151
4247C071l395m094l10M642L910j309m636j824J589L916J428l404l184J970L368
4262A738R46k768l476K65M781L706k564n291j553L595M067N71l766l560K089L781
4278B561O72k681k946J004L528K325l006m289n05L974L415r3m317l385J608M057
4294A922J131k539k645N56L173J396k477m086O77M151K733j751m281k228K041
$$ plain form
4309 -2227 1855 3459 587 -2153 -2420 -89 1633 618 -1773 -2059 720 2920 1769 -1782 -3381
4324 -3381 -1870 2872 3534 910 -2517 -2789 237 2547 2055 -630 -1748 152 2085 1220 -857 -2241
4340 -2241 -918 2149 3124 282 -3034 -3136 -71 2538 2424 -787 -3501 -1999 1282 1716 -743 -2492
4356 -2492 -1746 1194 2394 -705 -4196 -3085 661 3233 2110 -2273 -4267 -1669 2024 2562 -2
4371 -2 -2733 -2227 552 2442 447 -2898 -2049 1853 4495 2178 -1824 -3722 -868 4138 4202 423 -2542
4388 -2542 -1564 2005 3907 1341 -1917 -1370 2352 3965 1733 -1897 -2938 729 4368 3913 -957 -3588
4404 -3588 -2136 2329 3788 1424 -2606 -2518 711 2477 279 -2978 -3280 -435 2834 1484 -2639 -4900
4420 -4900 -1960 1769 2626 -527 -3411 -3258 13 2112 307 -2326 -2602 -310 1858 1241 -2123 -3157
$$ packed form
4309b227M082J604k872k740k67K331J722j015k391k86K779K200j151l551j599
4324c381J511M742O62k624l427k72L026K310m92k685j118J900J933q65k077j384
4340b241J323L067R75k842l316j02L065K609j14l211k714J502L281M34k459j749
4356b492P46K940J200l099l491J111L746K572j123m383j994K598L693N38k564
4371bk731N06K779J890j995l345Q49L902K642k317m002j898K854N006O4l779k965
4388b542R78L569J902k566l258N47L722J613k232l630j041L667L639m55m870k631
4404c588J452M465J459k364m030Q8L229J766k198l257l02K845L269j350m123k261
4420d900K940L729Q57l153k884J53L271K099j805k633k76K292K168o17l364j034
$$ plain form
4436 -3157 -279 2742 3079 97 -2501 -2502 951 3058 1817 -941 -1481 268 2275 1884 -501 -1851
4452 -1851 211 3227 2655 409 -2216 -1897 1051 3423 1644 -1361 -2259 -809 1534 2044 -575 -2360
4468 -2360 -1284 1120 1547 -577 -2322 -2879 -118 2422 1028 -2258 -3609 -1012 1820 2377 161 -3184
4484 -3184 -2278 1324 1961 457 -2048 -1777 730 3049 2021 -1766 -2464 226 3460 3470 553 -2923
4500 -2923 -1649 2178 3811 1454 -1625 -1458 1157 3439 2038 -1529 -2795 607 3728 2816 -643
4515 -643 -3486 -1966 1978 3376 335 -3390 -2794 134 2464 1031 -2666 -3752 -709 2313 1242
4530 1242 -2086 -4094 -2175 1689 2367 -771 -3884 -3065 427 2326 1061 -2371 -3445 214 2692
4545 2692 1869 -1280 -2834 -737 2632 3201 192 -2448 -1569 2173 3640 1994 -1122 -1801 766 3663
$$ packed form
4436c157K878L021L37k982k598jL453K107j241k758n40J749K007l91k385j350
4452a851K062L016n72k246k625L19K948K372j779l005q98J450K343N10k619j785
4468b360J076K404M27k124j745n57K761K540j394l286j351K597K832N57k216l345
4484c184R06L602O37j504k505K71K507K319j028l787o98K690L234J0k917l476
4500b923J274L827J633k357l079J67K615K282j401l567j266L402L121r12l459
4515f43k843J520L944J398l041l725N96K928K330j433l697j086L043L022j071
4530A242l328k008J919L864O78l138l113Q19L492J899j265l432j074L659K478
4545B692q23l149j554K097L369N69l009k640Q79L742J467j646l116o79K567K897
$$ plain form
4561 3663 2602 -534 -1692 -130 2474 2708 449 -2092 -1208 1782 2952 963 -1444 -2226 -106 2054
4577 2054 1583 -1267 -2674 -981 1004 1811 -611 -2669 -2097 401 1939 227 -2131 -2722 -925 1389
4593 1389 1594 -1147 -2753 -1381 1181 2047 435 -1921 -1966 741 2650 1778 -1026 -2045 -140 2464
4609 2464 2846 94 -2047 -601 1492 3019 1146 -1377 -2126 1416 3258 1672 -798 -2246 -298
4624 -298 2559 2890 -492 -2759 -1377 1466 2440 134 -2529 -2755 371 2231 1014 -2884 -3494 -1172
4640 -1172 1985 1703 -1454 -3775 -2131 1135 1826 -205 -3181 -2258 492 2545 1045 -2555 -3012 104
4656 104 2512 2115 -1107 -3104 -1058 2646 2810 502 -1847 -1501 1387 3510 1877 -1495 -1391 1098
4672 1098 3140 2429 -377 -2274 -495 2961 3021 387 -1964 -1489 1229 2579 1290 -1877 -1813 391
$$ packed form
4561C663j061l136j158J562K604K34k259k541Q84K990J170j989k407p82K120K160
4577B054m71k850j407J693J985Q07k422k058N72K498J538j712k358n91J797K314
4593A389K05k741j606J372K562Q66j612k356m5K707J909q72k804j019J905K604
4609B464L82k752k141J446K093J527j873k523p49L542J842j586k470j448J948
4624b98K857L31l382k267J382K843R74k306k663k26L126J860j217l898o10K322
4640a172L157k82l157k321J644L266O91k031k976R23K750K053j500l600m57L116
4656A04K408l97l222j997K046L704J64k308k349L46K888K123j633l372J04K489
4672A098K042p11k806j897J779L456O0k634k351M75K718J350j289l167O4K204
$$ plain form
4688 391 2277 1192 -1297 -2833 -1259 1680 2140 -570 -2679 -2157 162 1906 443 -2180 -2777 -532
4704 -532 1312 983 -1434 -2326 -834 1284 1710 -643 -2389 -1610 545 2505 1606 -1194 -1935 -67 1824
4721 1824 1762 -108 -1449 -304 1768 2529 293 -1537 -942 1404 2674 1855 -954 -1688 75 2335
4737 2335 2298 -28 -2242 -1326 1097 2346 576 -1856 -1747 390 2190 1046 -1978 -2757 -869 1996
4753 1996 1629 -1004 -3139 -1997 716 1937 272 -2536 -2264 468 2273 548 -1705 -2709 -454
4768 -454 1952 2135 -922 -2674 -1066 1741 2827 555 -2248 -1918 1379 2792 1307 -1349 -1776 415
4784 415 2831 2104 -1313 -2281 -71 2296 2598 335 -2507 -1856 866 2609 641 -1756 -1791 98 1741
4801 1741 1378 -1934 -2975 -679 1487 1479 -646 -2814 -2321 635 2130 83 -2303 -2436 -584 1727
$$ packed form
4688C91J886j085k489j536J574K939M60k710k109N22K319J744j463k623n97K245
4704e32J844l29k417q92J492K118M26k353j746P79K155J960q99k800p41J868J891
4721A824o2j870j341J145K072P61k236j830N95K346J270q19k809p34J763K260
4737B335l7k326k214R16K423J249j770k432J09K137J800j144l024p79J888K865
4753A996l67k633k135J142K713J221j665k808K72K732J805j725k253j004K255
4768d54K406J83l057j752J608K807J086k272k803L30L297J413j485k656m27K191
4784D15K416p27l417r68K210K367L02k263k842O51K722J743j968k397l5J889J643
4801A741l63l312j041K296K166qk125k168M93K956J495k047k386j33J852K311
$$ plain form
4817 1727 993 -1383 -2492 -311 1627 1442 -374 -2015 -1209 1370 2414 763 -1235 -1712 378 2439
4833 2439 1903 -9 -1524 -150 2120 1881 424 -822 -741 851 2389 1132 -1095 -1239 406 2058
4849 2058 2316 -386 -1661 -915 1100 1548 4 -1368 -1646 133 1634 511 -1742 -2335 -600 1087
4865 1087 1168 -1055 -2453 -1712 962 1555 -480 -2465 -2027 -171 1801 1037 -1670 -2356 -332 1544 1509
4882 1509 -518 -2375 -904 1483 2501 363 -1578 -1473 862 2310 1322 -1306 -2141 304 2591 2171
4898 2171 -373 -2086 -666 1956 2431 244 -1933 -1233 974 2539 900 -1620 -2266 99 2552 1648
4914 1648 -1199 -2322 -1031 1501 2446 -379 -2536 -1550 996 1679 468 -1925 -2217 193 2187 870
4930 870 -1272 -2416 -659 1383 2082 -145 -1993 -1360 1234 1759 197 -1447 -1561 337 2013 1598
$$ packed form
4817A727p34k376j109K181J938j85j816j641Q06K579J044j651j998m77K090K061
4833B439n36j912j515J374K270k39j457j246Q1J592J538j257k227j44J645J652
4849B058K58k702j275P46K015M48j544j372k78J779J501j123k253n93J735J687
4865A087Q1k223j398P41K674N93k035j985M38J856J972p64k707o86K024J876l5
4882A509k027j857J471K387J018k138j941J05K335J448r88k628q35K445K287m20
4898B171k544j713J420K622M75k187k177P00K207J565j639k520o46K365K453r04
4914A648k847j123J291K532R45k825k157R86K546O83j211k393k92K410J994j317
4930H70k142j144J757K042O99k227j848O33K594N25j562j644j14J898J676m15
$$ plain form
4946 1598 -777 -1375 123 1818 1913 48 -1964 -1020 1254 1872 749 -1206 -1280 206 1549 1200 -1106
4963 -1106 -1575 -432 1464 1496 -81 -2141 -1587 512 1610 459 -1089 -1518 -567 1520 1292 -746 -1801
4980 -1801 -874 744 1338 -192 -1577 -1598 1001 1613 567 -1394 -1726 -186 2072 2115 97 -1783 -472
4997 -472 1034 1426 480 -1396 -931 1229 2970 1128 -1128 -1510 -96 2188 2495 -328 -1622 -699 1494
5014 1494 1986 205 -1375 -1193 935 2316 927 -1302 -1261 565 2158 1532 -1326 -2535 -1365 1597
5030 1597 1813 83 -1712 -2164 46 1631 414 -1529 -1948 -113 1661 573 -1895 -3016 -949 1703
5046 1703 1910 -162 -2147 -1875 414 1884 480 -1642 -1817 74 1567 332 -1114 -1902 -386 1755
5062 1755 1764 -712 -2149 -946 925 2380 896 -1370 -1570 408 1372 587 -525 -1010 311 2003 1633
$$ packed form
4946A598k375n98J498J695R5j865k012R44K274O18j123j955p4J486J343l49k306
4963a106m69J143J896L2j577k060N54K099J098j151j548m29R51K087k28k038j055
4980a801R27J618N94j530j385k1K599O12j046j961l32J540K258M3k018j880J311
4997d72J506L92r46j876M65K160J741j842k256l82J414K284L07k823j294R23K193
5014A494M92j781j580J82K128J381j389k229M1J826J593o26k858j209J170K962
5030A597K16j730j795m52K210J585j217j943m19J835J774j088k468j121K067K652
5046A703K07k072j985K72K289J470j404k122j75J891J493j235j446p88J516K141
5062A755Rk476j437J203J871J455j484k266k00J978R64p85j112m85J321J692l70
$$ plain form
5079 1633 -327 -1549 -414 1330 2018 804 -1048 -1774 221 1404 1317 -210 -1190 -231 1121 1204 -413
5096 -413 -1868 -467 976 1033 182 -1315 -1703 -419 1669 1169 -610 -1265 -888 799 1399 92 -1051
5113 -1051 -726 535 1052 712 -861 -1482 180 1968 1388 -253 -1911 -1260 850 1923 1105 -1142 -1030
5130 -1030 585 1313 292 -1064 -1310 485 2325 1137 -1001 -1891 -869 1068 2046 597 -1921 -1985
5146 -1985 411 1423 588 -1022 -1850 -464 1355 1095 -1413 -1876 -638 1615 1645 -454 -2573 -2148 739
5163 739 2224 669 -1195 -1734 -510 1165 936 -997 -1434 315 1786 1318 -403 -2048 -1345 1232
5179 1232 2407 909 -1131 -1207 -57 1674 1390 -475 -1182 -91 1501 921 -485 -1532 -583 1248
5195 1248 2025 -143 -1594 -1332 49 1535 1187 -363 -1587 -340 554 825 -382 -878 -556 703 1339
$$ packed form
5079A633j960j222J135J744O88j214j852p26J995J183q7j527r80R59J352Q3j617
5096d13j455J401J443N7q51j497l88J284K088n00j779o55L77J687O00j307j143
5113a051L25J261N17l40j573o21J662J788n80j641j658O51K110J073q18k247J12
5130a030J615P28j021j356k46J795J840j188k138q90J022J937R78j449k518o4
5146a985K396J012q35j610q28J386J819k60k508m63J238K253L0k099k119M25K887
5163G39J485j555j864n39J224J675k29j933m37J749J471m68j721j645P03K577
5179A232J175j498k040p6J150J731k84j865p07J091J592n80j406j047R49J831
5195A248P77k168j451K62J381J486l48j550j224J247Q94K71j207m96L22J259O36
$$ plain form
5212 1339 -334 -1758 -1471 562 1490 1192 -679 -1849 -682 834 1091 -72 -546 -542 29 1279 370
5229 370 -815 -884 658 1468 1269 -76 -1422 -841 1166 1780 536 -679 -1145 329 1628 1244 -786
5246 -786 -912 11 1021 479 -610 -1686 -623 1324 1641 52 -1857 -1350 -454 1130 863 -1038 -1623
5263 -1623 -637 653 516 -779 -1965 -828 1284 1988 -131 -1926 -1152 458 1617 1127 -1202 -1921
5279 -1921 -149 1392 1071 -428 -1300 -599 1245 1903 -285 -1842 -622 1114 1955 683 -1489 -2147
5295 -2147 -159 1860 1288 -161 -1077 -485 708 1246 -398 -1685 -618 1284 1391 631 -1556 -1666 -78
5312 -78 1546 808 -881 -1052 -284 1203 1446 -64 -1735 -938 478 1165 -228 -1208 -970 198 1928
5329 1928 1022 -1066 -1514 -516 911 1294 292 -1205 -879 593 1120 411 -649 -693 432 1575 988
$$ packed form
5212A339j673j424K87K033R28k98j871j170J167J516K57j163m74MN71J250r09
5229C70j185o9J542Q10j99j345j346N81K007O14j244j215m66J474J299l84k030
5246g86j26R23J010n42j089j076J063J947L17j589j909N07Q96J584k67j901n85
5263a623R86J290j37j295j186J137K112P04k119j795P74J610J159m90k329p19
5279a921J772J541l21j499q72P01J844O58k188j557J220J736Q41j272k172o58
5295b147J988K019n72j449r16N92J193N38j644j287J067J902J07p60k187j10J588
5312g8J624p38j689j71P68J487K43j510j671P97J416O87j393r80K38J168J730
5329A928r06k088m48R98J427L83j002j497L26J472N27p09j060m4J125J143n87
$$ plain form
5346 988 -632 -1026 142 751 1431 359 -1001 -1296 539 1308 373 -591 -1006 -18 911 974 -572 -1180
5364 -1180 -297 672 746 -166 -1646 -1673 347 1102 -13 -1048 -1293 -585 539 803 -751 -1679 -620 648
5382 648 814 -96 -1195 -1179 493 1596 708 -1022 -1513 -251 1248 1446 -122 -1488 -637 1051 1439
5399 1439 80 -1007 -899 736 2508 1204 -1012 -1106 385 1654 1267 -300 -1445 -481 1653 1420
5415 1420 130 -997 -893 703 1815 747 -1363 -1160 313 1283 701 -672 -1749 -910 1203 1188 -400
5432 -400 -1591 -631 475 1231 217 -1841 -1261 230 1153 355 -405 -1353 -531 1126 1148 -568 -1327 -363
5450 -363 804 1233 480 -902 -1424 774 1376 448 -169 -357 -56 1447 1983 -196 -806 -246 595 1373
5468 1373 885 -732 -1174 385 1179 579 -530 -1258 -703 804 1236 -31 -1510 -838 322 719 202
$$ packed form
5346I88j620l94J168O09O80j072j360k95J835P69r35r64m15R88R29O3j546o08
5364a180Q83R69P4r12j480k7K020P55j115j035k45P08J124K64j554r28J059J268
5382F48J66r10j099J6J672J103q88j730m91J262J499J98j568j366Q51J688L88
5399A439j359j087J08J635J772j304k216r4J491J269l87j567j145R64K134k33
5415A420j290j127J04J596J112j068k110K03J473R70n82j373j077Q39K113j5j588
5432d00j191R60J106P56j014k058N80J491R23p98p60r48Q22J657K2j716p59R64
5450c63J167M29p53j382n22K198O02r28o17j88L01J503N36k179o10N60Q41P78
5468A373m88j617m42J559P94o00j109p28N55J507M32j267j479O72J160L97n17
$$ plain form
5485 202 -798 -1359 -289 1380 358 -610 -1509 -887 346 1287 156 -1675 -1364 138 677 514 -455
5502 -455 -1371 24 1068 1130 -572 -1087 -568 559 1951 788 -1325 -933 796 1656 999 -367 -1125
5519 -1125 -129 1337 1312 -305 -877 -415 981 1483 153 -1384 -1083 417 1559 557 -815 -1422 -300
5536 -300 1129 1071 -751 -1502 -465 599 759 -509 -1793 -1591 717 1173 -204 -1562 -1531 -438 1048
5553 1048 1141 -745 -1703 -425 935 926 -135 -1008 -993 942 1641 128 -1096 -524 668 1699 1206 -357
5571 -357 -1107 -43 1403 1269 318 -386 -614 807 1633 398 -1221 -412 453 1101 943 -549 -1522 -580
5589 -580 841 904 -164 -870 -903 -84 981 74 -1473 -1400 127 397 437 -770 -1842 -959 1048 949 -622
5608 -622 -1240 -1445 -107 1277 672 -841 -1059 -36 899 471 -257 -955 -386 950 1514 272 -794 -599
$$ packed form
5485B02j000n61J070J669j022r68q99O22J233R41j131j831L11J502N39j63r69
5502d55r16J395J044O2j702n15N19J127J392j163k113L92J729Q60o57j366p58
5519a125R96J466k5j617n72M62J396N02j330j537L01J500J142j002j372o07J122
5536c00J429n8j822p51J037J064J60j268j284K02K308M56j377j358L1J093J486
5553A048R3j886r58J278J360rj061q73J5J935O99j513j224N72J192J031m93j563
5571c57p50J064J446j34r51p04k28J421Q26j235j619Q09Q65O48j58j492r73R42
5589e80J421O3j068p06l3Q19J065r07j547P3J527K70M0j207j072Q83K007r9j571
5608f22o18k05J338J384o05j513k18J023R35m28p28o98N69J336N64j242j066J95
$$ plain form
5626 -599 299 1441 989 -563 -1120 238 1229 953 165 -858 -797 956 1503 90 -1346 -852 321 1320
5644 1320 987 -912 -1963 -187 1035 774 -497 -1327 -820 524 1209 -474 -1492 -1124 650 960 365
5661 365 -1159 -1690 -286 1504 773 -404 -1274 -652 495 1762 149 -1215 -637 1055 1139 319 -712
5678 -712 -1275 177 1883 1010 -555 -680 -132 1069 1509 559 -1280 -561 1038 1258 538 -456 -1000 -9
5696 -9 1703 932 -1153 -1150 -138 834 710 -116 -1653 -811 617 1210 27 -626 -1290 -301 1055 496 -1465
5715 -1465 -1219 72 776 609 89 -1645 -1175 691 1065 -22 -754 -804 -266 787 983 -694 -1234 -13
5733 -13 738 788 449 -738 -811 834 1459 357 -590 -632 218 975 1095 -177 -1310 -388 988 1058 646 -534
5753 -534 -857 337 1589 766 -990 -733 -50 772 842 -377 -1525 -793 878 781 -445 -1007 -1252 3
$$ packed form
5626e99Q98J142m52j552n57J358R91k76p88j023O1J753N47j413j436M94J173R99
5644A320l33j899j051J776J222k61j271q30N07J344O85j683j018L68J774L10n95
5661C65j524n31J404J790p31j177q70O22J147J267j613j364N78J692Q4q20j031
5678g12n63J452J706q73j565j25N48J201M40r50j839P19J599K20p20r94n44R91
5696iJ712p71k085LJ012R72j24q26j537Q42J428N93j183o53o64R89J356n59j961
5715a465K46J291P04j67n20j734M70J866L74j087p32n0N38J053J96j677n40J221
5733a3P51N0l39j187p3J645O25j102r47m2Q50P57J20j272j133R22J376P0m12j180
5753e34l23J194J252q23j756K57O83Q22P0j219j148P32J671r7j226n62k45J255
$$ plain form
5771 3 1427 278 -1142 -1230 -4 1016 606 -474 -1551 -905 956 803 -508 -1071 -851 -104 1488 1228
5789 1228 -1333 -1182 214 1166 812 -21 -1331 -226 1069 1465 -117 -1187 -394 892 1527 711 -1119
5806 -1119 -1062 474 1293 524 -228 -1000 -574 1431 1420 -343 -1222 -497 590 1132 480 -1088 -1437 304
5824 304 1220 205 -881 -1380 -782 656 1191 -434 -1269 -330 286 452 301 -945 -1378 476 1441 445
5842 445 -785 -904 -582 544 1292 -83 -1030 -422 690 811 425 -523 -826 513 1450 739 -488 -518
5860 -518 -543 609 1229 137 -1169 -687 825 786 560 -347 -1093 -291 1158 799 -744 -1027 -206 309 477
5879 477 -131 -1636 -1273 821 1007 242 -617 -1316 -380 741 373 -1058 -1180 150 502 689 264 -1140
5897 -1140 -1179 696 1338 631 -462 -971 -431 1173 1398 -394 -1637 -20 999 701 677 -709 -698 1263
$$ packed form
5771CJ424j149j420q8J226J020m10j080j077O46J861j53j311n63K20P47J592k60
5789A228k561J51J396R52l54q33j310J105J295L96j582j070P93J286O35q16j830
5806a119N7J536Q19p69p52p72M26K005j1j763q79P25J087N42o52j568l49J741
5824C04R16j015j086m99N98J438N35j625q35R39O16J66j51j246m33J854R65r96
5842D45j230j19L22J126P48j375r47O08J112J21l86r48l03J339R37p11j227l0
5860e18k5J152O20j092j306M82J512l9k26r07p46Q02J449l59j543k83Q21N15J68
5879D77o08j505L63K094J86p65q59o99R36J121l68j431j22J330L52J87m25j404
5897a140l9J875O42p07j093n09N40J604K25j792j243J617J019k98k4j386J1J961
$$ plain form
5915 1263 1844 300 -840 -800 12 1172 1362 -517 -1328 -371 950 710 101 -512 -867 481 1336 -403
5933 -403 -1597 -994 137 902 812 -917 -1961 -355 885 582 -392 -1067 -510 468 1050 -65 -1030 -617
5951 -617 546 808 682 -649 -1402 24 1484 865 -114 -705 -751 58 1116 316 -1036 -461 538 917
5969 917 266 -280 -1092 285 1736 1300 -420 -457 -537 -188 966 662 -893 -868 265 617 -74 -59 -969
5988 -969 -479 819 905 -540 -891 -620 -26 855 531 -635 -1358 -128 802 423 -20 -684 -787 598 965
6007 965 -564 -1257 -141 398 948 508 -1066 -1357 -41 1493 744 -14 -477 -690 214 1170 -17 -1234
6025 -1234 -211 593 1065 665 -759 -1421 -99 1627 702 -482 -687 -482 485 1405 12 -1167 -616
6042 -616 578 595 228 -950 -1135 -109 1351 618 -1495 -1263 -549 405 1066 -37 -1511 -1395 773 824
$$ packed form
5915A263N81j544j140M0Q12J160J90j879q11R57J321k40o09o13l55J348Q55j739
5933d03j194O03J131P65r0j729j044J606J240l03r74o75N57R78N82j115r65M13
5951f17J163K62j26j331p53J426J460o19r79n91m6Q09J058q00j352N75R99L79
5969I17o51n46q12J377J451m36j720l7q0L49J154l04j555K5J133L52o91J5r10
5988i69M90J298Q6j445l51K71N94Q81l24j166p23J230R30l79m43o64j03J385L67
6007I65j529o93J116N39N50m40j574k91J316J534p49p58m63k13R04R56j187j217
6025a234J023Q04M72m00j424o62J322J726r25j184k05K05R67R20j393j179N51
6042f16J194J7l67j178j85J026J460p33k113K32P14R54O61j103j474J16K168N1
$$ plain form
6060 824 -553 -737 -763 259 1332 612 -1037 -1387 7 812 978 323 -1372 -724 868 1107 74 -280
6078 -280 -633 80 1110 1129 -572 -1124 438 982 511 -213 -1110 -776 1107 1661 9 -633 -662 -29 534
6097 534 1128 -468 -943 36 579 257 -403 -1007 -1214 500 1263 -317 -980 -819 -479 420 682 -477 -1310
6116 -1310 -427 775 238 -459 -707 -1047 448 1151 -36 -1531 -533 344 588 797 -326 -1234 -495 1163
6134 1163 944 -13 -299 -345 -24 1242 367 -1116 -357 928 1016 746 -74 -1081 -637 1327 1345 -75 -557
6153 -557 -503 -89 961 341 -1233 -972 660 988 136 -276 -1394 -616 971 926 -902 -1151 -533 -185 949
6172 949 517 -1352 -1477 517 1462 243 -370 -831 -621 1418 1550 -772 -1238 -323 871 1264 536 -444
6190 -444 -1098 553 1335 463 -672 -324 -170 1159 1383 -412 -1372 -232 1010 691 473 -819 -1307 391
$$ packed form
6060H24j377j84k6J022J073p20j649l50J394Q05J66o55j695O48J592K39j033l54
6078b80l53P13J030J9j701n52J562N44m71p24q97L34J883N54j652o42k9O33N63
6097E34N94j596m75R79N43l22o60o04k07J714P63j580o63J61L40Q99K62j159q33
6116a310Q83J202n37o97k48l40J495P03j187j495R98Q77K44K09j123r08P39J658
6134A163k19r57k86m6L21J266q75j483P59J285Q8k70q20j007M44J964J8j420m82
6153e57N4M14J050o20j574K61J632L28q52m12j118P78J587m5j828k49O18L48J134
6172I49m32j869j25J994R45j219o13m61K10K039J32k322m66R15J194L93p28r80
6190d44o54J651P82q72j135L48J54J329K24j795r60J140J242l19k18j292m88J698
$$ plain form
6208 391 1440 137 -745 -557 -324 331 536 -500 -1263 -625 603 376 -261 -841 -1067 -189 1131 417
6226 417 -1169 -835 -365 9 815 -281 -1321 -679 1092 303 -120 -647 -549 50 1854 590 -778 -622
6244 -622 337 627 1077 584 -657 -361 1177 1162 282 -277 -669 -10 1111 922 -1031 -848 192 713 667
6263 667 267 -797 -860 668 1106 -180 -711 -792 -444 766 534 -1155 -1294 -104 445 431 10 -695 -1324
6282 -1324 460 1059 -165 -1009 -692 -187 849 680 -626 -2166 224 1191 866 -54 -760 -732 692 1757
6300 1757 -151 -1373 -199 273 1018 731 -418 -1057 -253 1592 513 -211 -660 -426 780 1436 199
6317 199 -1247 -553 471 673 367 -443 -1374 -422 1051 752 -764 -660 -252 406 1184 -97 -1214 -994
6335 -994 607 742 -85 -802 -1125 -84 993 510 -674 -784 -149 280 892 731 -1010 -538 698 854
$$ packed form
6208C91J049j303q82J88K33O55K05j036p63O38J228k27o37n80k26Q78J320p14
6226D17j586L34M70L74Q06j096j040O42J771p89m23n27R8N99J804j264j368J56
6244f22R59K90M50m93j241K96J538j5q80n59l92O59J121j89j953J83J040N21m6
6263F67m00j064o3J528M38j286n31q1L48J210k32j689j39J190N49j4m21p05o29
6282a324J784N99j224q44L17N05J036j69j306j540K390R67l25r20p06K8J424J065
6300A757j908j222J174M72P45k87j149o39Q04J845j079p24m49K34J206O56j237
6317A99j446O94J024K02l06q10r31R52J473k99j516J04M08O58P78j281j117K20
6335i94J601J35q27p17l23J041J077m83j184j10O35M29O12j61j741M72J236J56
$$ plain form
6353 854 54 -291 -430 -316 1051 1120 -497 -902 340 847 814 526 -530 -806 944 1280 -173 -98 -298
6372 -298 -297 610 1120 -477 -710 55 526 347 56 -813 -1203 415 1163 98 -867 -678 -843 384 685
6391 685 -233 -1106 -278 722 120 74 -398 -1478 134 1361 284 -861 -480 -390 482 1109 80 -1188
6409 -1188 -541 728 612 -28 -174 -777 314 978 758 -784 -813 375 634 969 276 -942 -802 866
6427 866 955 22 -568 -531 -72 927 781 -1554 -1257 463 889 452 -160 -1203 -998 907 877 -564 -970
6446 -970 -487 -77 445 302 -1000 -1201 574 726 63 -357 -927 -725 918 998 -428 -910 -159 197 719
6465 719 905 -764 -873 190 1043 289 86 -450 -352 937 1283 -87 -889 -407 716 798 537 -285 -1059
6484 -1059 358 1221 399 -372 -365 -428 220 969 -113 -1369 98 166 424 430 -228 -1555 -351 1196 498
$$ packed form
6353H54q00l45j39J14J367O9j617m05J242N07l3k88j056k76J750L36j453P5k00
6372b98JR07N10j597k33P65M71j79k91q69l90J618P48j065r65J89j65J227L01
6391F85r18q73Q28J000o02m6m72j080J612J227j077j145L81R0Q72O27j029j268
6409a188O47J269j16o40j46o03J091O64k20j542k9J188K59L35o93j218J40J668
6427H66Q9r33n90L7M59R99j46k335K97J720M26m37o12j043K05J905l0j441m06
6446i70M83M10N22j43j302k01J775J52o63m20n70K02J643Q0j426m82P51L56N22
6465G19J86j669j09J063Q53p54k03n36R8J289L46j370q02M82J123Q2k61q22p74
6484a059J417Q63q22p71Po3O48P49j082j256J467O8K58Oo58j327J204J547o98
$$ plain form
6503 498 -447 -762 -598 197 761 145 -1238 -582 525 337 160 -221 -755 -413 1255 1073 -589 -603 38
6522 38 353 865 386 -822 -694 690 1093 110 -58 -748 -112 1019 950 -227 -792 31 544 707 558
6541 558 -733 -772 606 1026 92 -693 -400 -449 669 1005 -616 -1308 -292 628 285 193 -771 -1276 334
6560 334 1089 -94 -972 -757 -156 489 990 -415 -1150 51 990 18 244 -493 -987 706 1517 503
6578 503 -930 -362 300 770 1008 -49 -1051 272 945 614 201 -458 -500 368 1250 238 -638 -413 185
6597 185 444 387 -346 -1135 -546 1076 446 -711 -499 -231 116 458 369 -1358 -904 202 188 201 2 -1252
6617 -1252 -1034 662 779 -623 -599 -507 -233 669 532 -833 -830 329 549 218 -62 -721 -699 644 1207 -13
6637 -13 -556 261 -89 1081 688 -396 -672 434 796 214 240 -312 -725 389 844 -332 -847 -48 415
$$ packed form
6503D98r45l15J64P95N64o16j383O56J107j88j77l81n34L42J668j82j662j4O41
6522C8L15N12m79j208J28J384M03r83j68o90O36J131o9j177n65Q23N13J63j49
6541E58j291l9J378M20r34p85K93m9J118L36j621o92J016R20l43r2r64n05J610
6560C34P55j183q78K15O01O45N01j405p35J201R39r72K26p37m94J693Q11j014
6578E03j433N68O62M70K38j057j002J323O73l31m13o59m2Q68Q82j012q76K25N98
6597A85K59n7p33p89N89J622o30j157K12K68L47L42q9j727M54J106j4J3j99j254
6617a252K18J696J17j402K4R2K74R02j37j365LJ159K20l31k80o59K2J343N63j220
6637a3n43Q17l50J170l93j084k76J106L62n82K6n52m13J114M55j176n15P99M63
$$ plain form
6656 415 660 745 -157 -1229 -66 1395 341 -134 -549 -866 174 1027 -50 -1420 -320 560 240 129
6674 129 -214 -1330 -130 1194 388 -797 -654 -391 276 905 -83 -1196 -448 622 366 115 -370 -851
6692 -851 46 1396 970 -797 -427 11 576 1127 248 -573 -819 689 684 64 117 -582 11 1332 875 -596
6712 -596 -850 112 393 832 231 -1016 -828 362 851 -138 -495 -297 -654 610 339 -1167 -1038 202
6730 202 898 97 50 -772 -680 409 953 -87 -911 -284 -21 452 872 -633 -954 41 793 266 -2 -312
6750 -312 -410 482 1435 179 -710 9 203 450 1228 274 -568 -211 695 410 158 -254 -400 286 1123 360
6770 360 -723 -427 374 720 815 209 -1129 -536 946 408 -430 -390 -789 -361 629 361 -1110 -1205 101
6789 101 316 350 -2 -1209 -824 737 756 -451 -149 -384 -214 756 513 -952 -826 378 539 54 -328
$$ packed form
6656D15K45Q5r02j072J163J461j054m75m15l17J040Q53j077j370J100Q80l20j11
6674A29l43j116J200J324q06j185J43K63O67O29r88j113P48J070k56k51m85m81
6692h51Q97J350m26j767L70M38N65N51q79q21k46J508no20N3o99N93J321m57j471
6712e96k54R62K81M39o01j247J88J190M89r89l57J98l57J264k71j506J29J240
6730B02O96q01m7q22R2J089N44j040q24O27K63M73M20j505l21R95P52n27k68l10
6750c12r8Q92R53j256q89P19J94K47P78r54q42L57R06k85k52m12j46O86Q37p63
6770C60j083K96Q01L46R5o06j338N93J482n38q38M0l99M28R90k68j471r5J306
6789A01K15L4l52j207L85J561J9j207L02k35J70R70k43j465J26J204J61m85l82
$$ plain form
6808 -328 -646 -259 1211 1191 -241 -743 -427 273 663 697 -498 -580 501 907 139 -501 -581 -558 709 1034
6828 1034 -301 -1126 -407 -34 436 691 -494 -909 276 917 -374 -699 -444 -360 334 836 -714 -1313
6846 -1313 -236 553 386 333 -214 -1096 202 725 169 -399 37 -350 223 758 92 -852 -110 1232 258
6865 258 279 -81 -754 -90 1247 597 -755 -367 67 247 538 275 -667 -51 902 430 -167 -511 -553 -273
6885 -273 1051 724 -1051 -446 -62 94 342 74 -828 -728 168 478 -503 -373 -338 -397 796 835 -676 -1044
6905 -1044 -5 113 528 505 -722 -1376 343 989 49 -571 -28 -174 458 616 -230 -1199 251 830 404
6924 404 162 -468 -764 329 978 53 -557 -112 140 351 981 -124 -844 441 1037 273 -18 -439 -744
6943 -744 365 1084 25 -927 -508 231 37 539 -138 -1171 -384 1086 200 -671 -361 -457 -5 895 312
$$ packed form
6808c28l18L87J470k0j432n02L16P00L90L4j195q2J081M06p68o40q0K3J267L25
6828A034j335q25P19L73M70K55j185m15J185O41j291l25K55Q4O94N02j550n99
6846a313J077P89j67n3n47q82J298N23n56n68M36l87N73N35o66r44P42J342r74
6865B58K1l60o73O64J337o50j352L88M34J80K91k63r42O16R53m72n97l44m2K80
6885b73J324l27j775O05L84J56K48k68r02J00Q96L10r81J30L5n9J193L9j511l68
6905a044J039J18M15k3j227o54J719O46r40o20N43j46O32J58q46r69J450N79m26
6924D04k42o30k96J093O49r25o10M45K52K11O30j105p20J285N96p64k91m21l05
6943g44J109P19j059r52M19P39j94N02o77j033P87J470q86q71L10r6M52R00n83
$$ plain form
6962 312 -993 -605 125 285 51 -128 -1106 -83 749 419 -447 -292 -197 273 1000 563 -763 -567 647
6981 647 511 449 110 -707 -674 534 505 -367 -270 -15 6 551 412 -663 -882 606 634 -79 -125 -335 -631
7002 -631 713 605 -501 -424 -133 156 104 494 -498 -1217 338 693 96 -332 -237 -440 -9 1033 -22
7021 -22 -636 -166 273 158 611 -221 -708 46 1086 -7 -260 152 -426 100 1239 398 -583 -247 446
7040 446 531 264 133 -1003 20 762 -4 -581 -245 -515 12 723 119 -1102 -545 701 325 -93 -134
7059 -134 -861 -695 1020 768 -600 -265 112 -57 422 171 -1094 -756 663 667 -372 -217 -469 -322 977
7078 977 911 -564 -787 179 463 50 257 -252 -541 540 1025 -89 -150 -149 -139 636 484 -388 -1031 545
7098 545 562 431 59 -213 -810 506 833 -239 -750 -305 -378 -56 459 -443 -1237 -348 506 14 -97 -283
$$ packed form
6962C12j305L88P30J60k34j79r78J023Q32l30q66J55R5M70P27m37j326J96J214
6981F47j36o2l39q17L3J208k9q72R7K55K1N45j39j075k19J488K8p13m6k10k96
7002f31J344j08j106P7K91K89n2L90r92p19J555L55n97m28R5k03M31J042j055
7021b2o14M70M39j15M53q32m87P54J040j093k53M12n78N26J139q41r81L36O93
7040D46Q5k67j31j136J023P42p66n77L36k70N27P11o04j221N57J246l76m18m1
7059a34p27J66J715k52j368L35L77j69M79k51j265L38J419Mj039J55k52J47J299
7078I77o6j475k23R66K84m13K07n09k89J081M85j114o1JJ0P75j52q72o43J576
7098E45J7j31l72k72n97J316L27j072n11M45p3L22N15r02p94Q89Q54m92j11j86
$$ plain form
7118 -283 -788 28 722 -55 -890 -19 61 -11 330 -205 -821 -247 929 195 -237 -50 -169 -18 1001 414
7138 414 -725 -101 540 386 785 572 -905 44 1183 346 -100 98 82 -305 890 573 -822 -638 232
7157 232 254 391 165 -718 -725 575 655 -538 -653 -163 -351 447 436 -668 -908 215 227 -236 -69 -664 -776
7178 -776 358 808 -759 -802 -409 -386 202 443 -332 -1014 239 764 -126 -377 -116 -496 582 875 -214
7197 -214 -693 291 541 663 340 -102 -626 -44 1043 410 -432 -189 -169 288 787 2 -1104 -134 635 -126
7217 -126 164 -63 -670 -191 681 -172 -803 -433 -241 -94 592 121 -905 -211 701 127 -601 -213 -416 -495
7237 -495 965 409 -663 -314 407 154 781 335 -862 -127 1136 659 -192 222 207 -100 1095 1088 -690
7256 -690 -366 676 261 401 722 -199 -312 577 475 -220 217 105 -96 607 949 -381 -781 320 244
$$ packed form
7118b83n05Q16O94p77q35Q71Q0p2L41n35o16N74J176p34m32J87j19J51J019n87
7138D14j139O24O41j54L99k13j477R49J139q37m46J98j6l87J195l17j395J84Q70
7157B32K2J37k26q83pJ300Q0j193j15M90j88P98j1j104k40J123J2m63J67n95j12
7178g76J134M50j567m3L93K3N88K41p75o82J253N25q90k51K61l80J078K93j089
7197b14m79R84K50J22l23m42n24N82J087o33q42K43K0M57M99p85j106R70P69p61
7217a26K90k27o07M79Q72q53o31L70J92J47O86m71j026O94R12n74p28L88k03p9
7237d95J460n56j072L49P21k53O27m46j197P35J263m77q51M14j5l07J195pj778
7256f90L24J042m15J40L21r21j13Q89j02o95M37j12k01P03L42j330m00J101p6
$$ plain form
7275 244 330 151 -304 -824 25 713 -519 -1019 -160 -557 -169 643 -338 -983 -331 90 -384 -216 -639 -915
7295 -915 -318 832 -111 -715 -443 -50 -122 794 20 -948 -193 704 368 -274 -313 -312 -78 946 346 -770
7315 -770 23 486 416 538 311 -1054 -292 1270 649 -280 -336 -147 85 775 138 -831 -594 561 166 34
7335 34 -197 -696 -590 706 535 -783 -513 -83 186 701 269 -908 -795 616 328 -197 8 -519 -638
7354 -638 727 1021 -226 -233 349 188 301 635 -639 -769 673 961 137 -47 -38 -147 433 964 147 -423
7374 -423 194 462 203 488 154 -270 335 659 128 114 174 -122 300 809 -153 -729 -301 528 -3 68 -126
7395 -126 -1314 -39 727 46 -794 -308 -436 -247 414 -134 -1142 -403 180 -270 -78 -277 -786 -477 852
7414 852 594 -860 -383 -22 -157 481 536 -893 -748 659 615 -232 -150 -505 -305 1124 588 -546 -379
$$ packed form
7275B44Q6j79m55n20Q49O88j232n00Q59l97L88Q12r81o45O52M21m74J68m23k76
7295i15N97J150r43o04K72L93p2R16p74r68P55Q97l36o42l9JK34J024o00j116
7315g70P93M63p0J22k27j365P62J562o21r29n6J89K32O90o37r69K37J155l95j32
7335C4k31m99J06J296j71j318K70M30K69N15m32j177J13J411k88n25K05n27j19
7354f38J365K94j247pN82j61J13L34j274j30J442K88q24j84Rj09N80N31q17n70
7374d23O17K68k59K85l34m24O05L24n31j4O0k96M22N09r62n76M28Q29n31P1j94
7395a26j188J275P66o81q40M86j28J89O61n48j008P39N83m50J92j99n09L09J329
7414H52k58j454M77L61j35O38N5j429J45J407m4q47Q2l55K00J429n36j134J67
$$ plain form
7433 -379 252 288 510 565 -314 -626 854 628 -99 -170 -334 -95 775 1039 -732 -772 386 746 224 53
7453 53 -670 -1040 507 743 58 -427 -42 -265 77 775 -271 -989 191 488 72 -403 -487 -518 -47 1005
7473 1005 -216 -709 7 200 179 780 -135 -927 212 833 181 -476 120 -85 164 1147 -22 -795 -17
7492 -17 247 43 647 51 -455 6 977 209 -502 -161 -160 -463 912 543 -925 -305 617 -67 87 27 -945
7513 -945 -483 498 385 -598 -258 -225 -252 529 436 -599 -515 373 289 -373 103 -654 -547 726 779 -399 -407 -53
7535 -53 -171 400 932 -524 -862 310 685 116 175 -249 -653 591 827 -167 -487 -10 335 278 616 -13
7555 -13 -792 458 557 38 -115 -91 -365 111 1050 -180 -884 -150 537 145 293 144 -942 -163 922 467
7575 467 -555 -430 -260 -166 672 -299 -974 -503 479 68 -191 -485 -880 -269 781 437 -616 -395 -28
$$ packed form
7433c79O31L6K22N5q79l12J480k26p27p1j64K39Q70K64j771m0J158L60n22j71
7453E3p23l70J547K36o85m85L85k23L42O98j046p18J180K97m16m75q4l1M71J052
7473A005j221m93P16J93k1O01r15p92J139O21o52o57N96k05K49R83j169p73P78
7492a7K64k04O04n96n06M61R71p68p11L41Jl03J375l69j468O20R22o84J54o0r72
7513i45M62R81j13r83L40L3k7P81r3j035Q4Q88q4o62M76p57J07J273N3j178qL54
7535e3j18N71N32j456l38J172L75n69N9m24m04J244K36r94l20M77L45n7L38o29
7555a3p79J250R9n19j53K4k74M76R39j230p04P34O87l92J48j49j086P79J085m55
7575D67j022J25J70R4Q38r71o75M71R82m11k59k94l95O11J050l44j053K21L67
$$ plain form
7594 -28 95 545 543 -1002 -235 653 34 -82 -191 -684 -518 1046 657 -685 -547 317 256 264 408 -685 -81
7615 -81 651 544 -444 -353 -168 35 656 266 -878 -511 545 -15 171 305 -561 -868 329 660 -311 -238
7635 -238 177 -329 352 584 -121 -919 94 269 34 212 -435 -693 502 991 248 -65 158 -115 41
7654 41 204 -180 -828 71 833 -75 -199 -181 -481 191 1053 269 -624 -12 142 -53 413 408 -781 -42 750
7675 750 157 -190 31 -333 -187 709 242 -911 -429 521 304 355 204 -714 -584 377 77 -447 -345 -203
7695 -203 100 809 88 -676 -679 677 442 408 123 -522 -455 505 450 -544 -697 104 -152 458 671 -341 -569
7716 -569 244 758 89 -69 -274 -337 1114 896 -363 -571 456 264 66 581 -191 -614 525 1056 -238
7735 -238 -133 167 -145 250 897 -534 -923 -20 354 2 425 -4 -1000 237 1203 -81 -497 192 5
$$ packed form
7594b8J23M50kj545P67Q88o19j16j09m93J66J564l89j342J38Q64o1QJ44j093O04
7615h1P32j07r88R1J85K03O21l90j144L67J056n60J86J34q66l07J197L31r71P3
7635b38M15n06O81K32p05p98J013J75k35J78o47k58J195M89p43l13K23k73J56
7654D1J63l84o48Q99P62r08j24J8l00O72Q62p84q93O12J54j95M66nj189P39P92
7675G50n93l47K21l64J46Q96m67j153M82R50k17N1j51r18J30R61l00n24J02J42
7695b03L03P09p21p64lJ356k35l4k85o45O7R60n5r94j53Q01k56O10K13j012k28
7716e69Q13N14o69j58k05o3J451k18j259k08J027j92j98N15p72m23J139N31j294
7735b38J05L00l12L95O47j431l89R03L74l52M23m29r96J237R66j284m16O89j87
$$ plain form
7754 5 196 475 -135 -997 -53 355 -20 187 249 -938 -329 1043 58 -469 -474 287 -120 647 191 -1033 -366
7775 -366 579 112 86 215 -365 -375 552 645 -621 -403 219 -46 370 242 -814 -392 401 439 -268 -188 -355
7796 -355 -223 465 623 -689 -640 85 -47 55 423 -231 -709 295 691 -329 -658 -322 -458 217 658
7815 658 -18 -962 -162 536 328 133 -168 -627 339 724 -18 -410 -151 -29 317 701 -335 -1063 118
7834 118 864 403 262 -20 -529 222 870 5 -764 169 336 147 577 12 -724 -139 681 353 -395 -39
7854 -39 -208 -89 615 513 -734 -17 218 -115 134 -326 -799 -475 749 32 -469 -166 -189 8 555 557 -581
7875 -581 -473 451 202 -51 369 -256 -189 604 632 -472 -545 126 -150 588 315 -500 -495 148 270 -305 38
7896 38 275 -714 317 675 -698 -503 24 -61 63 276 -478 -794 152 617 -6 -240 -338 -424 -48 550 -127
$$ packed form
7754EJ91K79o10q62R44M08l75K07O2j187O09J372r85n27nP61m07P67m56j224O67
7775c66R45m67k6J29n80j0R27R3j266K18O22k65M16j28j056M22P93L8p07Q0j67
7796c55J32O88J58j312M9P25j32J02L68o54m78J004L96j020l29L36j36O75M41
7815F58o76r44Q00O98k08j95l01m59R66L85p42l92K59J22L46L84j036p28J181
7834A18P46m61j41k82n09P51O48q65p69R33J67j89M30n65p36N85Q20l28p48L56
7854c9j69J19P04j02j247P17K35l33K49m60m73L24J224p17n01L03k3J97N47Kj138
7875e81J08R24k49k53M20o25O7P93K8j104p3O71k76P38k73q15NO43J22n75L43
7896C8K37r89J031L58j373J95N27q5J24K13p54l16R46M65o23k34r8q6L76N98o77
$$ plain form
7917 -127 -757 169 343 -7 165 61 -584 5 842 -108 -192 -62 -140 139 829 -50 -711 -340 718 380
7937 380 241 0 -643 -56 1058 39 -497 -120 234 218 780 204 -743 -253 575 380 133 122 -226 -170
7957 -170 929 154 -789 -526 -65 -41 256 144 -549 -605 493 445 -373 -78 -120 -292 918 372 -808 -494
7977 -494 81 343 124 95 -448 -656 550 774 -438 -206 -314 -2 63 662 -514 -443 458 409 22 234
7997 234 -238 -587 674 550 -242 -219 152 -66 128 577 -341 -839 209 161 216 -149 -280 -343 -11 444 -319
8018 -319 -678 -236 -143 171 345 157 -616 -47 598 462 -263 -28 -424 -76 812 -221 -629 -338 370 125
8038 125 635 122 -735 -140 457 130 -291 -172 -134 23 735 512 -616 -288 658 328 8 455 -192 -421
8058 -421 701 625 -489 -363 150 -102 429 525 -367 -635 380 415 208 -71 -366 -542 238 383 -149 -602
$$ packed form
7917a27o30R26J74l50J72j04o45N89Q37r50q4J30p8K79O90q79o61L71J058l38
7937C80j39k41o43N87J114j019n36L77L54j6N62n76r47M90Q28j95k47j1l48N6
7957a70J099p75r43K63M61K4K97j12o93n6J098m8q18K95m2j72J210n46j180L14
7977d94N75K62k19k9n43k08J206K24j212K32j08L12O5N99j176P1R01m9l87K12
7997B34m72l49J261j24p92K3L71k18J94M49r18m98J048m8N5l65j31o3L32M55p63
8018c19l59M42R3L14J74j88p73N69O45j36p25K35l96L48Q88j033m08K91P08k45
8038A25N10n13q57N95N97l27m21J19L8J57P12k23j128L28R46l30l20M47o47k29
8058d21J122p6j114J26N13k52N31R6q92k68J015L5k07k79k95j76P80J45n32m53
$$ plain form
8078 -602 101 -8 384 327 -640 -774 243 557 -241 30 -477 -567 289 667 -269 -710 24 335 87 416
8098 416 -608 -900 175 690 -210 -448 -186 24 9 369 -236 -648 190 597 67 201 44 -631 9 752
8118 752 16 -234 -133 208 -18 571 64 -745 -205 196 360 -146 -217 -366 -353 526 73 -386 -279 25 190
8139 190 50 472 -732 -549 516 67 -306 126 -335 -173 970 612 -128 0 546 68 83 685 -198
8158 -198 -202 265 835 -23 -136 377 -35 483 643 -309 -349 281 275 224 -14 -604 -483 313 760 -403 -516 60
8180 60 147 14 486 -590 -1191 97 284 -132 -141 -331 -510
$$ packed form
8078f02P03j09L92n7r67j34J017L14p98K71n07r0Q56L78r36m41P34L11k48L29
8098D16j024k92J075N15r00k38K62K10j5L60o05m12Q38M07n30J34j57o75O40P43
8118G52p36k50J01L41k26N89n07q09N40M01J64n06p1j49J3Q79m53m59J07L04J65
8139A90j40M22j204J83J065m49l73M32m61J62J143l58p40J28N46m78J5O02q83
8158a98mM67N70q58j13N13m12N18J60r52m0O30on1k38n90J21P96M47j163j13N76
8180F0Q7j33M72j076o01J288J87m16rj90j79
8191e10
$$ Imaginary data points
##PAGE= N=2
##DATA TABLE= (X++(I..I)), XYDATA
$$ plain form
0 0 0 0 0 8 -8 0 -8 16 -16 24 -24 34 -48 53 -64 77 -96 110 -129 152 -181 207 -240 274 -317 362 -412 465
28 465 -528 598 -670 752 -842 941 -1050 1169 -1301 1441 -1598 1773 -1960 2171 -2405 2662
44 2662 -2952 3277 -3643 4065 -4550 5119 -5793 6611 -7629 8926 -10651 13065 -16689 22715
58 22715 -34569 66622 -330487 -955980 -127890 234995 -222630 -376446 78046 24791 -400299
69 -400299 -358236 -14433 -142450 -367687 -113898 188687 -95292 -437340 -239176 70440
79 70440 -39096 -144611 12239 -8935 -254551 -156571 190100 201017 -60329 -104810 46175
90 46175 90865 -28175 -133298 -45981 183167 248314 86350 -25954 -26365 -59802 -9905 196746
102 196746 240578 4676 -113360 49945 122341 -64781 -149402 58626 192560 29105
$$ packed form
0@%%%Qj6QqK4l2M0m8N8q2J01j17J41j73K06k39K81l33L88m47N14n91O79p74Q77
28D65r93J126j268J422j594J783j991K219k470K742l039L371l733M131m576N067
44B662n614O229o920P708q615R669j0912J2404j4240J6555j9577K3716k9754L9404
58B2715n7284J01191l97109o25493Q28090L62885m57625j53816M54492n3255m25090
69d00299M2063L43803j28017k25237K53789L02585k83979l42048J98164L09616
79G0440j09536j05515J56850k1174k45616R7980L46671J0917k61346m4481J50985
90D6175M4690j19040j05123Q7317K29148O5147j61964j12304m11l3437M9897K06651
102A96746M3832k35902j18036J63305P2396j87122q4621K08028J33934j63455
$$ plain form
112 29105 -69801 60330 13878 -212785 -62992 306919 163618 -259728 -172604 156168 49447
123 49447 -159347 20752 177823 -7096 -87359 109519 132412 -88128 -79792 199209 250812
134 250812 -11041 -110452 64966 124365 49178 151731 254226 43081 -133517 66628
144 66628 246704 96596 -23777 108008 209368 114062 -33899 -100293 -43050 79962 136917
155 136917 108474 43920 -71827 -151115 -50802 83570 13267 -133210 -111672 -6147 -20691
166 -20691 -122719 -153536 -94028 -63097 -82594 -68349 -84752 -223965 -243092 28226 169154
177 169154 -111530 -332140 -150009 13262 -81981 -95310 32729 1876 -107951 -37305 49782
188 49782 -70743 -171789 4270 228512 156973 -75147 -105148 26235 58488 63573 159917
$$ packed form
112B9105r8906J30131m6452k26663J49793L69911j43301m23346Q7124L28772j06721
123D9447k08794J80099J57071j84919q0263J96878K2893k20540Q336K79001N1603
134B50812k61853r9411J75418N9399p5187J02553J02495k11145j76598K00145
144F6628J80076j50108j20373J31785J01360r5306j47961o6394N7243J23012N6955
155A36917k8443o4554j15747p9288J00313J34372p0303j46477K1538J05525j4544
166b0691j02028l0817N9508L0931j9497J4245j6403j39213j9127K71318J40928
177A69154k80684k20610J82131J63271r5243j3329J28039l0853j09827P0646Q7087
188D9782j20525j01046J76059K24242p1539k32120l0001J31383L2253N085R6344
$$ plain form
199 159917 132562 -47111 -22134 188560 161303 -58900 -51786 150511 202519 78870 -23935
210 -23935 -24595 39532 97080 99879 59630 -12761 -75220 -20017 101624 80296 -53130 -69792
222 -69792 14034 17255 -47757 -74335 -60231 -25581 19662 38313 -5216 -115049 -195578 -91761
234 -91761 98038 74823 -103684 -97968 32766 -6475 -110794 -59186 10566 -20418 1849
245 1849 81502 27932 -115295 -115435 38547 122368 40177 -43490 -5756 28604 -12238 17154
257 17154 99455 35021 -73737 12204 126254 27722 -89507 -7704 108210 91522 19915
268 19915 -27703 -52522 -30561 39592 100573 78979 -31847 -98593 -13772 71068 3786 -66988
280 -66988 -2658 61389 29265 -13155 -43181 -83439 -59670 43805 100765 33595 -86445 -113428
$$ packed form
199A59917k7355j79673K4977K10694k7257k20203P114K02297N2008j23649j02805
210b3935o60O4127N7548K799m0249p2391o2459N5203J21641k1328j33426j6662
222f9792Q3826L221o5012k6578J4104L4650M5243J8651m3529j09833q0529J03817
234i1761J89799k3215j78507N716J30734l9241j04319N1608O9752l0984K2267
245A849P9653n3570j43227j40J53982Q3821q2191q3667L7734L4360m0842K9392
257A7154Q2301o4434j08758Q5941J14050r8532j17229Q1803J15914j6688p1607
268A9915m7618k4819K1961P0153O0981k1594j10826o6746Q4821Q4840o7282p0774
280f6988O4330O4047l2124m2420l0026m0258K3769J03475N6960o7170j20040k6983
$$ plain form
292 -113428 2751 88514 1980 -89537 -26414 46975 20069 8569 14259 -50949 -70612 45209
304 45209 103558 -8733 -104206 -33585 93049 106047 3309 -69519 -42015 1637 22456
315 22456 59986 44691 -50550 -44670 89178 89621 -76325 -126091 -735 86477 63996 12415
327 12415 -36055 -58639 -26345 24626 32172 -23460 -78612 -22972 92367 66562 -79794 -108281
339 -108281 -6648 35954 8976 -2045 -27827 -58205 -8822 62065 32526 -63158 -96531 -20410
351 -20410 72237 52149 -44247 -50458 21909 26849 -11024 -5434 -20196 -55457 8474 103495 59222
364 59222 -55736 -65867 10650 54912 31736 -10405 -12275 17566 24707 24042 31743 -10753 -60458
377 -60458 6078 100968 49040 -52512 -31634 35788 34156 11184 413 -22914 -29009 10922
$$ packed form
292a13428J16179Q5763q6534r1517O3123P3389k6906j1500N690o5208j9663J15821
304D5209N8349j12291r5473P0621J26634J2998j02738p2828K7504M3652K0819
315B2456L7530j5295r5241N880J33848M43j65946m9766J25356Q7212k2481n1581
327A2415m8470k2584L2294N0971P546n5632n5152N5640J15339k5805j46356k8487
339a08281J01633M2602k6978j1021k5782l0378M9383P0887k9539r5684l3373P6121
351b0410R2647k0088r6396o211P2367M940l7873N590j4762l5261O3931R5021m4273
364E9222j14958j0131P6517M4262k3176m2141j870K9841P141o65P701m2496m9705
377f0458O6536R4890n1928j01552K0878O7422j632k2972j0771k3327o095L9931
$$ plain form
389 10922 53017 42699 -24579 -70888 -10916 65506 20617 -59014 -30826 26654 19478 14510
401 14510 14507 -45001 -79471 -2696 70777 30825 -48796 -57894 10287 59854 14153 -55292 -46388
414 -46388 -3989 9772 31947 31478 -47291 -80924 19893 85915 3484 -79264 -49427 20160
426 20160 49785 24786 -27856 -49933 -20663 22075 46181 14395 -65631 -70515 43699 95520
438 95520 -2795 -76016 -26227 32039 37053 22171 -16869 -52788 -18832 51993 66018 4531
450 4531 -62449 -42957 54017 80018 -14539 -67823 -7961 42025 37610 33185 -182 -57125 -29258
463 -29258 60043 62146 -23307 -61234 -5636 65489 58213 -19503 -57075 -17744 15800 19887 27669
476 27669 -1737 -57116 -20339 68839 42596 -59579 -71745 -4054 32415 22925 -4282 -29920
$$ packed form
389A0922M2095j0318o7278m6309N9972P6422m4889p9631K8188N7480p176m968
401A4510ln9508l4470P6775P3473l9952p9621r098O8181M9567m5701o9445Q904
414d6388M2399J3761K2175m69p8769l3633J00817O6022q2431q2748K9837O9587
426B0160K9625k4999n2642k2077K9270M2738K4106l1786q0026m884J14214N1821
438I5520r8315p3221M9789N8266N014j4882l9040l5919L3956P0825J4025o1487
450D531o6980J9492R6974K6001r4557n3284N9862M9986m415m425l3367n6943K7867
463b9258Q9301K103q5453l7927N5598P1125p276p7716l7572L9331L3544M087P782
476B7669k9406n5379L6777Q9178k6243j02175j2166O7691L6469r490k7207k5638
$$ plain form
488 -29920 -25930 -33 17058 12503 -28141 -66924 -19475 66185 45163 -40328 -42568 8528 14415
501 14415 5360 8763 -14133 -29841 11054 55373 40307 -14287 -46153 -7363 54225 38645
513 38645 -24312 -22224 18176 19653 23093 38646 -6352 -59004 -13774 55191 31344 -32946 -41897
526 -41897 742 36654 22653 -24783 -43652 -29639 -12619 16564 29000 -31945 -80384 -11544
538 -11544 62913 13973 -61065 -53737 -13895 9067 20949 3282 -33922 -32141 12293 46439
550 46439 25243 -43628 -67456 14858 88825 43290 -26194 -15807 17197 33473 50621 30724
562 30724 -27226 -22549 55888 92124 41015 -27194 -30174 39777 85481 32871 -34628 -21368
574 -21368 21148 40552 52525 22888 -52925 -58496 25275 52306 -18906 -67126 -35119 18467
$$ packed form
488b9920L990K5897J7091m555m0644l8783M7449Q5660k1022q5491k240N1096N887
501A4415r055L403k2896j5708M0895M4319j5066n4594l1866L8790O1588j5580
513C8645o2957K088M0400J477L440J5553m4998n2652M5230O8965k3847o4290q951
526d1897M2639L5912j4001m7436j8869J4013J7020K9183J2436o0945m8439O8840
538a1544P4457m8940p5038P328L9842K2962J1882j7667l7204J781M4434L4146
550D6439k1196o8871k3828Q2314P3967m5535o9484J0387L3004J6276J7148j9897
562C0724n7950M677P8437L6236n1109o8209k980O9951M5704n2610o7499J3260
574b1368M2516J9404J1973k9637p5813n571Q3771K7031p1212m8220L2007N3586
$$ plain form
586 18467 27226 -22544 -75933 -72136 -33921 -3738 9343 -24287 -91321 -80876 9480 24511
598 24511 -53973 -82591 -37953 -10666 -10913 -13999 -34907 -45775 -10893 30913 27053 -23719 -66802
611 -66802 -30265 56032 71347 8701 -13032 16432 24229 27510 44559 25166 -1994 35020
623 35020 85055 64314 7467 -11864 23404 74259 76308 23946 -3102 13128 22826 34999
635 34999 57086 30578 -22264 -4979 44586 25751 -23889 -24520 6563 27667 24439 -8106 -43228
648 -43228 -47214 -25338 13667 40000 -3869 -73710 -53363 15513 7003 -42046 -36435 -9739 -3772
661 -3772 4811 -4837 -51857 -66301 -9149 50373 40001 -28206 -71105 -28244 35886 26779 -13177
674 -13177 -10638 -1703 -7354 13445 21622 -25690 -41634 23429 65557 21757 -41631 -59248 -19817
$$ packed form
586A8467Q759m9770n3389L797L8215L0183J3081l3630o7034J0445R0356J5031
598B4511p8484k8618M4638K7287k47l086k0908j0868L4882M1806l860n0772m3083
611f6802L6537Q6297J5315o2646k1733K9464P797L281J7049j9393k7160L7014
623C5020N0035k0741n6847j9331L5268N0855K049n2362k7048J6230R698J2173
635C4999K2087k6508n2842J7285M9565j8835m9640o31L1083K1104l228l2545l5122
648d3228l986K1876L9005K6333m3869o9841K0347O8876q510m9049N611K6696N967
661c772Q583r648m7020j4444N7152N9522j0372o8207m2899M2861O4130r107l9956
674a3177K539Q935n651K0799Q177m7312j5944O5063M2128m3800o3388j7617L9431
$$ plain form
687 -19817 41268 54206 7135 -37419 -44095 -19516 20424 21895 -33220 -46478 24155 55435
699 55435 -12050 -73838 -59140 -2458 45034 40554 -17084 -56632 -36736 5931 34300 24604
711 24604 -27046 -43087 17109 51756 2545 -31491 314 31128 37288 33352 -1431 -39702
723 -39702 -10660 61850 87745 38658 -25709 -27085 33094 58000 19924 4708 32731 35695
735 35695 25055 33931 11632 -31540 -2004 68787 65260 3675 -27744 -17023 10361 33572
747 33572 25375 -4040 -20168 -15922 3937 18238 -10840 -49373 -18612 34282 10861 -47933
759 -47933 -56291 -32700 -10722 10713 4907 -36385 -59999 -46752 -22956 -833 -3337 -37290 -44264
772 -44264 -10727 -9431 -44375 -49120 -24669 -5562 16460 16392 -38331 -82767 -47085 22785 46040
$$ packed form
687a9817O1085J2938m7071m4554o676K4579L9940J471n5115j3258P0633L1280
699E5435o7485o1788J4698N6682M7492m480n7638l9548J9896M2667K8369r696
711B4604n1650j6041O0196L4647m9211l4036L1805L0814O160l936l4783l8271
723c9702K9042P2510K5895m9087o4367j376O0179K4906l8076j5216K8023K964
735C5695j0640Q876k2299m3172K9536P0791l527o1585l1419J0721K7384K3211
747C3572q197k9415j6128M246J9859J4301k9078l8533L0761N2894k3421n8794
759d7933q358K3591K1978K1435n806m1292k3614J3247K3796K2123k504l3953o974
772d4264L3537J296l4944m745K4451J9107K2022o8n4723m4436L5682O9870K3255
$$ plain form
785 46040 8373 -38363 -34379 3760 7048 -13727 -1622 15635 8200 19968 33733 -14678 -54390
798 -54390 5920 81484 68253 8620 -26749 -26246 12115 61365 65110 24633 -5072 6105 37903
811 37903 34432 -12612 -15909 56795 94033 36612 -25515 -34334 -16234 26137 73130 55909 -7453
824 -7453 -34545 -15451 9990 22096 4520 -20357 742 37787 13604 -44004 -59782 -25926
836 -25926 27470 56571 10004 -72036 -78681 -7370 38935 14451 -32823 -40312 -1602 14572
848 14572 -27797 -52942 -15476 14262 10026 12308 -4929 -58846 -61410 11171 52034 24806 -7274
861 -7274 -23987 -29564 -8682 16274 7806 -12588 -2047 32834 39863 -14194 -69519 -31364 55265
874 55265 64764 9414 -17257 -17190 -19687 1536 27285 12942 -6257 3276 5650 -7618 -10982 -10393
$$ packed form
785D6040l7667m6736L984L8139L288k0775J2105J7257p435J1768J3765m8411l9712
798e4390O0310P5564j3231n9633l5369N03L8361M9250L745m0477k9705J1177L1798
811C7903l471m7044l297P2704L7238n7421o2127q819J8100M2371M6993j7221o3362
824g453k7092J9094K5441J2106j7576k4877K1099L7045k4183n7608j5778L3856
836b5926N3396K9101m6567q2040o645P1311M6305k4484m7274p489L8710J6174
848A4572m2369k5145L7466K9738m236K282j7237n3917k564P2581M0863k7228l2080
861g274j6713n577K0882K4956q468k0394J0541L4881P029n4057n5325L8155Q6629
874E5265R499n5350k6671O7k497K1223K5749j4343j9199R533K374j3268l364N89
$$ plain form
888 -10393 -4179 23290 38455 8430 -29820 -44874 -27828 22496 56554 19125 -40380 -39568 -445
901 -445 17199 9862 -2275 2143 23498 19377 -19121 -31684 -9260 6959 27164 49434 13752
914 13752 -52134 -44081 21070 48208 33609 12636 -11198 -18104 8274 22957 -1628 -21705
926 -21705 22 40967 39755 -20714 -60416 -12922 50360 43755 6445 -14079 -33802 -29122 19758
939 19758 38541 -6203 -35490 -13005 8789 5951 -11655 -28986 -13291 33135 43541 -3866
951 -3866 -53370 -58945 -14890 41202 37948 -24265 -49319 -9505 19689 4604 -20082 -25837 -1111
964 -1111 32101 23320 -19759 -36184 -23201 -3949 26171 32784 -18149 -53812 -11598 37548 29975
977 29975 3479 -9379 -9810 8359 21210 -4892 -34786 -15479 35274 56610 15702 -46966
$$ packed form
888a0393O214K7469J5165l0025l8250j5054J7046N0324L4058l7429n9505Q12L9123
901d45J7644p337j2137M418K1355m121l8498j2563K2424J6219K0205K2270l5682
914A3752o5886Q053O5151K7138j4599k0973k3834o906K6378J4683k4585k0077
926b1705K1727M0945j212o0469l9702M7494O3282o605l7310k0524j9723M680M8880
939A9758J8783m4744k9287K2485K1794k838j7606j7331J5695M6426J0406m7407
951c866m9504n575M4055N6092l254o2213k5054L9814K9194j5085k4686n755K4726
964a111L3212q781m3079j6425J2983J9252L0120O613n0933l5663M2214M9146p573
977B9975k6496j2858m31J8169J2851k6102k9894J9307N0753K1336m0908o2668
$$ plain form
989 -46966 -46352 17045 48670 23392 9518 8324 -11439 -13545 10824 7508 -14049 1774 28236
1002 28236 21569 -2169 -21553 -26368 3093 42786 40835 1324 -34868 -39569 -4524 32633 17583
1015 17583 -21024 -15264 10367 3813 -14265 -15814 -7412 12185 27483 7479 -26146 -33775 -23961
1028 -23961 -1334 32719 29751 -19742 -42593 -13309 11465 13390 10294 -2717 -8995 11108 19318
1041 19318 -12508 -37190 -14514 30944 50089 16903 -33525 -32861 10995 30099 20527 13577 -3810
1054 -3810 -18384 8497 32478 1867 -28612 -6404 26316 28895 6551 -25390 -34006 2983
1066 2983 40535 29559 -11649 -41686 -31483 13716 32832 -7779 -38064 -9577 21212 10160
1078 10160 -15936 -34954 -33285 4631 37382 16220 -27151 -41897 -23231 12159 30708 356
$$ packed form
989d6966O14O3397L1625k5278j3874j194j9763k106K4369l316k1557J5823K6462
1002B8236o667k3738j9384m815K9461L9693j951l9511l6192m701L5045L7157j5050
1015A7583l8607N760K5631o554j8078j549Q402J9597J5298k0004l3625p629R814
1028b3961K2627L4053k968m9493k2851K9284K4774J925l096j3011o278K0103Q210
1041A9318l1826k4682K2676M5458J9145l3186n0428O64M3856J9104r572o950j7387
1054c810j4574K6881K3981l0611l0479K2208L2720K579k2344l1941q616L6989
1066B983L7552j0976m1208l0037J0203M5199J9116m0611l0285K8487L0789j1052
1078A0160k6096j9018J669L7916L2751k1162m3371j4746J8666L5390J8549l0352
$$ plain form
1090 356 -34984 -15633 19920 15622 -7912 -20223 -17288 11445 40416 18736 -30138 -34941 5464
1103 5464 40482 36960 -1614 -28784 -7539 23737 18551 3859 1125 -3490 4497 27166 15503
1116 15503 -23767 -21453 20174 37229 18728 -10469 -31559 -20757 14071 27408 7595 -14332
1128 -14332 -22183 -7650 16224 8035 -24857 -20985 12767 17392 -3417 -17488 -25679 -20794 7871
1141 7871 23198 707 -22900 -23279 -6171 17001 19822 -8689 -22667 -1840 12009 5427 -1579
1154 -1579 -11216 -15270 10438 32632 8818 -23682 -18096 9062 29147 26795 -2381 -22516 -5155
1167 -5155 15912 14600 5369 -6961 -15324 7848 35257 13407 -24921 -19230 12193 26646 20771
1180 20771 -4646 -28977 -16347 18040 25618 2652 -21085 -22102 7814 33234 8320 -31107
$$ packed form
1090C56l5340J9351L5553m298k3534j2311K935K8733K8971k1680m8874m803M0405
1103E464L5018l522l8574k7170K1245L1276n186j4692k734m615P987K2669j1663
1116A5503l9270K314M1627J7055j8501k9197k1090J0802L4828J3337j9813k1927
1128a4332p851J4533K3874q189l2892L872L3752M625k0809j4071q191M885K8665
1141G871J5327k2491k3607l79J7108K3172K821k8511j3978K0827J3849o582p006
1154a579r637m054K5708K2194k3814l2500N586K7158K0085k352k9176k0135J7361
1167e155K1067j312r231j2330q363K3172K7409k1850l8328N691L1423J4453n875
1180B0771k5417k4331J2630L4387P578k2966k3737j017K9916K5420k4914l9427
$$ plain form
1192 -31107 -21707 14019 23173 9980 -13404 -34737 -19287 24074 31008 -6528 -31764 -19973
1204 -19973 10250 27930 7024 -27667 -21966 11876 21760 4992 -16782 -31224 -12010 30320
1216 30320 32861 -13300 -36357 -12179 17368 25400 5954 -23380 -21440 10996 23514 4373
1228 4373 -15727 -21519 -4866 27894 26980 -15146 -31992 -2253 23393 19845 2813 -18339 -20940
1241 -20940 6609 24895 9639 -11982 -16335 -2696 20614 20339 -13298 -27706 949 21054
1253 21054 12739 -421 -14423 -22180 -395 24209 10127 -17815 -19562 -2535 12350 11398 -10251
1266 -10251 -24144 -7372 10251 7930 -639 -12918 -23621 -5280 23210 11784 -19053 -21001
1278 -21001 -2946 9766 13742 1673 -18726 -14326 10190 17777 6186 -9765 -18265 -901 27612
$$ packed form
1192c1107R400L5726R154j3193k3384k1333J5450M3361O934l7536k5236J1791
1204a9973L0223J7680k0906l4691N701L3842R884j6768k1774j4442J9214M2330
1216C0320K541m6161k3057K4178K9547Q032j9446k9334J940L2436J2518j9141
1228D373k0100n792J6653L2760r14m2126j6846K9739K5646l548j7032k1152k601
1241b0940K7549J8286j5256k1621m353J3639K3310k75l3637j4408K8655K0105
1253B1054q315j3160j4002p757K1785K4604j4082k7942j747J7027J4885r52k1649
1266a0251j3893J6772J7623k321q569j2279j0703J8341K8490j1426l0837j948
1278b1001J8055J2712L976j2069k0399M400K4516P587j1591j5951q500J7364K8513
$$ plain form
1291 27612 19983 -13964 -20456 91 14969 19624 8559 -16130 -17582 11959 26551 9614 -12110
1304 -12110 -18050 -521 27171 21670 -14769 -25664 -478 17712 17734 4509 -20459 -23687 11421
1317 11421 32297 6581 -23380 -21399 1790 23349 16945 -14826 -26899 -2457 19842 18315
1329 18315 905 -22827 -22570 16281 37436 4730 -27628 -16027 10421 24089 18241 -9323
1341 -9323 -25707 -739 29188 23390 -4445 -21696 -11393 22171 34287 1221 -27509 -12290
1353 -12290 14816 21881 12135 -10389 -24768 -3210 25438 15597 -13351 -22265 -9955 11537 19589
1366 19589 -5843 -31198 -18132 8385 12025 960 -15514 -28858 -14268 15011 11491 -17263
1378 -17263 -26275 -10788 5521 9322 -6502 -25412 -16923 6180 11587 1963 -12032 -24638 -12515
$$ packed form
1291B7612p629l3947o492K0547J4878M655j1065k4689j452K9541J4592j6937k1724
1304a2110n940J7529K7692n501l6439j0895K5186J8190K2j3225k4968l228L5108
1317A1421K0876k5716k9961J981K3189K1559o404l1771j2073K4442K2299j527
1329A8315j7410k3732K57L8851K1155l2706l2358J1601K6448J3668n848k7564
1341i323j6384K4968K9927n798k7835j7251J0303L3564J2116l3066k8730J5219
1353a2290K7106P065r746k2524j4379K1558K8648r841k8948q914J2310K1492Q052
1366A9589k5432k5355J3066K6517L640j1065j6474j3344J4590K9279l520k8754
1378a7263r012J5487J6309L801j5824j8910Q489K3103N407r624j3995j2606J2123
$$ plain form
1391 -12515 18419 18755 -10894 -19772 -3599 6282 9882 6488 -9835 -13913 6590 19655 8562
1404 8562 -8585 -16238 -4043 21609 23727 -2615 -16309 -5067 6675 15770 16417 -3622 -17187
1417 -17187 3139 23089 11232 -8495 -13981 -3221 19923 27800 1330 -22768 -11179 11945
1429 11945 22756 17428 -6384 -22767 -1045 26943 16081 -10537 -15145 654 20229 24009
1441 24009 -1421 -24943 -11721 17198 26518 13581 -12027 -27034 -2764 28540 16964 -14612
1453 -14612 -17034 985 13868 15920 -2382 -26401 -16671 17554 26299 1867 -26054 -29110 -1218
1466 -1218 26347 12705 -20244 -24408 -4732 9424 10679 -6101 -28956 -17138 18488 20973 -11007
1479 -11007 -29919 -19612 4829 23371 11956 -19648 -25051 -901 15072 12037 -2792 -18150
$$ packed form
1391a2515L0934L36k9649q878J6173R881L600l394j6323m078K0503J3065j1093
1404H562j7147p653J2195K5652K118k6342j3694J1242J1742R095O47k0039j3565
1417a7187K0326J9950j1857j9727n486J0760K3144P877k6470k4098J1589K3124
1429A1945J0811n328k3812j6383K1722K7988j0862k6618m608J5799J9575L780
1441B4009k5430k3522J3222K8919R320j2937k5608j5007K4270L1304j1576l1576
1453a4612k422J8019J2883K052j8302k4019R730L4225Q745k4432k7921l056K7892
1466a218K7565j3642l2949m164J9676J4156J255j6780k2855J1818L5626K485l1980
1479a1007j8912J0307K4441J8542j1415l1604n403K4150J5973l035j4829j5358
$$ plain form
1491 -18150 -10744 17133 20772 -6286 -20947 -7471 12033 23171 12964 -14020 -20334 3573
1503 3573 21085 15843 711 -14219 -10946 13915 21328 -3169 -16658 -1832 11760 12822 7478
1516 7478 -9412 -19356 -1058 20071 15190 -3782 -17853 -14252 6760 18384 2757 -12772 -8489
1529 -8489 364 6162 8566 -5577 -20228 -3773 21029 12809 -11414 -19448 -11880 6472 21824
1542 21824 10875 -13224 -17424 -2543 10725 14332 1504 -15086 -6166 16583 13865 -8196 -16058
1555 -16058 -6375 12462 26844 11887 -20955 -25680 1919 22452 19659 -339 -20687 -13614 13947
1568 13947 16608 -7383 -16343 -3062 10547 16382 3325 -24157 -27872 4689 28821 16924 -12435
1581 -12435 -30487 -17651 14276 21135 -4075 -18713 -7256 7029 11802 -52 -23621 -22287
$$ packed form
1491a8150P406K7877L639k7058j4661J3476J9504J1138j0207k6984o314K3907
1503C573J7512n242j5132j4930L273K4861P413k4497j3489J4826J3592J062n344
1516G478j6890r944J8298K1129m881j8972j4071L601K1012J1624j5627j5529M283
1529h489Q853N798K404j4143j4651J6455K4802q220k4223q034P568J8352J5352
1542B1824j0949k4099m200J4881J3268L607j2828j6590Q920K2749k718k2061p862
1555a6058R683J8837J4382j4957l2842m725K7599K0533k793j9998k0348P073K7561
1568A3947K661k3991q960J3281J3609N835j3057k7482l715L2561K4132j1897k9359
1581a2435j8052J2836L1927O859k5210j4638J1457J4285M773j1854k3569J334
$$ plain form
1593 -22287 14700 33124 6197 -23138 -25118 -6321 17617 24052 2141 -17620 -9934 7456
1605 7456 13355 4005 -12121 -11297 15542 29634 4944 -22581 -20363 2235 26194 29996 678
1618 678 -24807 -11538 13881 15582 2225 -6340 -3358 11681 16632 -5092 -22479 -9796 10675
1631 10675 19258 15324 -5579 -27274 -19856 7353 18201 8071 -7680 -17167 -8112 6844 139
1644 139 -15643 -10699 6829 12548 5229 -15298 -31936 -14294 20620 23622 -1243 -16342 -16345 -8852
1658 -8852 5615 12085 2349 -4803 -1160 2881 4180 -1236 -12667 -5415 19731 25809 3511 -16878
1672 -16878 -19091 -2641 24155 30268 933 -20916 -6555 12313 12208 1892 -6793 -2022 14857
1685 14857 17152 -4284 -19186 -11535 4586 20101 19896 -6717 -29179 -15708 11256 17856 4709
$$ packed form
1593b2287L6987J8424k6927k9335j980J8797K3938O435k1911j9761P686J7390
1605G456N899r350j6126Q24K6839J4092k4690k7525K218K2598K3959L802k9318
1618F78k5485J3269K5419J701j3357q565K982J5039M951k1724j7387J2683K0471
1631A0675Q583l934k0903k1695P418K7209J0848j0130j5751r487R055J4956o705
1644A39j5782M944J7528N719p319k0527j6638J7642L4914L002k4865j5099lP493
1658h852J4467O470r736p152L643M041J299n416j1431P252K5146O078k2298k0389
1672a6878k213J6450K6796O113k9335k1849J4361J8868j05j0316q685M771J6879
1685A4857K295k1436j4902P651J6121J5515k05k6613k2462J3471K6964O600j3147
$$ plain form
1698 4709 -14475 -18289 1984 16297 -2034 -24171 -16394 8057 21165 10096 -20696 -35678
1710 -35678 -8362 24702 19241 -5886 -17627 -13027 1501 13191 4423 -11842 -8259 9341 17841
1723 17841 7867 -14930 -25135 798 33101 26506 -5621 -23087 -14240 9308 26454 13170
1735 13170 -13983 -11582 12312 15104 -2864 -14572 -8610 10717 24530 9503 -17752 -23460 -8215
1748 -8215 10562 21717 11597 -15681 -23641 -4783 9340 5402 -4468 -9370 -1502 12240 4730
1761 4730 -20651 -24362 1314 22022 19608 -1687 -25239 -22481 5421 19613 8341 -1842 -3688
1774 -3688 -4835 -630 4818 131 -3643 4076 12821 12393 1788 -15647 -17164 9310 29841 17169
1788 17169 -7136 -18114 -11270 8439 20893 6276 -11274 -2662 11621 5881 -7585 -12667 -6811
$$ packed form
1698D709j9184l814K0273J4313j8331k2137P777K4451J3108j1069l0792j4982
1710c5678K7316L3064n461k5127j1741M600J4528J1690q768j6265L583J7600Q500
1723A7841r974k2797j0205K5933L2303o595l2127j7466Q847K3548J7146j3284
1735A3170k7153K401K3894K792j7968j1708N962J9327J3813j5027k7255n708J5245
1748h215J8777J1155j0120k7278p960J8858J4123l938r870m902P868J3742p510
1761D730k5381l711K5676K0708k414k1295k3552K758K7902J4192j1272j0183j846
1774c688j147M205N448m687l774P719Q745m28j0605j7435j517K6474K0531j2672
1788A7169k4305j0978O844J9709J2454j4617j7550Q612J4283n740j3466n082N856
$$ plain form
1801 -6811 8906 18842 6107 -14016 -20908 -13295 5220 20838 9490 -16116 -19114 -1164 8237
1814 8237 1704 -10375 -14568 1174 19919 8149 -21982 -26661 -2439 21045 23020 398 -23626
1827 -23626 -17248 8873 16520 4315 -4545 -5941 784 10724 7049 -11619 -14560 5757 24335
1840 24335 22404 -2085 -27478 -19876 14680 30109 11087 -11348 -15264 -2294 13894 9846 -11763
1853 -11763 -13724 11937 24398 6741 -16623 -23167 -6978 18744 23487 932 -19423 -18458 -3035
1866 -3035 13765 14993 -4624 -15531 -1398 11414 3088 -10738 -14229 -2821 16885 19482 -6938
1879 -6938 -28359 -16328 9809 21772 13137 -7796 -17010 -3537 9604 4254 -4515 -3647 1018
1892 1018 7390 9232 -3930 -16986 -8038 11086 19357 11191 -7922 -19923 -6737 14190 13801
$$ packed form
1801f811J5717R936j2735k0123o892P613J8515J5618j1348k5606k998J7950R401
1814H237o533j2079m193J5742J8745j1770l0131m679K4222K3484J975k2622k4024
1827b3626O378K6121P647j2205q860j396O725R940l675j8668k941K0317J8578
1840B4335j931k4489k5393P602L4556J5429j9022k2435l916J2970J6188m048k1609
1853a1763j961K5661J2461j7657k3364o544J6189K5722M743k2555k0355R65J5423
1866c035J6800J228j9617j0907J4133J2812q326j3826l491J1408J9706K597k6420
1879f938k1421J2031K6137J1963q635k0933r214J3473J3141n350q769Q68M665
1892A018O372J842j3162j3056Q948J9124Q271q166j9113j2001J3186K0927l89
$$ plain form
1905 13801 -1600 -9640 -7410 2566 10120 1728 -13228 -7059 11754 13946 715 -11382 -15559
1918 -15559 -4551 13288 14700 -1296 -13889 -13028 -2012 12082 9064 -7541 -10144 4935 11199
1931 11199 2104 -10425 -15831 -4819 17509 20572 -3656 -21677 -13696 5888 17449 10786 -7915
1944 -7915 -13185 2407 12418 4670 -7307 -10488 -2099 15018 17269 -4728 -21236 -9228 13350
1957 13350 21707 9859 -13526 -20605 -353 18793 12279 -4907 -11357 -2816 11579 12335 -7946
1970 -7946 -20847 -4075 19184 19021 -968 -19898 -20580 1383 20594 11771 -9403 -15584 -4585
1983 -4585 9021 10454 -6753 -19549 -5584 15268 12083 -6015 -17889 -14052 5558 21285 8811
1996 8811 -15941 -18643 -777 13402 11597 -4217 -16030 -6639 10890 9839 -3922 -10406 -4741
$$ packed form
1905A3801j5401q040K230R976P554q392j4956O169J8813K192j3231j2097m177
1918a5559J1008J7839J412j5996j2593Q61J1016J4094l018j6605k603J5079O264
1931A1199r095j2529n406J1012K2328L063k4228j8021P981J9584J1561o663j8701
1944g915n270J5592J0011p748j1977l181Q389J7117K251k1997j6508J2008K2578
1957A3350Q357j1848k3385p079K0252J9146o514j7186o450Q541J4395P56k0281
1970g946j2901J6772K3259j63j9989j8930o82K1963J9211q823k1174o181J0999
1983d585J3606J433j7207j2796J3965K0852l185j8098j1874L837J9610J5727j2474
1996H811k4752k702J7866J4179j805j5814j1813R391J7529j051j3761o484N665
$$ plain form
2009 -4741 9075 18681 7115 -14905 -16114 3177 15567 11888 -609 -11835 -7229 8275 12058
2022 12058 261 -6855 -2417 7225 14484 6844 -11667 -14921 945 12938 8646 -2991 -12126
2035 -12126 -8695 6786 13198 1951 -9651 -7970 776 9047 6091 -9081 -15182 -2323 8932
2048 8932 4461 -5729 -12842 -10217 6302 17472 6042 -12106 -13837 -1950 8122 7554 -5393
2061 -5393 -14251 -3075 11639 9292 -3825 -13201 -8513 10068 22104 7707 -13213 -13143 2554
2074 2554 12454 8389 -6002 -15503 -3937 15263 14773 -1640 -12337 -7167 8408 17737 4637
2087 4637 -15803 -13803 5000 15131 6215 -10645 -19432 -6147 15743 16015 -3074 -14853 -6910
2100 -6910 7895 12977 -487 -18844 -14934 6606 16120 4508 -11410 -16059 -3840 14941 15360
$$ packed form
2009d741J3816R606j1566k2020j209J9291J2390l679j2497j1226M606J5504L783
2022A2058j1797p116M438R642P259p640j8511l254J5866J1993m292j1637r135
2035a2126L431J5481O412j1247j1602J681Q746Q271k956j5172o101J2859J1255
2048H932m471j0190p113K625J6519J1170j1430j8148j731J1887J0072n68j2947
2061e393q858J1176J4714k347j3117r376M688J8581J2036j4397k0920P0J5697
2074B554R900m065j4391r501J1566J9200m90j6413j0697N170J5575R329j3100
2087D637k0440K000J8803J0131q916j6860q787J3285K1890K72j9089j1779P943
2100f910J4805N082j3464j8357L910K1540R514j1612j5918m649J2219J8781M19
$$ plain form
2113 15360 -4931 -15722 -3915 11746 13825 -645 -16569 -13050 7216 16799 5274 -8187
2125 -8187 -9268 2464 16363 12722 -7572 -15776 -871 14141 12452 174 -11688 -10965 4448
2138 4448 13709 3856 -8135 -7245 3363 12404 9178 -8076 -17265 -5456 8325 8520 -1095 -10831
2152 -10831 -11072 2092 11747 2428 -10767 -10868 -471 8463 8090 -4661 -14320 -6432 5955 6770
2166 6770 -1691 -8265 -7793 2929 13967 8025 -8189 -12134 -1964 8391 10594 1445 -9196 -5116
2180 -5116 8024 10883 1669 -7740 -8338 3398 17229 12268 -5924 -12236 -1310 9523 10066 885
2194 885 -10208 -7362 9090 15164 2591 -12054 -12478 547 13697 9647 -8062 -15422 -2853
2207 -2853 10035 8496 -4261 -16456 -11476 7927 16065 914 -15173 -13008 792 11536 6335
$$ packed form
2113A5360k0291j0791J1807J5661K079j4470j5924L519K0266R583j1525j3461
2125h187j081J1732J3899l641k0294q204J4905J5012j689j2278j1862P23J5413
2138D448R261r853j1991Q90J0608R041l226j7254r189J1809J3781J95r615r736
2152a0831k41J3164R655r319j3195j01J0397Q934l73j2751r659P888J2387Q15
2166F770q461o574M72J0722J1038n942j6214l945J0170J0355K203r149j0641M080
2180e116J3140K859r214r409n98J1736J3831m961j8192o312J0926J0833N43r181
2194H85j1093K846J6452O074j2573j4645m24J3025J3150m050j7709p360J2569
2207b853J2888j539j2757j2195M980J9403Q138j5151j6087K165J3800J0744n201
$$ plain form
2220 6335 -10849 -16650 -896 14373 10765 -5160 -15621 -10188 8511 16448 2254 -13031 -8162
2233 -8162 7251 14784 6641 -10311 -14878 1225 17956 13320 -3170 -11548 -5121 9953 14780
2246 14780 136 -13723 -5822 10715 15103 4888 -9011 -13788 -853 13964 9775 -5590 -11613
2259 -11613 -2971 8939 10870 -2679 -15275 -8729 6769 11422 2986 -8355 -12121 -1762 10661
2272 10661 6451 -8597 -12160 -2238 8375 9685 -201 -11500 -8728 4123 9617 2496 -5673 -7443
2286 -7443 705 11345 8751 -5630 -11465 -2641 8007 11049 4420 -7093 -8113 3298 10021 3486
2300 3486 -5808 -8096 -547 10848 11250 -3061 -12804 -6145 4547 8097 2611 -7684 -10816 469
2314 469 10293 3532 -9603 -13543 -5169 8208 10794 -2299 -14232 -8521 3711 7393 241 -11047
$$ packed form
2220F335j7184n801J5754J5269l608j5925j0461N433J8699P937j4194j5285M869
2233h162J5413P533q143j6952m567J6103J6731m636j6490q378O427J5074M827
2246A4780j4644j3859P901J6537M388j0215j3899m777J2935J4817m189j5365o023
2259a1613Q642J1910J931j3549j2596O546J5498M653q436j1341l766J0359J2423
2272A0661m210j5048l563R922J0613J310r886j1299K772J2851N494p121q169j770
2286g443Q148J0640k594j4381n835Q824J0648L042o629j1513j020J1411O723o535
2300C486r294k288P549J1395M02j4311r743O659J0692L550n486j0295l132J1285
2314D69R824o761j3135l940Q374J3377K586j3093j1933N711J2232L682p152j1288
$$ plain form
2328 -11047 -12899 1393 14344 7056 -9130 -13001 -2684 10000 12013 -869 -12437 -5772 10405
2341 10405 14317 3305 -9973 -10573 4154 17934 10910 -5927 -8606 3406 14189 11761 -2885
2354 -2885 -14125 -4968 14517 17259 3208 -10320 -9673 3873 14079 6578 -9147 -9741 3708
2367 3708 12752 5953 -8468 -17217 -8002 10075 12894 -2147 -14568 -11004 2091 9931 2722 -11474
2381 -11474 -12646 236 8316 2573 -8400 -13661 -5498 9404 10476 -4767 -13729 -6849 6663
2394 6663 12634 5756 -7594 -10706 26 8840 5918 -1901 -4757 1048 10022 9693 -2274 -9814
2408 -9814 -2137 9459 13984 8074 -4945 -11228 -2387 8860 8177 -17 -4876 -2092 5501 7768
2422 7768 -1475 -10815 -5871 5004 8781 2018 -9274 -13883 -4446 8344 6898 -4631 -11448 -8424
$$ packed form
2328a1047j852J4292J2951p288j6186l871J0317J2684K013j2882j1568O665J6177
2341A0405L912j1012j3278o00J4727J3780p024j6837k679J2012J0783k428j4646
2354b885j1240R157J9485K742j4051j3528O47J3546J0206p501j5725n94J3449
2367C708R044o799j4421q749R215J8077K819j5041j2421L564J3095P840p209j4196
2381a1474j172J2882Q080n743j0973n261Q163J4902J072j5243q962O880J3512
2394F663N971o878j3350l112J0732Q814k922p819k856N805Q974l29j1967p540
2408i814P677J1596M525n910j3019o283Q841J1247o83q194m859K784P593K267
2422G768r243r340M944J0875L777o763j1292m609R437J2790j446j1529o817L024
$$ plain form
2436 -8424 643 6415 1086 -9008 -8428 206 4820 837 -8023 -12871 -2952 11805 11805 -3316 -13870
2451 -13870 -9221 4217 12946 7040 -6104 -8092 3359 9951 4477 -5993 -8151 2936 15979
2464 15979 13355 -3652 -12222 -4396 9087 15323 7523 -6916 -10661 2134 12179 6503 -5102
2477 -5102 -8728 -316 11333 9034 -7263 -14933 -3729 11667 12563 -1475 -16677 -15035 2857
2490 2857 13243 4857 -8415 -10770 -3281 4617 3413 -6998 -10969 1 11016 8288 -4961
2503 -4961 -14787 -11015 6101 17033 7454 -8853 -10979 -424 9764 8897 -1856 -7552 902 11049
2517 11049 7729 -3266 -7530 -597 10756 13843 2379 -10213 -8748 2143 10924 11062 1571 -8109
2531 -8109 -5983 3615 5733 -725 -5170 -2727 5013 8231 -975 -13156 -11781 1103 9808 6230
$$ packed form
2436h424R067N772n329j0094N80Q634M614l983q860m848R919J4757%j5121j0554
2451a3870M649J3438Q729n906j3144j988J1451O592n474j0470k158J1087J3043
2464A5979k624j7007q570P826J3483O236p800j4439l745J2795J0045n676j1605
2477e102l626Q412J1649k299j6297p670J1204J5396Q96j4038j5202J642J7892
2490B857J0386q386j3272k355P489P898j204j0411l971J0970J1015k728j3249
2503d961r826L772J7116J0932r579j6307k126J0555J0188q67j0753n696Q454J0147
2517A1049l320j0995m264O933J1353L087j1464j2592J465J0891Q781J38r491r680
2531h109K126R598K118o458m445K443P740L218r206j2181J375J2884Q705l578
$$ plain form
2545 6230 -4858 -13399 -8782 2309 5518 -1171 -6159 -5261 -2001 1594 -421 -7397 -7583 940 8298
2560 8298 6010 -4183 -13218 -9481 5779 14348 5746 -6997 -8470 -346 7487 6462 -2737 -5222
2574 -5222 4193 10785 5264 -5217 -9261 -2150 11534 14984 3644 -9590 -10188 -866 9306 11346
2588 11346 1280 -8391 -3633 6104 4623 -5237 -10396 -2978 10384 13107 -2601 -17955 -13600 4180
2602 4180 13871 7394 -7457 -14394 -5694 6180 4500 -3787 -6512 -1456 4920 4854 -4632 -13360 -6651
2617 -6651 9205 15330 6473 -9170 -15938 -4027 12717 13281 -697 -7756 -1921 7468 7938 -1488
2631 -1488 -8607 -614 12561 12559 -546 -11214 -8195 4473 14459 9909 -3819 -10226 -4624 3313
2645 3313 6865 3039 -4360 -4066 3525 5777 -3152 -11039 -8194 3483 12335 6837 -8414 -14969 -6129
$$ packed form
2545F230j1088q541M617J1091L209o689m988Q98L260L595k015o976j86Q523P358
2560H298k288j0193r035L737J5260Q569q602j2743j473Q124P833j025r199k485
2574e222R415O592n521j0481m044P111J3684L450j1340j3234n98R322J0172K040
2588A1346j0066r671M758R737j481r860n159P418J3362K723j5708j5354M355J7780
2602D180R691o477j4851o937Q700J1874j680q287k725N056O376o6r486q728O709
2617f651J5856O125q857j5643o768J1911J6744N64j3978p059N835R389M70r426
2631a488p119P993J3175kj3105j0668L019J2668R986m550j3728o407N602P937
2645C313L552l826p399K94P591K252q929p887K845J1677Q852n498j5251o555Q840
$$ plain form
2660 -6129 5076 6580 165 -6590 -5302 1330 3559 -2258 -6185 -3122 2379 6267 3803 -4784 -9974
2675 -9974 -2775 8266 11000 3518 -7121 -10106 -447 9420 7350 -826 -2836 1012 5255 3225
2689 3225 -4849 -7457 1410 11837 10497 -258 -9537 -10102 129 9893 8564 -1321 -7103 -4501
2703 -4501 1678 4446 -1061 -8281 -4378 6109 7385 -2658 -12263 -9540 3225 12595 5964 -10094
2717 -10094 -14777 -4237 7272 9393 475 -7728 -5081 3808 4693 -2845 -7330 -2436 7229 12489
2731 12489 5089 -9677 -13282 -465 12993 12809 988 -8724 -6184 6265 10085 942 -6498 -2607
2745 -2607 6941 10474 2176 -10200 -9652 3983 13208 6793 -6004 -11677 -5478 5900 9439 -72
2759 -72 -8418 -6184 1631 4950 -53 -8728 -8059 2342 9433 2471 -9656 -12538 -3564 7949 9821
$$ packed form
2660f129J1205J504o415o755J288O632K229n817l927L063N501L888k464q587n190
2675i974P199J1041K734p482j0639k985R659R867k070q176k010L848M243k030
2689C225q074k608Q867J0427j340j0755r279n65J0231R764j329r885n782K602
2703d501O179K768n507p220L903J0487J276j0043r605K723J2765R370o631j6058
2717a0094m683J0540J1509K121q918q203K647Q889Q85p538m485M894R665N260
2731A2489p400j4766l605J2817J3458j84j1821r712K540J2449L820r143p440L891
2745b607R548L533q298j2376N48J3635R225o415j2797n673O199J1378L539r511
2759g2q346K234P815L319n003q675O69J0401P091o962j2127k882Q974J1513J872
$$ plain form
2774 9821 -957 -10208 -6847 2233 5895 1616 -3674 -3498 3919 8011 2191 -6787 -6859 1139 9721
2789 9721 10901 2569 -6295 -5046 3681 8263 5037 -1368 -3658 1879 7882 5443 -2569 -4755 203
2804 203 6295 6207 -676 -7851 -5156 5019 9277 3296 -5827 -9905 -5503 3255 5326 -1011 -5669
2819 -5669 -3572 1192 1895 -3698 -10763 -8278 2403 8623 2768 -7830 -11539 -5871 4138 6437
2833 6437 -1855 -8680 -4763 3755 6661 928 -7044 -6859 3364 9517 3803 -5393 -6478 1292 10398
2848 10398 9992 -1414 -9330 -3084 8343 11767 4104 -4691 -4899 4315 10700 4306 -5203 -5477 3474
2863 3474 11424 8221 -4307 -11294 -3829 8702 10231 921 -7384 -6282 2827 7816 1209 -9132
2877 -9132 -8539 1563 8528 4743 -6063 -11795 -4949 5557 5971 -3510 -8824 -4919 3776 8113 988
$$ packed form
2774I821j0778r251L361R080L662m279n290J76P417M092n820q978p2P998Q582
2789I721J180q332q864J249Q727M582l226o405k290N537O003k439q012k186M958
2804B03O092q8o883p175K695J0175M258n981r123m078M402Q758K071o337m658
2819e669K097M764P03n593p065K485J0681O220n855j0598l709N668J0009K299
2833F437q292o825L917Q518K906n733p972J85J0223O153n714r196j085P770R106
2848A0398m06j1406p916O246J1427L424p663q795k08R214O385o394r509k74Q951
2863C474P950l203j2528o987P465J2531J529r310q305J102R109M989o607j0341
2877i132N93J0102O965l785j0806n732O846J0506M14r481n314L905Q695M337p125
$$ plain form
2892 988 -9766 -9628 -46 6119 3744 -3628 -6804 -773 7843 5790 -3811 -8570 -3504 5581 9224
2907 9224 3926 -5206 -6497 895 5705 2623 -2974 -4613 940 8253 7372 -1083 -6936 -4723 1951
2922 1951 5843 2025 -4521 -5709 1061 5972 2598 -4650 -7617 -3525 4249 6470 65 -6374 -5464
2937 -5464 240 2546 -3 -6093 -6882 365 6840 4895 -2663 -7435 -4857 3383 6870 2055 -5593
2952 -5593 -5054 2063 6229 2675 -5116 -7003 352 9858 9495 838 -5050 -2514 4624 7608 1379
2967 1379 -6172 -3828 5180 10479 5503 -3656 -7175 -986 8428 8225 -325 -5622 -1308 5750 7184
2982 7184 -1447 -11109 -8516 3210 9462 4258 -4792 -7276 -783 6425 3715 -6946 -11329 -3647
2996 -3647 5615 6535 -2089 -10386 -8591 1476 6077 302 -6801 -6002 2170 8748 4587 -6927 -12079
$$ packed form
2892I88j0754J38R582O165k375p372l176O031Q616k053r601m759N066R085L643
2907I224n298r132j291P392M810l082n597j639N553P313q81q455n853K213O674
2922A951L892l818o546j188O770M911l374p248k967M092P774K221o405o439R10
2937e464N704K306k549o090p89P247O475j945p558m772K578Q240L487m815p648
2952e593N39P117M166l554p791j887P355R506l63q657n888K536P138K984o229
2967A379p551K344R008N299m976r159l519O189R414k03q550n297M314P058J434
2982G184q631r662K593J1726O252n204r050k484O493P208k710j0661m383P682
2996c647R262R20q624q297J795J0067M601n775p103P99Q172O578m161j1514n152
$$ plain form
3011 -12079 -4358 5099 6033 -349 -5908 -3288 5830 8504 760 -6729 -4692 3368 8830 5209 -4012
3026 -4012 -7279 -568 6946 6266 -419 -5047 -2020 5605 9108 2923 -4362 -4187 1840 5588 3603
3041 3603 -3479 -6477 -1181 5890 4947 -1925 -5645 -3102 3504 7139 2050 -5626 -6850 -1268 2657
3056 2657 2180 -2461 -5264 -1606 4375 3751 -2841 -6898 -4764 2214 7003 4037 -4192 -6719 -2373
3071 -2373 2811 2772 -2101 -5640 -1632 5908 7429 588 -5853 -4472 1452 6165 3664 -3634 -5283
3086 -5283 1803 7547 6046 -1296 -6550 -3966 4754 8507 2932 -3960 -3681 2555 6582 2261 -6435
3101 -6435 -8383 531 9579 7421 -1555 -7929 -4762 3457 6249 -491 -7082 -4356 4009 7285 1595
3116 1595 -7025 -8904 -696 7312 5314 -3462 -7294 -2795 5366 6624 -1538 -9064 -5721 4121 7903
$$ packed form
3011a2079P721R457R34o382n559K620R118K674p744p489K037Q060N462l621r221
3026d012l267O711P514o80o685m628L027P625L503o185p285J75O027L748j985
3041C603p082k998N296P071r43o872l720K543O606L635n089p676j224N582L925
3056B657m77m641k803L658N981o24o592m057K134O978M789k966q229k527M346
3071b373N184l9m873l539M008P540J521o841o441J381N924M713k501p298j649
3086e283P086N744j501p342n254K584Q720L753n575o892K79O236M027m321q696
3101f435j948Q914R048k158q976o374L167Q219K792o740o591K726Q365L276n690
3116A595q620j879Q208Q008j998q776l832M499Q161J258q162p526L343R842L782
$$ plain form
3131 7903 2311 -5274 -6407 776 7193 3512 -5065 -6953 -161 6804 6834 -1609 -8239 -4749 4076
3146 4076 6740 1359 -4607 -4479 1730 6395 2519 -5631 -7021 -588 6039 5958 -515 -6402 -4135 2771
3162 2771 4952 -249 -5294 -3460 2353 6967 3371 -4208 -6892 -1766 4376 4489 777 -3843 -2182
3177 -2182 3145 4929 325 -4600 -3857 1386 6588 5479 -1309 -5077 -1316 4006 4757 606 -3702
3192 -3702 -2921 3078 7186 2567 -3959 -4985 -540 4667 4889 -470 -4794 -1445 4346 4359 -1224 -6300
3208 -6300 -6052 1166 6899 3927 -3638 -6503 -2659 2327 2539 -3203 -7117 -2548 4792 6006 -1430
3223 -1430 -8303 -7489 266 6492 3298 -4734 -6543 -380 5203 3624 -3304 -7888 -3338 5033 7225
3238 7225 573 -5254 -3635 3315 7432 2776 -6089 -6934 1912 9086 7314 -1130 -6725 -3349 4737
$$ packed form
3131G903n592p585j133P183O417l681q577j888O792O965L0q443o630L490Q825
3146D076K664n381n966J28O209M665l876q150j390O433O627q1o473n887K267O906
3162B771K181n201n045J834N813M614l596p579k684N126O142J13l712m620J661
3177b182N327J784m604m925P43N243N202j109o788l768L761N322P51m151m308
3192c702P81N999M108m619o526j026M445N207K22n359m324L349N791J3n583n076
3208f300K48P218N733k972p565k865L844M986K12n742l914M569P340J214p436
3223a430o873Q14P755O226l194q032j809O163N583j579o928m584M550Q371K192
3238G225o652n827J619O950M117m656q865q45Q846P174j772q444n595L376Q086
$$ plain form
3253 4737 6436 190 -4795 -983 6048 8250 1353 -7326 -7285 1767 7894 4941 -2865 -6124 -1802
3268 -1802 5052 5531 -1840 -6383 -3467 2966 5066 310 -5797 -5398 1404 5852 1770 -5203 -6385
3283 -6385 -1244 5307 6107 -843 -6808 -4106 2225 4055 629 -3423 -3589 1577 4725 1124 -4186
3298 -4186 -4397 805 6059 6285 -368 -5799 -4599 1535 4917 2555 -1775 -3173 -222 3667 1980
3313 1980 -2931 -4195 -357 4111 4450 -1020 -6630 -5254 1485 4421 1499 -3763 -6136 -2084 3187
3328 3187 3842 -1364 -4844 -2622 1272 2012 -1627 -5642 -3972 3034 6805 2289 -4837 -7848 -2284
3343 -2284 6068 7768 780 -4414 -2433 3007 4343 695 -3485 -2238 5100 7908 2802 -4160 -4326
3358 -4326 1610 8616 7829 -585 -6344 -3137 4337 7156 2733 -3453 -3470 2463 5884 1149 -5573 -4973
$$ packed form
3253D737J699o246m985L812P031K202o897q679M1R052O127k953p806l259M322
3268a802O854M79p371m543K916O433K100m756o107L99O802M448m082o973j182
3283f385N141O551Q00o950n965K702O331J830l426m052j66N166L148l601n310
3298d186k11N202N254K26o653n431J200O134L382k362m330j398K951L889j687
3313A980m911j264L838M468L39n470n610J376O739K936k922n262k373M052N271
3328C187O55n206l480K222L894P40l639m015J670P006L771m516p126l011N564
3343b284Q352J700o988n194J981N440J336l648m180J247P338K808n106o962j66
3358d326N936P006p87q414n759L207P474K819m423o186j7N933L421m735o722O00
$$ plain form
3374 -4973 2287 7736 4240 -5492 -10194 -4116 5372 6412 -644 -6711 -6615 -525 3365 -405 -5403
3389 -5403 -4333 1350 3788 133 -6747 -9412 -2775 5757 6659 -859 -7018 -6066 520 5234 1604
3404 1604 -3945 -3608 2098 5441 2522 -3605 -4200 1336 6860 5069 -1958 -5266 -1460 4754 7916
3419 7916 4049 -2244 -3850 -185 3378 2975 488 -945 1197 5054 3231 -3145 -6541 -2746 4477
3434 4477 7316 3044 -4341 -6303 -1524 3150 2520 -869 -3311 -1916 1060 1285 -1948 -4507 -2166
3449 -2166 2022 3939 634 -5551 -6727 -1344 5920 5839 -257 -5655 -4979 736 4568 1538 -2875 -1496
3465 -1496 2978 4590 1163 -3865 -4054 2288 7856 5521 -2072 -6320 -3292 3920 7578 3981 -2723
3480 -2723 -4114 244 3941 2079 -2331 -3873 1255 6994 4058 -4794 -8759 -3315 4770 6580 128
$$ packed form
3374d973P260N449l496r732m702O078R488J040p056o067R6O090L890l770m998
3389e403J070N683K438l655o880k665O637Q532R02p518o159R52O586M714l630
3404A604n549L37N706L343k919o127n95N536N524j791p027l308L806O214L162
3419G916l867o293j606L665L563m03k487j433K142L857j823o376l396L795P223
3434D477K839m272p385j962M779M674o30l389k442J395K976K25l233k559K341
3449b166M188J917l305o185j176N383P264q1o096n398O76N715L832l030m413J379
3465a496M474J612l427n028j89O342N568k335p593m248L028P212L658l597o704
3480b723j391M358L697j862m410j542N128N739k936q852l965N444Q085J810o452
$$ plain form
3495 128 -7284 -6439 758 4877 1118 -4597 -5240 -1295 3246 757 -5287 -6578 -1075 5187 4834 -2007
3511 -2007 -9039 -7274 1727 6978 3231 -3172 -4840 -700 4208 1931 -3775 -4506 1921 6984 5211
3526 5211 -1563 -5688 -2269 5177 7815 2865 -3304 -3463 1265 5702 4709 -277 -2599 570 4404
3541 4404 2975 -1322 -3668 -918 5460 6909 1056 -6003 -5877 144 5141 4376 -580 -3921 -1575
3556 -1575 2093 1516 -1488 -3076 -982 2301 3622 -766 -4595 -4033 823 4774 3773 -1678 -6066
3571 -6066 -4003 2415 4890 1689 -1966 -2379 1133 3398 601 -3652 -3261 2149 5942 3448 -2160
3586 -2160 -5775 -2439 4012 6144 1352 -3897 -4019 74 3950 2548 -2479 -4615 -840 3427 1824
3601 1824 -3202 -6656 -3393 3473 5193 -1228 -7742 -6619 -624 4190 2133 -4054 -6678 -1858 2556
$$ packed form
3495A28p412Q45P197M119l759n715o43L945M541k489o044j291N503O262l53o841
3511b007p032J765R001N251l747o403j668M140M908k277n706p31O427N063j773
3526E211o774m125L419P446K638m950o169j59M728M437r93m986k322L169L834
3541D404j429m297k346K750O378J449n853p059J26O021M997p65m956l341K346
3556a575L668n77l004j588K094L283J321m388l829N62M856L951j001n451m388
3571f066K063O418K475l201l655m13L512K265k797m253L91N410L793k494n608
3586b160l615L336O451K132m792n249j22M093L876j402n027k136L775M267j603
3601A824n026l454L263O866J720o421o514J123N995M814k057o187k624M820M414
$$ plain form
3616 2556 1231 -3962 -6385 -2433 3374 4403 -2232 -7269 -5328 2161 5724 2760 -4068 -6061 -506
3631 -506 5107 3884 -1949 -3882 -455 5468 5332 -573 -5346 -1605 5448 7638 3110 -3025 -3956 2079
3647 2079 7093 5182 -921 -2967 595 5100 5328 443 -3142 -482 5004 5933 1301 -3967 -3637 1840
3663 1840 6745 3881 -2126 -4414 -451 3649 3641 -649 -4046 -1762 2954 3422 -136 -3708 -3070 1016
3679 1016 4522 2645 -3214 -5022 -1322 2947 3656 -41 -3888 -2727 1651 3254 563 -2943 -2822
3694 -2822 597 3597 2443 -2456 -4527 -1284 3291 3567 79 -4665 -4190 858 3907 1331 -3102
3709 -3102 -4232 -752 2758 1994 -2821 -5440 -2485 2295 2948 -1160 -5576 -5169 -104 3505 836 -4344
3725 -4344 -5673 -1338 2511 2403 -2597 -6356 -3103 2509 3431 -791 -5163 -4155 1413 5206 2289
$$ packed form
3616B556j325n193k423L952N807J029o635n037J941P489L563k964o828j993N555
3631e06N613j223n833j933L427N923j36n905m773L741P053K190m528o135r31O035
3647B079N014j911o103k046L562M505K28m885l585K660N486R29m632n268L30N477
3663A840M905k864o007k288L963M100qm290l397K284M716M68l558l572O38M086
3679A016L506j877n859j808L700M269P09l697l847J161M378J603k691l506J21
3694b822L419L000j154m899k071L243M575K76l488m744M75N048L049k576m433
3709c102j130L480L510p64m815k619K955M780O53m108m416M07N065L609k669n180
3725d344j329M335L849j08n000l759L253N612R22m222m372J008N568L793k917
$$ plain form
3740 2289 -4520 -4805 238 4984 4138 -1209 -4579 -1554 4963 5437 424 -3841 -2109 3692 6680 3064
3756 3064 -2955 -3589 1968 6488 4543 -1216 -4141 -442 5646 5887 -2 -4105 -1795 3361 5581
3771 5581 1750 -4223 -4346 1749 5302 2692 -2724 -4518 -828 4112 3877 -1433 -5118 -2344 2633
3786 2633 4187 864 -4239 -3881 1356 4678 1843 -2629 -4091 -252 3986 3702 -996 -4243 -1592
3801 -1592 2942 3987 974 -2779 -2661 1678 5108 2445 -1994 -3583 -826 3168 3663 -10 -3518
3816 -3518 -1661 2242 3081 480 -3551 -4223 193 3808 2340 -2463 -4532 -2276 1624 2523 -1034 -5062
3832 -5062 -4128 454 1996 -157 -3664 -4424 -1020 3035 1852 -3481 -5794 -2839 1658 3136 122
3847 122 -4919 -4116 1138 3710 1592 -2629 -3441 -47 4483 3337 -1712 -4183 -919 4115 5163 1026
$$ packed form
3740B289o809k85N043M746q46n347l370L025O517M74n013m265J732N801K988l616
3756C064o019o34N557M520j945n759k925L699O088K41n889m103K310N156K220
3771E581l831n973j23O095L553k610n416j794L690M940k35n310l685K774M977
3786B633J554l323n103L58N237L322k835m472j462L839M238k84m698l247K651
3801a592M534J045l013l753J18M339L430k663m439j589K757L994M95l673l508
3816c518J857L903Q39k601m031o72M416L615j468m803k069K256L900Q99l557m028
3832e062R34M582J542k153l507p60L404M055j183n333k313K955M497J478l014
3847A22n041Q03N254K572k118m221q12L394M530j146n049k471L264N034J048m137
$$ plain form
3863 1026 -4465 -3276 2944 6049 3027 -1716 -2995 629 4703 3558 -1802 -4494 -737 4627 4969
3878 4969 -90 -4873 -3435 2765 5620 1692 -3783 -4332 133 4042 2832 -3380 -5645 -1578 3354
3893 3354 3015 -1366 -4691 -2434 3266 5328 322 -5309 -4667 492 4016 2764 -2373 -4429 -625
3908 -625 3922 3420 -837 -3565 -1557 3705 5285 821 -3972 -3117 1784 4589 2896 -1879 -3629 -33
3924 -33 4599 4048 -608 -3021 -1531 1925 3541 221 -3972 -3189 1298 3379 1429 -2779 -4285 -1501
3940 -1501 2778 2594 -1043 -3725 -2650 711 2197 -120 -4127 -3836 50 2823 1387 -2283 -3569
3955 -3569 -1256 3076 3518 -359 -3754 -3021 705 3426 1638 -2145 -2967 913 4105 3089 -805 -2537
3971 -2537 -560 3861 4729 787 -2896 -1890 2156 4624 2390 -2364 -3612 436 4372 3435 -1132
$$ packed form
3863A026n491J189O220L105l022m743j279L624M074j145n360k692L757N364L42
3878D969n059m783J438O200K855l928n475n49M465L909j210o212k265M067M932
3893C354l39m381l325K257N700K062n006n631O42N159L524j252n137k056L804
3908f25M547n02m257k728K008N262J580m464m793Q55M901K805j693m775j750L596
3924c3M632n51m656k413J490L456J616l320m193P83M487K081j950m208j506K784
3940a501M279j84l637k682J075L361J486k317m007K91L886K773j436l670j286
3955c569K313M332M42l877l395P33L726K721j788l783q22L880L192j016l894j732
3971b537J977M421Q68l942l683J006M046K468k234m754j248M048L936r37m567
$$ plain form
3986 -1132 -3258 -1470 2945 4071 -506 -4937 -2985 1843 3762 1036 -3710 -4828 -500 3825 2431
4001 2431 -3002 -5150 -2086 2486 3287 -1297 -5515 -3431 1927 3867 197 -3904 -4307 345 4714
4016 4714 2501 -3165 -4618 -766 3762 4131 -361 -4306 -1960 3709 4941 643 -3268 -2825 1722
4031 1722 5188 3108 -2325 -3032 816 4279 3942 -244 -3629 -1310 3681 4616 774 -3301 -2778 1148
$$ packed form
3986a132k126J788M415J126m577m431J952M828J919k726m746j118M328M325j394
4001B431n433k148L064M572Q01m584m218K084N358J940l670m101m03M652M369
4016D714k213n666j453L852M528L69m492l945K346N669J232m298l911M43M547
4031A722L466k080n433p07L848L463l37m186l385K319M991R35l842m075N23L926
$$ [...]
8191B12
##END NTUPLES=NMR FID
##END=
