##TITLE=1H_CG-1112-B
 DMSO, 8 sc, 
 29.9.2020
##JCAMPDX= 6.0         $$ Bruker NMR JCAMP-DX V2.0
##DATA TYPE= NMR FID
##DATA CLASS= NTUPLES
##ORIGIN= UXNMR, Bruker Analytische Messtechnik GmbH
##OWNER= root
$$ XWIN-NMR		Version 3.5
$$ Tue Sep 29 10:27:07 2020 Russian Standard Time (UT+4h)  she@DPX200
##.OBSERVE FREQUENCY= 200.1315066352
##.OBSERVE NUCLEUS= ^1H
##.DELAY= (6, 6)
##.ACQUISITION MODE= SIMULTANEOUS
##.ACQUISITION SCHEME= undefined
##.AVERAGES= 8
##.DIGITISER RES= 18
##SPECTROMETER/DATA SYSTEM= spect
##.PULSE SEQUENCE= zg30
##.SOLVENT NAME= DMSO
##.SHIFT REFERENCE= (INTERNAL, DMSO, 0, 15.7039)
##AUDIT TRAIL= $$ (NUMBER, WHEN, WHO, WHERE, WHAT)
$$ ##TITLE= Audit trail, XWIN-NMR		Version 3.5
$$ ##JCAMPDX= 5.01
$$ ##ORIGIN= Bruker BioSpin GmbH
$$ ##OWNER= she
$$ F:/spectra/data/she/nmr/H-F/1/audita.txt
$$ ##AUDIT TRAIL=  $$ (NUMBER, WHEN, WHO, WHERE, WHAT)
(   1,<2020-09-29 10:26:17.21 +0400>,<she>,<DPX200>,
      <created by zg, POWCHK disabled, PULCHK disabled
       configuration hash MD5:
       00 E9 B6 7A A2 85 ED C7 34 08 36 98 17 FE 4E 26
       data hash MD5: 16K
       6A 27 6D 89 A0 63 B4 52 B6 8A FA BE 90 A4 97 D4>)
$$ ##END=
$$ 
$$ hash MD5
$$ 51 06 D8 88 52 47 EC 29 6F 3D 63 F1 50 4C 17 EF
##$RELAX= 
##$RELAX= 
##$RELAX= 
##$RELAX= 
##$RELAX= 
##$RELAX= 
$$ Bruker specific parameters
$$ --------------------------
##$DU= <F:/spectra>
##$EXPNO= 1
##$NAME= <H-F>
##$PROCNO= 1
##$TYPE= <nmr>
##$USER= <she>
##$AMP= (0..31)
100 100 100 100 100 100 100 100 100 100 100 100 100 100 100 100 100 100 
100 100 100 100 100 100 100 100 100 100 100 100 100 100 
##$AQSEQ= 0
##$AQ_mod= 1
##$AUNM= <au_zg>
##$AUTOPOS= <>
##$BF1= 200.13
##$BF2= 200.13
##$BF3= 200.13
##$BF4= 200.13
##$BF5= 200.13
##$BF6= 200.13
##$BF7= 200.13
##$BF8= 200.13
##$BYTORDA= 1
##$CFDGTYP= 0
##$CFRGTYP= 5
##$CHEMSTR= <none>
##$CNST= (0..31)
1 1 145 1 1 1 1 1 1 1 1 1 1 1 1 1 1 1 1 1 1 1 1 1 1 1 1 1 1 1 1 1 
##$CPDPRG= <>
##$CPDPRG1= <>
##$CPDPRG2= <>
##$CPDPRG3= <>
##$CPDPRG4= <mlev>
##$CPDPRG5= <mlev>
##$CPDPRG6= <mlev>
##$CPDPRG7= <mlev>
##$CPDPRG8= <mlev>
##$CPDPRGB= <>
##$CPDPRGT= <>
##$D= (0..31)
0 1.2 0 0 0 0 0 0 0 0.06 0 0.03 0 0 0 0 0.0002 0 0 0 0 0 0 0 0 0 0 0 0 
0 0 0 
##$DATE= 1601360776
##$DBL= (0..7)
120 120 120 120 120 120 120 120 
##$DBP= (0..7)
150 150 150 150 150 150 150 150 
##$DBP07= 0
##$DBPNAM0= <>
##$DBPNAM1= <>
##$DBPNAM2= <>
##$DBPNAM3= <>
##$DBPNAM4= <>
##$DBPNAM5= <>
##$DBPNAM6= <>
##$DBPNAM7= <>
##$DBPOAL= (0..7)
0.5 0.5 0.5 0.5 0.5 0.5 0.5 0.5 
##$DBPOFFS= (0..7)
0 0 0 0 0 0 0 0 
##$DE= 6
##$DECBNUC= <off>
##$DECIM= 32
##$DECNUC= <off>
##$DECSTAT= 4
##$DIGMOD= 1
##$DIGTYP= 9
##$DL= (0..7)
0 120 120 120 120 120 120 120 
##$DP= (0..7)
150 150 150 150 150 150 150 150 
##$DP07= 0
##$DPNAME0= <>
##$DPNAME1= <>
##$DPNAME2= <>
##$DPNAME3= <>
##$DPNAME4= <>
##$DPNAME5= <>
##$DPNAME6= <>
##$DPNAME7= <>
##$DPOAL= (0..7)
0.5 0.5 0.5 0.5 0.5 0.5 0.5 0.5 
##$DPOFFS= (0..7)
0 0 0 0 0 0 0 0 
##$DQDMODE= 0
##$DR= 18
##$DS= 0
##$DSLIST= <SSSSSSSSSSSSSSS>
$$ [...]
##$SUBNAM2= <"">
##$SUBNAM3= <"">
##$SUBNAM4= <"">
##$SUBNAM5= <"">
##$SUBNAM6= <"">
##$SUBNAM7= <"">
##$SUBNAM8= <"">
##$SUBNAM9= <"">
##$SW= 16.880792210976
##$SWIBOX= (0..15)
0 0 2 0 0 0 0 0 0 0 0 0 0 0 0 0 
##$SW_h= 3378.37837837838
##$TD= 16384
##$TD0= 1
##$TE= 0
##$TE2= 300
##$TE3= 300
##$TEG= 300
##$TL= (0..7)
0 120 120 120 120 120 120 120 
##$TP= (0..7)
150 150 150 150 150 150 150 150 
##$TP07= 0
##$TPNAME0= <>
##$TPNAME1= <>
##$TPNAME2= <>
##$TPNAME3= <>
##$TPNAME4= <>
##$TPNAME5= <>
##$TPNAME6= <>
##$TPNAME7= <>
##$TPOAL= (0..7)
0.5 0.5 0.5 0.5 0.5 0.5 0.5 0.5 
##$TPOFFS= (0..7)
0 0 0 0 0 0 0 0 
##$TUNHIN= 0
##$TUNHOUT= 0
##$TUNXOUT= 0
##$USERA1= <user>
##$USERA2= <user>
##$USERA3= <user>
##$USERA4= <user>
##$USERA5= <user>
##$V9= 5
##$VALIST= <valist>
##$VCLIST= <CCCCCCCCCCCCCCC>
##$VD= 0
##$VDLIST= <DDDDDDDDDDDDDDD>
##$VPLIST= <PPPPPPPPPPPPPPP>
##$VTLIST= <TTTTTTTTTTTTTTT>
##$WBST= 1024
##$WBSW= 4
##$XGAIN= (0..3)
0 0 0 0 
##$XL= 0
##$YL= 0
##$YMAX_a= 141654
##$YMIN_a= -155581
##$ZGOPTNS= <>
##$ZL1= 120
##$ZL2= 120
##$ZL3= 120
##$ZL4= 120
##$ABSF1= 10
##$ABSF2= 0
##$ABSG= 5
##$ABSL= 3
##$ALPHA= 0
##$AQORDER= 0
##$ASSFAC= 0
##$ASSFACI= 0
##$ASSFACX= 0
##$ASSWID= 0
##$AUNMP= <proc_1d>
##$AZFE= 0.1
##$AZFW= 0.1
##$BCFW= 1
##$BC_mod= 2
##$BYTORDP= 1
##$COROFFS= 0
##$CY= 11.3945322036743
##$DATMOD= 1
##$DC= 2
##$DFILT= <>
##$DTYPP= 0
##$F1P= 16.9975609425685
##$F2P= -3.02152046262296
##$FCOR= 0.5
##$FTSIZE= 0
##$FT_mod= 4
##$GAMMA= 1
##$GB= 0.15
##$INTBC= 1
##$INTSCL= 1
##$ISEN= 128
##$LB= 0.24
##$LEV0= 0
##$LPBIN= 0
##$MAXI= 10000
##$MC2= 0
##$MEAN= 0
##$ME_mod= 0
##$MI= 1.114404
##$NCOEF= 0
##$NC_proc= 0
##$NLEV= 6
##$NOISF1= 3.799351
##$NOISF2= 2.8
##$NSP= 1
##$NTH_PI= 0
##$NZP= 0
##$OFFSET= 15.70392
##$PC= 1
##$PHC0= -9983.168
##$PHC1= 26.00089
##$PH_mod= 1
##$PKNL= yes
##$PPARMOD= 0
##$PSCAL= 0
##$PSIGN= 0
##$REVERSE= no
##$SF= 200.130013532006
##$SI= 16384
##$SIGF1= 3
##$SIGF2= 2
##$SINO= 400
##$SIOLD= 16384
##$SREGLST= <1H.CDCl3>
##$SSB= 0
##$STSI= 0
##$STSR= 0
##$SW_p= 3612.71676300578
##$SYMM= 0
##$S_DEV= 0
##$TDeff= 0
##$TDoff= 0
##$TI= <>
##$TILT= no
##$TM1= 0
##$TM2= 0
##$TOPLEV= 0
##$USERP1= <user>
##$USERP2= <user>
##$USERP3= <user>
##$USERP4= <user>
##$USERP5= <user>
##$WDW= 1
##$XDIM= 8192
##$YMAX_p= 0
##$YMIN_p= 0
$$ End of Bruker specific parameters
$$ ---------------------------------
##NTUPLES= NMR FID
##VAR_NAME=  TIME,          FID/REAL,        FID/IMAG
##SYMBOL=    X,             R,               I
##VAR_TYPE=  INDEPENDENT,   DEPENDENT,       DEPENDENT
##VAR_FORM=  AFFN,          ASDF,            ASDF
##VAR_DIM=   8192,          8192,            8192
##UNITS=     SECONDS,       ARBITRARY UNITS, ARBITRARY UNITS
##FACTOR=    0.000296,      1,               1
##FIRST=     0,             0,               0
##LAST=      2.424536,      0,               0
##MIN=       0,             -155581,         0
##MAX=       2.424536,      141654,          0
$$ Real data points
##PAGE= N=1
##DATA TABLE= (X++(R..R)), XYDATA
0@%%%%%%%%%%%%%%%oJ4j6J6j6J6k1K9l2L9m7N4o2P2q3R2j06J22j38J58j80K02
37A07k27K55k86L18l53L93m36M81n32N90o52P20p93Q73r61J059j167J287j422
56g46J573j746J944k172K438k757L147l635M264n111O317q180J1484k9074J63328
71A41074m2486k53867O8055K06609m3614j97993K8814J76818J5212j73140m6985
82a21503J67201Q2328j75661q9855J82346R6380j90650r5482J82700R4345j60113
93b7964q5889J29697Q4283j03802r6281P5008J19578n3849j40976L5639J59484
104I4928l1054j69105L5261J72423l9320j68770L5628J56176j9831j35766M543
115f4887J21572J5165j16061l8988J19454O1551j23166p5821J27448P8671j30610
$$ plain form
0 0 0 0 0 0 0 0 0 0 0 0 0 0 0 0 0 -6 8 -8 8 -8 8 -13 16 -16 23 -24 30 -32 40 -43 49 -57 65 -73 85 -95 107
37 107 -120 135 -151 167 -186 207 -229 252 -280 310 -342 378 -415 458 -503 556 -611 676 -746
56 -746 827 -919 1025 -1147 1291 -1466 1681 -1954 2310 -2801 3516 -4664 6820 -22254 141074
71 141074 98588 -155279 -87224 119385 75771 -122222 -93408 83410 98622 -74518 -121503
82 -121503 45698 128026 -47635 -137490 44856 141236 -49414 -144896 37804 132149 -27964
93 -27964 -113853 15844 100127 -3675 -99956 -24948 94630 40781 -100195 -64556 94928
104 94928 63874 -105231 -69970 102453 63133 -105637 -70009 86167 66336 -69430 -64887
115 -64887 56685 71850 -44211 -83199 36255 97806 -25360 -101181 26267 104938 -25672
126b5672p3623J28675O7039j22354o4002J03314O2926q0299o4363O0659P0398
137F2698m6565q4506L7119R7976k9812j04917K7899J05431k8255r9424K8482R1843
149E7969k2535q3397R778P2899O743o4714k1102O2035L3837o7621m5381P2117
161A0628N2037p4524n3329P3592M9055o9245m5178O2761M4094n2072m6754L8669
173a0266N3148k7593n7162K2036O4595k0638p1320K0864P4116k0123p1857K0359
185b3841O4609j7911n8276J3467N2047n468m7589o010M4522J4970m3317k1124
197c3921M5579K5079m8978k6650M8328K7733m4822k5241L9523K3952l2555k4864
209b6837K5536K8978j7931l5061J1871M0213r240m3737R014M6813j0359m7858
$$ plain form
126 -25672 -99295 29380 96419 -25935 -89937 13377 76303 -3996 -68359 -7700 62698
137 62698 16133 -68373 -31254 66722 36910 -68007 -40108 65323 37068 -62356 -33874 57969
149 57969 35434 -47963 -38185 34714 41457 -23257 -44359 17676 51513 -16108 -61489 10628
161 10628 62665 -11859 -65188 8404 57459 -11786 -56964 5797 49891 -2181 -48935 -10266
173 -10266 42882 15289 -41873 -19837 44758 24120 -47200 -26336 47780 27657 -44200 -23841
185 -23841 40768 22857 -35419 -21952 30095 24627 -22962 -28972 15550 30520 -12797 -33921
197 -33921 11658 36737 -12241 -38891 9437 37170 -7652 -32893 6630 30582 -1973 -26837
209 -26837 -1301 27677 9746 -25315 -13444 26769 17529 -26208 -17194 29619 19260 -28598
221b8598R402M6023q379m1651N644L6733j345l4238l982L3082J0739l3328j6089
234b5987L4260J8381l4175j9166L5828J8430l4907j8079L1551J7541k6600j6811
246a9734K0632J8291j6614k0642J1918K4637r336k7720P272K9044o515k9366O839
259a1294K8542o006k6810L374K4142M26k1289m005J9731P924j9730j1719K0616
272C902J4723k1398j6130K1266J5915k0838j5209J9888J4612j7600j4830J3960
284a739J5236j0500j6344P940J8100o700j9225N150K0805m500k0797M130K0052
297A1608l474j8628K959J6733j049j5240j313J3425L956j2307o178J2212P918
310A0622j2698r120J2525R740j1784r852J0672R579r615q873P506R629n563j0276
$$ plain form
221 -28598 -19196 26827 18448 -23203 -17559 19174 17829 -16409 -20391 12691 23430 -9898 -25987
234 -25987 8273 26654 -7521 -26687 9141 27571 -7336 -25415 6136 23677 -2923 -19734
246 -19734 898 19189 2575 -18067 -6149 18488 9152 -18568 -11296 17748 11233 -18133 -11294
259 -11294 17248 11242 -15568 -12194 11948 12374 -8915 -12920 6811 14735 -4995 -16714 3902
272 3902 18625 -2773 -18903 2363 18278 -2560 -17769 2119 16731 -869 -15699 -1739
284 -1739 13497 2997 -13347 -5407 12693 5993 -13232 -8082 12723 8223 -12574 -8444 11608
297 11608 8134 -10494 -7535 9198 8149 -7091 -8404 5021 8977 -3330 -9508 2704 10622
310 10622 -2076 -11196 1329 11069 -715 -10567 105 9684 69 -8804 -1298 8331 2768 -7508
324g508L552J1421k277j1989J372J2740j059j3371J043J3047n60j2103n1J1212
338E469K62j0331j275R184L074q927m137Q443M727q092n530Q065N623p478o000
353f923P277N687o211n450N031N490m119n438K985O065k072o593J332O862r01
368C022p123O77P204l16o931l31O641P05n986j060N299J988n358k541N305L253
384D448n075l874N331L359m604l797M837L826m666l952L976L943l044m242K896
399f38L908k082m307J659M588j651m492J571M433j120m417O54M224k14m060M7
415a897L649M93l650p29L272J438l570j740L432K241l377k214K977K353k796k757
431b875K965K664k222k920J961K691j608k989J263L480j015l854J186L537o87
$$ plain form
324 -7508 -3956 7465 5188 -6801 -5429 7311 6252 -7119 -6076 6971 6411 -5692 -5743 5469
338 5469 5731 -4600 -5875 3309 6383 -2544 -6681 1762 6489 -1603 -7133 932 6555 -923 -6923
353 -6923 354 6041 -170 -5620 -589 4901 782 -4656 -1671 4394 2322 -4271 -2939 3923 3022
368 3022 -4101 -3424 3780 3464 -3467 -3798 2843 3548 -2438 -3498 1801 3789 -1569 -4110 1195 4448
384 4448 -627 -4501 830 4189 -415 -4212 625 4451 -215 -4167 -191 3752 708 -3534 -638
399 -638 3270 1188 -3119 -1460 3128 1477 -3015 -1444 2989 1869 -2548 -1894 2330 2116 -1944 -1897
415 -1897 1752 2245 -1405 -2134 1138 2576 -994 -2734 698 2939 -438 -2652 325 2678 -118 -2875
431 -2875 90 2754 532 -2388 -427 2264 656 -2333 -1070 2410 1395 -2459 -1273 2264 1577
446A577l946Q80L759q72l335M44L100L45l101m52K739P94k935p53K730R69k587
463f44j480K825J152k274j753K510J460j800j567J558J769j642j813J002K354
478A657q92k360Q65K339p55k438L82K335J46k504j2K321L52k367m05K134P05k118
496f15j043K255R16k036q61K033R45j798j238J677J193j632j099J554J128j401
512b2j418J297J322p61j808R46J907r57j444K40J820m25j938M61J796k41j616
529h41K09J576qj597j74J618M56j796n96J487Q18j594n96J499O80j307r53J389
547B70P74j204j000J203J246j025j518J184J140r13j518J045J555p17j825N63
563g40J662l56j387L0J672j68j346j77J763k92j278l02J575L54j608m88J547P49
$$ plain form
446 1577 -2369 -1489 2270 1398 -1937 -1493 1607 1952 -1149 -1601 1138 1932 -1003 -1756 974 1943 -644
463 -644 -2124 701 1853 -421 -2174 336 1796 -4 -1571 -13 1756 114 -1699 -697 1657
478 1657 765 -1595 -730 1609 854 -1584 -1202 1133 1279 -1225 -1237 1084 1436 -931 -1336 798 1503 -615
496 -615 -1658 597 1513 -523 -1384 649 1594 -204 -1442 235 1428 -204 -1303 251 1379 -22
512 -22 -1440 -143 1179 418 -1390 -444 1463 506 -938 -698 1122 697 -1241 -780 1016 775 -841
529 -841 -632 944 936 -661 -835 783 1239 -557 -1153 334 1152 -442 -1038 461 1141 -166 -1119 270
547 270 1044 -160 -1160 43 1289 264 -1254 -70 1070 157 -1361 -316 1239 522 -1303 -740
563 -740 922 566 -821 -791 881 713 -633 -810 953 661 -617 -919 656 1010 -598 -1086 461 1210
581A210j454p43J424Q11j443p21Q97J371j463j143J169J394j163j619J031J803
597A361j163j201N37J599o85j522O12J432k00j788L02J718k51j659j34J674K86
614I18j528m50J805K62j342o50J258J005j722q74J376J184j345j100J360J032
630A189j042j354J027J228p42j288N45J259l00j304J88J273j21j347J67J309L88
647A075j677n03J583N05j453m73J271P10j105j032J395J010j364q53P68J242j283
664a84p90O62J201o80j418R89J090l72j324L44J205J4j396q8J448q6j229j65J325
683E46P0j108l25J024O17j255k86R23O83j057p74J143P91r06r13O97R81l49j415
702i13N72J315o04j029K35J056m4j341K76Q66L12j105j70J130p8p40k07Q30J37
$$ plain form
581 1210 -244 -987 437 1248 -195 -916 -19 1352 -111 -1254 -85 1309 146 -1473 -442 1361
597 1361 198 -1003 -466 1133 448 -1074 -462 970 770 -1018 -716 1002 751 -908 -1042 632 918
614 918 -610 -1060 745 1007 -335 -985 273 1278 -444 -1318 58 1242 -103 -1203 157 1189
630 1189 147 -1207 -180 1048 306 -982 -437 822 522 -782 -594 679 558 -789 -622 687 1075
647 1075 -602 -1105 478 983 -470 -943 328 1038 -67 -1099 296 1306 -58 -911 -143 1099 -184
664 -184 -974 -312 889 209 -1209 -220 870 498 -826 -482 723 737 -659 -747 701 615 -614 -779 546
683 546 616 -492 -817 207 824 -431 -717 206 889 -168 -942 201 992 86 -827 -130 851 502 -913
702 -913 -341 974 370 -659 -424 632 588 -753 -477 389 701 -404 -574 556 478 -262 -469 361 498
721D98q29m91R93N82r90m51P09P24q82k82M95N35n30o96L49Q79o11m44P6J042
741F76m02p30J18P67o0q07r5P54K43r62k24J076J50o04n10P05M69n88o59Q12L98
762E27l59p73M35Q50p45l20K66P52m00o32L06R52p96l34R5L83J47q38L32M44R3
783C85n29m09Q60J56q24N0M96L38n36o28M67Q11p73m40N75O02o04n56M11P73o14
804A1n67M35N41m5q73kR62l4q43M56M10k9p93l73P74K79n86m22Q64L08o14j96
826c37M54L58o22k11M55N56m78n38M25L23m10n28J8P32l8o60L98M92j62l11m61
847e45O45N8l18j26K87L94o42k08M64L42l71k20M60L23n29o18M88M32l24k90J65
868a33O72l89n10K27L08M18r24lO72k64m33K17K34K21m79r3K25K65j24n59L76
$$ plain form
721 498 -331 -822 171 753 -237 -688 21 745 -137 -419 76 611 81 -615 -266 613 2 -442 -366 676
741 676 274 -456 -338 429 369 -438 -533 221 464 -498 -722 354 504 -100 -610 95 564 -24 -683 129 527
762 527 168 -605 -170 680 -65 -385 -119 633 233 -399 -93 859 63 -271 -176 207 354 -484 -152 292 385
783 385 -144 -553 307 463 -361 -311 185 523 -13 -641 -174 637 -136 -576 -1 601 -3 -559 -148 625 11
804 11 -556 -121 420 375 -498 -500 462 428 -415 41 451 422 -371 -744 30 309 -277 -699 165 473 -141 -337
826 -337 117 475 -147 -358 97 653 175 -363 62 385 -25 -553 -535 197 159 -501 -103 389 227 -84 -545
847 -545 100 158 -160 -286 1 395 -247 -455 9 351 -20 -240 220 543 14 -604 -116 316 -8 -298 -133
868 -133 539 150 -360 -133 175 593 -331 -334 338 74 -359 -142 92 313 -166 -259 -34 231 107 -452 -76
889g6L23o15J87J45L59m26j13K44J57j37l49K03M38j17n29L10J77m04L6K24o4
910b7R1j99j54L26Jk24L2K45J60k50l8L30l9l07k90M20p4r9k05M46J38m54j0L51
934A70K24k58j92K16O5j89m01K29J34K17j32J20j08O3k56R0K2J32j80k0K79k44
956a9q0J42J65J22m17o5K39P8j32lK03p7l14n6K65Q3k79J2K9J92J32k38J78K12
980C72l03n9l16L17J29j47K33r6k21JK28k26K26j77k7%J96k61R5O8J29m79K55
1003f3l4J81k22Q7j79K02m6n9L12o7j42j79K45j11J05O9Oj46J5q9K53j03j29p4
1027a68J77l3j35J85n9K72k26j81R7O8J68n03L25J42r6J69J64k31j13k32K9K45
1049F4O7l38J49J61k27O1J86K2k53K1o5J76j36N6K5L41j84k36PJ10L51o25K15
$$ plain form
889 -76 247 -368 -181 -36 323 -103 -216 28 185 48 -301 -98 340 223 -306 4 181 -223 -187 37 -27
910 -27 64 -135 -289 37 38 -186 -154 91 251 1 -37 293 254 -53 -343 77 3 -96 -301 145 283 -171 -181 170
934 170 394 136 -56 160 225 36 -365 -136 -2 215 83 203 95 158 -98 -8 14 146 -34 -54 225 -19
956 -19 -99 43 208 330 -87 -152 87 165 33 30 233 156 -158 -214 51 134 -145 -133 -104 88 220 -18 160 372
980 372 69 10 -306 11 140 -7 226 130 -91 -90 138 -88 138 -39 -66 -66 130 -131 -36 32 161 -318 -63
1003 -63 -97 84 -138 -51 -230 -28 -74 -133 179 112 -30 -209 36 -75 30 99 105 -41 -26 -115 138 35 -94 -168
1027 -168 9 -24 -159 26 -33 239 13 -168 -71 -3 165 -338 -13 129 33 202 366 135 22 -210 -181 64
1049 64 131 -207 -58 103 -124 -63 123 145 -108 -87 -152 24 -112 -56 -31 310 126 -110 -103 7 358 -267 -52
1072e2M6J25k54J51l7R1j57K9J74j36r4pJ96K4j57R4P7J4j04r2M5M35l95k18P0
1097a32K16l47J95O2K11k68O4l02L99J25m89K30K60k4k28M3j40J95k1j43L33K4
1119B63k73o6R2l6l3M6m9K74q8n23K98N3o8j06K03O3j31pKJ53O5m14K01J04nJ64
1145A82l40J90J32k69o3L67j64j07m1L01j4l23j12O41j33j69k86M0M53l96j45
1166b56K75j02L43m77J10p7L38j95m8k8K32j70j36L22J22k85j07L03P0m61M2J58
1188b7K18K5l92J03J29J8j29M3J5Q7k69K32J4L6Lm9J46j95k42K29M0K42m61K96
1212A12J91j61k27r8M15k18j84q8K18N8k25L3J98K30k98r9N7J50m0p8R2j37K70
1235A71n8J17j22n6j18R3m8k3p8O7MM0k6L63l52K23j44j10P2J02j31j14J29Q2
$$ plain form
1072 -52 -6 119 -135 16 -21 70 -87 -58 116 -20 -114 -121 75 99 -58 36 113 127 23 -69 -24 411 16 -202 -132
1097 -132 84 -263 -68 -6 205 -63 1 -301 98 223 -266 -36 224 200 -28 15 -125 70 49 -94 239 263
1119 263 -10 -76 16 -20 -53 -7 -56 218 130 -393 -95 -42 -110 -216 -13 50 -81 -88 -86 67 132 -282 -81 23 18 182
1145 182 -158 32 164 -105 -168 199 35 -72 -113 188 174 -149 -261 380 247 78 -208 -168 285 -111 -256
1166 -256 19 -83 260 -217 -107 -184 154 -41 -89 -117 115 -55 -191 131 253 -32 -139 164 234 -227 -185 -27
1188 -27 191 216 -176 -73 56 74 -55 -12 3 90 -179 53 67 103 106 57 203 8 -234 -5 35 277 -184 112
1212 112 303 142 -85 -183 232 14 -170 -258 -40 18 -207 -174 24 254 -44 -143 -86 64 24 -54 38 -99 171
1235 171 113 230 108 52 -66 27 -21 -44 -122 -55 -51 -11 -37 326 -26 197 53 -57 15 117 -14 -128 1 83
1259H3k49K83j31l0M8k82L90J66p3k07J33m3J4j46j22J18P4k99J71r8L11j62l0
1282h1J42L67o82J26K70J16j64k50Q2R9j35N1R4q3K41n31K20J42j9L5mR4N2k90
1306a08J58l2J24l72K77Q3j18M7Mm6m2K76l40J20L26l93J39q8k23L13j86j56L40
1329A03Q6k95k6L2K92l1l21K23r6R9j58J6J69pn9l6N8N5k95J92M4L8K05k05j46
1354f3J45o0oj5K49k49j06L0J84j76M0J5J25qj73J39j41J50k47o7L78j48K47k08
1378C5J26j33l7K37p8k41J70l49M10j91K29m5n1j70j37J42K67K2J2j45j68K20
1400A25l23J19RM93n57L2P3J40k9m9p1L31k88p7k1j27K63k5Q4N0Kj0j82J43k28
1425a23R4l38L47L6j86j82M71q5j19j80K47J62R1k01r3l5J88k65Q6L2o8k19M09
$$ plain form
1259 83 -166 117 -14 -44 4 -278 112 278 205 -2 131 88 102 -44 -166 -48 26 -273 -102 -200 111 -51 -81
1282 -81 61 428 -254 -128 142 258 94 -156 -74 25 -110 -59 35 -48 193 -338 -118 24 5 40 36 130 182 -108
1306 -108 50 18 142 -230 47 130 12 59 63 17 -25 251 -89 31 357 -36 103 15 -208 105 -81 -237 103
1329 103 189 -106 -132 -100 192 161 -160 63 -33 66 -92 -76 93 86 27 -9 49 104 -191 1 45 83 288 83 -63
1354 -63 82 22 16 1 250 1 -105 -75 109 -67 -27 -12 113 105 -68 71 -70 80 -167 -234 144 -4 243 35
1378 35 161 28 -9 228 150 -91 79 -270 140 -51 178 133 82 -88 -225 -83 184 206 218 73 -95 125
1400 125 -198 -79 -70 423 -134 -102 -29 111 82 33 -38 293 5 -72 -93 -220 43 18 102 152 154 144 -38 105 -123
1425 -123 -29 -367 -20 16 -170 -352 119 34 -85 -265 -18 144 235 34 -59 -94 94 -171 -85 -53 -121 -340 69
1448F9j46K36O3l99L07k3j1k67J53m2k42J38K6K33L0l76M81Lk53J1p7J11R6j44
1472b3K4N4q3J21q6L9q6J0l3K71l84R2m8J69J6l6l13M52k64q6K31p8P8q8j83K32
1498br9K21k85Q9L0m5J71j76K56r7l00l1K28J70l81J80M54j89J31l21R2p9j76
1521a59J49P4j82J25l43M15k85J05N3l7p0J9J05l8L84l48JP1K6oj83q8Q2K44k84
1546a70K34j6o5j64n7K71k1k6K03K21k91l4j63K91j4j51j41R0J01j89k97K71L85
1569B68k81k54Q2J01M5P4o6K38j90j21J83p1j6Q1p0OJ50m79J12K04j3j54M2L43
1593B14Q7l39j57J10J04J05q2L3J2p9J15q0J12k9k58K37O8l19N9J08Q5N0k30O2
1617a2J47r7k3q8J32O9l06K64J59k42j54j09K30J24n6j75J65l5n5j40J25K20M1
$$ plain form
1448 69 -77 159 222 -177 130 107 96 -171 -18 -60 -302 -164 -138 95 125 -251 230 233 -20 -9 -86 25 121 -23
1472 -23 1 55 -28 93 7 46 -40 -30 -63 208 -176 -84 -132 37 53 17 -296 156 -108 -194 37 -41 37 -51 -234 -2
1498 -2 -101 120 -165 -76 -46 -91 80 -96 160 63 -237 -268 -40 130 -251 -71 383 194 325 4 96 17 -159
1521 -159 -10 64 -118 7 -336 79 -206 -101 -48 -85 -155 -136 -31 -69 315 -33 -32 39 65 59 -124 -212 -130 114 -170
1546 -170 64 48 -17 -181 -238 33 12 -14 189 410 119 85 -78 213 199 48 -93 -3 98 -91 -388 -117 268
1569 268 -13 -267 -185 -84 -39 35 -31 207 17 -104 79 8 -8 73 3 9 159 -320 -208 -4 -17 -171 -129 214
1593 214 301 -38 -195 -85 19 124 42 75 87 8 123 43 155 126 -132 105 173 -146 -87 21 106 156 -74 -12
1617 -12 135 38 15 -73 59 128 -178 86 245 3 -151 -260 -30 94 38 -137 28 -7 -62 -202 -77 143 184
1640A84m35M09m2k13J24r4J01q1J15o9o2M4m5J20j9n0k1K00n75M02j55L72k61
1663e1K97k57j13J82j6N2j05J62pq0N5j00q9j95N62j18j94J57k25K12j15J03l0
1686H7q6J56M4k72J67mK3j48Q6L0j64nJ46Q1k41J05k39M01k90l0K73J05k41J4
1710bJ38K93l82J18M4l46j38J32K32Q3J22j57j83J54j70p1J69o3r4K73j86o9K13
1733A10O3k32Q5P9l29L51o4j62R5j2L4K1M3k59J14m1MK94J6k23K23m25J16P4l15
1758c40O15l18J69j60q3J14r0QJ37k64J22j50K84m8j3L4N1j94J01j09n3J02Q8
1781CQ0o5k01M18p8k02oJ1K6j13K66p8j89J39j42k47L19R4P4o5j37L43j07j79
1805c6L6Jr4n4L09j76j3Q6j82M52l70O2l11L03m0P0P5j5l68j8M82j72J31p5o3
$$ plain form
1640 184 -251 158 116 -97 27 -67 34 -47 68 -1 -63 -19 -64 56 37 -13 -34 166 -409 -7 -162 210 -51
1663 -51 246 -11 -124 58 42 94 -11 151 144 64 119 19 -70 -265 297 179 -15 142 -83 129 14 117 87
1686 87 1 157 201 -71 96 92 115 -33 53 83 -81 -86 60 141 -100 5 -234 167 -123 -153 120 225 -16 -2
1710 -2 136 429 47 165 209 -137 -275 -143 89 172 294 137 -46 108 -62 -133 36 -27 -121 152 -34 -103 110
1733 110 173 -59 26 105 -224 127 63 -99 -4 -16 18 39 82 -177 -63 -104 -100 194 210 -13 210 -215 -99 -25 -340
1758 -340 275 -43 126 -34 -117 -3 -93 -85 52 -212 -90 -240 44 -4 -17 17 68 -126 -25 -134 -187 -85 3
1781 3 83 18 -183 235 157 -45 -51 -40 -14 -127 139 61 -128 11 -131 -378 -59 35 109 44 -93 250 143 -36
1805 -36 0 1 -93 -147 162 -14 -27 59 -123 329 -41 21 -290 13 -27 43 118 103 -265 -283 199 27 158 83 20
1830B0J00o1k78J64n8pQ3l5J16R3M9Pk48P9q8K66P1j40j37q7L21j10k8j66J03
1855B9k57O5M8k9K75o1n4j83J80R3p3j92K11l14R7K92l04OQ7J04rj29Q4j36J36
1880c4L7J09j28K36l42M4l3R8j37K60j26P6l0o4R7j14j2j74L32k81L79k47M4o5
1904g5k06M01n7p0j50K0K51j26k33M82k90k07K62J52j86L5j82K28j36N3J92j6
1926A42j10n4M75k48k42r0N5J70j96k7oL1K06k62L43k65o2J33k7j8J43K3m6R3
1950A61j88N8k42K91j3M9k02K22j40j02P9j95J00J15R1k57kK40r9J59k14P7j93
1973b05J34J51j40K05j86L7N1RM5k02K23j47j74M32l18r8J01k74O00k88k8J39
1995F7m4j56J00p0J38K2j65J53k10K92j36k77M56l0N5k83J37J70k08q3J50k51
$$ plain form
1830 20 120 59 -219 -55 -113 -120 -37 -72 44 137 186 193 -55 24 -64 202 273 133 -4 -91 230 120 92 -74 29
1855 29 -228 -163 -115 -144 131 70 16 -167 13 106 33 -159 52 -262 -165 127 -177 -171 -84 20 11 -118 -34 -170 -34
1880 -34 3 112 -16 220 -122 -78 -111 -13 -150 110 -16 60 30 -34 63 -51 -63 -237 95 -186 193 -54 -10 -75
1904 -75 -281 120 63 -7 -157 -137 114 -12 -245 237 -53 -260 2 154 -32 3 -179 49 -87 -34 158 142
1926 142 32 -22 453 205 -37 -127 -72 98 -98 -125 -131 -100 106 -156 187 -78 -140 -7 -34 -52 91 114 68 161
1950 161 -27 31 -211 80 67 116 -86 136 -4 -106 -27 -222 -122 -7 84 -173 -175 65 -34 125 -89 -12 -205
1973 -205 -71 80 -60 145 -41 -4 47 56 101 -101 122 -25 -199 233 -85 -183 -82 -356 244 -44 -72 67
1995 67 23 -133 -33 -103 35 57 -108 45 -165 127 -9 -286 170 140 195 -88 49 219 11 -72 78 -173
2017a73j23M03l32L10k81K74M8k2k71Ml4J44N1q3K5J20K67l22q9Q9p3m9K81rK
2042A57j63J26l4L2mm5J66j49k31q7J06K8K97j93o4K02nq6j6j7q2r6M69m00J27
2067C8j64K83k15J36o8J05q8P4j77M1J84l43J07J85M1j23jq3Q2j40J12J26k78
2090a66K79P3k14J60l34J56q4K03N9j81J69p8k18P2r5L96l52L18q2M4k59MR1j1
2114e0J41k22J11k11L28pK9j22j32Q0j18L85j29J72j67j48l5L33k02Q9j08p0J30
2137G7q1r8K86k9k06K55q0l0j44RL46k39m5K96k90J7J88j79J56p5J41l31p4J49
2161A9r8J11Q0K4l6r0j87K72j25q5K81k15K14j95p8J76p0j28P8l1L6J07J62p4
2185A48l01k8J51l1q0K5L36k04n3K51k53K41k55o2L6R8Mj10K79l45j0N0O1N2j28
$$ plain form
2017 -173 -296 107 -225 85 -196 78 126 104 -167 -163 -197 -53 -2 -85 -60 60 327 5 -84 5 -68 -117 164 155 157
2042 157 -6 120 86 118 114 69 235 86 -145 -232 -126 -98 199 6 -58 144 139 53 37 20 -62 -158 311 -89 38
2067 38 -126 157 -58 78 10 115 27 101 -76 -35 149 -194 -87 98 139 16 15 -68 14 -126 -14 112 -166
2090 -166 113 186 -28 132 -202 -46 -130 73 132 -49 120 42 -176 -104 -199 197 -155 163 81 125 -134 -130 -39 -50
2114 -50 91 -131 -20 -231 97 90 119 -3 -135 -55 -173 212 83 255 88 -60 -95 238 36 125 17 -53 77
2137 77 -4 -102 184 155 -51 204 124 94 -50 -41 305 66 21 317 27 44 232 53 209 134 275 -56 -130 19
2161 19 -79 32 112 136 100 10 -177 95 -30 -115 166 -49 165 -30 -108 68 -2 -130 -52 -83 -47 60 222 148
2185 148 -153 -181 -30 -61 -141 -116 220 16 -37 214 -39 202 -53 -115 -79 19 23 -87 192 -153 -163 -113 -52 0 -128
2210a28j55L16R3J01k36q9k8L13k5N9J20k53j02j19J64j08J4J4o8J82k6l31L32
2233D0j73J10j46K5K70j59j45J56K32M6j56p6K9j32Mj19L7K35j25K13k63K5j06
2256a78k5O6J89J14n9j57J06o4PP1K1p5J53k23j44K66l86L74P9j71L7l0K7Q9L8
2281A25j81k0P4P3k00O2L5J10j79N1J05ln2l5j9P7k4J4J45k13K47j79j95J76j12
2306a18J51p9P1k52K13O1J4j9q6M7q7j16L19Q4k82J24M1j20j9j0K1m9J76j78L0
2331f3j7M5LP4k6k3R6k35J24J78k62Q2K2p0J44j17J14j86l0kM2K19k05Q3k00J46
2357f4J75j88Jm0J54j85K9K67j40P0k33J40J80l18K19p3j25K02Nk18K90l39P9
2380a12L95m92J82N5J42l52J44q0J11J79j81m7j2L67m57J06k68M04k2k03Q9J73
$$ plain form
2210 -128 -283 33 126 227 -9 -98 -126 187 162 221 341 88 -14 -133 31 -77 -63 -49 -117 65 39 -292 40
2233 40 -133 -23 -169 -144 126 -33 -178 -22 210 256 100 24 53 -79 -75 -194 -157 78 -47 166 -97 -72 -178
2256 -178 -203 -137 52 166 107 -50 56 -8 -1 70 91 16 169 -54 -198 68 -318 56 135 -36 1 -29 -2 87 125
2281 125 -56 -76 -2 71 -129 -67 -32 78 -101 -50 55 52 0 -35 -54 23 -1 13 158 -55 192 13 -182 -6 -118
2306 -118 33 -46 25 -227 -14 47 61 42 -44 3 -84 -200 119 203 -79 45 86 -34 -53 -63 -42 -91 85 -93 -63
2331 -63 -80 -35 -32 42 16 -7 89 -146 -22 156 -106 -24 -2 -72 72 -45 69 -117 -147 -149 -107 112 -93 -10 -210 -64
2357 -64 111 -77 -76 -116 38 -147 -118 149 9 79 -154 -14 166 -152 67 -6 -131 71 76 -142 148 -191 -112
2380 -112 283 -209 -27 28 170 -182 -38 -118 -7 172 -9 -56 -68 299 -158 -52 -320 84 62 -141 -52 121
2402A21l9j15J65j78m4o9K82J5j66j6N1J45J08j66L5r6o5Q3L5r7j10O7j5J61J58
2427B50k81j80M51j45l5o1J72j22M6r6k66L09j04Q0M6O8j69o3Q3j14J83k19O8
2450i9J49OJ63l50K12J62m95O2Q8K05J69q8k73N4N8k11J14J92Qj67j36J21P7L7
2474E8k19P1k27K53%K55q3k55p9P9J10j12jR0J78k98Q3J91k81J47L2l7JJ74N1
2499A81k98J48J91l95R6M04l13q2nJ43K08m5k65J38j15m4J46l3P5k22j44L44j22
2522ik55J03J43K57k4k45o4J3K09j75P9k69L11k28O0N3J5j5K55j96j24R0Q9J86
2546B59k31j34K15K0Nk63kK26p8OK9R7l7q5j27P2R7j78JO0J01J81l98L80j35Q9
2572A70r5k1P6j97L22j14k16N3P8Q4q5K42l22o0J75k68J9L60j64k73L17k3k44
$$ plain form
2402 121 82 -33 132 -46 -90 -159 123 138 -28 -44 7 152 260 94 129 33 -32 51 86 -11 -121 -54 -69 92 250
2427 250 -31 -211 240 95 60 -1 171 49 95 -1 -267 42 -62 18 64 132 -37 -100 -17 -131 52 -167 -99
2450 -99 50 56 219 -131 81 243 -252 -190 -102 103 272 184 -89 -35 23 -188 -74 118 126 -41 -177 -56 21 58
2474 58 -161 -90 -317 -64 -64 191 108 -147 -226 -147 -37 -149 -150 -60 118 -180 -97 94 -187 -40 -8 -45 -44 130 181
2499 181 -117 31 222 -173 -77 327 14 -68 -73 70 278 233 -32 106 -9 -53 93 60 135 -87 -231 113 -9
2522 -9 -264 -161 -18 239 215 -30 -94 -81 128 -47 32 -237 74 -154 -94 -41 -26 -41 214 18 -106 -16 73 259
2546 259 28 -106 109 129 134 -129 -131 95 17 23 52 149 112 27 -100 -28 69 -109 -108 -48 53 234 -164 216 81 170
2572 170 75 54 130 -67 255 141 -75 -22 56 140 55 297 -25 -85 90 -178 -159 201 37 -236 81 58 -186
2595a86J79R4l4j52j51J67J78K4p7j93L19m10K74J53l80K44j36k4J61l0m3k15
2617b38L00l9l70K80M2k08J36j6R7p9P6j29OK21k06J92j36P1l9K4j17L4J61k23
2641a60L86l15J22M6m7J20k62L35l37j03L74J07p8k9j06r3J7n7j64O20m20p8k9
2664a51Q4L2J67k63L05r9k58J36k10K02J83Pj23N4M0k54K32l5j06O1k6q2K95k36
2688d5J29k36M20j57k23J6j06J66j20J52J1L9j39Nk3L52k49J94Lj12j06J08k61
2711a82K57l42R4qK43J20j43m0MQ4l48J9K57k45K49k1J16l27L53R0j32n9J18k00
2735d3Q2N9l93L47J21j75j5k38L91j48r8K70l75K61J37jk15K46k81J80N3j70j9
2758b4j47L17j58J72j13R0R4k39j7p2k21J90P1J12J13M2j84o2L15m63M65l36l5
$$ plain form
2595 -186 -7 87 53 -99 -250 -83 95 119 42 -151 168 -242 32 185 -195 49 -87 -111 50 20 -23 -238
2617 -238 62 23 -347 -67 -25 -233 -97 -113 -16 -95 -19 -148 -142 79 -127 65 -71 0 -39 -15 -132 -98 63 -160
2641 -160 226 -89 33 79 32 152 -110 225 -112 -215 159 266 188 159 53 -40 -23 -80 -244 376 -44 -122 -151
2664 -151 -67 -35 132 -131 174 75 -183 -47 -257 -55 128 135 12 66 106 -148 84 49 -57 4 -22 -104 191 -45
2688 -45 84 -152 268 111 -112 -96 -202 -36 -156 -4 7 46 -93 -88 -111 241 -8 186 189 77 -29 79 -182
2711 -182 75 -267 -173 -181 62 182 39 -1 3 87 -261 -242 15 -230 19 -2 114 -213 140 230 98 39 157 -43
2735 -43 39 98 -295 52 173 -2 -17 -255 136 -12 -110 160 -215 46 183 182 -33 213 -68 112 165 -5 -24
2758 -24 -171 146 -12 160 47 137 231 -8 -25 -97 -318 -128 -57 55 168 210 26 -36 279 -184 281 -55 -90
2781i0J16l9R9k53M6N7p1J41N1O3o1k57K78k18R7j5J38p1N2k56R0Q0J92p1l75
2806b77M30k48L7J7j77L1L20j0l22J56J94j53j78J29J13n5k61J40O6Q4Qj72n5
2829a83Q8K56L3j92J94k67J20k02L72k69j8J18L1k01J67m9k3m0k06L3K79l34M73
2852A80j14J55p4o2j76Q4m1p1J74K2k9k22J33J95n0j18j16O6N0M7R0n7j54N0K24
2877A86m49J35j1J84k20L03M5k37J24k64K43j06k00N11l19k2K67j55RO5j65O1
2899a5J49M8k47J49J30j31j62j58L87k58K87r5j08J86j47j8l1j32O59n95K98m3
2921A53l67O3K39r5L3K12m37J2J75r8J61k35J96P6j52J04k45J11J16k66L42k8
2943G0k29N8K50k7k42k3K38O5M9l36M43n71J52J70l29M28j37q7K26J5Nk18J23
$$ plain form
2781 -90 26 -13 86 -167 -121 -64 -135 6 57 120 59 -198 80 -138 -41 -56 82 11 63 -193 -103 -23 169 98 -277
2806 -277 153 -95 -58 -41 -218 -187 133 123 -199 -43 151 -2 -180 -51 62 7 -254 -114 -48 36 44 -128 -183
2829 -183 -95 161 194 2 196 -71 49 -153 219 -50 -68 50 81 -120 47 -2 -25 -65 -271 -238 41 -293 180
2852 180 66 221 147 85 -91 -7 -48 -119 55 77 48 -174 -41 154 104 -14 -130 -64 -14 33 123 66 -88 -38 186
2877 186 -263 -128 -139 45 -175 128 173 -64 60 -204 39 -67 -267 244 -75 -97 170 15 24 89 -76 -15
2899 -15 134 182 -65 84 214 83 -79 -237 150 -108 179 84 -24 162 15 -3 -34 -166 493 -102 196 153
2921 153 -214 -151 88 -7 26 238 -199 -187 -12 -110 51 -184 12 88 -64 40 -205 -94 22 -244 98 70
2943 70 -159 -101 149 122 -120 -143 95 160 209 -127 316 -255 -103 67 -262 166 29 -58 168 183 188 -30 93
2966I3j7O9N7l49J79Nl28rK56j26K07j10k5J71j4k39M48l93p6L81Q4k44L6j98
2990a42L18l40J48pJ30j50j52K21k8J70l91J36J50o1O7J05j32P3N3l9M1l05P6
3013e9j11K15M1j11q8J45K9m5K07o7j98m9J1K37j91L15k73J61l64K16l3j61l5
3036b08L41j1j50k24K01n5O8o0J47R8j14p2J93j64j63K67m6k22J86k21J04J28
3058B3m4pk8j42j2L37L3j75q7K45k69J27k2j2J46o0L08k98N2l51J8L11l20L74
3082A47J32o11J91J08J98k24M6J16j24K4j8Q6k2R9j79P0J82j04m16K63n2p1J55
3105dj20K35n4j41M6L3nJ94m06L48j70R9q3J52N7l62J89J1J00j98M6J29n8j85
3129a47R7j74K24j98K03k5J3k9K3M1J45k19J20j11Q2K3o5j46J52J59jk21P2p8
$$ plain form
2966 93 76 145 202 -147 32 37 -291 -300 -44 -170 37 -73 -98 73 59 -180 268 -125 -201 180 264 20 56 -142
2990 -142 176 -164 -16 -23 107 -43 -195 26 -2 168 -223 -87 63 2 69 174 42 115 168 129 170 -135 -59
3013 -59 -170 45 86 -25 -113 32 61 16 223 156 -42 -91 -80 157 -34 281 8 169 -195 21 -12 -173 -208
3036 -208 133 122 -28 -252 -51 -106 -38 -98 49 147 33 -39 154 -10 -173 94 48 -174 12 -209 -105 23
3058 23 -21 -28 -56 -198 -210 127 160 -15 -102 143 -126 1 -21 -33 113 53 361 63 115 -236 -218 93 -227 147
3082 147 279 -332 -141 -33 165 -59 -13 103 -21 3 -15 71 49 148 -31 39 221 117 -299 -36 -88 -159 -4
3105 -4 -124 111 57 -84 -38 -5 -10 184 -222 126 -44 55 -28 124 181 -181 8 19 119 -79 -33 96 38 -147
3129 -147 -50 -224 0 -198 5 -20 -7 -36 -13 28 173 -46 74 -37 45 68 3 -143 9 168 167 -54 18 -60
3153f0J24K02k33j24k72M57j49J22j90R1K78l52J0L3L64l42K68l43NJ25j00r0
3175a76K18j89L28k36L50k72J3k5k10J99L9j08J65k37K30L3k72R1l6M14l46J73
3197A46k02m6j04J18P0k25K10J75Jk24m6J43k32K23J10P8k48j52M53k03l08M22
3219A59Po4k22kL08j94Q1J08j53P9l38K22m3j2J00K66k58rM0l16K14J49j49j23
3243a50K01M6j93o6J81j73j1m6L63j43J80l19R0K58lk11J64k51j1KJ29K4k49K29
3267D1p9P5j6Nj84O5k6K38k68O0KP5k57M38k19L5K32j89Lp6K47j15k11j25J36
3292a13j16M0J66J93l47K83m4L3j16q8J39o1l2Q7k37K88j47K29K5j10j67R3n7
3315e9K20l8M0%l54R8K86R7l56K55l75K3J10N9L8q1j26J6K19j43J64K08j09m06
$$ plain form
3153 -60 64 266 33 -91 -363 94 -55 67 -123 -32 246 -106 -96 -63 301 -41 227 -116 -111 14 -86 -176
3175 -176 42 -147 181 -55 295 23 36 11 -199 0 39 -69 96 -141 89 122 -150 -59 -95 319 -27 146
3197 146 -56 -102 -206 -88 -18 -243 -33 142 143 -81 -127 16 -216 7 117 195 -53 -205 248 45 -263 159
3219 159 166 102 -120 -122 186 -8 73 181 28 107 -231 -9 -52 -64 36 302 44 35 75 -241 -27 122 -27 -150
3243 -150 51 97 -96 -162 19 -154 -165 -211 152 9 189 -130 -40 218 215 4 168 -83 -94 -92 37 61 -188 41
3267 41 -38 37 21 26 -158 -93 -119 119 -149 -89 -87 -12 -269 169 -50 -15 217 28 31 -45 202 87 -124 -249 -113
3292 -113 -229 -189 -23 170 -177 106 62 95 -21 -109 30 -31 -63 24 -213 75 -72 157 182 72 -95 -2 -59
3315 -59 161 123 163 163 -191 -93 193 290 -66 189 -186 -163 -53 6 44 -37 -163 -147 72 -71 93 301 192 -214
3339b14N9o8N15m42K09j36n1L20k14PJ56k96J58l5J34j25q1J78k83N81n25L7P3
3362d3J23j83n7O1L07l54k1N8P3Q8m7J39p7j35J98K7k7K9j50r4K79n5k03j4P2
3387fQ0j93N6N8j01K54j8m0k7L1lO9j51j17J11J5o5N8l05L67j04L0m6o8k1K20
3413H4k64M13k71k4j03p2L17k3n6o0j0PK99l69N39k15l26j7L88j05n5j52J74j59
3437f0M0J2K91k80jo7q4K7n7M04m49J35N4L6R7o3k3M4p1J95l89oJ94j12O4N1n
3464b3K1L9L7j66K86J0q0J80j83N5M0o1j30o2r6K4r4J56J9l9J00p7N77o27m7K30
3490H9j28Q4L8k74L90k50Q6j52P4r7K01p4k26L1K18J59k81J33K01p7o9R8k05J49
3514A18j60k4j09L29k13O4Q7k5N1m5J22j56K5K11k69K5R2j63K0k99k4L98j18L45
$$ plain form
3339 -214 -155 -223 292 -150 59 -77 -128 192 -22 -15 141 -155 3 -32 102 -23 -104 74 -209 372 -153 -116 -43
3362 -43 80 -103 -160 -99 208 -146 -167 -109 -36 52 5 144 67 -68 130 157 130 159 9 -85 194 139 -64 -78 -6
3387 -6 74 -119 -63 -5 -106 148 130 90 63 94 91 160 9 -108 3 18 -47 11 -294 73 -31 -1 -47 -115 -136 84
3413 84 -180 233 -38 -62 -165 -237 80 57 1 -59 -69 -62 237 -132 407 192 -134 -151 237 132 77 -75 99 -60
3437 -60 -20 -8 283 3 2 -65 -149 -122 -179 225 -224 -89 -35 1 98 35 12 56 -15 180 -209 -215 -21 -133 -69 -18 -23
3464 -23 -2 37 74 -92 194 204 124 304 121 176 216 155 25 -37 -133 -109 -203 -47 -28 -67 33 -44 533 -94 -141 89
3490 89 -39 45 83 -191 199 -51 35 -117 -43 -140 61 -13 -239 -208 10 169 -112 21 222 145 76 174 -31 118
3514 118 -42 -66 -175 154 -59 5 92 67 118 73 195 39 64 275 6 31 123 -40 -20 -319 -343 55 -63 282
3538B82k86N6m4J11j46J46k76K21k17K99p0j35J4r7R2L0j66J74K53k49nm0J88
3561A35k09K40p8p2l77M82j65OJ82Pl6k79K84k03m7j5J92j84J66n1j07J6M8q5
3585a50Q1J64j73O5j01M0J03J30m0j22J92j52j82J93j71K62k19O4j9j24L89k17
3607A3o3j13j5K5kK16k3p3l62L35r3J13L09l01P7k20M6J3K90P7l68J0j20K79Q7
3632A37k84J12m6M4J22M1m37K80J45M7j95J39L5l01K32%o1O1K2k32J71J28k78
3655a18J65k10k3J08l3M7Q6K03j83o9K47k16m2J30j03L2m7J6j73K38N8j43K13
3678A83l38q6K69m2J47o6Rl1j66O1k50K70l8l1N2Q4M0j95P0J99j56l4j5m4P8j25
3704a55M08k78j14J57J79m11L13m5j26j40K57n3Q4k27L98k12J27j28l9J28o2j19
$$ plain form
3538 282 -4 52 8 119 -27 119 -157 64 -153 146 76 -59 -45 -142 -50 -20 -186 -12 241 -8 -13 -53 135
3561 135 -74 166 88 16 -361 121 -44 -38 144 151 115 -164 120 -83 -130 -145 47 -137 29 -22 -129 -113 -65 -150
3585 -150 -69 95 -78 -13 -114 -74 29 159 119 -3 189 37 -145 48 -123 139 -80 -16 -35 -159 230 13
3607 13 -50 -163 -178 -153 -155 61 38 -35 -397 -62 -155 -42 267 -34 43 -177 -131 -118 172 249 -119 -109 -229 50 137
3632 137 -147 -35 -81 -37 85 126 -311 -31 114 161 -34 105 140 -161 71 71 10 71 93 -139 32 160 -118
3655 -118 47 -163 -186 -78 -111 -64 22 225 42 -27 220 4 -38 92 -11 21 -26 -10 -183 55 113 -30 183
3678 183 -155 -241 28 -14 133 67 76 45 -121 -60 -310 -40 -78 -109 -57 27 67 -128 -58 141 -15 -49 -64 -108 -30 -155
3704 -155 253 -25 -139 18 197 -214 99 54 -72 -212 45 -8 76 -151 247 35 162 34 -5 123 61 -58
3726e8K00j79k24J96K06j62L41l18l2K4j60J14L3j35K63q1j07K8j58N58l85j65
3748b01M08k71j8K05j08l6K44j36r4j30K06j68q5J0M37l58j56L88k28N7Q1k40
3770a93J75J37k97j0R3j13K07k89K05RJ62O8j85J63j9p0J10k45rQ8j87K38l9L9
3794C8j4J60j96j15L64N0k40K7j83J00k0N9k58L43J6j75M2M0R0l27J54L3J71p8
3818H1j40J87l65K66l3o2J6N1J7J57j93R8k10P1J80j24n1J25Lk07J21j8lmJ96
3843A59o4k09K13n9j19J32k35J38O8L1j71J34k55N1N7J34J39j81p2o7K92k01j9
3866a04O5J39m13K80L8L9J44q8j68j52N0R7Q6j78Q8L20K3j35k46K55Q0k66J61
3889A15q9N2j97j1K61J22P1n74K98m2J48M8k21Q5j53O1M2n5l6l3j16J22O9J08
$$ plain form
3726 -58 142 -37 -261 -65 141 -21 320 2 -30 -6 -166 -52 -19 -154 109 28 -79 -51 -209 349 -36 -201
3748 -201 207 -64 -82 123 15 -21 223 87 -7 -137 69 -99 -184 -174 263 -95 -251 137 -91 -34 47 -193
3770 -193 -18 119 -178 -188 -95 -208 -1 -290 -85 -76 86 154 -31 132 113 43 153 -92 -101 -13 -200 38 -1 38
3794 38 24 184 -12 -127 237 287 47 74 -109 -9 -29 30 -228 115 131 -44 -2 38 128 -199 -45 -12 159 81
3818 81 -59 128 -237 29 -4 -66 -50 1 18 175 -18 80 -130 -59 121 -3 -54 71 74 -133 -12 -30 -33 -37 159
3843 159 95 -114 99 40 -79 53 -182 -44 24 55 -116 18 -237 -186 -129 5 144 -37 -109 -176 116 -85 -104
3866 -104 -39 100 -313 -33 5 44 188 100 -68 -220 -170 -73 13 -165 -77 243 266 131 -115 140 220 -46 115
3889 115 26 78 -119 -130 131 253 324 -250 48 6 154 202 -19 66 -87 -26 16 -39 -75 -108 -224 -102 -33 75
3913G5J47l11J67j86O8K00j59K6j38n0j07K18J28R0k63n1j9J36J87j69m5J70j7
3936I7q1l9j31j3J83o3j8k1J69r8m2m8N0J40j37K18j66j36J04J56j40k25K97K03
3960B59q4l5k92J43k6R9P9j84Q8k12K41%k47Q1J47j91O8O0P9k47K00l8Mm00N79
3985A71j17M8q2m9K29j4N6j90J18j12j51R9k6Mj53k9J67M5J63j71j40K13j22K19
4009A76m11N04j87r6Lo5k3j10J72K17l2j12j4l5Rnk19j0M25m00J70j8N7q5j04
4034a93oJ06J1J15J07q8p3J97p1j43P9k10J73J10J7J55l65M9L6j00j50J33m7J71
4058A3J25k59P7k5K26p6j2p4l4j32L1L50l7j22l1k62O21m45J17l6J44J4j93J02
4082H2o7K00p6j73P0R5k55K67J7K6lj67k0J72l06K59k60M51j22n17M89j26p9l33
$$ plain form
3913 75 222 -89 78 -108 -40 160 1 27 -111 -161 -268 -50 78 168 -95 -146 -165 -29 158 -11 -56 114 97
3936 97 16 -23 -154 -167 16 -47 -65 -86 83 -15 -57 -105 -55 85 -52 166 0 -136 -32 124 -16 -241 56 259
3960 259 175 140 -152 -9 -35 64 143 -41 47 -165 76 76 -171 -90 57 -134 -66 -6 73 -174 26 -12 -8 -408 171
3985 171 54 102 20 -29 200 186 242 52 170 58 -93 6 -20 -16 -169 -198 -31 14 177 6 -134 79 -43 176
4009 176 -235 269 82 -14 -11 -76 -99 -209 -37 180 148 36 22 -13 -4 -9 -228 -238 187 -213 -43 -61 -4 -89 -193
4034 -193 -199 -93 -82 33 140 52 -21 176 105 -38 41 -169 4 114 131 286 -79 -30 6 -94 -244 -111 -158 13
4058 13 138 -121 -44 -69 157 81 69 -5 -39 -171 -140 210 173 51 20 -242 379 -66 51 15 159 173 -20 82
4082 82 15 215 139 -34 36 131 -124 143 160 186 183 16 -4 168 -138 121 -139 312 190 -327 162 36 -43 -376
4106c76K72n0Q7j23K16j14J08Q4k37R8o9P4pQ5J19k29K53j81N7j53J35k4J35r9
4130F1P2j8k48N0J15l2o0J25j41L18k41p5J47l7j92k4k5J94m5J75K04m78O5L77
4154B87n20K88k3O1p2P7j29k8K4j34J14R4l59K64M7j25J28P5j79J46k37J85J34
4177A18j21J46k65J01j77L34k68R2j85K33K20k77J16p7j68J39j4J31pj59j47J69
4199f6J43l8p1J21L22m05J91j98N4j05p4L49l04k0p3Q3L18k34l9J89J2k14J35
4222G6k93J55ok31L87j43k88L20J58k82K47r9k1J5J35jLj22P8M0j83q6J56J13
4246A28l05J94j67K94k40P7J62J7j70lJ39k16K45k51K12j15J19j4J32l75J24j85
4268a98J44O9R3Km1l1ok54P2J89P9r9l20K89j01J42k13L50O2m60J96j64L49j71
$$ plain form
4106 -376 -104 -154 -67 -190 26 -88 20 104 -133 -35 -104 -30 -37 48 167 -62 191 10 67 -86 49 25 160 61
4130 61 133 115 -133 -83 32 0 -60 65 -76 242 1 -74 73 36 -156 -180 -205 -11 -56 119 323 -155 -90 287
4154 287 -233 55 32 93 21 98 -31 -59 -35 -169 -55 39 -320 -56 -9 -134 -6 69 -110 36 -201 -16 118
4177 118 -3 143 -122 -21 -198 136 -132 -40 -225 8 228 -49 67 -10 -178 -39 -53 78 71 -88 -235 -66
4199 -66 77 39 -32 89 411 6 197 -1 53 -52 -126 223 -81 -101 -174 -91 227 -7 -46 143 155 -59 76
4222 76 -217 -62 -68 -299 88 -55 -343 -23 135 -147 100 1 -20 -5 130 129 132 10 88 128 -55 -141 15 128
4246 128 -177 17 -150 144 -96 -19 143 160 -10 -13 126 -90 155 -96 116 1 120 106 238 -137 -13 -198
4268 -198 -54 15 108 110 69 38 32 -222 -150 39 118 19 -301 -12 -113 29 -184 166 228 -232 -36 -200 149 -22
4292b2K81m12J68N3k24L39k20p3N5L03k54J17j47J32P8k42J07Q5l03J76Mk75K95
4315B1k49L31j61K17l0k03Q9M8j29L16j44k01M1J57J39k61L9K62l55J92j77J97
4337A39l04o1J77Q4K08r4p3O8m0k34J49j15P1j25L39j59J67l25m3J50m9J94k11
4360h7Q4P4j24J42n6l97M51q4q3K92k46m6Ql1J15k5m8J8K43oJ45m06L9l1O8k4
4386a5rK9J75k51K12k19N2J30l35J6L63j8oM3k13K8J23J66l55J29m1n6J41l7k03
4411a51K06J90l66m9m3K05N8j95M05l16j42L55k45J30Q0n1J25k02L7j32R8k20
4433b23K50j18j46K08o5J71k94P6J12J95l17k4K25j11J8J06j61m3J73n9j46L05
4455A32k62K02k40J30j13j1K76l87K23R5m1J57k62n8L4M9N1k4p7K93k14jK66l26
$$ plain form
4292 -22 259 -153 15 68 -156 183 -37 -110 -55 248 -6 111 -36 96 174 -68 39 124 -179 -3 1 -274 21
4315 21 -228 103 -58 159 129 -74 15 63 -66 250 106 -95 -54 103 242 -19 20 282 -73 119 -58 139
4337 139 -165 -226 -49 35 243 149 76 144 104 -130 19 -96 -25 -150 189 30 197 -128 -171 -21 -70 124 -87
4360 -87 -3 71 -53 89 33 -364 87 3 -80 212 -34 -80 -72 -103 12 -13 -61 -43 200 194 339 -67 -28 -59 9 -15
4386 -15 -24 5 180 -71 141 -78 -26 104 -231 -215 148 130 124 167 -46 -18 105 271 -84 45 4 -52 89 52 -151
4411 -151 55 245 -121 -170 -213 -8 50 -145 260 -56 -198 157 -88 42 122 71 196 -6 31 -101 -3 -223
4433 -223 27 -91 -237 -29 -94 77 -217 -141 -29 166 -151 -175 50 -61 -43 63 -98 -141 32 -27 -173 132
4455 132 -130 72 -168 -38 -151 -162 114 -273 -50 45 4 161 -101 -159 -125 -76 -25 -49 -126 167 -47 -48 218 -108
4479a08nL64j38j97J86p4j34R1l0R9o8j08K73k68J28N9j03J04Jp3j08P1p0R6j33
4504a45l5J4L08k56n5L2J61l4p6L65k60j26k7J8K43k68L32k44j19J37J7J16j56
4527e8K39j66q2J39j43K56k70L70m11n7L91l21J28O9K8j16L2J91m07L43j99j5
4549e9J37r7k6O1Kp2Q6J0k06R4M9j61K71m8J15o1k47K30j53N5O3j59J03K5J07
4574A19j50r7L39k04n7Q4L5J1j8j49R6r0L9J32j17n8qJ71J38k38L9J57j54l24
4598c04L44j31Q5J28j58R2k90L11J4kQ2k96J21J50j10K33q4r4q9K54J20n49K0
4621a53Q2J13O9j20K1J50l28k4J58j11N6K64j25P5J0r7K46j31j61N4j23Q4O2o0
4645A1p0J58J77n36L13p8r0R5j3J18p5K52k00q5J35L3j90K1J72l8J6J7n2o5Rk85
$$ plain form
4479 -108 -113 251 113 -84 102 28 -106 -15 -45 54 -14 -122 151 -117 11 70 -33 71 72 -1 -109 -38 -108 -12 -145
4504 -145 -180 -166 142 -114 -169 -137 24 -10 -86 279 19 -107 -134 -116 127 -141 191 -53 -172 -35 -18 98 -58
4527 -58 181 15 -67 72 -71 185 -85 285 -126 -183 208 -113 15 84 112 -4 28 219 -188 155 -44 -59
4549 -59 78 -19 -45 16 18 -54 32 42 -164 -70 -21 -182 89 41 156 95 -152 78 -75 -20 43 -116 -13 12 119
4574 119 -31 -128 211 7 -50 34 69 80 62 -87 9 -81 -42 90 -27 -85 -93 78 216 -22 17 174 20 -304
4598 -304 40 -91 -6 122 -36 56 -234 77 91 89 171 -125 -4 146 36 269 185 91 2 256 376 -173 -153
4621 -153 -71 42 111 -9 12 162 -166 -190 -32 -143 -87 177 52 127 137 40 286 155 -6 48 -75 9 71 11
4645 11 -59 99 276 -260 53 -25 -115 -20 -33 85 10 262 62 -23 112 145 -45 -24 148 110 126 143 91 26 35 -250
4671b50M06k29J26p2j04M45l41n9J95j80j84K68J46k86J33j40k9m7K48o5Q0j28
4693f7Q9J26k35L26j43Oj40J65j92P0r4J81r5O1j63K07R6j43Mr6J53j86n7n3L56
4718A76j45mJ78r7j2P5m3j57o0L18j33O3j31j91o9J96K73q2p6j31r4l0K95k43
4742a24J62l88N69m5j80O4k39l8L25K2j05N9k73K23k5q0n5J07k16p0N24k55J17
4765G9k4J76r6P8k66J25KJ6Pj08L08k67o2O7J69m06K21l8o5Q2J3l3j04K70m2k5
4791G7r9J17j18LO7j10j07J62k62K79j62K02j15J69l13J95q2R4%j07K72m2P5l71
4815a76J88j6j04N9K87l49J60p5Q4o0J77p1j76m2K06k99Q4J89j14o7K45l7j2J13
4839A94n02K33k38L05M1k29M05j89l06J73L21k38j50L57k26J55k92j55J49J85
$$ plain form
4671 -250 156 -73 53 -19 -123 322 -19 -78 117 -63 -247 21 167 -119 14 -126 -155 -202 46 -19 61 -67
4693 -67 22 148 -87 239 96 102 -38 127 -65 5 -89 92 -3 58 -105 102 198 55 59 -37 116 -70 -127 -180 176
4718 176 31 27 205 108 96 171 128 -29 -89 229 96 159 28 -163 -232 -36 237 155 79 -52 -146 -176 119 -124
4742 -124 38 -350 219 174 -6 58 -181 -219 106 128 23 82 -191 32 7 -73 -128 -21 -237 -307 217 -38 79
4765 79 55 231 135 213 -53 72 74 90 97 -11 297 30 -32 35 204 -202 19 -19 -84 -2 11 -22 -126 144 102 77
4791 77 -22 95 -23 -20 47 -63 -170 -8 -270 9 -153 49 -66 103 -210 -15 -97 -3 -3 -110 162 120 195 -176
4815 -176 12 -4 -108 -49 238 -111 49 -26 58 -2 175 104 -72 -114 92 -207 -123 66 -48 -115 130 93 81 194
4839 194 -308 -75 -313 -8 33 -196 209 20 -286 -113 208 -30 -180 177 -49 106 -186 -341 -192 -7
4859gj1j30Q5KJ52J41l48J49j15N0j79L07l04K58j14p8N8J02J33n8q0k3N1k86
4883b45J62J26J11q7j57j76J68M7N6J18l8K35l7l52j65K91k92L77p1j19Q6J29
4905A67p8K1j98J28J28q9l26J96j7O0O0r9L69l53J4j29K1QJ10o9pj33J27Q6R0
4930H7k03n1J98j22j15J27J0M6k7l9Oj02L88k56J19p2o3K58k98R9p4K66j68J60
4954A74n1J2l9l94L84m77L02r9J93j27J39j42L5J59j68J87o3Q9k20J61o4j67L45
4977A69j09Jq8M1J50k28L4Jo5L08k89R0K49m6l55o0K91L9l92K76J07m6n4R8l13
5002a91K00k78J38K16L0N9J85k06n2L4p3j28j67J71J32J9j34P8l9Q8j98K51R2
5025B27k48k5J54p1Q2j76j52N6Q4J79k2j87J94j68n7K0r5J11Q9j6N2r6J59J06
$$ plain form
4859 -7 -18 -148 -63 -61 91 232 -116 33 -82 -32 -211 96 -208 50 -64 -142 -84 18 151 93 13 -10 41 -245
4883 -245 -83 43 154 67 -90 -266 -98 -51 5 123 85 320 283 -69 -234 57 -235 142 71 -48 38 167
4905 167 89 110 -88 40 168 79 -247 -51 -68 -8 52 -47 322 -31 -17 -146 -125 -117 -7 -76 -83 -216 -89 -3 87
4930 87 -116 -167 31 -91 -206 -79 -69 -23 -50 -89 -83 -185 203 -53 66 -6 -69 189 -109 -10 -84 182 14 174
4954 174 123 135 96 -298 86 -391 -89 -188 5 -122 17 -125 -90 69 -99 88 25 114 -106 55 -9 -176 169
4977 169 60 61 -27 14 164 -64 -30 -29 -94 214 -75 15 264 218 -137 -197 94 133 -259 17 124 78 24 122 -191
5002 -191 9 -269 -131 85 115 174 359 153 101 135 62 -66 -233 -62 70 89 -45 33 -6 82 -116 135 227
5025 227 -21 -46 108 37 119 -57 -209 -153 -69 110 88 -99 95 -73 -130 -110 -205 -94 -5 -21 31 -65 94 200
5049B00n1j39J27K27l23j30o7K57r2n6R3r2J41L2m04L88k48K66k33N2J05j00k6
5072g3J77O5k48K18q3j45q3L42k38P6O4r5N0J7j65P7k22M63k18N9j08P9%J30l48
5097b09P4J32j01j2K92j3k56K81k25m5J96P5j50J96j43r5o0J68L19j51j90j20
5119c7j13P1j5k6K61k42rJ07k9R1k86N45k89n6K43l66L03p2J70j63p4p9m6n4K15
5144E0q1rJ57K8j47J86j15k4J52j24j19p5L58j91j67K11k92P4K01j73L03k5j42
5167C6k9r7Pr8K66R1j50pk71R2K34k97K93j96K06r8J14J3j72j81K66j08j56J10
5191a32n6N3O6J00q5M0j18L7o7K63l36J46QK2J28R8k42j53J64l0K02n7j97L10
5215A64l58L87j46R3j88r5L37l12K30k88O1m2J21L23j09j43k1J82j22j21M6L9
$$ plain form
5049 200 149 10 137 364 41 -89 -156 101 9 -47 46 -46 95 127 -277 111 -137 129 -104 -52 53 -47 -73
5072 -73 104 169 -79 139 56 -89 -172 170 -68 8 72 -23 27 44 -121 -44 -266 197 -21 38 -70 9 9 139 -209
5097 -209 -135 -3 -104 -116 176 163 -93 188 -37 -82 114 189 39 235 92 -3 -63 105 424 273 83 -37
5119 -37 -150 -79 -94 -120 141 -101 -110 -3 -32 59 -227 318 29 -27 216 -150 153 81 251 88 14 -65 -111 -165 50
5144 50 -31 -40 117 145 -2 184 69 45 197 73 -46 -121 237 46 -121 90 -202 -128 73 -100 203 178 36
5167 36 7 -90 -83 -181 85 176 26 19 -252 -160 74 -223 70 -126 80 -18 96 109 -63 -244 22 -86 -242 -132
5191 -132 -188 -135 -69 31 -54 -14 -132 -95 -162 101 -235 -89 -81 -59 69 167 -75 -228 -64 -94 108 51 -146 164
5215 164 -194 193 47 140 -48 -143 194 -118 112 -176 -115 -157 -36 287 178 35 14 196 74 -47 -1 38
5237C8J57l8k83l5Q4j10J59R8j82j82N30k64m7R8q5m2J48j55K63k55M09m25P8
5260d1J8K6N8l6N6q7j22J45j06L68q5l12J58o8M3K8O1k22k0N7J17J03j98K40J
5285A82j94q6j13L0qJ20N2J64m26P4K66j19r8J54m1J70j28J21j98m9J72rn2j18
5309a34K82k63O3R9J06r9j62J66k4K6k9l35K84j8Lm4R9l5j66K01j60J77j63K82
5333A56j81Q8k32R4J78r2o9J5J62m14N76k27O0j60j48J03J22k53K62K7K7j19q6
5356a11o7K89m93L52J43k5j1o7j47k4K52k72M46l13N1O5q4qJ36j04j32M6J48k4
5380D6k70L35j43K45j15jk39J17l7O7k40J29M95l91Pk9j78J71j62K75K05l07O8
5403D8P7k49J42J34k68J09o7J34j52J08K4J07j70J0K49j19j56M7M1nj84J34r5
$$ plain form
5237 38 195 157 -126 -161 -77 -187 -28 70 -112 -294 236 -28 -75 23 -62 -104 44 -111 152 -103 306 -119 -41
5260 -41 -23 3 61 25 81 -6 -128 17 -89 279 194 -118 40 -28 15 43 104 -118 -138 -81 36 139 -59 181 182
5285 182 -12 -98 -211 -181 -189 -69 -17 147 -279 -205 61 -58 -156 -2 -43 127 -1 120 -78 -127 45 36 -16 -134
5309 -134 148 -115 -52 47 153 54 -108 58 34 60 31 -304 -20 -38 -35 -79 20 -15 -181 20 -140 37 -126 156
5333 156 -25 63 -169 -75 103 11 -58 -43 119 -295 281 54 114 -46 -194 -91 31 -222 40 67 94 -25 -111
5356 -111 -178 111 -382 -30 113 88 77 10 -137 -161 91 -181 265 -48 3 68 -16 -24 112 8 -124 -78 70 46
5380 46 -224 111 -32 213 98 97 -142 -25 -62 5 -235 -106 389 -2 5 -24 -202 -31 -193 82 287 -20 48
5403 48 125 -124 18 152 -116 -7 -74 60 -92 16 40 147 -23 -13 236 117 -39 8 49 44 -140 -6 -101
5426a01J46J93j50j62M9J53m4l08L00P5j00N2k92O6J82m9Rl8P7Q6l0j03l6k61
5450b86K06K32j78KK6k9J2O5lJ7j13nN1J17j5p2J85l16J2lK0J65j50J20J75j20
5476A15l17L18j97J24O8j47J13J5l9j48M0L6rj07r4K04j61J17K28k32K8Q5R1q5
5500D6j38M1J14L8k85M30j41j43P0L8j50n6K32k55K33o0M0l22L38m4J1r9J13p0
5524a9Mj21J14J21O4L3j96j80K64j70N4J52k2K5k09J47o9k2K5O0L0J4k21K85l58
5549a95J73K74j92J02j76k31O8L88j72j61m6K20J39m66J73O6j61N3r1M11j01l77
5571c02Q4j2N3n1K46k2j49K21K2r8j9rQ9K3q9r3j64J76l0K83j32j70M6L6k2J61
5597G8k24J72J59j44j45j91J91K6M5k10L37r0j70p5J86j62Q5L47k0L3k77N8j4
$$ plain form
5426 -101 45 238 88 -74 -25 128 84 -224 76 151 51 103 -189 -123 59 10 19 -19 58 144 114 11 -25 -286
5450 -286 -80 152 -26 -24 2 -27 -15 50 47 64 -49 -54 -3 114 99 27 212 -104 -92 -95 -75 90 -60 60 235 115
5476 115 -202 116 -81 43 111 -36 77 92 53 -95 -55 -19 -28 -135 -229 -25 -186 -69 159 -73 -45 40 131 46
5500 46 -92 -51 63 101 -184 246 105 -38 32 70 -80 -136 96 -159 74 14 54 -268 70 26 37 -62 51 -19
5524 -19 -15 -136 -22 99 163 196 0 -180 84 -86 -32 120 98 123 -86 61 -8 -30 -5 55 85 99 -122 163 -195
5549 -195 -22 252 60 162 -14 -245 -177 211 39 -122 -168 52 191 -275 -102 -36 -197 -144 -235 176 75 -302
5571 -302 -218 -230 -177 -228 18 -4 -153 68 90 -8 -27 -36 53 76 -13 -106 -270 -94 -124 159 27 -143 -97 -61 -83 78
5597 78 -146 26 185 41 -104 -295 -104 -78 -33 -243 94 4 -166 -241 -55 -217 -132 215 195 228 -49 9 -5
5620eL31m23J9P9M2J04Q1j41L3k5j34Q7R7KP5l52K3k0j8O0L39m58n8K87l4NL1
5647B7j9K81m06l2J76Kr3M6J6Oj0j15M47j94l1kj78K10k84L40j48j32M34l17J6
5672D0J90n2k33o5L67k10k81K81r1m4J68n3j93q5J31K02q4J25j06J35j81K75k65
5695b9M4k40Nm4K87j72K33r1O9N8m9J08k99N6m3N9J21k24K28k3l2J15k24J98J3
5720A24j03J22k26r3J74j69J05J91O1k14m9j08L06j32o8J27p6j19K14l49J10K17
5742D5j27j9o9K89k29J83J5K8j20j71P7q0J15L9p4J35j26K11J19k93Q6m7j08L21
5766B00j47k06L8l2kJ20L7O1k57j14K44j96J01R5J4M3o4k78N74k70J46j53M8K35
5790B37j73M3N6K52k01j74o3q8K52j33k2k8J48j52R3Q1j92Nj04Q6o6J94J93l87
$$ plain form
5620 -5 326 -97 -78 1 43 147 228 87 120 95 -39 48 145 147 222 -130 -107 -127 -145 -85 254 -204 -262 25 -9 -4 27
5647 27 8 289 -117 -149 27 29 -64 -18 -2 4 -6 -121 326 132 101 99 -79 131 -153 187 39 -93 341 24 40
5672 40 230 178 -55 -120 247 37 -244 37 -54 -98 70 17 -176 -261 -130 72 -12 113 7 142 -39 236 -29
5695 -29 15 -225 -220 -264 23 -149 84 -7 62 120 71 179 -120 -64 -107 -48 73 -151 77 54 22 137 -87 111 124
5720 124 21 143 -83 -176 -2 -171 -66 125 186 -28 -77 -185 121 -11 -79 48 -28 -147 67 -282 -172 45
5742 45 -82 -101 -170 119 -110 73 88 116 -4 -175 -98 -178 -63 -24 -98 37 -89 122 241 -52 34 -13 -121 200
5766 200 53 -153 -115 -147 -149 -29 8 69 -188 -302 -58 -254 -153 -58 -44 -1 -65 -343 231 -39 107 -46 2 237
5790 237 64 107 163 415 214 40 -23 -111 141 8 -14 -42 106 -46 47 128 -64 -59 -163 -77 -143 51 244 -143
5814a43K02j82M1L9n9R5m5R2l8o8J4j10J89jL1J07j29J64j86K31k12J71k3k56
5838g6r0L04O5m21J56R7j79K25j99Q6K08q1k52R1Q5j2J54j95q0o9j4K86k22L58
5862B25l88p7L83k19k6L9k1O2K29j19j97K64l52P7KoJ95M6j14J22m52K27K02j65
5886f3R5j31O0J67k92R2m5P4J2ok22J52N1j14L08l16n5L52p1L5K0k90Q1m6J67
5911A5n0K30j82J36j01j34j04L49k81J77n2K0j23J55k81L68l82L06M1j11p0j2
5933h6K88j14J58m23j5J28Q1J4J5o2k22K40N6j20J61R2jK01k75p6k06L95k17J40
5957A52r1j29K66k67R9r9K32j27J57k90l4K50J42k88J98n3j47k22N26j27k39K02
5979A11j61J67j20K87m11l8K1K62N4j71j45M37l30J40j16J36j59p4K73k23q4J36
$$ plain form
5814 -143 59 -123 -82 -43 -102 -7 -52 40 2 -66 -52 -162 27 26 57 164 35 199 13 244 32 203 180 -76
5838 -76 -166 138 203 -218 -62 35 -144 81 -118 -32 176 95 -157 -66 19 7 161 -34 -114 -183 -197 89 -133 225
5862 225 -163 -240 143 -76 -102 -63 -84 -22 207 88 -109 155 -197 -120 -118 -124 71 117 3 125 -327 -100 102 -63
5886 -63 32 -99 -39 128 -164 -72 -117 -43 -31 -37 -259 -107 -56 -170 138 -178 -233 119 48 83 103 -187 -106 -152 15
5911 15 -35 195 13 149 48 -86 -190 159 -122 55 3 23 -100 55 -226 142 -240 66 107 -4 -74 -86
5933 -86 202 88 246 -177 -192 -64 17 31 46 -16 -238 2 58 -62 99 191 190 391 116 40 -166 229 12 152
5957 152 61 -68 198 -69 30 -69 163 36 193 -97 -131 119 261 -27 171 118 -29 -251 275 148 -91 111
5979 111 -50 117 -3 284 -127 -165 -144 118 172 1 -144 293 -37 103 -13 123 -36 -110 163 -60 -144 -8
6001hJ32k59M33k37n5j5o3K66Pk80O6k5j29J22O2j26M14m74K46L4j33J07j19J63
6025A29j6k06j58L01J61k70%J69K56o68K85J71l42J60k8n9J09j6k46J32M08l82
6047a10J61K58l80P3P1p7l19R3N82m10l0J99j06k3P0j5K18l61J2J85j09J45o0
6070F7J26l71K48j01J7j26K22J37n6j83J96j01Kk37j8L83j32j16M4k02L08k00
6092i3J42m9p8K42k49K04j70j13M5L90k40J69M5m05M20q4L1j25q6J27l10J25J04
6115D2O7k37L56J9k48J14l76N13j80j48N2K56l00m2J27J03M7R7l77K65j55k64
6137b69K99N3j0Q4p5k37k40M06j16J49J65j67j2M2j34J16N5m2j26O6j46p3K05
6160gR4k33K19j94K04K2p1R6k78J36l5j15o3L75k88j01J32K50l7k12n1J93j45
$$ plain form
6001 -8 124 -135 298 61 6 -9 -72 194 201 -79 -13 -38 -167 -45 17 -109 305 -169 77 111 -22 85 -34 129
6025 129 113 -93 -251 50 211 -59 -59 110 366 -302 -17 154 -188 -28 -56 -115 -6 -22 -268 -136 272 -110
6047 -110 51 309 -71 2 73 -4 -323 -230 352 -58 -88 111 5 -18 52 37 255 -106 -94 91 -18 127 67
6070 67 193 -178 70 -31 -14 -140 82 219 163 -20 176 75 77 -160 -178 205 73 -43 1 -201 107 -93
6092 -93 49 0 -78 164 -85 119 -51 -164 -119 271 31 200 245 -160 260 176 207 82 -4 123 -187 -62 42
6115 42 109 -128 228 247 -1 113 -263 250 70 -78 -26 230 -70 -112 15 118 165 262 -115 150 -5 -269
6137 -269 30 83 73 157 82 -155 -395 11 -105 44 209 42 30 72 -62 54 109 67 -59 7 -139 -212 -7
6160 -7 87 -146 73 -121 83 105 34 130 -148 -12 -47 -162 -225 150 -138 -239 -107 143 106 -106 -157 36 -109
6183a09R2j73K33j20JR6J15j9k91J35j28N9K26k9k4R0R4l17j1J54r5P9j07J35
6207H6j68J89J28k49R7j66N1j38Q9j26J40O2q8qR0K2o2Q7J21j56j50L64k71J16
6231F0O8O0o5L8k17q8K69j31j11K97l00J33M6R2k04J90j44J29k74L34k66j31K94
6254G9m24N95m27K90m6r5N5L5j63K14pk43K99o0k14j66L68j18n5K28k33J97O6
6277A75o6m3j91J2J50J15k6k84M1k17N01k72J51J40k43KK65l55N8o5J91j70n8
6300a89j0J13J01j00J00N3P0k27J55L8Q7r2j40P8J5p2m2J5J64j49j0J19mP5j51
6325ck60K97r1J8k1J10r4J70m95N76j88M2n3n7j33K7J90j22k7J12j0J31q9K7m9
6350HQ6j05Q3p4P5J89l68K29j72k2P8Q7k57J60P3N0j11j40r6K49J52k7k12R9o4
$$ plain form
6183 -109 -17 -190 43 -77 -76 20 135 116 -175 -40 -168 -109 117 88 64 154 248 -69 -80 74 -21 58 -49 86
6207 86 -82 107 235 -14 83 -83 -32 -170 -81 -207 -67 -5 -93 -101 -11 11 -51 36 157 1 -149 215 -56 60
6231 60 128 188 123 161 -56 -144 125 -6 -117 180 -120 13 59 151 -53 137 -7 122 -152 182 -84 -215 79
6254 79 -345 250 -177 113 67 -28 27 62 -101 113 106 -137 162 102 -112 -278 90 -28 -83 145 -88 109 175
6277 175 109 66 -125 -113 37 152 126 -158 -117 -334 167 -105 46 186 -57 -55 210 -145 -87 -152 39 -131 -189
6300 -189 -199 -86 15 -85 15 68 138 -89 66 104 191 99 -41 37 52 -20 -62 -47 117 -32 -42 77 73 148 -3
6325 -3 -263 34 -57 -39 -60 50 -44 126 -369 207 19 61 8 -49 -182 -155 35 -87 -114 -2 -12 119 30 57 8
6350 8 94 -11 72 -2 73 262 -106 123 -49 -71 7 94 -163 -3 70 120 9 -131 -227 22 174 147 -65 34 -30
6375c0k86K80N9k21K36j08Q3R1n0Onj1k01K68k38J37n6l66N26o9j05J21M6k35
6399a28Q4J16k89K21J25m59L33J36l80L27k8j30jJ83kr9j61j24K76j56K53j79
6421h2k8O9R7j41p0Q2J70k30K94j68k13J33J53L8q5L9k43J85j97L32j75J15j62
6444h7m9PK71n0N3k28J23J27l06L02k00N9qn5L3j19O0J34j29K00l14J00J64j06
6468a8O1P2j81QQ6K5j33K81j71j14J66p5J51j66j63j5l4L44J51k82R3j59J56p1
6492A2R6j86p2J89R1Q3l06P2n0K3K61j46j29k61M07R8j63n6J50P6k55L47k47j69
6516a35J23Q7m0p1j21J19j39M08k97J98k39K14O5j01k20K19np3q1K24j58J57k23
6539h9J30J32l73L28%q9O4l60K56J67J11k61PK42j27j5k13k04K78J71j50Q5k86
$$ plain form
6375 -30 -316 -36 23 -198 38 -70 13 104 54 60 55 44 -157 111 -127 10 -46 -412 114 45 -60 61 107 -128
6399 -128 -44 72 -217 4 129 -330 3 139 -241 86 58 -72 -73 110 108 9 -152 -276 0 -156 97 -82
6421 -82 -110 -41 56 -85 -155 -73 97 -133 161 -7 -220 -87 66 104 19 58 -185 0 -197 135 -40 75 -87
6444 -87 -136 -129 142 92 145 -83 40 167 -139 163 -37 22 14 -41 -8 -127 -67 67 -62 138 -176 -76 88 -18
6468 -18 43 115 -66 -58 28 53 -80 201 30 -84 82 7 158 -8 -171 -186 -220 124 275 -7 86 -73 83 12
6492 12 108 -78 -150 39 130 213 -93 -21 -71 -48 213 67 -62 -323 84 182 19 -37 113 189 -66 281 34 -135
6516 -135 -12 75 35 -36 -157 -38 -177 231 -66 132 -107 107 172 71 -149 70 65 -8 -89 135 -23 134 -89
6539 -89 41 173 -200 128 128 39 103 -257 -1 166 277 16 23 265 138 123 -90 -294 -16 155 5 90 -196
6562a96L84j33k4q9o3J92J11k32kL32l31l5J49j15Q7k54J87M5J62j68R1k61J34
6585b9Q5N1j34O2J83j89j03m3j21K47n0N7K6j18J35j17J70k18J63LK0k72K04j70
6609a58K1L7L51k46K4j1O8k44J51k57K67k03NJ33K5J6J7k08K27n8q8J38R6j69
6633f6K51j01Q4k99j11K85l0j37J10j72K75j48N4J72l53L31k3j27j71J41jK80
6655B44q5j01q0K84l23j03j7P0R7R4j58J3N6J31k07J37n7K7j22O4l57M12j65K16
6679G0k1l09J96J27Q5j65j49K24J57k13k27L13j37J17j01q6J45J1j7j89K09j31
6701i1o1l7J28j0P8j85L8J62j20K26k39L47q3j48j24K88k17M4m0o9J84j33j3N8
6725a7l3K12j93J30k16J62Q5j95K50o6j14m0N0j84K02l03L39l03L04q9N8n5j54
$$ plain form
6562 -196 188 55 31 -58 -121 71 182 -50 -52 280 -51 -86 63 -52 35 -219 -32 13 175 7 98 -163 -29
6585 -29 56 107 -27 35 218 29 -74 -117 -238 9 -41 16 42 -76 59 -58 112 -106 57 60 80 -192 12 -158
6609 -158 -137 -100 251 5 29 18 86 -158 -7 -264 3 -200 -195 -62 -37 -21 -4 -212 15 -43 -131 7 103 -66
6633 -66 185 84 168 -131 -242 43 13 -124 -14 -186 89 -59 -5 167 -186 145 122 -5 -176 -35 -36 244
6655 244 159 58 -22 262 -61 -164 -181 -111 -14 80 -78 -65 -9 122 -85 52 -5 22 -100 -36 -393 19 -146 70
6679 70 49 -260 -64 63 148 -17 -166 58 215 2 -225 88 -49 68 -33 -119 26 37 20 -169 40 -91
6701 -91 -152 -189 -61 -71 7 -178 -140 22 -98 128 -111 236 153 5 -119 169 -48 -4 -44 -113 71 -62 -75 -17
6725 -17 -50 162 -31 99 -117 45 130 -65 185 119 5 -35 15 -169 33 -270 69 -234 70 -19 39 -16 -170
6748a70K9O5j09K45j16J19k2j72J27J37Om69K39K80J9j00j73L0K07l60N9o6K90
6771I5l1j62K82P2n14J55K99k89%J65oj4M4l35K37P7p7j6j9K22Qq4r3l06L0K39
6797b1P5kJ5j04ro4K20j46r8R5o7M5K00l25M64l17j6J50k43R3M6%j24j63K74j19
6823a41K88k39J07J10j24l18K04J21J15n0j99Q9r8J15o5K05j07J19k09K64j52
6844C5J73o1m4m7p8pr7J57m9J51r0J37j53K00k78Q0K4N1m1O3j75M19l90J26j98
6869i2O7j16L53l70K07k35K53o2n5L0r7p3J8Q4M9J40r6j8L0P8j77J54k51J82q4
6894h1l8M5K78o3p4j22k05M49j54K42m15J32O7l40M82j06j79J29K9j52J75k72
6916a73J58j57K43q3q9K12j69O5L3J40j95k36K48K98m77K64j7K32k51m2J87m51
$$ plain form
6748 -170 -141 -76 -185 60 -56 63 41 -131 -4 133 139 -330 -91 189 208 108 -65 -35 172 -188 -129 -195 95
6771 95 64 -98 184 256 -258 -103 196 -93 -93 72 66 52 96 -239 -2 75 -2 -18 -37 185 193 109 16 -290 -260 -21
6797 -21 54 52 67 -37 -46 -110 110 -36 -134 -39 -106 -61 139 -186 278 -39 -55 95 -148 -55 -9 -9 -133 -296 -22 -141
6823 -141 147 -92 15 125 1 -317 -113 8 123 73 -126 -37 -135 -20 -85 120 13 132 -77 187 35
6844 35 208 147 103 56 -22 -29 -126 31 -18 133 43 180 27 227 -51 29 53 104 63 126 -49 370 -20 106 -92
6869 -92 -25 -141 212 -158 49 -186 67 5 -50 -20 -117 -190 -172 -88 -39 101 5 -13 17 95 -82 72 -179 3 -81
6894 -81 -119 -74 204 141 67 -55 -260 189 35 277 -138 -6 61 -279 203 97 -82 47 76 -76 99 -173
6916 -173 -15 -172 71 -12 -101 111 -58 7 40 180 -15 -251 -3 295 -182 82 65 297 46 4 191 -260
6938b60K26N3j25K25j17J78j61m6K4k61M81l97K29j0K10l99mK09O5Rr8o1k75M39
6962A34k0k88K60j34l6k0N3l3K53o3r6j66P4J19k42K36n7l5N0K36j31k26K21O1
6986A50k49K04m6K8J2j16K3j65L74k61Q0l59L68K35k94N8L0k48K17m8KN1j76J54
7010B4J45j43J11k37P0M6k49J95mL12l37M2k4J67j97J98M3k45L96k47n1k53L75
7033A37m8j73K05k12%J52p0j7J29k03j25J97P9k21J28k0J12j79L30k18Q2K1Q6
7056A72L0j92J9M8k51J51K25l37J36J12j24Q0j65J03n1P6j78L70l31J39j22j62
7078b52J53P0jn7R2j43L32l32R9J12j62J40j02M1p9J77l64k0L87o1j78M0J62k04
7102a50K11q1R1M9j71K25k15p1J27k85L52r0k04K57k3J13j88q3K79l78J27K79
$$ plain form
6938 -260 -34 19 -106 119 2 180 19 -27 -3 -264 217 -180 49 39 249 -150 -154 55 120 129 31 -30 -305 134
6962 134 114 -174 86 -48 -84 -104 -51 -84 169 106 10 -156 -82 37 -205 31 -26 -61 -11 225 94 -132 89 150
6986 150 -99 105 59 87 99 -17 6 -159 215 -46 34 -325 43 278 -16 42 72 -176 41 -7 -5 46 -130 24
7010 24 169 26 137 -100 -30 16 -233 -38 -42 270 -67 -25 -49 118 -79 119 162 -83 313 66 15 -238 137
7033 137 89 -84 121 -91 -91 61 -9 -26 103 -100 -225 -28 51 -170 -42 -62 50 -129 201 -17 65 86 172
7056 172 202 10 29 77 -174 -23 202 -135 1 113 -11 69 -96 7 -44 32 -146 224 -107 32 -90 -252
7078 -252 -99 -29 -30 -87 5 -138 194 -138 -39 73 -89 51 -51 -10 -89 88 -276 -296 91 30 -148 -108 54 -150
7102 -150 61 -20 71 120 -51 174 -41 -112 15 -270 82 -8 -212 45 22 135 -53 -136 143 -235 -108 171
7124A71j46R3j83n1J81k10J68J71k20m9j3n1R7K51j72k5J28k68K77l40R5K97k03
7147bl19M87l09jK14j26J79k32o1K45O5m20L87j31m5J77n1k0M4j1l11K32q7K57
7171A61r4n1p6o2K44n2k00K62j75j60O5J17R3J3J1k15J69j8r2r5N3K06j43jJ79
7196A39m0j95M5J8km7k15L0L18M0k61N7K48k58K69m1j92K38N4l67K01LO0k80K76
7221I8kk28J77j15M9r4L66k09q2Q2J40m31L49K2J00l19J50j67J36J1j53J01r4
7244a13Q7R4k91P6J85M9n4n4O8j92k0mL8R1m3Q2j43J30j73J26L32k45%m0K14m56
7270b56K14J07j56R0K47l04j4P2J5L3j11j09J00p3J62kj13J21L61m12N9O9j42
7293d2J10j88J62j83J20J94j07q7P8j17J70O1j23j58J32j46j96L72l03Q5K57L
$$ plain form
7124 171 25 118 -65 -116 65 -145 23 194 -26 -75 -88 -139 -42 209 37 12 140 -128 149 -191 -96 201 -2
7147 -2 -321 166 -143 -144 70 -56 123 -109 -170 75 140 -280 107 -24 -69 108 57 37 81 70 -241 -9 -96 161
7171 161 67 16 -60 -122 122 70 -130 132 -43 -203 -138 -21 72 85 96 -119 50 32 -60 -155 -102 104 -39 -40 139
7196 139 99 -96 -51 -33 -35 -82 -297 -267 51 91 -170 -113 135 -123 146 105 -87 151 205 -162 39 42 102 -178 98
7221 98 96 -132 45 -70 -21 -115 251 42 -40 42 182 -249 100 122 222 -97 53 -114 22 33 -120 -19 -113
7244 -113 -26 68 -223 -147 38 87 33 -21 47 -145 -165 -169 -131 -40 -83 -1 -144 -14 -187 -61 271 26 26 -14 200 -256
7270 -256 -42 65 -91 -1 246 -58 -72 0 15 48 -63 -172 -72 -145 17 15 -98 23 384 -28 31 100 -42
7293 -42 68 -120 42 -141 -21 173 66 -21 57 -60 110 171 48 -110 22 -124 -320 52 -251 -166 91 94
7315I4K58k34k9j44MRK14m54L54K3q9m0l2J89k83K64J4j47J27k33J60M5q8m3J2
7340d9J95j32j6R3O8j33K04l37j53L22k2L5n2k15M03n43L24j84N0m1J98L5m2j22
7364a14R8n7K7j64J80Q3q5n2J1J84n1K5j08j17K71j99L58k60k05J21J09n9k18
7387b22K89q4j12J98%n9l0n8K49j61J28m09R6J84m0l2J03n3K17j34K0o4k77M87
7411B36l73R2j65K37o5o5k7p8K64L3k04N7r2K01j73K78o0j84J7J61m3m5Q8p1l1
7436a2nM5M6p1J7M0j75K30k08OJ10P3j47P8N8j39L18j87j20r7M04k41L8K4j42
7461e7q3L2K41j35r0K3Q0j57J78k6P8J30k09R4l2j13M0L6m7J31O8l64K86O1j44
7486B1l8L7Q7R7j90M7l6j83M58l08k8n0M5q8K0J21j18N1R9J38k47Q7M4j65K49
$$ plain form
7315 94 352 118 89 -55 -51 -42 172 -282 72 95 6 -34 -66 123 -160 104 118 -29 98 -135 25 70 -18 -61 -49
7340 -49 146 14 -2 91 159 26 230 -107 -260 62 40 75 23 -192 211 -332 -8 -192 -142 -183 15 50 8 -114
7364 -114 -16 -73 -46 -210 -30 53 -32 -84 -73 111 60 85 -23 -140 131 -68 290 30 -175 -54 55 -4 -222
7387 -222 67 -17 -129 69 69 10 -20 -78 171 10 138 -271 -175 9 -31 -63 40 -13 204 70 90 26 -251 236
7411 236 -137 -45 -210 27 -38 -103 -130 -208 56 89 -115 -58 -150 51 -122 156 96 -88 -71 90 47 2 90 19 -12
7436 -12 -17 28 74 3 20 60 -115 115 -93 -87 23 96 -51 27 85 -54 264 77 -43 -140 264 23 61 85 -57
7461 -57 -140 -108 133 -2 -92 -69 11 -146 32 6 84 214 5 99 67 -46 -6 30 -17 114 182 -182 104 165 21
7486 21 -17 20 107 204 14 61 25 -158 300 -8 -36 -86 -41 -129 -109 12 -106 -55 44 182 -65 22 66 -99 150
7511A50k44K2P9K8m2L56k65j04L84l57j11P9K79l32p8P4j55J23r6J92k00L30K7
7534A39j56l9j61M00j76j69M04j88Mk30J93P7k53J43Q8Q4r8J14Q1q8j66j97K57
7557F3p2J73l22J90qj8k1n4O8n5K00k15j46J35n2J59M3o0r6K46k01J39j87pK04
7582A06n5oJ30k83j27PJ58n1K4K04j02P2j8J91l2l58O9j16n9K10J9Q6k3l2j65
7607a51J74p6l3K19j46rL5oj11P7K12k48K5L0rJ01j13r4J01K65m45J9J05J56l4
7632D4J8j89K18j58J83l0l03M20k12j18J79J22j15m9j4K30j33j81K14j16o2L0
7654b2R1q7j36K75k48j2J79m8Q1j49q0K99K9k30j67L36N2k86J09o9p2L52l54P3
7678h4k12K65K2O5J6j59R0j6j88M85j38k18N0MO0M5k59K80K11n60K06J10k20J55
$$ plain form
7511 150 -94 -72 7 35 -7 349 84 -20 364 7 -104 -25 254 -78 -156 -82 -237 -114 -210 -18 -218 112 139
7534 139 -17 -56 -217 183 7 -162 242 54 58 -172 21 98 -155 -12 76 160 62 176 257 169 3 -194 63
7557 63 -9 164 -158 32 24 6 -15 -69 -1 -56 144 -71 -217 -82 -134 25 68 8 -88 158 -43 96 -91 -98 106
7582 106 51 45 175 -108 -235 -228 -70 -121 -97 107 5 77 59 250 218 -140 -71 -187 -246 -36 -17 69 46 14 -151
7607 -151 23 -53 -86 133 -13 -22 13 7 -104 -27 185 -63 -38 -8 -17 84 -29 -123 -22 243 -202 -183 -78 78 44
7632 44 62 -127 91 -67 116 86 -217 203 -9 -127 52 174 59 10 -4 226 93 -88 126 10 -52 -22
7654 -22 69 -18 -154 121 -127 -139 40 -8 73 -76 -156 143 172 -58 -225 111 163 -123 -14 -83 -155 197 -157 -84
7678 -84 -296 -31 -9 56 72 -87 3 -13 -201 284 146 -72 -22 -18 42 87 -172 108 319 -241 -35 75 -145 10
7702A0m2n6k77J88L63ql92K47L0Ok64J92J07J42m07n1K49K3K60k86j42O5L71l35
7726gk44L77rl55M26j27P8j45L9j16qp7l3J20k8K22k31L4j09J57r7k6P7K51j79
7751a0j70J51J9j79K70J7j23Lp3O1K0J53j54P7k19K43J3r8N1j0j36L05j52l3k78
7776b52M35l18J38j53K04j08O1M0j43J26l11J58j50M75r9k48J17J43k11K04k00
7797i2J46P6j09j09J67M0k61L94q2M9j20l17J19j7L33j6m34K38k9m4P6j89o6l4
7821b81M39l15L60l93J25o2J71j22j43K28J23q1M9Mj44r4o8L43j00j08p7J46j69
7844a69K57j46K65q6K7k08l3N0KJ5J90j81j18J41j72K75j16l5pk37J71J59N7o6
7868C5L9j44J36j71Q8m5K24K7k32J7J50j14k68L15j53m3L35k84K49m17J0M04j55
$$ plain form
7702 10 -32 -88 -365 -177 186 178 -214 33 63 69 -195 -3 104 246 -161 -212 37 60 320 34 -108 -43 328 -7
7726 -7 -251 126 117 -238 188 61 139 -6 33 -83 -91 -168 -201 -81 -109 113 -118 -84 -193 -36 -133 -159 -82 169 -10
7751 -10 -180 -29 -10 -189 81 98 -25 -22 -95 -34 -14 139 -15 62 -157 86 99 1 52 42 -94 211 59 26 -252
7776 -252 183 -135 3 -150 54 -54 7 47 -96 30 -281 -123 -273 202 103 -145 -28 115 -96 108 -92
7797 -92 54 130 21 -88 79 119 -142 252 170 219 99 -218 -99 -116 217 201 -233 5 -24 -68 8 -181 -247 -281
7821 -281 158 -157 203 -190 -65 -127 44 -78 -221 7 130 49 98 102 -42 -136 -204 139 39 -69 -146 0 -169
7844 -169 88 -58 207 121 148 -60 -93 -43 -41 -26 164 -17 -135 6 -166 109 -7 -42 -49 -286 -115 44 101 35
7868 35 74 -70 66 -105 -17 -62 162 189 -43 -26 124 10 -258 57 -96 -139 196 -88 161 -256 -246 158 3
7891Cj28J68j71K9K82k44L57k54kj5P1k26k4J16j4J07m1Q1k09K64k6q8r0k61M86
7916A71k31mJJ67O0k86L06j23n2Q5k22K27l12J79M6L3J53l0j83j83K25K13k67
7939b7N9J06l24K36l5r0N8j02J82k38P0Q1J23K6k48J5R3ok64L93j09K7q0M8m3
7964d9L02l68K32k8j21k8J5Q2k4l5j39J5p9K39J17L5l8l8j85Pj80K54N7P8J20
7989B41k67PK4J92l62Q1J78k13M6J82q9j56K02J46j94Q8k77K93k36K55j09j96
8011a64J33K1J6k18K95k36J48L3j09L13m06j04K73Q1r0%K87n05K42J2J92k42j15
8034a43K69j51q5M4N6J73j87l0L8j53M14j91r2j48J91R8k93L04Lk24J13J30l17
8057a81J04K40l24J70j63J99N3j15J65n12N94j90k7J30j08j7N2j7r8p1J62l6J63
$$ plain form
7891 3 -125 43 -128 -99 183 -61 296 42 40 25 96 -130 -154 -38 -52 55 14 95 -114 150 124 36 -54 -315 171
7916 171 -60 -64 -63 104 164 -122 184 61 9 94 -128 99 -213 -34 12 45 198 168 -15 -198 27 240 -27
7939 -27 32 138 -186 50 15 -75 -17 -119 63 -175 -105 -24 99 125 -123 -108 -15 -21 -285 108 -1 26 -54 -6 -49
7964 -49 253 -115 117 89 -32 -60 -45 37 13 -22 -161 -146 -225 14 131 166 128 90 -95 -88 -268 -14 43 121 241
7989 241 -26 -19 5 197 -165 -84 94 -119 -73 109 20 -136 66 212 18 106 -171 122 -114 141 32 -164
8011 -164 -31 -10 6 -212 83 -153 -5 28 -81 232 -174 -278 -5 76 -14 -14 273 -232 10 22 214 -28 -143
8034 -143 126 -25 -110 -66 -10 163 -24 -54 -16 -169 245 54 -38 -186 5 103 -190 114 117 -107 6 136 -181
8057 -181 -77 163 -161 9 -154 45 98 -17 148 -364 230 40 13 143 35 18 70 53 -45 -116 46 10 173
8080A73k33j17N5J69j08J8K19j72P8m6J09m8J30l38J88%k21R2K9Q1J26k19j45
8103a80R2L0l8J32k10K87N3m18l1M34j84J37L5k12J60j39J6J79k73j13L87j36
8125HP8j70K13l01K22j23J7J16k89K95J73k51J31l7k35L20l9q1K11l23K63j09
8147H9k6J91l68K97m21J08K96l99K95JJ60n8k53J90j81J29J03j3l26K11j94L11
8169A42j28l9l4j01J4j64K68j8J98qJ07k66K25j44R9l96M83j82j15J16j61n2
$$ plain form
8080 173 -60 -177 -122 47 -61 -43 176 4 82 36 145 97 227 -111 77 77 -144 -52 -23 58 184 -35 -180
8103 -180 -88 -58 -96 36 -174 113 166 -252 -283 151 -33 104 139 -73 87 -52 -36 143 -130 -243 144 8
8125 8 86 -84 129 -172 50 -73 -56 60 -229 66 239 -12 119 82 -153 167 128 47 258 -65 198 89
8147 89 63 254 -114 183 -238 -130 166 -233 62 63 223 165 -88 102 -79 50 153 140 -186 25 -169 142
8169 142 14 -25 -59 -160 -146 -310 -42 -60 138 130 237 -29 196 52 151 -245 238 56 -59 57 -104 -156
8191a56
$$ Imaginary data points
##PAGE= N=2
##DATA TABLE= (X++(I..I)), XYDATA
0@%%%%%%%%%%%%%Qj6J6j6K4l2L2m0M8n6P0p8Q8j04J22j43J65j90K18k46K79l15
35a66L55m01M49n01N57o20O90p66Q48r38J039j146J264j394J535j690J862k053
53a076K265k503K770l073L419l819M291m858N547o406P521r028J1184j4544K0543
68A2233l4428J25588K3100k82074P9678K12366m5461k12438M5667J78580k613
79A00198j80432k7452J64827O9599j73986q5534J76229R5599j88830r3651J87627
90D4194R7460j73920q8866J43910Q5248j17731q7530Q8364J07857o4400j30347
101i5761M2472J51130l2741j65772L2096J70972l8740j71712L8725J63489k8723
112F5435j45283J1815J27833M550j16550k6385J18158N1403j20950o9007J25399
$$ plain form
0 0 0 0 0 0 0 0 0 0 0 0 0 0 0 8 -8 8 -8 16 -16 16 -24 24 -32 38 -40 48 -56 66 -77 88 -102 116 -130 149 -166
35 -166 189 -212 237 -264 293 -327 363 -403 445 -493 546 -600 664 -730 805 -885 977 -1076
53 -1076 1189 -1314 1456 -1617 1802 -2017 2274 -2584 2963 -3443 4078 -4950 6234 -8310 12233
68 12233 -22195 103393 126493 -155581 -75903 136463 91002 -121436 -75769 102811 100198
79 100198 -80234 -107686 57141 126740 -47246 -132780 43449 139048 -49782 -143433 44194
90 44194 141654 -32266 -121132 22778 108026 -9705 -97235 -8871 98986 34586 -95761
101 -95761 -53289 97841 65100 -100672 -68576 102396 63656 -108056 -69331 94158 65435
112 65435 -79848 -68033 59800 64350 -52200 -78585 39573 90976 -29974 -98981 26418
123B6418P9221j29026p6473J30305P0119j26691o5069J14363O3052r1878o3906
134f9565O9296O6205n3600p7307M1023R1535l3296j02110K7533J06131k7534j03189
146f4878K8666R6290k6378q7550J7367P8041q35o7984j4302O2608K7305o4236
158a5886l9927P0293M9332p3845n3767P4235N1173p2139m6997O5948M3846n8112
170e846m4837M5208M9689l2572n5129K4316O0916k1166o8054K0773P3484j9724
182B7058p3483K0434O8551j9337o0991J6268N4892j0092m9748j56M5803J0634
194B9833m3431j8913M4006K3186m7875k5971M8825K7538m6970k6734M2375K4389
206C0258l5765k3944K9138K6409k1405l1560J4928L7871r929m1648Q448M5408
$$ plain form
123 26418 105639 -23387 -99860 30445 100564 -26127 -91196 23167 86219 -5659 -69565
134 -69565 -269 65936 12336 -64971 -23948 67587 34291 -67819 -40286 65845 38311 -64878
146 -64878 -36212 60078 33700 -53850 -36483 41558 40723 -27261 -41563 21045 48350 -15886
158 -15886 -55813 14480 63812 -10033 -63800 10435 61608 -10531 -57528 8420 52266 -5846
170 -5846 -50683 -5475 44214 11642 -43487 -19171 41745 20579 -47475 -26702 46782 27058
182 27058 -46425 -25991 42560 23223 -37768 -21500 33392 23300 -26448 -26604 19199 29833
194 29833 -13598 -32511 11495 34681 -13194 -39165 9660 37198 -9772 -36506 5869 30258
206 30258 -5507 -29451 -313 26096 4691 -26869 -11941 25930 16001 -25647 -17199 28209
218B8209r605m7591J0275M7096q993m3939O819L9069l553l5466j412L3296P448
231B1653l3131j3946L3883J7824l4254j9143L5013J8951l5551j8091L3683J7992
243B4883k9000j6880K3377J7467j8423j9414J4356K2450j0334k6795Q244K8427
255A8358o525k9429O430K8948o811k7816M941K5595j964k2365k069K0386N882
268A3561j9754r704K0519J3434k1159j5587K1588J6119k0905j5844K0667J4841
280A7776j8777j4995J5927J5090j2134j6026R120J6877p283j8618N533K0376m657
293H209k1208M332K0479m212j9031L471J7486j776j5919l63J4293K828j2790m847
307i048J2109P226j2289q703J2287R715j2169j0170J1349R990j0115r350Q590
$$ plain form
218 28209 18604 -28987 -18712 28384 19391 -24548 -17729 21340 17787 -17679 -19091 14205 21653
231 21653 -11478 -25424 8459 26283 -7971 -27114 7899 26850 -8701 -26792 6891 24883
243 24883 -4117 -20997 2380 19847 1424 -17990 -3634 18816 8482 -18313 -10069 18358
255 18358 11833 -17596 -11166 17782 10971 -16845 -11904 13691 11727 -10638 -12707 7679 13561
268 13561 -6193 -15897 4622 18056 -3103 -18690 2898 19017 -1888 -17732 2935 17776
280 17776 -1001 -15996 -69 15021 2887 -13139 -4019 12858 5575 -13043 -7510 12866 8209
293 8209 -12999 -8667 11812 7600 -11431 -7960 9526 7750 -8169 -8532 5761 8589 -4201 -9048
307 -9048 3061 10287 -2002 -10705 1582 11297 -872 -11042 307 10297 182 -9168 -578
320e78Q898o297j0039M481J1000k918j1667J791J2590j554j2910J235J3307j131
334F208j2414J52J1742J57j0638p74R765K030r132l397Q496M636q192n589Q437
349A487N479q425n705P977N668o799n710N732N191m433n191L155O094k618o368
364d466J600O800o22p118O42P018n73o960L05O447L45o260q14N798J508n550k180
381d080N112L181n206l500M911L795m893l948M794L884m467l859M003L952l459
396B20l792K791M028k398l816J607M534j402n056J358M729r54m679J131M242p19
412A824l915L9L805M70l888m34L114J494l638j488L598J643l192k331L390K221
428B712k955k549L060K075k360k486K090K969j723k910J165L317j140l749J288
$$ plain form
320 -578 8320 2023 -8016 -3535 7465 4547 -7120 -5329 7261 5707 -7203 -5968 7339 6208
334 6208 -6206 -6054 5688 5845 -4793 -5567 4198 6228 -2904 -6301 2195 6831 -1361 -6950 1487
349 1487 6966 -1459 -7164 813 6481 -318 -6028 -296 4895 462 -4729 -1574 4520 1902 -4466
364 -4466 -2866 3934 3312 -3806 -3164 3854 3281 -3679 -3374 3073 3418 -2842 -3656 2142 3650 -1900 -4080
381 -4080 1032 4213 -993 -4493 418 4213 -680 -4628 166 4050 -417 -4276 -273 3679 220
396 220 -3572 -781 3247 849 -2967 -1360 3174 1772 -3284 -1926 2803 1849 -2830 -1699 2543 1824
412 1824 -2091 -2052 1753 2223 -1665 -2099 1015 2509 -1129 -2617 981 2624 -568 -2899 491 2712
428 2712 -243 -2792 268 2343 -17 -2503 -413 2556 833 -2077 -912 2405 1265 -2484 -1196
443a196L529r50l307Q72L220p74l488O52L002J16l129l13K986M55k626r48K827
460I28J248l166j125K866J154k338j617K444J442k077j269J293K077j837j661
475a638J149K059r58k347J128K238p64k247L45K509m10k272K25J973K38k348j47
492a267K069O67k545n48K297Q75k322q15K301Q30j809j218J766J302k057j116
508a590J690J606j868j054J074J451j208j180Q76J531p47j896J006J605o88j750
524a142N48J502l64j560m4J951l36j417j17J569L60j709l65J471Q33j772n58J482
542C32P61j604n66J288J124j481j165J321J213j115j425J356J134j178j293R76
558c22J455q88j381Q05J399o57j415L28J517k74j622M9J821o7j641Q2J412K10
$$ plain form
443 -1196 2333 1383 -1924 -1052 2168 1394 -2094 -1442 1560 1676 -1453 -1766 1220 1675 -951 -1899 928
460 928 2176 -990 -2115 751 1905 -433 -2050 394 1836 -241 -1510 -217 1860 23 -1638
475 -1638 -489 1570 612 -1735 -607 1631 867 -1380 -1035 1474 1064 -1208 -983 990 1228 -1120 -1267
492 -1267 802 1469 -1076 -1624 673 1548 -774 -1589 712 1542 -267 -1485 281 1583 -474 -1590
508 -1590 100 1706 -162 -1216 -142 1309 101 -1079 -203 1328 581 -1315 -309 1296 608 -1142
524 -1142 -594 908 544 -1016 -1060 891 555 -862 -979 590 950 -759 -1124 347 1180 -592 -1150 332
542 332 1093 -511 -1077 211 1335 -146 -1311 10 1223 108 -1317 39 1173 -5 -1298 -322
558 -322 1133 245 -1136 -331 1068 411 -1004 -676 841 567 -1055 -1006 815 748 -893 -811 601 811
576H11j603j39J342O55j753j6J228N14j245q60J251P48j043j066J225J043r87
593A05j196Q39J495q68j512J037J410n87j606K79J494j42j383j48J748r2j757
610h84O2J498L95j518o28J853L52j553q50J605P57j435r63J528J037j253j291
627a288J248J028r12j197Q20J332p12j189L92J565n30j313J84J300O3j618K37
644e90J100J34j288l00J595J84j297n83J450P34j528o59J238P69j291q40J178
661FJ067r30j159Q57J030o19j263O68J082n96r10L16J215j97j371J54J420j01
679F69j279J30R07L00j193k25J211N24j231n40R78N21r47p85R11Q33p40q83O61
698a78J110p39p32L88O81l7j173K95J131j45j196J35R39J3p97m75J157M01j056
$$ plain form
576 811 -792 -931 411 1066 -687 -703 525 1039 -206 -1066 185 933 -110 -1176 49 1092 105
593 105 -1091 -252 1243 375 -1137 -100 1310 723 -883 -604 890 748 -635 -783 965 873 -884
610 -884 -822 676 1071 -447 -1075 778 1130 -423 -1273 332 1089 -346 -1309 219 1256 3 -1288
627 -1288 -40 988 76 -1121 -301 1031 319 -870 -478 1087 557 -756 -572 728 791 -827 -590
644 -590 510 644 -644 -944 651 835 -462 -1045 405 1139 -389 -1048 190 959 -332 -1172 6
661 6 1073 143 -1016 -159 871 252 -1011 -343 739 143 -767 -451 764 567 -804 -650 770 669
679 669 -610 -480 427 727 -466 -691 520 1044 -187 -727 251 772 -175 -960 -49 784 44 -839 -178
698 -178 932 193 -539 -151 530 493 -680 -385 746 601 -595 -460 479 492 -305 -780 377 778 -278
717b78l64J045J51p92n92J202L89j150k30O87O71n14o98M81O08n62n66M77R32
736H97n91p95q5R68j96l69j05Q00k44q19J45O96j27m73l64P87O13r14n38J015
756C01L20q18m94P96M93n61p92O44R11j039k65M59N23m53n19L05P34k85p44J77
776c07J002j70p25j84P09K00r58R6Q93j23o35l60O04L55n13j86M42J52l90l06
796d04L29O78l36p86K60Q18l47n52K02M93j17n35M7N43O4o02j24Q48k14o89J05
817c19N43L71r46k92Q08L21q69j37M14M36m04l43N51N15p11m29L87O23j13j048
837f42M06N58k11k63N5N21k35m13J10L07J20n99N5L37L35n16m03N80J50j82k90
858b20J22N24m69n05O44L85m57k68J11O27k18n97L51J48J09n41R9M47l83k08M1
$$ plain form
717 -278 -642 403 554 -238 -830 372 761 -389 -619 68 739 225 -473 8 616 54 -512 -35 897
736 897 306 -489 -574 394 198 -171 -276 524 280 -539 -394 302 175 -298 -662 125 738 -176 -714 301
756 301 621 -197 -691 105 598 37 -755 -111 800 -239 -504 -45 478 25 -494 -189 545 260 -484 -307
776 -307 695 525 -200 -384 325 525 -433 -337 556 433 -202 -562 42 397 -116 -302 140 292 -98 -404
796 -404 -75 603 267 -519 -259 559 212 -340 -138 355 238 -297 -250 293 357 -245 -369 479 265 -424 -319
817 -319 224 595 -351 -643 165 486 -383 -520 -106 330 -74 -417 134 649 -62 -491 -104 519 406 -642
837 -642 -236 322 111 -152 -97 424 189 -224 -114 193 313 -286 -231 106 441 -75 -478 102 252 70 -220
858 -220 -98 426 -43 -548 96 481 24 -244 -133 494 276 -321 30 178 287 -254 -155 292 -91 -299 -258
879b58L98J04m75P2K65K92m16k22M88J19n64m7L93K16l50k99K51K45K1o14M25
900D4J46m8k63M9N73k99k97k83K74K80m94K14M05j28m78J27L68j69j57K32n5j23
922h2j72K3N95j36r6k51K95L9o8m17K10K75k03m77N03N9n3j46J43p8J76j38k4
945b3K88k45q5j6MQ1k95K28L29j49%j97J50K69k72k40K70l0rj31K9K70m16J77
969a3K4q3K56k45K40j74M7l03L73k26Q7j58L62j98p2pj6K84m18M34j12l2J55k90
993h5J59m7L4l46K07R5o0j66J21J52p3j63K49M7r6P1j07K85l37k5J02o5k1n8K06
1018G9L8nj29K1K82l90l6J0K71m6k26P2J33J3l36L43q2k7j28j05J89J41r7O0K27
1043B72l93K12k32J15Kj7n5K57Qn52K59K55m8O0J9l63K45J91l63J63QJ60m46Q6
$$ plain form
879 -258 140 244 -231 -159 106 398 -18 -240 248 367 -197 -244 149 365 15 -284 -33 212 233 -381 44
900 44 190 142 -121 -72 501 202 -95 -378 -104 176 -318 -104 301 173 -305 -178 190 21 -136 96 41 -82
922 -82 -254 -231 364 228 132 -119 176 215 147 -270 -60 215 12 -465 38 97 44 -102 41 -37 139 1 -23
945 -23 265 20 -65 -81 -77 4 -291 -63 266 117 117 -80 70 339 67 -173 97 67 58 -73 -44 226 -190 -13
969 -13 11 -72 184 -61 179 5 52 -251 122 -104 -17 -175 187 -11 -83 -90 -106 178 -240 194 82 50 205 -85
993 -85 74 27 61 -285 -78 17 -43 -209 -88 64 -9 -172 77 124 28 99 -8 277 -60 -85 17 -48 -69 -127 79
1018 79 117 112 -17 4 286 -104 -140 -130 141 95 -131 -59 74 87 -249 94 12 -15 -143 -248 -59 82 -15 45 272
1043 272 -121 91 -141 -26 -24 -41 -96 161 169 -383 -124 131 83 143 162 -201 44 235 -128 35 43 203 -243 -157
1067a57J22m5O4j76J12J38q5rJ92j47j50n1N94m42J63l12K57J45k28l0M75m09
1089B1O1j85J55n3K1j85J89L7k05J7L3J10j61J89P0J25J5l80K8J13J53p5k85K90
1113I8N5k20L3J77q2K5l25K84R4l92Q8KL00k7k93J58N8K6k00n5J84L81n35L84
1137B18O3l71O5K2K94m27n8N1L36l2k36j3j51M56k74p4L13l23M3j40M3M29j96
1160C8l44K98P8p3l38J00K50K1k8Q6k1j69k7q4K01Q1Jj04M8J42k25j98K79n6J84
1185A40k55N8K59m3l71J58j34J21n4J74Q4k02j35M3L53m05K33o7L20j33m53R1
1207b18M70j88k40N7j15L39P3k67K23j60k33J43O1M24n75J27q1L09r0p2O9q5O8
1230C9M5k79L87K4k16P2N8J13m77l0K16R3r9j46L44r0m8n6k5J47j43j40K2L83
$$ plain form
1067 -157 -35 -80 -16 -192 -80 58 -27 -36 156 9 -141 -192 402 -40 123 -189 68 213 -15 -45 430 21
1089 21 82 -103 52 -1 20 -165 24 61 -144 -127 -94 16 -145 44 114 239 254 -126 -98 15 168 93 -192 98
1113 98 153 -67 -34 143 61 86 -239 45 139 -253 -165 -163 137 110 -183 -25 33 59 -141 -196 -12 369 -166 218
1137 218 281 -90 -25 -3 291 -136 -194 -143 193 161 -75 -88 -239 217 -57 -131 182 -141 -98 -238 -195 234 38
1160 38 -306 -8 70 -3 -341 -241 9 30 2 88 67 -102 -129 -213 -12 69 70 -34 14 156 -69 -267 12 -44 140
1185 140 -115 -57 202 159 -212 -54 -188 -67 -121 53 137 -65 -200 -157 196 -209 24 -43 277 144 -309 -218
1207 -218 252 64 -176 -119 -234 105 178 -89 134 -26 -259 -116 -55 369 -206 -79 -160 149 59 -13 56 -29 39
1230 39 84 -195 192 216 0 72 130 243 -234 -264 -48 45 -54 -200 144 54 6 -50 -75 72 -71 -211 -189 194
1254A94k17R4q1M0q3p0P0J22q4P6j90K11j01P3J96j59k35J53j56J53p6k8J23n5
1278c0K8p3j04J60K0J04Om1qK0p8j73J05mJ02k41K47J04j39P0l12K99p2J2M7k22
1304a73J03J54j71K67r4r7o0R1l82J94M80l89n1J37j6M8L34m48o4J60J34l96Q3
1327a56J11Q5Q6P6j92K66n5l73K48n7n3LJ82l08N3r3K61L0qp7j71K8J6J40j92
1352a50M28k83J14m21L61q6k9N5J9O5q5KL4l0J48l11K02J00j72j01J08l2J88k59
1376a35M4L05j82k47r5M95k11K5k23K42j34K3o2M3J50q1r2L6Q8K0Om8J2R9o3k
1402A3p8L20m19K20J30j95N0k34J53J09J94k12j34M13k32j15P7j17K1j30K21R2
1424A47j60k31N8L95k46j22J74M5k59O3K96p5j04j71k5K26J51q2j8J73r4j07k51
$$ plain form
1254 194 -23 71 -10 30 -53 -123 -53 69 -15 61 -129 82 -19 54 250 91 -144 9 -147 6 -70 -98 25 -30
1278 -30 -2 -75 -179 -19 1 105 111 70 62 82 4 -169 -64 -68 34 -207 40 144 5 75 -237 62 -10 2 49 -173
1304 -173 -70 84 -87 180 86 -11 -71 20 -362 -168 312 -77 -128 9 -7 41 375 -73 -137 23 157 -239 -156
1327 -156 -45 40 126 202 10 276 221 -152 96 39 -14 -11 171 -137 -84 -177 84 114 106 29 -142 -114 -98 42 -150
1352 -150 278 -5 109 -312 49 -37 -66 -11 8 73 -12 -10 24 -6 142 -169 33 133 -39 -140 -32 -64 124 -135
1376 -135 -91 214 32 -215 -310 185 -26 -1 -224 18 -116 -93 -155 -112 38 -43 -135 -99 -11 9 15 -33 -21 78 15 13
1402 13 -65 255 -164 56 186 -9 41 -193 -40 69 263 51 -83 330 98 -17 60 -57 -36 -166 55 147
1424 147 -13 -244 -186 209 -37 -159 15 60 -199 -136 160 85 -19 -190 -215 11 162 80 62 235 141 34 -217
1447b17K03Q9p7j50J34J7j45P6K36R2l68J71k6J8j40o8M36r1k23qk9K61j25k61
1471a95L8L53l49J18l3J22j19kQ5P5J05j41m2J76k22l8j58K67P0j81j34M00j88
1494GJ63j71k4K08l22R4j57J58J31r7K0K59P5l79J01mo8j45J53K33J69m15q2J44
1518E1k6n2j71L58l17Kj2J60o0J97k10J38O1j77N0J43Q2j99o7r8J61l05K87o2
1542f6K35r1m6P3j08j5p4p9J38K27k49m3K02J7n64L18J48N8r7j96Q8R7j06N7o2
1567a38R0n4j3J94Jj33J11o2j01J86l97L08N3k74M73k31o0K33n71J80M17k0l94
1590b02J98J76r8k23k1J24K70j63k58J86k10Q5J38k6Pm8J67k96N28k14m08Q4J51
1613e3J82l95M87o2j26p7j98L92k31J48k48M0K03n5qk9n7J9L8k4NJ1Jk0J09N6
$$ plain form
1447 -217 -14 75 -2 -152 -18 -1 -146 -70 166 258 -110 61 35 53 -87 -155 281 190 -33 -41 -70 191 66 -195
1471 -195 -157 196 -153 -35 -68 54 -65 -67 18 93 198 57 15 191 -31 -69 -227 40 110 -71 -205 195 7
1494 7 170 -1 -25 183 -139 -45 -202 -44 87 -10 10 269 344 -35 66 62 -6 -151 2 235 404 -11 -93 51
1518 51 25 -27 -198 160 -157 -155 -167 -7 -67 130 -80 58 119 -58 -8 135 217 18 -49 -147 14 -291 -4 -66
1542 -66 169 78 32 105 -3 -18 -92 -171 -33 194 -55 -98 104 121 -443 -125 23 81 -16 -212 -124 -27 -133 -76 -138
1567 -138 -48 -102 -115 79 80 -53 58 -4 -105 81 -316 -8 45 -229 244 13 -47 186 -385 -205 212 192 -202
1590 -202 -4 172 74 -149 -170 -46 224 61 -197 -11 -221 -136 2 -24 -17 -65 102 -194 334 120 -288 -204 -53
1613 -53 129 -266 221 159 33 -44 -242 150 -81 67 -181 -141 62 7 -1 -30 -87 -68 -30 -54 -49 -38 -37 -57 52 108
1639A08P9k44rQ1p5N0r7K39q4k48K30J59j44N8j12r7m3q3L88J20j80j56J25j65
1663a00M8p2M24l07J11l54K64JPN0J34r4j01jL5O8k26j6P3JQ6r8J00q1j34K93
1689A11r1l9J60k03J62q2J02k69j8L65k50k31L88j51mK3k1j45J88J03k53K46j35
1712d4k12K01J17K5j89J52k2J04j6Pj94J07M5k19K21k88M14l8l01K55o5n5J44
1735A49j85j63R1J78R3l41Q5o8K25Q8j62k8K69k19k45K85J22l11K5k03K49R4j10
1758h2P9M8O0j74n9J41j9J15j25Q6j57J72M7j92L07m12J39K94k47o7j20L09j9
1781A24j93M4j6L44k10k3k24K33j8j92J61J67j76j16j01Q9k7QP1o0n2J57j44j2
1805a66K9Q1Q0P1j79J78r5Ln2m5K89k58K11p6n6R9j75o1J29jk14K85k19R4K10
$$ plain form
1639 108 187 -57 -66 15 -60 -10 -107 132 48 -200 30 189 45 103 -9 -106 -149 -232 156 276 96 -60 65 -100
1663 -100 -52 -124 300 -7 104 -250 14 15 22 72 206 112 11 10 45 113 -113 -129 -56 -55 31 -67 33 -48 -182 111
1689 111 20 -19 141 -62 100 18 120 -149 -167 198 -52 -283 105 -46 -50 -27 -48 -193 -5 98 -155 91 -44
1712 -44 -256 -55 62 87 -102 50 28 132 116 123 -71 36 81 -138 83 -205 209 171 -130 125 60 5 149
1735 149 -36 -199 -108 70 163 -178 -93 -161 64 152 -10 -38 231 12 -233 52 174 -137 -112 -315 -66 28 -82
1758 -82 -3 45 105 -69 -128 13 -6 109 -16 70 -87 85 132 -60 247 -165 -26 268 21 -46 -166 143 124
1781 124 -69 -25 -41 303 93 70 -154 79 61 -131 30 197 21 -95 -196 -107 -134 -126 -55 -115 -167 -10 -154 -166
1805 -166 -137 -56 24 95 -84 94 -1 2 -50 -95 194 -64 147 71 15 114 -61 -122 7 6 -208 77 -142 -48 162
1830A62J1j88q6L76m74K83l4l5J29N1j88m9K11l21K2J36j19N0N0rO8j41J50j57
1854a02K12j95R6j52L3K38l32K80j03K37j76j18J83p4r7M5J15j68J13j00L95m42
1876a12L28l27o5L97l01K2J24k77j0K47j63K15r1j24R6o7O9MJ98r5m88K14J27
1899g9P5%l12K97J52r3J04l10L29k32M8J54P3p5j76J58k08M8j46Q1J36j3N7q7
1923a9j17M90m74j52M87l82N4o2J93J91l30r4J23L45o2l45L20p7j22o3J33j7l2
1946a2K77l58O1K49k80J20J71k09J49j54o1J31k22J2L42l48J06r4k9L60O0j80
1968I1j75L55j52m66K40K02J47k59j3Q6k33L6L19K5k23k9M5J9Q3j36m2J12j07
1991g5P3jn5J59o5k2JJ87k59N6Q8R3l41J64m0J50J34l85J8P2J45j0Jl0n0j45k31
$$ plain form
1830 162 173 -15 -101 275 -199 84 50 15 144 195 7 -42 169 -152 -130 6 -113 -63 -13 -22 46 -95 55 -102
1854 -102 110 -85 11 -141 -108 130 -202 78 -25 212 36 -82 101 27 -70 -25 90 -78 35 -65 330 -112
1876 -112 216 -111 -176 221 -80 -58 66 -211 -221 26 -137 78 -13 -137 -41 -108 -39 -35 163 68 -420 -206 -79
1899 -79 -4 -4 -316 -19 133 40 144 -166 163 -69 -21 133 206 131 -45 113 -95 -47 -193 -112 24 11 68 -19
1923 -19 -136 354 -120 -272 215 -167 -113 -175 18 209 -121 -215 -92 253 191 -154 166 89 -33 -96 37 20 -12
1946 -12 265 -93 -32 217 -63 57 228 19 168 14 -47 84 -138 -126 216 -132 -26 -120 -149 211 271 91
1968 91 -84 271 119 -347 -107 95 242 -17 -30 56 -177 -141 178 203 -20 -49 -4 15 98 -38 -80 32 -75
1991 -75 -2 -3 -58 101 36 14 15 202 -57 -1 87 180 -161 3 -37 113 247 -138 -120 -48 97 87 88 58 8 -137 -368
2018c68K30L43j17m3l9j76j53L74k14J30k63M27j38j3P8m5j01J16j02j75J22K02
2040G5J7j75r9J28R2J7k14K24K2nk12L18J02k86o6l7K85R5m54J61J48o7r7j65
2064a93K22L8q2R4j26O4N0J23k7j17J33j19k25J19j52K06K09l57L2K92j17j5j02
2087e0N8JJ00j81M1K54l09k1J55q5J38J46k65k54J27J66k03L13j0j71M0j49L09
2110A50j11p6P6O8K5k02J64M8j65J23Pj85L18k08O1O1k05k1Q5K59j33o5j34J79
2134A19l3j76J38j7j08l0J18k8K06o9l67P1J22n8L71k78N8J58l49K75k86L33l6
2157A34j69O8j3j60K26mQ7j79l9j03J74j16J42J64q2q7N7J5p8j16J50J58j84R6
2181A41j4j14R6j10k07M36p1k67n1j46M13l7m7k9L10m7j65R6p9qr1J3q7M4k23
$$ plain form
2018 -368 -138 205 88 45 6 -170 -323 51 -163 -33 -296 131 -7 -20 58 13 -88 28 -74 -249 -127 75
2040 75 92 -83 -182 -54 38 55 -159 65 87 82 -130 188 290 4 -62 -99 186 281 -173 -12 136 69 -28 -193
2064 -193 29 67 -15 79 -47 17 67 190 163 46 179 60 -165 -46 -198 8 217 -140 -108 184 67 52 -50
2087 -50 8 9 109 -72 -31 223 -86 -107 48 -37 101 247 -18 -272 -145 21 -182 131 121 -50 -10 -159 150
2110 150 39 -37 39 107 132 -70 94 142 -23 100 107 -78 240 32 93 154 -51 -72 13 272 139 74 -60 119
2134 119 86 -90 48 31 -77 -107 11 -17 189 120 -247 -176 -54 -112 259 -19 39 197 -152 123 -163 170 134
2157 134 -35 33 20 -140 86 82 169 -10 -49 -152 22 -94 48 212 130 43 100 115 37 -79 71 229 45 141
2181 141 127 13 109 -1 -208 228 157 -110 -161 -307 106 69 22 -7 303 256 91 187 108 100 9 22 -65 -21 -244
2206b44K08j25O4j59J48J10j48J02p3L40k90M7L1J42j05j69p1L04k50J70j1k0
2228Aj60%J95j32K27l00K0J6K73Rl22L15J61m88K55L2J27l0l50L1R4j74p1K91
2252B0k88L13l76J24K07K18j65M2j33M6k70J68J47Pj10R3J29l74J29J6J41P0k29
2275g5j66K32P5K4l2R6L2o1l57J84M4P2k03L97j61r1J9P6r6r2J53j38R7m8j54
2300a73L8J84k41q3Q3K11oN8m8P6O6k07J39o0m6r3J86r5J94j87r7P7J01j91L97
2325B83j75L3m1k10kM5J02p2l3J24n0K40k07J62j29j3J5q6m6O5k47K19J02j50
2349g1r8K05j8j04N0j14M67l26P7k89L97Q3k84j12m1J93qj14J55p9k56M19j25
2372Go2J62k21P2PJ75k74J40p3kp5R0j06J9Q6J5Q3j71M9M0k7K05l8L9j58J95r5
$$ plain form
2206 -244 -36 -161 -97 -256 -108 2 -146 -44 -117 223 -67 -20 11 153 48 -121 -192 112 -138 32 21 1
2228 1 -159 -159 36 -96 131 -169 -149 -133 140 149 -173 142 303 -185 70 102 229 199 -151 -120 -26 -200 -271 20
2252 20 -268 45 -331 -207 0 218 53 95 -38 8 -262 -94 53 60 -50 43 172 -202 -73 -57 84 154 -75
2275 -75 -241 -9 66 90 58 154 186 125 -232 -48 -4 68 -135 262 101 10 29 105 9 -83 70 -68 29 -19 -173
2300 -173 -135 49 -192 -275 -192 19 13 71 23 99 165 -42 97 37 -9 -102 84 -11 183 -4 -101 -24 77 -114 283
2325 283 108 141 100 -110 -112 -67 35 -37 -70 54 4 244 37 199 70 57 72 -14 -60 5 -242 -23 79 -71
2349 -71 -169 36 18 -86 -36 -150 317 -9 68 -221 176 259 -25 -137 -178 15 7 -107 48 -31 -287 132 7
2372 7 -55 107 -114 -42 -35 140 -134 6 -67 -69 -144 -54 -160 -141 -55 -40 43 -128 -79 -39 -66 139 101 140 -18 177 82
2399H2m1o0J17k22o2N0J14K04j47n3J58r8k61K79J76l21M18o38L21k1j23J20O0
2422E2O7j65J79J62k55j53K04r4J21l19K64m3K9k78K77J74l42J10k43K19J14p4
2444Fj55J90r9N3j42K42k2j17J2J02J2j29K37k91N7L4l2N8J30k48j05K27R1j04
2468Gm7o3Qj79K72j15K94k81J14q3p7K48Q4j1j57l2K2k32Q3K36j03J8m3K52k18
2493cl4l28J11L84l14L04M3k51O2K07k9l13o7K05N5J14k23L9j6n1pM0J0j52J68
2518d6J3J61L0l46K99j82J48k60j01K81Q5K27k44j57Q9Jk05K17k03k2J34R4p5
2541f2L82l35LJ9Mj22R2J48N2no5j14j8q2M0P2qk1J20M2o2j11m5R4K39k66q6N6
2569c9l5J44j10J60P7j13K6q6J52Rm01L94L2l49J50N8l16K58L0J65j46j43O4l39
$$ plain form
2399 82 41 -19 98 -124 -186 -136 -22 182 35 -18 140 42 -219 60 236 -85 333 -305 16 -5 -128 -8 52
2422 52 119 -46 133 295 40 -113 91 -3 118 -201 63 20 49 -229 48 222 -120 -10 -253 -34 80 6
2444 6 -149 41 -58 -5 -147 95 73 -44 -32 70 82 -47 190 -101 -44 -10 -42 16 146 -102 -207 20 111 7
2468 7 -40 -103 -95 -274 -2 -117 177 -104 10 -73 -150 98 182 171 14 -18 4 -228 -145 91 -12 6 -37 215 -3
2493 -3 -37 -365 -254 130 -184 120 163 -88 -26 181 152 -161 -228 -23 32 146 -77 -38 -54 -105 -112 -72 -62 -214 -46
2518 -46 -33 128 158 -188 111 -71 77 -183 -284 -3 82 309 65 -92 -3 -2 -207 10 -193 -215 -81 13 -62
2541 -62 320 -15 -12 7 11 -111 -19 129 181 176 111 -3 -21 -103 -63 9 1 -20 100 142 80 -31 -76 18 257 -9 -95 -39
2569 -39 -74 70 -40 120 197 84 110 24 176 185 -216 178 210 -139 11 69 -247 11 41 206 60 -83 -19 -358
2593c58L82J04k97K50k50L29k35J88N2j56J21k87J16o7L82l36Q0o0N8j9J28Q7
2615B12J87o23J73K99n03J32J58l97K69J98j67j04K59J47j91M1l05M41m18j7J86
2636b3P5k23R9k9K26Mm8p9k22M14k67J71n5k8l1J50j68K8m1J44j51qO1J09l3l62
2662b87J54K77j77P3j63J12K3P2m0j65M69m38J18k2j05N1K62k64J07q7K6R3j56
2685f7J03M1J1k89J95j95J24q0k5J99J33l50K62j35R8n3J60j08j59K83j47j21
2707a20p2K84J45j88j55P9r0J39k14L05j70L9rj02K14J7l72K43r6o8K20Lp4j1
2731e3k2JM04m15L24r7k48K6NJ08k25K1J99j32J61k69J92Q1n5J32j32p1K14j61
2755a2R2o8j02M04m12n6Q0K18j72P9J44k65L3l2qQ4R3k65K26r4J06K9j33L1P2
$$ plain form
2593 -358 24 128 -169 81 -169 160 -75 113 165 9 130 -157 -41 -108 274 -62 18 -42 16 -3 125 212
2615 212 399 -224 -51 248 -255 -123 35 -362 -93 105 -62 -166 93 240 49 90 -215 226 -192 -209 -23
2636 -23 52 -171 -72 -101 125 129 81 2 -220 194 -73 98 43 15 -16 134 -34 -6 -47 97 -54 -62 -1 108 75 -287
2662 -287 -133 144 -33 40 -123 -11 12 84 44 -121 348 -90 28 6 -99 -48 214 -50 57 -30 -4 89 -67
2685 -67 36 77 88 -201 -6 -201 -77 -157 -182 17 150 -200 62 -73 25 -28 132 24 -135 148 1 -120
2707 -120 -192 92 237 49 -106 -27 -117 22 -192 113 -57 -18 -27 -129 85 102 -270 -27 -123 -191 29 32 -42 -53
2731 -53 -75 -74 330 -85 239 142 -106 -80 -75 33 -192 -171 28 -104 57 -212 -20 61 6 138 6 -65 149 -12
2755 -12 80 12 -90 314 -98 -154 -74 144 -28 51 195 -70 -37 -69 -77 7 100 -165 61 -33 73 102 -31 0 72
2780G2j50M5q8o4K88j06l3r8J00k19J94q6K26O7j11k5j2K7j9P4j49K52jk62J55
2805G7n4Q8j73j28M15j18j34j22K37j31R7k27J96j31n7M9K35l5j52K9L25k49j66
2828a29m8J44J42j03K0n4R6m6p4p0J85l5n2q4jJ79n6j86R1P0n2J25j98L13m00
2853b23M77k57Rq2M7P2k38L06l5j63J26o4L2J49k13J20j94J18Q7M2k46J38j92
2876a84K28o1J41k71P7n6J5J35l4M7J66k61o4L69j07r0p9J75j15l45L67J7j36
2899f6J73p0K72m56M7K25m6j06k6L8j50rK37J26k55J09R0k82J03J31k13m4J05
2922f7j35K02r8k5j1L6K22k44L92k50J25j48J08j03j24k12J97O3j53K81N8j80
2944f6P5Q7K2l33P1J31m6L27k85k18L8K81k03p7J89J13j53j12J39j23N9q2K45
$$ plain form
2780 72 -78 -33 -121 -185 103 -3 -36 -134 -34 -253 -59 -145 81 148 37 12 0 27 8 82 -67 185 184 -78 77
2805 77 23 111 -62 -190 225 107 -27 -149 88 -43 54 -173 23 -108 -165 -116 119 84 -68 -39 286 37 -129
2828 -129 -177 -33 109 6 26 -28 68 22 -52 -122 63 28 -24 -108 -109 70 14 -172 -81 -11 -63 62 -136 177 -223
2853 -223 254 -3 6 -76 -29 43 -195 111 76 -87 39 -25 7 156 -57 63 -131 -13 74 116 -130 8 -184
2876 -184 44 -17 124 -147 -70 -126 -111 24 -10 37 203 -58 -122 247 140 50 -29 146 31 -314 53 70 -66
2899 -66 107 37 309 -147 -100 125 79 -27 -53 -15 -165 -174 63 189 -66 43 133 -149 -46 85 -128 -172 -67
2922 -67 -202 0 -98 -123 -134 -98 124 -120 272 22 147 -1 107 4 -120 -332 -135 -72 -225 56 114 -66
2944 -66 9 96 118 -215 -144 -13 -59 268 -17 -235 -197 84 -119 -196 -7 106 -47 -159 -20 -143 -84 -166 79
2967G9j33J92k46L08l99L14q5O0j93J63M3k90L96k63K67j79j85J61K37k35K54
2988B66l11J25j25J9J86K8k67J48j13J26j89j9P5L9J30j29jm9m6J33J41j86j89
3011b08J06J80k9j44K3K21j57p1J45J04%L3j44k85J38K21k01J60j17k8L7R9m9
3034C4l61M97J58k26j10l7m7J36j84K71p1p3L6j97J42k6n0J92Q4j75j07LK45l
3058A31k85L3J79k8J41k06J63J9J5n5l45J46J5j7J98j85N2K4p7k01O9K73k2k04
3082a67K29j92n3KR8J66k4r6J28j22M8k4k09K27J77j37j67K41l1j26K6j21J38
3105A1j9K6j9O0J5l6j68J60J59k30Q0j77LJ91j5m7J06k6j0J09j29n7j01p4J77
3130a1kK9J26l33K0K10M6k51K77j30p8J31N3r6k39K30l5J60rj7j73K87l42J56
$$ plain form
2967 79 -54 138 -108 200 -199 115 30 90 -103 60 103 -187 209 -54 213 34 -151 10 247 12 266
2988 266 -45 80 -45 -26 160 188 -79 69 -44 82 -107 -126 -51 -12 118 -11 -12 -61 -107 26 167 -19 -208
3011 -208 -102 78 49 -95 -72 149 -8 -79 66 170 170 203 59 -226 -88 133 -68 92 -25 -53 -16 83 34
3034 34 -327 170 328 102 -8 -45 -92 44 -140 131 60 -13 23 -174 -32 -58 -108 84 168 -7 -114 -111 134 131
3058 131 -154 -121 58 30 171 -35 128 147 162 107 -238 -92 -77 -94 104 -81 -29 -5 -82 -283 -214 59 37 -167
3082 -167 62 -130 -183 -181 -83 83 59 -37 91 -31 17 -7 -216 11 188 51 -116 125 94 -32 -6 -127 11
3105 11 -8 18 -1 59 74 38 -130 30 189 -41 39 -138 -135 56 41 -6 100 74 64 173 44 -13 -114 -188 -11
3130 -11 -13 16 142 -191 -171 39 85 -166 111 -19 -97 34 87 -9 -248 -18 -53 107 98 81 -92 195 -147 9
3154Ij66J33J93l26Q5J56K15k33o7j08j23L49k01n4PK37j83J43o2K0k6j14K42
3177A26k11K52l45K22r1O4q4K54j78k18K20N7k7J73m8k62N7L5J72j85J29o8l32
3200b88J43N9K03k04J66j56J44o1J10l35k0K74J17n5j29J74j99M4nj18j18L55
3222A01m47L07kj86L92j19L6J20j00j80J14K01m9k04j03J6J47k11Q4K71l25K39
3244A02j87K76l33p6J20k1J16J28j01j06K97l76L63r9o7qk4j95J93l5q0J13R6
3267I6j47n5R9q8J30J69m36L69j41p2J96k65L09q7k01N5K56l09Q8J5o1J28J02
3290A50j27O8k38L44j42j40J14j86J47j14K8K38k92K15k0o6q2M5J11j41J04j02
3312h6J7L02l45N7J32k1J04k06M0J5oL13l19l4j39J96k14K07j58J48q9O3p1K0
$$ plain form
3154 9 -157 -24 169 -157 -72 84 299 66 -1 -109 -232 117 -84 -138 -131 106 -77 66 4 24 -2 -116 126
3177 126 -85 167 -178 44 -47 17 -67 187 9 -209 11 68 41 214 166 -96 -39 -4 168 -17 112 44 -288
3200 -288 -145 -86 117 -87 79 -77 67 6 116 -219 -239 35 152 97 -32 142 -57 -13 -18 -136 -254 101
3222 101 -346 -39 -41 -227 165 46 82 202 102 -78 36 237 188 -16 -119 -103 44 -167 -83 188 -137 102
3244 102 -85 191 -142 -218 -98 -119 -3 125 24 -82 215 -161 202 103 36 28 4 -191 2 -33 -113 0 96
3267 96 -51 -106 -7 -95 35 204 -232 137 -4 -76 120 -145 164 77 -124 -69 187 -122 -34 -19 -80 48 150
3290 150 23 91 -147 197 55 -85 29 -157 -10 -124 -96 142 -150 65 45 -21 -103 -58 53 -88 16 -86
3312 -86 -69 233 -112 -55 77 56 160 -46 -6 9 3 316 -3 -37 -176 20 -194 13 -145 3 -86 -23 -94 -74
3336g4r8J98L4j95R9k5J82l21M1j1k3L81k95J92kr7J18j33l4%J04n6L14l31P7
3361D5o2M8l14L38n9k4J05j41l0K56o4j19m1N0J15l6m20N32k56J49J05J56n84
3384b51P4P9O1j45K51L6k21J37j1N1J2K4K28l22k5j88J12J58j1j85P5l1l8L7J18
3409B5J24j45P6M8j95j50L53p8j55j40L17j87L2P5j99J70O0j05J47j14J13L2j67
3432f3J15N8k39J77m0K0m3MJ30j03J4k20K76j4o6M5K40k87J13r2m7Q0p9l9O3P6
3458G9j21J21j04M53o62K37M19k1n43J60P5j40pJ80j05r6m3R7J21j71K20q1K5
3481I3j44N1K6N1J05l33J13J04J55l35J50q5j44L65l03L4J61p9J26J24l71O8r8
3504a66K72k32K25j90J72k04K26o7j52N7K2J41k04J53n3m3k2R8p3j3J55l0k96
$$ plain form
3336 -74 -172 26 60 -135 -36 -61 121 -200 -159 -170 -193 188 -107 85 83 -14 104 -29 -63 -63 41 -15 299 -32 45
3361 45 -17 31 -283 55 -4 -28 77 -64 -94 162 98 -21 -62 -12 103 67 -353 179 -77 72 177 333 -251
3384 -251 -177 -98 -37 -182 69 105 -116 21 10 61 73 97 325 3 -22 -210 -98 60 49 -136 -61 -92 -130 -93 25
3409 25 149 4 80 128 -67 -217 136 58 -97 -237 80 -107 -75 0 -199 -29 31 -74 73 -41 72 104 -63
3432 -63 52 110 -129 48 8 28 -15 -11 119 16 30 -190 86 72 6 51 291 4 117 25 -22 58 -21 -60 3 79
3458 79 -42 79 -25 428 -234 3 422 401 -142 18 93 -47 -54 126 21 -75 -118 -21 100 -71 149 68 93
3481 93 -51 0 26 77 182 -151 -38 66 221 -114 36 -49 -193 172 -131 -97 64 -15 111 235 -136 -68 -166
3504 -166 106 -126 99 -91 81 -123 103 36 -116 -59 -37 104 -100 53 0 -43 -65 33 -40 -53 102 72 -224
3527b24L34q2l5m3N2J05k38J27J61q4k59K23M6j65Q3l7qJl42L23NJ07P7r0k02
3552a65L67l6j3p3q6J3j68K16q3L8j5m2j24J93j09J08J0k32Q6J94P1Kj78k54L56
3577G6j62J02J06j63J93j75K74j25o8J6j8J65j03Kj90j14K61J04q5qQr9K4j5J74
3602A80j77q2J1O3n2R7n9l7P9j44Q1l9K18j09J9j0q5Km5J69qk58L76j48oJ55j40
3629E1j64K03j15N3N8k19j96M13r0lJ35k17k36N99l14j30K10L5QJ0k6l5L5j37
3653g2K9k00K77q2Q7K1j20J63k19L7j50J67L29l06p7L97k82j1J46k09K4J21K9
3676I9l33P4l5J40Q6j22K%J77l7j39n9O2j01J07J40N3j37JJ63P8j92q7j22L28
3701A46r0j68R5N6N5r3N6J8l7r0J07Q1j68j9O6J68j15k65M01m33K79j0Op6K92
$$ plain form
3527 -224 110 28 -7 -50 2 107 -131 -4 157 73 -186 37 83 -82 1 -36 -44 -43 -385 -62 -57 50 127 37 -165
3552 -165 202 166 153 80 -6 7 -161 55 -28 10 -5 -47 -171 22 -87 21 31 -201 -115 79 150 152 -26 -280 76
3577 76 -86 16 122 -41 152 -23 251 126 58 74 56 221 118 120 -70 -184 77 181 96 88 96 -3 21 6 180
3602 180 3 -79 -68 -5 -57 40 -19 -56 23 -121 -40 -79 139 30 49 39 -46 -44 -89 80 72 -186 190 42 36 191 51
3629 51 -113 90 -25 28 86 -133 -329 84 -6 -9 126 -91 -327 272 -42 -172 38 73 81 91 65 30 65 -72
3653 -72 -43 -243 34 -48 39 60 -60 103 -116 -79 -229 -62 267 -39 -116 281 -1 -12 134 -75 -51 70 99
3676 99 -234 -160 -195 -55 31 -91 -89 -89 88 51 -88 -147 -85 -186 -79 61 114 -23 -22 141 219 27 -60 -182 146
3701 146 56 -112 -17 39 94 1 57 75 38 -52 55 136 -32 -51 15 183 68 -197 204 -229 50 40 46 -30 262
3726B62q5L1k12P4j51K34j59m6k6r2M6K32J33q9n9j56k68L06J06k71K87j93J68
3749G2R6k32M6J07J72k08q4N3j62J44Q5j78J05R9j44O2l5OJ24k07K27k01J46j09
3773a6Q1o2M9Rk9j78L46k24R2N0l83K01l4r9J50K81k13L8j30M6j25l7K30J75k80
3798f2Q4j20r0J01J2P0k06J41J09j61J26N3O8M1j59K13r6j78J64p6m1L19m51K
3822a37K05k03j2M5J6J89P4k30l2k1N0J43k18L74k47Q0q7m6J33L6J74l88oJ24
3846A6J31m29J71J24j61L14K1J29m46J79j23O1j22K4M5K11k0j13kr7Q0N0n5RL2
3871B9j01M73j72r4j91J35Kl01R8K23j12K57l80m3L72j75j37J63j53J08l5L3l0
3894c1o9L06k18K70l14q1K26p1k11L41m8k75L2Qp8K0K17K75m47n1J59n9m3J71
$$ plain form
3726 262 177 208 -4 70 -81 153 -6 -52 -78 -170 -124 108 241 152 93 -63 -331 -25 81 -190 97 -96 72
3749 72 168 -64 -18 89 261 53 -31 22 -140 4 89 -89 16 115 -29 33 -2 4 128 -79 148 -53 93 -16
3773 -16 65 3 52 61 32 -146 200 -24 68 118 -265 -64 -98 -197 -47 234 21 59 -71 -25 -150 -187 43 218 -62
3798 -62 22 -98 -188 -87 -75 -5 -211 -70 39 -122 4 57 125 166 7 220 124 -54 110 34 -7 312 -139 -137
3822 -137 68 -135 -147 -102 -86 103 177 -53 -85 -106 -56 87 -131 243 -4 76 -11 -57 76 112 286 -102 -108 16
3846 16 147 -282 -111 13 -148 166 187 316 -130 49 -74 -13 -135 -111 -66 145 125 12 10 -87 -7 43 -12 -3 29
3871 29 -72 401 229 135 -56 79 81 -220 -122 101 -11 246 -134 -177 195 20 -117 46 -107 1 -34 -1 -31
3894 -31 -100 206 -12 258 -56 -137 89 18 -193 148 100 -175 -143 -135 -213 -193 24 299 -148 -199 -40 -99 -142 29
3918B9l97N20k87K0K91k18m0J25Q1P4j91j25J70O9l30L06n2j21j40J9J86p1J36
3941E4J33k37L3n2j7P2j29J12j81K62j83K86k63p9J71O1l31M40k34P2M0M9k56
3964a77j23J47K55j49K04j25Q7l10K27l35L84j62j09j39L16m8J83P1p9J00k40
3985b2l0L54k56J4j88M4K49k38K0j27K57j49l9J05J65l31P4K24j33M3P5m36K33
4008i2J93q4o6j36J60l9m6L01j51k85L39n8pO2j49J41k02l5J26j0K9j08q5M57
4032B55M7n28J77jK76m05J34k81M04k4Q6j15r1j6Q2L7j22j10J23N2O8k29O4J77
4056F0M1k26J54J50l15N3K80j7k59L9j22K91j49l2j32M23j89P1j02J18O2j48k7
4079B4J05j21P4k12R5j0K6M0N4j36O1J65k73J96k93Q5J90k65J37oJ59k14L45l56
$$ plain form
3918 29 -368 152 -135 -115 176 -42 -82 43 124 198 7 -118 52 121 -209 97 45 -76 -216 -197 -11 -82 54
3941 54 187 -50 -17 -69 -86 -14 -143 -31 -212 50 -133 153 -110 -189 -18 43 -288 152 -82 -10 30 79 -177
3964 -177 -300 -153 102 -47 157 32 119 -191 36 -299 85 -77 -186 -325 -9 -57 126 197 118 218 -22
3985 -22 -52 302 46 60 -128 -84 165 -73 -53 -180 77 -72 -111 -6 159 -172 -98 126 -7 36 111 -325 -92
4008 -92 101 17 -49 -185 -25 -64 -110 191 40 -245 94 36 29 91 -58 83 -119 -154 -28 -38 -9 -117 -202 255
4032 255 302 -226 -49 -50 226 -179 -45 -326 78 54 140 25 -66 -82 0 37 -85 -195 -72 -20 48 -181 -117 60
4056 60 101 -125 29 179 -136 -83 197 180 -79 -40 -162 129 -20 -52 -184 239 50 121 19 137 199 51 24
4079 24 129 8 82 -130 -35 -45 -19 21 75 -61 0 165 -108 88 -205 -120 70 -195 -58 -64 95 -119 226 -130
4103a30J13K72l14Mk2o9l3K77J7k2p0n0O5k89J64K92j63p8R8k05R4N3j0l1p7O1
4129e3l5pJ30j15m8P8N3K7M1Pj42J2n4Q3O4k14L38j1r6k85J93R5o5P3j61R3Ml6
4157c1R1k19J2M23j50k69J64j44J20L4N1k01J03M3j14n1L7P0J63k92q4J07K43
4180A06k16K71p2k20J02o5M0K4k1N4N3L4nj93P1j13K99k67K15j06j8l62K30K42
4204H3r6N7P2k4K1m38L39j77J35K38j84K8j57L9j06P3j82K12j0M2O8K04l50J63
$$ plain form
4103 -130 -17 255 -59 -55 -77 -146 -179 98 115 93 23 -27 38 -251 -87 205 42 -36 62 -143 -49 4 -6 -37 -114 -53
4129 -53 -88 -95 35 -80 -128 -50 3 30 71 78 -64 -52 -106 -23 41 -173 165 154 58 -227 -34 61 -4 69 -92 1 5 -31
4157 -31 60 -159 -147 276 126 -143 21 -123 -3 31 82 -119 -16 27 -87 -138 -101 -31 132 -160 -244 -137 106
4180 106 -110 161 89 -131 -29 -94 -54 -30 -51 3 56 90 85 -108 -37 -150 149 -118 97 -9 -27 -389 -159 83
4204 83 -13 44 116 92 113 -325 14 -163 -28 210 26 54 -103 -64 -170 -97 -279 -67 -77 -35 33 237 -113 50
$$ [...]
8191b26
##END NTUPLES=NMR FID
##END=
