##TITLE=1H_CG-1112_7
 DMSO, 8 sc, 
 23.10.2019
##JCAMPDX= 6.0         $$ Bruker NMR JCAMP-DX V2.0
##DATA TYPE= NMR FID
##DATA CLASS= NTUPLES
##ORIGIN= UXNMR, Bruker Analytische Messtechnik GmbH
##OWNER= root
$$ XWIN-NMR		Version 3.5
$$ Wed Oct 23 14:48:46 2019 Russian Standard Time (UT+4h)  she@DPX200
##.OBSERVE FREQUENCY= 200.1315
##.OBSERVE NUCLEUS= ^1H
##.DELAY= (6, 6)
##.ACQUISITION MODE= SIMULTANEOUS
##.ACQUISITION SCHEME= undefined
##.AVERAGES= 8
##.DIGITISER RES= 18
##SPECTROMETER/DATA SYSTEM= spect
##.PULSE SEQUENCE= zg30
##.SOLVENT NAME= CDCl3
##.SHIFT REFERENCE= (INTERNAL, CDCl3, 0, 15.7039)
##AUDIT TRAIL= $$ (NUMBER, WHEN, WHO, WHERE, WHAT)
$$ ##TITLE= Audit trail, XWIN-NMR		Version 3.5
$$ ##JCAMPDX= 5.01
$$ ##ORIGIN= Bruker BioSpin GmbH
$$ ##OWNER= she
$$ F:/spectra/data/she/nmr/H-F/1/audita.txt
$$ ##AUDIT TRAIL=  $$ (NUMBER, WHEN, WHO, WHERE, WHAT)
(   1,<2019-10-23 13:50:07.93 +0400>,<she>,<DPX200>,
      <created by zg, POWCHK disabled, PULCHK disabled
       configuration hash MD5:
       00 E9 B6 7A A2 85 ED C7 34 08 36 98 17 FE 4E 26
       data hash MD5: 16K
       C3 A0 6D 1B 12 4E 29 C8 23 18 A5 4B 14 AD 51 08>)
$$ ##END=
$$ 
$$ hash MD5
$$ 81 23 BF 42 D0 C1 C5 63 55 C7 A4 77 1D AB FA 7B
##$RELAX= 
##$RELAX= 
##$RELAX= 
##$RELAX= 
##$RELAX= 
##$RELAX= 
$$ Bruker specific parameters
$$ --------------------------
##$DU= <F:/spectra>
##$EXPNO= 1
##$NAME= <H-F>
##$PROCNO= 1
##$TYPE= <nmr>
##$USER= <she>
##$AMP= (0..31)
100 100 100 100 100 100 100 100 100 100 100 100 100 100 100 100 100 100 
100 100 100 100 100 100 100 100 100 100 100 100 100 100 
##$AQSEQ= 0
##$AQ_mod= 1
##$AUNM= <au_zg>
##$AUTOPOS= <>
##$BF1= 200.13
##$BF2= 200.13
##$BF3= 200.13
##$BF4= 200.13
##$BF5= 200.13
##$BF6= 200.13
##$BF7= 200.13
##$BF8= 200.13
##$BYTORDA= 1
##$CFDGTYP= 0
##$CFRGTYP= 5
##$CHEMSTR= <none>
##$CNST= (0..31)
1 1 145 1 1 1 1 1 1 1 1 1 1 1 1 1 1 1 1 1 1 1 1 1 1 1 1 1 1 1 1 1 
##$CPDPRG= <>
##$CPDPRG1= <>
##$CPDPRG2= <>
##$CPDPRG3= <>
##$CPDPRG4= <mlev>
##$CPDPRG5= <mlev>
##$CPDPRG6= <mlev>
##$CPDPRG7= <mlev>
##$CPDPRG8= <mlev>
##$CPDPRGB= <>
##$CPDPRGT= <>
##$D= (0..31)
0 1.2 0 0 0 0 0 0 0 0.06 0 0.03 0 0 0 0 0.0002 0 0 0 0 0 0 0 0 0 0 0 0 
0 0 0 
##$DATE= 1571824207
##$DBL= (0..7)
120 120 120 120 120 120 120 120 
##$DBP= (0..7)
150 150 150 150 150 150 150 150 
##$DBP07= 0
##$DBPNAM0= <>
##$DBPNAM1= <>
##$DBPNAM2= <>
##$DBPNAM3= <>
##$DBPNAM4= <>
##$DBPNAM5= <>
##$DBPNAM6= <>
##$DBPNAM7= <>
##$DBPOAL= (0..7)
0.5 0.5 0.5 0.5 0.5 0.5 0.5 0.5 
##$DBPOFFS= (0..7)
0 0 0 0 0 0 0 0 
##$DE= 6
##$DECBNUC= <off>
##$DECIM= 24
##$DECNUC= <off>
##$DECSTAT= 4
##$DIGMOD= 1
##$DIGTYP= 9
##$DL= (0..7)
0 120 120 120 120 120 120 120 
##$DP= (0..7)
150 150 150 150 150 150 150 150 
##$DP07= 0
##$DPNAME0= <>
##$DPNAME1= <>
##$DPNAME2= <>
##$DPNAME3= <>
##$DPNAME4= <>
##$DPNAME5= <>
##$DPNAME6= <>
##$DPNAME7= <>
##$DPOAL= (0..7)
0.5 0.5 0.5 0.5 0.5 0.5 0.5 0.5 
##$DPOFFS= (0..7)
0 0 0 0 0 0 0 0 
##$DQDMODE= 0
##$DR= 18
##$DS= 0
##$DSLIST= <SSSSSSSSSSSSSSS>
$$ [...]
##$SUBNAM2= <"">
##$SUBNAM3= <"">
##$SUBNAM4= <"">
##$SUBNAM5= <"">
##$SUBNAM6= <"">
##$SUBNAM7= <"">
##$SUBNAM8= <"">
##$SUBNAM9= <"">
##$SW= 24.0689530833862
##$SWIBOX= (0..15)
0 0 2 0 0 0 0 0 0 0 0 0 0 0 0 0 
##$SW_h= 4816.95568400771
##$TD= 16384
##$TD0= 1
##$TE= 0
##$TE2= 300
##$TE3= 300
##$TEG= 300
##$TL= (0..7)
0 120 120 120 120 120 120 120 
##$TP= (0..7)
150 150 150 150 150 150 150 150 
##$TP07= 0
##$TPNAME0= <>
##$TPNAME1= <>
##$TPNAME2= <>
##$TPNAME3= <>
##$TPNAME4= <>
##$TPNAME5= <>
##$TPNAME6= <>
##$TPNAME7= <>
##$TPOAL= (0..7)
0.5 0.5 0.5 0.5 0.5 0.5 0.5 0.5 
##$TPOFFS= (0..7)
0 0 0 0 0 0 0 0 
##$TUNHIN= 0
##$TUNHOUT= 0
##$TUNXOUT= 0
##$USERA1= <user>
##$USERA2= <user>
##$USERA3= <user>
##$USERA4= <user>
##$USERA5= <user>
##$V9= 5
##$VALIST= <valist>
##$VCLIST= <CCCCCCCCCCCCCCC>
##$VD= 0
##$VDLIST= <DDDDDDDDDDDDDDD>
##$VPLIST= <PPPPPPPPPPPPPPP>
##$VTLIST= <TTTTTTTTTTTTTTT>
##$WBST= 1024
##$WBSW= 4
##$XGAIN= (0..3)
0 0 0 0 
##$XL= 0
##$YL= 0
##$YMAX_a= 87812
##$YMIN_a= -121916
##$ZGOPTNS= <>
##$ZL1= 120
##$ZL2= 120
##$ZL3= 120
##$ZL4= 120
##$ABSF1= 10
##$ABSF2= 0
##$ABSG= 5
##$ABSL= 3
##$ALPHA= 0
##$AQORDER= 0
##$ASSFAC= 0
##$ASSFACI= 0
##$ASSFACX= 0
##$ASSWID= 0
##$AUNMP= <proc_1d>
##$AZFE= 0.1
##$AZFW= 0.1
##$BCFW= 1
##$BC_mod= 2
##$BYTORDP= 1
##$COROFFS= 0
##$CY= 11.3945322036743
##$DATMOD= 1
##$DC= 2
##$DFILT= <>
##$DTYPP= 0
##$F1P= 20.1720416913024
##$F2P= 0.152960286110954
##$FCOR= 0.5
##$FTSIZE= 0
##$FT_mod= 4
##$GAMMA= 1
##$GB= 0.15
##$INTBC= 1
##$INTSCL= 1
##$ISEN= 128
##$LB= 0.24
##$LEV0= 0
##$LPBIN= 0
##$MAXI= 10000
##$MC2= 0
##$MEAN= 0
##$ME_mod= 0
##$MI= 1.114404
##$NCOEF= 0
##$NC_proc= 0
##$NLEV= 6
##$NOISF1= 3.799351
##$NOISF2= 2.8
##$NSP= 1
##$NTH_PI= 0
##$NZP= 0
##$OFFSET= 15.70392
##$PC= 1
##$PHC0= -9581.379
##$PHC1= 22.80082
##$PH_mod= 1
##$PKNL= yes
##$PPARMOD= 0
##$PSCAL= 0
##$PSIGN= 0
##$REVERSE= no
##$SF= 200.130013532006
##$SI= 16384
##$SIGF1= 3
##$SIGF2= 2
##$SINO= 400
##$SIOLD= 16384
##$SREGLST= <1H.CDCl3>
##$SSB= 0
##$STSI= 0
##$STSR= 0
##$SW_p= 3612.71676300578
##$SYMM= 0
##$S_DEV= 0
##$TDeff= 0
##$TDoff= 0
##$TI= <>
##$TILT= no
##$TM1= 0
##$TM2= 0
##$TOPLEV= 0
##$USERP1= <user>
##$USERP2= <user>
##$USERP3= <user>
##$USERP4= <user>
##$USERP5= <user>
##$WDW= 1
##$XDIM= 8192
##$YMAX_p= 0
##$YMIN_p= 0
$$ End of Bruker specific parameters
$$ ---------------------------------
##NTUPLES= NMR FID
##VAR_NAME=  TIME,          FID/REAL,        FID/IMAG
##SYMBOL=    X,             R,               I
##VAR_TYPE=  INDEPENDENT,   DEPENDENT,       DEPENDENT
##VAR_FORM=  AFFN,          ASDF,            ASDF
##VAR_DIM=   8192,          8192,            8192
##UNITS=     SECONDS,       ARBITRARY UNITS, ARBITRARY UNITS
##FACTOR=    0.0002076,     1,               1
##FIRST=     0,             0,               0
##LAST=      1.7004516,     0,               0
##MIN=       0,             -121916,         0
##MAX=       1.7004516,     87812,           0
$$ Real data points
##PAGE= N=1
##DATA TABLE= (X++(R..R)), XYDATA
$$ [...]
2393h70L79J588l44r29j51M49J388j32k183j477K218K519p29k338j589Q57K730
$$ -870 -491 1097 753 -176 -327 122 1510 1378 -805 -2282 -64 2455 1726 -612 -2201 -1344 1386
2410A386J493k617k441L99J973J623J17k071j745O67J688P81k4r58j939k46K469
$$ 1386 2879 262 -2179 -1780 193 1816 1933 -138 -1883 -1216 472 1253 1229 271 -1668 -1914 555
2427E55J631M0k563l084O47L538K985k719l665j083K928M023R9m710k568J742
$$ 555 2186 2226 -337 -3421 -2774 764 3749 1030 -2635 -3718 -790 3233 3332 -1378 -3946 -2204
2443b204L780J175j477l057j030K875J733n24j485q14m23P00J712K8j015l5j399
$$ -2204 1576 2751 1274 -1783 -2813 62 1795 1271 -214 -1028 -1451 -751 961 989 -26 -61 -1460
2460a460L43J920J173k042j218j20J487J294K34k551j231K216J188o88r29q52
$$ -1460 -1117 803 1976 -66 -1284 -1404 83 1377 1611 -940 -2171 45 1233 545 -384 -1236
2476a236R97J253l69j795M51J282N64j604n70j26K062J485j806k845R92J707J140
$$ -1236 -239 1014 645 -1150 -699 583 1147 -457 -1027 -1153 909 2394 588 -2257 -1265 442 1582
2493A582q88j617r57J439K552r72j587l01J16J56J181j04l21n59n22N6J544J233
$$ 1582 694 -923 -1880 -441 2111 1139 -448 -749 -633 -477 704 600 279 -280 -802 -746 798 2031
2511B031j226k287m04J746K646l0l083k724K072L657J80k346k848j56L708K346
$$ 2031 805 -1482 -1886 -140 2506 2476 -607 -3331 -1259 2398 2578 232 -2616 -2772 936 3282
2527C282k174k659n30J804J907L44j969j753J166J244J55J5m72j124l38R73J056
$$ 3282 1108 -1551 -2081 -277 1630 1974 5 -1748 -582 662 817 832 360 -764 -1102 -129 927
2544I27M21r93j761l54K346J388j194j939j170J296K924L66l069j742J585J913
$$ 927 1348 355 -1406 -1760 586 1974 780 -1159 -2329 -1033 1891 2257 -812 -2554 -969 944
2560I44O63j554j959M94K151M57j655o60J060P04k73m38j352R56J717p85j636
$$ 944 1607 53 -1906 -1412 739 1196 -459 -1119 -59 645 372 -66 -1418 -462 1255 470 -1166
2577a166J41J065Q50m28r24j001R50J430n99q43L61K35n87O01J11J12L07j241
$$ -1166 -1025 40 890 462 -462 -1463 -513 917 318 -525 -164 71 -516 85 196 308 615 -626
2595f26j138J575K190j27k544j568O79K961J898k627l673O41K955K333o79l495
$$ -626 -1764 -189 2001 1874 -670 -2238 -1559 1402 3300 673 -3000 -2359 596 2929 2250 -1245
2611a245k004K018L685q4k332j199m93J801K023p02j404j036K55L28J850O02j827
$$ -1245 -3249 -1231 2454 2370 38 -1161 -1654 147 2170 1468 64 -972 -717 -389 1461 2063 236
2628B36j419q7Q43K516M02k753k425J611K753J145j712l029n35K535K576j710
$$ 236 -1183 -1270 -427 2089 2491 -262 -2687 -1076 1677 2822 1110 -1919 -2454 81 2657 947
2644I47k077j30J034J557k99j496p68J454M99r49j69L69K94K91p10j112P92J282
$$ 947 -1130 -1260 -226 1331 1032 -464 -1232 222 721 -228 -397 -28 266 557 -153 -1265 -473 809
2662H09l87j437l39J087M73J17l64q08M53M87n82j44J120Mj084n41r9J505J442
$$ 809 422 -1015 -1354 -267 206 323 -41 -849 -396 91 -491 -635 485 489 -595 -1136 -1235 270 1712
2681A712j236k653J5K702J747r48k527j679K021L262l90k746j935R38K667J854
$$ 1712 476 -2177 -2162 540 2287 1339 -1188 -2867 -846 2416 2026 -720 -2655 -1717 950 2804
2697B804j906k789Q6K076O29L65q15j628j56J244Q67M33o8k037j038J686J782
$$ 2804 898 -1891 -1805 271 900 1265 450 -1178 -1334 -90 777 1210 1142 -895 -1933 -247 1535
2714A535M69j774j655l67K895K172j718l357l45K050K139j22k268j852J947J979
$$ 1535 2004 230 -1425 -1792 1103 3275 1557 -1800 -2145 -95 2044 1922 -346 -2198 -251 1728
2730A728j50j499q75o1J373P78q25j315R98N35r68M83N5k85K33k36p73Q32J052
$$ 1728 1578 79 -796 -857 516 1294 469 -846 152 687 -281 202 257 -28 205 -31 -804 28 1080
2749A080p24j259J30J149j14K16j160n88J129R87j405n61R43P41k05o31j181N08
$$ 1080 356 -903 -773 376 262 478 -682 -1270 -141 846 -559 -1120 -177 564 359 -272 -1453 -945
2767i45K332j82k106j056J089J624Q62j637k122M30K687P24j438j356q03J225
$$ -945 1387 1205 -901 -1957 -868 756 1618 -19 -2141 -1711 976 1700 262 -1094 -1897 -672
2783f72K019k69j593o64M86N04J029N07j286j237l8R08J166R90j696k081M31K103
$$ -672 1347 1078 -515 -1179 -693 -189 840 1347 61 -1176 -1214 -306 860 1850 154 -1927 -1496 607
2801F07J579o93k587j773K117L383l02k268j926L24K216J852j132k856p3J723
$$ 607 2186 1493 -1094 -2867 -750 2633 2331 63 -1863 -1539 677 2529 1397 -1459 -1532 191
2817A91R99J86p38j507L77Q76K25r%m39j104Q95J010K27l28j134r38J133J577
$$ 191 1190 1376 638 -869 -492 384 609 600 600 161 -943 -48 962 1189 861 -273 -1211 -78 1499
2836A499m87j716r6M07J126J78p79j321J284P37p39p05L31N86M24m93j628K16
$$ 1499 1012 -704 -800 -393 733 911 132 -1189 95 832 93 -612 -281 305 729 236 -1392 -1176
2854a176J816O60j044j345k68J356J217L6k483o72J495J151J17o50j355p80J769
$$ -1176 640 1300 256 -1089 -1357 -1 1216 1252 -1231 -1903 -408 743 860 210 -1145 -1925 -156
2871a56J019l10j55j058r89R40J580L45j031j734m92J647K290k42k500j670J258
$$ -156 863 553 398 -660 -1649 -709 871 1216 185 -1549 -2041 -394 1896 1654 -846 -2516 -1258
2888a258K172J561j532l292j91K863J766p23k016j034O29K543M23j997q31K22
$$ -1258 914 2475 943 -2349 -2540 323 2089 1366 -650 -1684 -1055 1488 1911 -86 -917 -695
2904f95K30J000P26r77p03P5J4Q91P36j060j358K56P62R27L67r08j666P24J912
$$ -695 -465 535 1261 284 -419 -344 -330 561 1297 237 -1121 -865 -103 824 1191 283 -1383 -659 1253
2923A253j94p69r22J27R28P97j107j420P89J166k81n75N9l2L11Q92j320q04J129
$$ 1253 1059 290 -632 -505 423 1220 113 -1307 -518 648 367 -208 -149 -181 130 1022 -298 -1102 27
2942B7Q54l17o81o53J25J277J38p10o97K49J80M26N87n06q08N23k95L78P57l81
$$ 27 881 564 -117 -770 -645 632 770 60 -637 -388 -208 218 805 299 -509 14 -281 97 854 473
2962D73j375j19J107O16N23j103j890J57K466J299j667j519j364J760K336L39
$$ 473 -902 -1021 86 702 1225 122 -1768 -1611 855 2154 487 -1032 -2396 -636 1700 2039
2978B039k677j423J358J478Q18m99k158o76J685J112l83l66r97j003J218J448
$$ 2039 -638 -2061 -703 775 1593 1094 -1064 -1740 -55 1057 674 308 -689 -1692 -474 974
2994I74j57n73j295k45J198J787m12j829j072P25J294J473j093k118O8J659N42
$$ 974 817 244 -1051 -1296 -98 1689 1277 -552 -1624 -899 395 1868 775 -1343 -1275 384 926
3011I26O2o74j545P01J677k41j113j77o0L77K40k61m18L96O89p68o25P27M31j39
$$ 926 988 314 -1231 -530 1147 906 -207 -384 -444 -67 173 -88 -506 -110 579 -189 -814 -87 344 205
3031B05k23k40m02O45P56n46l65J67l96K35Q63j36j81n84l76m8J604K18j469q16
$$ 205 -18 -258 -660 -15 741 195 -170 -3 -399 -164 699 563 382 -202 -578 -626 978 1196 -273 -1089
3051a089Q9J305J293P2k375j436J789J842j53q50k042nK167J425j252j570p76
$$ -1089 -1000 305 1598 1670 -705 -2141 -352 1490 1337 487 -1555 -1560 607 2032 780 -790 -1566
3068a566O49J427J131j123j594K98M48Q57Q48p74j746j05J394Q77M31j393j947
$$ -1566 -917 510 1641 518 -1076 -778 -330 527 1375 601 -1145 -1250 144 1021 1452 59 -1888
3085a888O18J866O84q04j365p46R75J609O33j735j167R05O03N94j35j431k12J236
$$ -1888 -1270 596 1280 476 -889 -1635 -660 949 1582 -153 -1320 -415 188 782 647 -784 -996 240
3103B40p0J04k8n34k16L42O87q77O7M95o59L9K12N48o33O80n22k55O04j96l83
$$ 240 170 274 246 -288 -504 -162 525 -352 -285 210 -449 -410 -198 350 -283 397 -125 -380 224 28 -355
3124c55M90O05j018q0M42j75L32K46j097l32J088R03m71p96o62l68K049Q25j590
$$ -355 135 740 -278 -358 84 -91 241 487 -610 -942 146 1049 578 -218 -880 -1248 801 1626 36
3143C6r82J59P09J160J77j626j143Q06J313L98k72j273p73Q70J883l31p90r74
$$ 36 -946 -787 -78 1082 1259 -367 -1510 -704 609 1007 735 -538 -1311 -441 1442 1111 321 -653
3161f53l08N55K063J67k069j133O27J102J438o64k044l46J191J014K80q65j655
$$ -653 -961 -406 1657 1824 -245 -1378 -751 351 1789 1125 -919 -1265 -74 940 1220 355 -1300
3178a300l34K178J086j121j138p33M45J233Q05j001r88K44K62O14O49m55j198
$$ -1300 -1634 544 1630 509 -629 -1362 -917 316 1121 120 -868 -624 -362 252 901 446 -752
3195g52P8M60N18K21n49q83J75Q62N6n3J8p04m8O39L7k59q9K86j81R1j96J4N10
$$ -752 -674 -214 304 525 -24 -907 -732 130 186 133 151 -553 -601 38 75 -184 -273 13 -168 -77 -273 -259 251
3218B51M80r06m45M77M99L65j36q41p43Q73J106l79j200l64K33R47J249j109j043
$$ 251 731 -175 -620 -143 356 721 585 -256 -999 -126 980 601 -599 -963 -730 217 1466 357 -686
3237f86N2M91N09J097q14j379m37J067J209J9l08k216m1J941J146q01j172p44
$$ -686 -634 -143 366 1463 649 -730 -1167 -100 1109 1128 820 -1396 -1437 504 1650 849 -323 -1067
3255a067L07J766O05j152j417j43Q54J255M32j152j717Q60J187N69l35j244j081
$$ -1067 -760 1006 1611 459 -958 -1101 -247 1008 1440 288 -1429 -569 618 1187 852 -392 -1473
3272a473J210J077m7m37o82l90L77J190K14j325l39Q2L01Q73P5j199j77K74L37
$$ -1473 -263 814 767 330 -352 -742 -365 825 1039 -286 -625 -543 -242 631 706 -493 -670 -396 -59
3291e9P6K48r11j41R37L90q80j03K38k12M70l48j58K38O08k10m11j13k12M33L21
$$ -59 17 265 -646 -787 150 540 -340 -443 -205 -417 53 -295 -453 -215 393 183 -228 -341 -553 -120 201
3312B01o7o40J14K13K47P77j035n10P1R02M12n67n78k31L79Q33N57j031o91J42
$$ 201 134 -506 -392 -179 68 845 -190 -700 -629 273 685 118 -460 -691 -312 521 1078 47 -644 -502
3332e02RJ411q3j166o55P26N89O70l28j347o04J024J686k23j330q53j70J535R29
$$ -502 -493 918 835 -331 -986 -260 329 999 671 -676 -1280 -256 1430 1207 -123 -976 -1146 389 1318
3351A318l71j775K00M92P06R06q34j523P3R27P93N8q44r56k22J420Q41l77j480
$$ 1318 947 -828 -628 -136 570 1476 642 -881 -808 119 912 970 126 -830 -1052 368 1209 832 -648
3370f48j39K40J429J5p89p61J40O57K34M46j207n69O65P14m8j58l94k69M47O94
$$ -648 -787 -547 882 897 108 -653 -513 144 378 824 -383 -952 -287 427 379 221 -173 -442 5 699
3390F99o87k20P2j17J86K21j53j79L97J0p60J03N0K13K42L29j111K63N01O5k3
$$ 699 12 -208 -136 -253 -67 154 1 -178 219 229 -531 -428 -378 -165 77 406 -705 -442 59 124 101
3411A01j33o19m63J154M91n2m35n75m15J180J192r64r75l84N93O94J046j037j384
$$ 101 -32 -651 -1114 40 531 479 44 -531 -946 234 1426 462 -513 -897 -304 390 1436 399 -985
3430i85o7J225N54O07j190j431L25J705O44r18r73o91N50J900L15j257j086J64
$$ -985 -1052 173 727 1334 144 -1287 -962 743 1387 469 -504 -1195 -645 1255 1570 313 -773 -609
3448f09M41J168K9j164r13O23O32O63l0r16j206J104Q94l91l3m41o07Q43R05q59
$$ -609 -168 1000 1029 -135 -1048 -425 207 870 840 -76 -1282 -178 716 325 292 -149 -756 87 992 133
3468A33k58k29K38k9O09l25j70j81K46j46Q3K40m44J81J46k06m00M58L11k3n5
$$ 133 -125 -354 -116 -145 464 139 -31 -212 34 -112 -29 211 -233 -52 94 -112 -512 -54 257 234 179
3489A79k30l91M13O28q08q5l3J21M69L52k08j167K20N42K86L49q72n61j39J444
$$ 179 -51 -442 -29 599 -209 -294 -327 -206 263 615 407 -760 -540 2 288 637 -235 -796 -935 509
3509E09K58k90p98n67K28J399L9p38o74K1L10J032J7j407m40N63O97N75J45j666
$$ 509 767 477 -321 -888 -660 739 778 40 -634 -613 -303 729 746 -661 -1101 -538 159 734 879 -787
3529g87k79J013R02k77o82o46j38J158J026j049j030k11O04O36R49j179p61K39
$$ -787 -1066 -53 849 572 -110 -756 -894 264 1290 241 -789 -1000 -396 240 1189 10 -751 -512
3547e12O55M29J36q76l74Q1P80K67l48m74l70L93J083j23r14k77J34K54M54J21
$$ -512 143 572 708 -168 -542 -461 319 586 238 -236 -606 -213 870 747 -167 -444 -310 -56 398 519
3567E19q93p7M77J10Rj61j49j21L40K6j76J2L94r1K9k86l74K86Q22n33o62L26
$$ 519 -374 -451 26 136 145 -16 -165 -286 54 80 -96 -84 310 219 248 -38 -412 -126 696 163 -499 -173
3589a73j63M41N62l4j252K85K79N95M00m52j036j17P58P10k49n59o71k8P67Q49
$$ -173 -336 105 667 633 -619 -334 -55 540 940 488 -548 -665 93 803 554 -5 -676 -704 63 912
3609I12q17p79k37M21J170K56j026q38K20Q30R26l57p91j194P16J116N77n60r79
$$ 912 95 -684 -921 -500 670 926 -100 -938 -718 112 1038 681 -110 -1304 -588 528 1105 545 -434
3628d34n24M52J189P2r22m62j48N78J294m05q67o76M75N57N99k19j301L7N84M65
$$ -434 -958 -506 683 755 -167 -629 -777 -199 1095 690 -177 -853 -378 179 778 559 -742 -705 -121 344
3648C44r8k01o75O8O77L32k74j00r4k04M96Jk08k51j6L46l12QL53k68K00M09p07
$$ 344 246 45 -630 -562 115 447 173 73 -21 -225 271 272 64 -187 -203 143 -169 -161 192 -76 124 533 -174
3671a74l47O54j81J01J22o77J76O81L09o24p4l93k3N49M90n77o00J60M67L53K04
$$ -174 -521 133 -48 53 175 -502 -326 355 664 40 -34 -427 -450 99 589 12 -588 -428 39 392 596
3692E96m80j198K76J347k47J79q10m54L26J416k49q35l43j08N02R85p2j260m05
$$ 596 116 -1082 -806 541 294 473 -337 -791 -465 951 702 -133 -476 -584 -82 903 831 -429 -834
3711h34P64N09M06p58r19J15R36M41m05k34q44O5J329K68o97n48m2J05M67P72
$$ -834 -70 439 845 87 -832 -717 219 660 255 21 -823 -758 571 839 142 -406 -448 -343 124 896
3731H96j170n46M21M10M03n8n54j032O58Q59J8m1p67k25N20N65n4m06J20Q1k54
$$ 896 -274 -820 -399 11 414 356 -198 -1230 -572 287 305 264 -503 -728 -208 357 303 -103 17 98 -156
3752a56M72j88n21K8N72J31j35j4m48K53O52r30j22K10K43L06r9l48j38J81N01
$$ -156 316 128 -393 -365 207 338 203 189 -259 -6 646 -284 -406 -196 47 353 254 -94 -232 -51 450
3773D50l63k88J26j06N09M48n11r43L37L18M26K42m89r40L18R83J9L5m58q75L32
$$ 450 87 -201 -75 -181 328 776 265 -678 -341 -23 403 645 156 -784 -466 517 536 571 113 -762 -430
3794d30J142L4m67n86n84O09J183M86j581p04L89Q50N17m99p01o69N68R27K25
$$ -430 712 746 279 -307 -891 -282 901 1387 -194 -898 -509 341 858 359 -342 -1011 -443 484 709
3813G09k74j010l42O01J087j55n65o20q7O39O07P3j132l25N95K60O86k23q51j20
$$ 709 435 -575 -917 -316 771 616 51 -569 -656 -17 590 663 -469 -794 -199 61 747 524 -327 -447
3833d47M55q6K87j70l51J40L42r0k58p7k8n2Q6N83o35J81M23n84O9J47N9j20N64
$$ -447 8 -78 209 39 -312 -172 170 80 -178 -255 -283 -335 -249 334 -301 -120 303 -281 -212 -65 -6 -126 438
3856D38n13l23J48O03l38QJ52o72L10P58o9m64J6o91M29P25L04q87m42L9O16O75
$$ 438 -75 -398 -250 353 15 23 175 -497 -187 571 502 38 54 -637 -208 517 821 -66 -508 -469 147 822
3878H22K0q76n90O21Q76L7n70n25m22P47N72p4n74n66j93R56O11l45j106J70L61
$$ 822 842 -34 -624 -3 873 910 340 -185 -607 140 712 638 64 -502 -695 261 872 527 -579 -409 -48
3899d8K28N49o0j145m41R84l4K14m50n90M74N58K98q89j6j79L50Q41rq63j97K07
$$ -48 180 729 669 -476 -917 67 33 247 -203 -793 -319 239 537 -352 -368 -547 -197 644 635 -228 -425 -218
3921b18K21N57o4r70j74N92L90l14J42m31mK65M38n68l98K17P2J24O15o08l88
$$ -218 3 560 496 -474 -648 -56 334 20 162 -269 -273 -8 430 -138 -536 -319 -247 -123 492 -116 -504
3942e04L03M57n12M3K97n62N08N52o95k38M80q5J71k9m18r5N24J25l41j44j16
$$ -504 -201 256 -256 -213 84 -478 30 582 -113 -351 129 44 215 186 -232 -327 197 322 -19 -163 -279
3963b79k52R15J25m19n72m2M22M64m5n98m28L00Q07On4o89o53P98J010j53m45
$$ -279 -531 384 509 90 -482 -524 -102 362 317 -281 -709 -409 398 404 350 -339 -992 -194 816 663 218
3984B18p09k21O88Q58J9j261k26N36L93N43k05j602j9J311K81o9l57q09R8N96
$$ 218 -491 -712 -24 834 853 -408 -634 -98 295 838 633 -969 -988 323 604 535 178 -631 -533 63
4004F3M34k41l31m59n8O09N24l64o96K54k18O75J88l94k60L1L16j12j26L30n19
$$ 63 497 256 -75 -534 -592 17 541 177 -519 -265 -483 192 380 -14 -274 -243 73 -39 -165 165 -354
4025c54O3J62J25k71K22M6l32L62o5o4rM24j66m27J85J29L05q1n26l98O74M41
$$ -354 -291 -129 -4 -275 -53 -7 -339 23 -42 -106 -115 309 143 -284 -99 30 335 254 -272 -670 4 445
4047D45k44Q3l96p21Q23M47Ro74k86n2J19J022R9r51l61J37N38P32k26j071l05
$$ 445 201 284 -112 -833 -10 437 446 -228 -514 -566 -447 575 674 -277 -638 -501 37 769 543 -528 -833
4068h33R27K05M86o65o73j42J004L80m14l07l8l35Q22M48q16n53K35j31M76O22
$$ -833 94 299 785 120 -553 -695 309 689 275 -32 -70 -405 417 865 49 -504 -269 -400 76 698
4088F98o11n93K98N69j22J45m61o73M17Q09l90k19m08K40j14R15r6o89j48N96
$$ 698 87 -506 -208 361 239 384 -77 -750 -333 476 86 -133 -541 -301 -415 500 404 -285 -433 163
4108A63j63J55N3m16MN51k61p6J16m52R7M44J98p37K50L15n09L86M5l17J04L88
$$ 163 0 155 208 -208 -204 347 86 10 126 -326 -229 215 413 -324 -74 241 -268 118 163 -154 -50 338
4130C38l80K09k83Qj46K18k5m80J8N43Q8L86m87l24P5L38M08n62k8L3l23O79J73
$$ 338 -42 167 -116 -108 -254 -36 -61 -541 -523 20 108 494 7 -317 -242 96 504 -58 -86 -53 -376 303 476
4153D76o65m53J46L44P76o0o69o38N29P99l16L8p38m64Q33Q09o66k02m59k88P26
$$ 476 -189 -642 -496 -152 624 564 -105 -743 -214 585 269 307 -431 -895 -62 747 81 -121 -580 -868 -142
4174a42P24m69q48J05N00J79Q45m69r14n8M97L64k2j46m80j86R23j07ql37k54
$$ -142 582 113 -735 -630 -130 49 894 425 -489 -547 -50 314 292 146 -334 -520 403 296 288 -49 -303
4195c03j93Q73K33l29l13Nk40K54M89l18k49k5J3l39P23j85m18M44R0j72O4J34
$$ -303 -496 377 610 281 -32 -27 -267 -13 476 158 -91 -116 -103 -442 281 96 -322 122 212 40 104 238
4217B38k56m4J84J47m01N91k92o32J14K23J08L92J70q87Q6J01M02L72j92m46j29
$$ 238 -18 -62 122 269 -132 459 167 -465 -351 -128 -20 372 542 -345 -259 -158 244 616 424 -22 -151
4238a51L95N35m24m75n0m26O01Q51n38p46r1L19L56O08k37j438N10O75Q7L6m66
$$ -151 244 779 355 -120 -170 -596 5 856 318 -428 -519 -200 156 764 527 -911 -401 274 361 397 -69
4259f9o23j69R86L74j41m98j71k42Q20M06q33n2J05%O67k88l86l16M66J10o8J23
$$ -69 -692 -861 125 499 358 -140 -311 -553 267 673 -160 -212 -107 -107 560 272 -114 -430 36 146 78 201
4281B01n11nN02L7m22L20j34k27J67N76l07m79K69O9j13Q7K92o55K44N33l05l22
$$ 201 -310 -315 187 224 -198 122 -12 -239 -72 504 197 -282 -13 56 -57 30 322 -333 -89 444 139 -183
4303a83K39l58O15j02l39K46L4Q7LJ13l91k09M64N5k18k55j5J33j62Q48m32q75
$$ -183 56 -302 313 211 -128 118 152 239 242 355 -36 -245 219 274 56 -199 -214 -81 -243 605 173 -702
4325g02N82M06j19J57k27n10P9N80k11k6k88r3L77L06J41q15r4L59J43L45j64
$$ -702 -120 286 167 324 97 -413 -334 246 35 9 -279 -372 5 311 452 -363 -457 -98 45 390 226
4346B26n80j47M05O20N5n69m95k58Q80M61l03j33q09L46K12J048o07p74K6L64
$$ 226 -354 -501 -96 524 579 10 -485 -743 137 598 295 162 -647 -301 -89 959 352 -422 -396 -32
4366c2K14L61m43o66J44N33k03K79O2j136K32Q03K54n31J16j80k06P68l50k65
$$ -32 182 543 100 -566 -422 111 -92 187 249 -887 -655 148 402 -129 -13 -193 -399 369 19 -246
4386b46r8L36m41M52K51j54l47K87k36M41m49K56k08L90k10o27O79J44m7j88L4
$$ -246 -344 -8 -449 3 254 100 -247 40 -196 245 -204 52 -156 234 24 -603 76 220 173 -15 19
4407A9m46N00L62n52j30j32L68N5L34r3p10j45K34O26J33m97n77K63L62M31k31
$$ 19 -427 73 435 -117 -247 -379 -11 44 378 285 -425 -570 -336 290 423 -74 -651 -388 -26 405 174
4428A74n19j88j39J092J89m98n29k9J19K59M60k75o70M56J46J45N54n69o85K64
$$ 174 -345 -533 -672 420 609 111 -418 -447 -328 -69 391 116 -554 -98 48 193 747 178 -507 -243
4448b43L93J86n3m53k84L6Q66o9k10j68j77J04K48N04j122K61L05l2r6L3qk48
$$ -243 150 336 283 -170 -454 -418 448 379 169 1 -176 -72 176 680 -442 -181 124 92 -4 29 21 -227
4470b27M75j1j37k16L29j99L83j33m02o4J82K52j46p0J70l30L17Q8n65M7L56k41
$$ -227 248 237 100 -116 213 14 397 264 -138 -202 -20 232 86 16 186 -144 173 261 -304 -257 99 -142
4492a42nM50l24k02J72n0J67l4k65j70N10K81k84k00j26j20M15K22j01k61J0K91
$$ -142 -147 303 -21 -223 -51 -101 66 32 -233 -403 107 388 104 -96 -222 -342 73 295 194 -67 -57 234
4514B34Mj31j3m48L20K88J08k77j27j0K18L68j74j066O42k2N6O97j47r96RL49
$$ 234 238 107 94 -354 -34 254 362 85 -42 -52 166 534 360 -706 -64 -86 -30 667 520 -476 -467 -118
4536a18L97L58k89q75K36N05J40j52m06p2J3Q85l09k53k51q0N0O52j33j04n36
$$ -118 279 637 348 -527 -291 214 354 202 -204 -276 -263 622 313 60 -191 -271 -221 431 298 194 -342
4557c42J49Q0J93K07r6o43K7Q06on49O4m34N37M01j35l44J94k3l02N37l14L5o4
$$ -342 -193 -113 80 287 191 -452 -425 381 375 -174 -110 -544 -7 394 259 -85 109 86 -216 321 7 42 -22
4580b2P8l0k92L24k9j02L31l15q6K16O4l39R8np3K72J94k87j49j46K98j3N12m92
$$ -22 56 26 -266 58 29 -73 258 -57 -143 73 137 -202 -104 -109 -182 90 284 -3 -152 -298 0 -13 499 7
4604Gm05K49k24N80J10l06l75j90Q89r9k33Kp01N05L37O66q30m10J27o7Q00n6
$$ 7 -398 -149 -373 207 317 11 -364 -554 335 236 3 5 -696 -191 146 812 -18 -428 -301 -368 432 376
4626C76o07p2J16J97M24K61q67l94J82O19K07l41J04o53R4P36K8l39M4n75L53
$$ 376 -231 -303 -187 10 434 695 -172 -566 -384 235 442 101 205 -448 -354 382 410 71 115 -460 -107
4647a07P06l67m97J53N9J15j02L6j85j45P44j32l83M46m26k76P09n99j43L34p4
$$ -107 599 232 -265 -112 -53 62 -40 -4 -189 -334 410 278 -105 341 -85 -361 348 -251 -394 -60 -134
4668a34M2Q0O7j55m2M55l54m4l0J28Q2j78J59l16k20N71j37M57o4p90J9N67J33
$$ -134 -92 -12 55 -100 -142 313 -41 -85 -115 13 95 -83 76 -240 -460 111 -26 431 367 -423 -404 163 296
4691B96k04k49Q2Q1K01K18l20l94N02J1r3J09m57m12N46M38m02J5l07m1M27O63
$$ 296 92 -157 -75 6 207 425 105 -289 213 224 131 240 -217 -629 -83 355 -47 -32 -339 -380 47 710
4713G10l60o03n3j61N44L59k77m40K22M6L23J36n58j16k54O07K33m38J48m67L29
$$ 710 350 -253 -306 -467 77 436 159 -281 -59 -13 310 446 -112 -228 -482 125 358 -80 68 -399 -70
4734g0N36L4n71k22j05M08K18K13n96j31L24R6J8M6n45j1M59l9j23L13l50l26
$$ -70 466 500 -71 -293 -398 10 228 441 -155 -286 38 134 152 198 -347 -358 101 62 -61 252 -98 -424
4756d24M84L40j59m61K57o3R2J71r8m26M96k58q4L13l6k04K19K48l71m26O73m46
$$ -424 60 400 241 -220 37 -26 66 237 139 -287 209 -49 -133 180 144 -60 159 407 36 -390 283 -163
4778a63K33J23m30j01O13R0m1p84K41J31L47K37n11k96K09QJ02K34l02l29J23
$$ -163 70 193 -237 -338 275 365 324 -460 -219 -88 259 496 -15 -311 -102 -94 8 242 -60 -389 -266
4799b66M33K91r9m11m82K42O43K21n59k43R0J42M81K76q18l45J69L23N05l87n38
$$ -266 167 458 359 -52 -534 -292 351 572 13 -230 -140 2 483 759 -59 -404 -235 88 593 206 -332
4820c32m23P15J92N8ko11j8O08O1k77l1j40rL4O90n06j36L57m93J22O5J76l51
$$ -332 -755 -40 152 210 208 -403 -421 187 248 -29 -60 -200 -209 -175 515 9 -127 230 -263 -141 -76 100 -251
4843b51J25J59K53j75lk03j82M30K14p01Q2J19N3J94n35L87P4K11k12r1n1J33
$$ -251 -126 33 286 111 108 -95 -277 153 367 -334 -252 -133 -80 114 -421 -34 40 251 39 -52 -103 30
4865C0L2L68m86m84O25J5L18j87m15l20N31L13n9k00n8j34k83Q56k4q93M36N2
$$ 30 62 430 -56 -540 85 100 418 231 -184 -504 27 340 281 81 23 -111 -394 462 438 -455 -19 33
4887C3J0K00q9l55p4oL46J35J93r98K60N97K1j6k73k96q7N30J84l16l03J77L64
$$ 33 43 243 154 -201 -275 -281 65 200 393 -605 -345 252 273 257 -16 -312 -399 131 315 -1 -304 -127 237
4910B37K5N6k52n44M40K99j08k12J9k93J55M42k94KK9k85k95P54K58p45J64J71
$$ 237 262 318 66 -478 -38 261 153 -59 -40 -333 -178 264 -30 -28 1 -284 -579 175 433 -312 -148 23
4932B3J00J20Jn87J02K80j19L69m44N0j15L9L30n41L54OJ92L9k67p0J22L51k11
$$ 23 123 243 244 -343 -241 39 -80 289 -155 -105 -220 -181 149 -392 -38 -32 160 199 -68 -138 -16 335 124
4955A24o19L83K80l15L57k07l12K90j20M13l79N4j00j34M98k07K36k81j87j87
$$ 124 -495 -112 168 -147 210 3 -309 -19 -139 274 -105 -51 -151 -285 213 6 242 -39 -226 -413
4975d13P54J5l06m72J46N54K46o0o60j84J94L45K67o2p07j54O48L22O8p57Rn3
$$ -413 341 356 50 -422 -276 278 524 464 -196 -380 -186 159 426 364 -343 -497 151 473 541 -216 -207 -260
4997b60l2P27l85m01K96Pj78L97M6k44k62K87M63l29Lo4m38J42P26p37j87L51
$$ -260 -292 435 50 -351 -55 -48 -226 171 217 -27 -289 -2 461 132 135 71 -367 -225 501 -236 -423 -72
5019g2pJ75M86r37j24K97n1K37L49m22j2k4L50m16J68QK29k25k04K06n5N61o54
$$ -72 -79 96 582 -355 -479 -182 -233 4 353 -69 -81 -105 245 -171 -3 5 234 9 -195 11 -44 517 -137
5042a37n0o7j13Q5O24j5k56l78m6J76J67Q6k61j5K30M0LN7k62l67L87L23J15n54
$$ -137 -187 -254 -367 -282 342 327 71 -307 -353 -177 -10 76 -185 -200 30 70 73 130 -132 -499 -112 211 326 -228
5066b28k43K34K68M36n14k15j30K16L61r9K7m58N13Jj48P3o2k89J2M00j72L21
$$ -228 -471 -237 31 467 -47 -262 -392 -176 185 86 113 -345 168 169 21 94 32 -257 -245 155 -17 304
5088C04k48l67pL23L77l81j62J05K12J63J0j90p01L01O66n12K63k49m15O48j10
$$ 304 56 -311 -318 5 382 1 -161 -56 156 319 329 139 -562 -261 405 -107 156 -93 -508 140 30
5109C0J02k84J0l2N20L3l85o7K44j54k08Q2J57l02L83k25K2q7K98n2l04K82l8
$$ 30 132 -152 -142 -174 346 379 -6 -73 171 17 -191 -109 48 -254 129 -96 -74 -161 137 85 -219 63 25
5132B5k30J32k01j49K30K72j78j41M79N0m36Nj05K60M79p67j52P6L56J50j0N8
$$ 25 -205 -73 -274 -423 -193 79 -99 -240 239 289 -147 -142 -247 13 492 -275 -427 -351 5 155 145 203
5154B03n66K35N85l78l49M8j32M36K50J6o76J13K93j67o8N91l57k96K00nL7Q3
$$ 203 -363 -128 457 79 -270 -222 -354 82 332 348 -328 -215 78 -89 -157 434 77 -219 -19 -24 13 96
5176I6k53k61K19N06j27l81J38j02K62L68l15l81k71L58K96L66n03p1j02L37l42
$$ 96 -157 -418 -199 307 180 -201 -63 -165 97 465 150 -231 -502 -144 152 518 15 -56 -158 179 -163
5197a63J98J45l79j03K9K74j78K31j69l5k0L62k34l8O3K2k27N09k35k29K29K30
$$ -163 35 180 -199 -302 -273 1 -177 54 -115 -150 -170 192 -42 -80 -17 5 -222 287 52 -177 52 282
5219B82k46r7j4j42M63l97J03P2J54J28k77k27k23J88N90o2p33K62O1K56r5Ml39
$$ 282 36 -61 -75 -217 246 -151 -48 24 178 306 29 -198 -421 -233 357 295 -438 -176 -115 141 46 50 -289
5242b89N1L44r1J36p2l64RK08L90k0p3l14l17L12P2r7l23K46K3Q2O76m11l10L1
$$ -289 -238 106 15 151 79 -285 -276 -68 322 302 229 -85 -402 -90 -18 -115 -438 -192 -169 -87 589 178 -132 -101
5266a01K39Q6L4m22jJ45M78kp23K69r0k7L90m16k41K38J93m4l4L47l07k54L60
$$ -101 138 224 258 -164 -165 -20 458 456 -267 2 -88 -115 275 -141 -382 -144 49 5 -29 318 11 -243 117
5289A17l08J44K86m19n7J18M10l76J03j89O9J44M91n36l76M25P8lr4l06J30O70
$$ 117 -191 -47 239 -180 -237 -119 291 -85 18 -171 -102 42 533 -3 -379 46 124 121 27 -279 -149 521
5311E21k50l04m28M44pj46L40l83j19K97M1O1j72J4j7K23J53k50k1J14l08L69
$$ 521 271 -33 -461 -17 -24 -170 170 -213 -332 -35 6 67 -105 -91 -108 115 268 18 -3 111 -197 172
5333A72j89m8o1J93l0j0P3j74l30J71J96K6j8P6l3O2J76j27m85j77M42L95K43
$$ 172 -17 -65 -126 67 37 27 100 -74 -404 -233 -37 -11 -29 47 14 76 252 125 -360 -537 -95 300 543
5356E43m95o12M4L01L78O3l28k55Q4N14m0l47k26J25K6N6N7M32n18n6J48J79K50
$$ 543 48 -564 -520 -219 159 222 -106 -361 -277 237 197 -150 -376 -251 -225 -169 -112 320 -198 -254 -106 73 323
5379C23l85l06J25K26J41J28k69j67R9L14J44l75j51j00J57K27j85pK8K46m07
$$ 323 -62 -368 -243 -17 124 252 -17 -184 -85 229 373 -2 -153 -253 -96 131 -54 -61 -33 213 -194
5400a94K55j51j35J62J27m1l69L34L74l59K10m96J53L92r6m47n1M69l20O0M70
$$ -194 61 -90 -225 -63 64 23 -346 -12 362 3 213 -283 -130 262 166 -281 -332 137 -183 -123 347
5421C47l77l22M35j56J60L81l79l01k20Q46j27J2K9n84l58N00M25j47j37k66L32
$$ 347 -30 -352 83 -73 87 468 89 -212 -432 414 287 299 328 -256 -614 -114 311 164 27 -239 93
5442I3K7J51k25l40M5K99Q1N39p31j87K47M3J72Qo2l93K17J99j44J15n2j18l8
$$ 93 120 271 46 -294 -249 50 131 670 -61 -248 -1 42 214 222 160 -233 -16 183 39 154 102 -16 -54
5465e4M14m7m97K25l27L20N10k98l10m1K92Jq6j27J2J17O8k60k23K64p2J84j60
$$ -54 360 313 -184 41 -286 34 544 246 -64 -105 187 188 102 -25 -13 104 172 -88 -311 -47 -119 65 -95
5488i5J3Q3J12o4k12K55J24m74M2L64k0j60OJ96j78K82l20Q1J1Q2R4k58K15j83
$$ -95 -82 1 113 49 -163 92 216 -258 -216 148 128 -32 -26 170 -8 274 -46 35 46 128 222 -36 179 -4
5512dm28O38r5k50J6J56j62M45m5l92K05O9N2M5m3m37J51J31J59l0L1j57l55K24
$$ -4 -432 206 111 -139 -123 33 -129 316 271 -121 84 153 205 250 207 -230 -79 52 211 181 212 55 -300 -76
5536g6J26m7j85rM44l4J68l18l41k87N83j29K65k3m98L72K64n7m19j25m1J31P26
$$ -76 50 3 -182 -191 253 219 387 69 -272 -559 24 -105 160 137 -361 11 275 218 -201 -326 -367 -236 490
5559D90k4n57j7J50k30K33j59k6o2K75kj31L79k96k40K03o8J36j97J42j76r7N26
$$ 490 466 -91 -108 42 -188 45 -114 -140 -202 73 71 -60 319 23 -217 -14 -82 54 -143 -1 -177 -274 252
5582B52k39j58L5L42l66l2o1k33N27L50r55L88J48j7L73m73J10n06P20r9J53l24
$$ 252 13 -145 -110 232 -134 -166 -227 -460 67 417 -538 -150 -2 -19 354 -119 -9 -515 205 106 259 -65
5604f5R9m7j28L39n14N0K82k10K30Q1j21j22J00m4J17Q1j49p1N0J49l3J02k49
$$ -65 34 -13 -141 198 -316 -266 16 -194 36 117 -4 -126 -26 -70 47 128 -21 -92 -42 107 74 176 -73
5627g3l97L12L23K17m50k36p4J65L69j37j83r7J31K20KO1l29j89O42J74m88K5
$$ -73 -470 -158 165 382 -68 -304 -378 -213 156 19 -164 -261 -130 90 92 153 -176 -365 277 451 -37 -12
5649a2p3k55P41k12l97K28J63k89K30RJ21m52J0J23J63O9o6l08J71J76j32j01
$$ -12 -85 -340 401 189 -208 20 183 -106 124 133 254 -198 -188 -65 98 167 101 -207 -36 140 8 -93
5671i3K07l92M34o9r0j78P8J15j4L3m0l65L29L04j4n49J89J10J67Q7l27k64q0
$$ -93 114 -278 156 87 -3 -181 -103 12 -2 31 -9 -374 -45 259 245 -304 -115 -5 162 249 -78 -342 -422
5694d22N56j4k31L02j89j82J96K72m21J45j93K64J40n1j20j9n1k10L73q8k02l2
$$ -422 134 120 -111 191 2 -180 16 288 -133 12 -181 83 223 172 52 33 -18 -228 145 57 -145 -177
5716a77L58q9M1Qk12k75O26m38J34k91J75o7K74K04n16P9P2L6R7l1r5l41N15R
$$ -177 181 92 133 141 -71 -346 280 -158 -24 -315 -140 -207 67 271 -245 -166 -94 -58 39 8 -87 -428 87 96
5740I6k50L43j80k30J5L96k2l07j89M37l45J88J62k77n9M49k70J1J82m00J15K28
$$ 96 -154 189 9 -221 -206 190 168 -139 -328 109 -236 -48 114 -163 -222 227 -43 -32 150 -250 -135 93
5762I3k83K96J92l3j00j32J11j74m46N96J07k75M8M6M7n6j62m6M0L33k51J45P4
$$ 93 -190 106 298 265 165 33 144 -30 -476 120 227 -48 0 46 93 37 -125 -171 -131 202 -49 96 170
5785A70k73j29K84j27J48M09o96K51J92j17j47JJ1k5J5L19l98k7n9k7M54JK5q93
$$ 170 -103 -232 52 -75 73 482 -214 37 229 112 -35 -34 -23 -48 -33 286 -112 -139 -198 -225 229 230 255 -638
5809f38L72L68kK42n12j43M58Q0r2j85p5mL2L28k63M4m08L10k29K01J72k41J72
$$ -638 -266 102 100 342 -170 -313 145 225 133 -52 -127 -131 -99 229 -34 10 -398 -88 -317 -116 56 -185 -13
5832a3J31j27K1K05k49l0J93L49m03k24J72l11L83m6r7J95R2k66L3L7R2p5n7M35
$$ -13 118 -9 12 217 -32 -62 131 480 77 -147 25 -286 97 51 -46 149 241 -25 8 45 137 62 5 440
5856D40m70m7P1J25N4l74J0K95J65j30k70J35j42M2J37J05n4J5j40P3lM06j95
$$ 440 -30 -77 -6 119 173 -201 -191 104 269 139 -131 4 -138 -96 41 146 92 107 -33 40 37 443 248
5879B48k44n8J96l3Mr8k96J95N09m65K41r9j74K60j48Nk19K16j61J27l6J32j01
$$ 248 4 -54 142 109 113 15 -281 -86 423 -42 199 100 -74 186 38 43 -176 40 -121 6 -30 102 1
5902AJ74k41q2j77P37k29l21M90J44o66K3O0r0L29j2%k63J17rM57j56k70j48J71
$$ 1 175 -66 -148 -325 412 183 -138 352 496 -170 -147 -87 -177 152 140 140 -123 -6 -15 442 286 16 -132 39
5926C9J11o1q0j81r9K01J78k04j12pK30k06K07j80q5L02p2l5R6K34m73N7J86L9
$$ 39 150 89 9 -172 -271 -70 108 -96 -208 -215 15 -191 16 -164 -249 53 -19 -54 42 276 -197 -140 46 85
5950H5j20j36N88l90N7p5j36J96j13J0J52r6q1P7Q8k53J73m8j64K79q1J67l85
$$ 85 -35 -171 417 27 84 9 -127 69 -44 -34 118 22 -59 18 106 -147 26 -22 -186 93 12 179 -206
5973b06m0L61p9k48J14l00L95p3J98k39J00q6l6J17M90n79J0J89k9P8j7l60k68
$$ -206 -246 115 36 -212 -98 -398 -3 -76 122 -117 -17 -103 -139 -22 468 -111 -101 88 59 137 120 -240 -508
5996e08O39q3R6p9k95K7J47N46k84k91J50k55J23J52l6k05k26J02M60k04K03m51
$$ -508 131 48 144 65 -230 -203 -56 490 206 -85 65 -190 -67 85 49 -156 -382 -280 180 -24 179 -272
6018b72J17J74P3J12j65k30L0M44l13k10O8L88l15L4K24l79K35k7L34m34j05O0
$$ -272 -155 19 92 204 39 -191 -161 283 -30 -240 -172 216 -99 -65 159 -220 15 -12 322 -112 -217 -157
6040a57K57Oj71kJ29k72K09k7L04m12m3L90k17n1p7j02Q0N62j76m76M0n4J93O7
$$ -157 100 106 -65 -67 62 -210 -1 -28 276 -136 -179 211 -6 -57 -134 -236 -156 406 230 -246 -206 -260 -67 0
6064@k2k04k09K40K13j68J8J28n6M3J25L6k8K4j06J9J58j70P0k58P3k72N97k13
$$ 0 -22 -226 -435 -195 18 -150 -132 -4 -60 -17 108 144 116 140 34 53 211 41 111 -147 -74 -346 251 38
6088C8m9q1o9O09j27l42j05k00P15j76j25k58M5O1J79j17k26L92j3K1j18J58l94
$$ 38 -11 -92 -161 448 321 -21 -126 -326 389 213 88 -170 -125 -64 115 -2 -228 164 151 172 54 212 -182
6111a82M6K84n4j39n1l27L42K70n6k32P2K42j33P4R7l02J46j43J87j32N6k67J56
$$ -182 -136 148 94 -45 -96 -423 -81 189 133 -99 -27 215 82 156 253 -49 97 -46 141 9 65 -202 -46
6134d6J42J78l09l7O9QR7o2j6j39Q4Q9P1j04k1j45M67l11n3M1j44K51J02j58j26
$$ -46 96 274 -35 -72 -3 5 102 40 24 -115 -31 58 129 25 4 -141 326 15 -38 3 -141 110 212 54 -72
6159g2J8L46l25R6j07n7j60k0L55J16l56K77l14L2O78m13k69J71J75j37L71l75
$$ -72 -54 292 -33 63 -44 -101 -261 -281 74 190 -166 111 -203 -171 507 94 -175 -4 171 34 405 30
6181C0k95J41J28N04o42L53k29m98O98L71m13q6R6m52K38N97m20ok59K52k8k09
$$ 30 -265 -124 4 508 -134 219 -10 -508 190 561 148 62 158 -294 -56 541 121 115 -144 108 80 -129
6203a29J66k64O7K70j9j45n7j79O08j99l70L87n8l69L54J63j72k23J12L30m55
$$ -129 37 -227 -160 110 91 -54 -111 -290 318 119 -251 136 78 -291 63 226 54 -169 -57 273 -182
6224a82r3J15M5J55M9j35l5o9K18J64j03k39L8j85K29J00K18o11L05j26L73J61
$$ -182 -275 -160 -115 40 89 -46 -81 -150 68 232 129 -110 -72 -257 -28 72 290 -321 -16 -142 231 392
6246C92l30j55j10L46q0K16m85m4j1J41J28L32n07L52k8J7j47mJ22j73P6P2l33
$$ 392 62 -93 -203 143 63 279 -206 -250 -261 -120 8 340 -167 185 157 174 27 23 145 -28 48 120 -213
6269b13N2J46q2K15J83j42l56P4J85j70J02l5j83L85l3N2k12J34n4J37p4q8l35
$$ -213 -161 -15 -97 118 301 159 -197 -123 62 -108 -6 -41 -224 161 128 180 -32 102 48 185 111 23 -312
6292c12M33j74M5R0j05J91m23L09J49j12m9j20M3K66j92k58Q8J85l4p4J62j30
$$ -312 121 -53 -8 82 -23 168 -255 54 203 91 42 -78 -35 231 39 -219 -131 54 20 -54 108 -22
6314b2k96N94k5k90q8k2J52j08L31P8l56L12l68M62k26k23k29J78K58j17J23o5
$$ -22 -318 276 251 -39 -127 -149 3 -105 226 304 -52 260 -108 354 128 -95 -324 -146 112 -5 118 53
6336E3j86K03K25l35j97L4K28q8P8o4l09N58j80l30N44l23LK43m6j73L7j39PJ75
$$ 53 -133 70 295 -40 -237 -203 25 -63 15 -49 -358 200 20 -310 234 -89 -86 157 111 -62 -25 -164 -157 18
6360A8J03po1l29k1M82P9k23n02l0N92l0j33Q6k95K66p5J60j00L7k81J50L12j21
$$ 18 121 114 53 -276 -297 185 264 41 -461 -491 101 71 -62 24 -271 -5 -80 80 -20 17 -264 -114 198 77
6384G7j97K41k52J22R5j56j00J58l07L28L07l33k86J15j95K00J75K54Q6k63P8
$$ 77 -120 121 -131 -9 86 -70 -170 -12 -319 9 316 -17 -303 -188 -383 -183 -8 246 332 69 147
6405A47l89L06j24j90O6J39J32j95K47n7j97P0j93L59k16K22O2l05j74J91M01
$$ 147 -242 64 -60 -250 -184 -45 87 -108 139 82 -115 -45 -238 121 -95 127 189 -116 -290 -99 302
6426C02p8j98O0j43K56J04k92L5R8l79L22O2M5m18r9K80J05j74O5r7k63O25m64
$$ 302 224 26 86 -57 199 303 11 46 144 -235 87 149 194 -224 -323 -43 62 -112 -47 -144 -407 218 -246
6449b46L73l22j26M85q6L8l84L81r0n0K35k60j6j22K69j36M6J8Oj77L46O8m4j47
$$ -246 127 -195 -321 164 78 116 -268 113 23 -27 208 -52 -68 -190 79 -57 -11 7 13 -164 182 250 206 59
6473E9l27K38K60k55J58P8j28K27j82j64n6M3L71q9k86j81P9M4P4k55L57k93k7
$$ 59 -268 -30 230 -25 133 211 83 310 128 -36 -92 -49 322 233 -53 -234 -155 -111 -37 -292 65 -228 -255
6496b55M19k57K89J34l10q1M46n51J87K6j70j01K23P0n1q2K7M20l8n3n24L32j1
$$ -255 164 -93 196 330 20 -61 385 -166 21 47 -123 -224 -1 69 18 -64 -37 383 345 292 -232 100 89
6519H9k90J42J27r8l26J23L56k89j56K65K32r0j34J85J21j62m8Q6j32j76j07N94
$$ 89 -201 -59 68 -30 -356 -233 123 -166 -322 -57 175 85 -49 136 257 95 47 133 1 -175 -282 312
6541C12k31K0k94j50K38K30J48J29m63j5J07n2j05N3R4k10Q4J08J44J89m44r7
$$ 312 81 101 -193 -343 -105 125 273 402 -61 -76 31 -21 -126 -73 21 -189 -105 3 147 336 -108 -205
6563b05K45K67j33j27m48M23J5J81K51n13n6J13J94n78J79K43q1O0K26j98k7J82
$$ -205 40 307 174 47 -401 22 37 218 469 -44 -100 13 207 -371 -192 51 -30 30 256 58 31 213
6585B13l4j54k51L61m4l82L46j70K08j79M22l63j41J4J77P0J44N0ok97l0J40K4
$$ 213 179 25 -226 135 91 -291 55 -115 93 -86 336 -27 -168 -154 23 93 237 287 281 -16 -46 94 118
6608A18j0j22K41rk58mO5N1k27Q6K36j59n06N00j2l1L35l91p4J28O1P0L51n33
$$ 118 108 -14 227 218 -40 -44 21 72 -155 -69 167 8 -498 2 -10 -41 294 -97 -171 -43 18 88 439 -94
6632i4j21K92%k64K06Q2j85J9M57k36k47k1J30M1j98L12k32o3O8J06m51P72l17
$$ -94 -215 77 77 -187 19 101 -84 -65 392 156 -91 -112 18 59 -139 173 -59 -122 -54 52 -399 373 56
6655E6k8L20l31R1k0L7J10k25j36L33k17Rj01j47K63P7l10Q6R1p1k3L26l68J74
$$ 56 28 348 17 108 88 125 235 10 -126 207 -10 -1 -102 -249 14 91 -219 -133 -42 -113 -136 190 -178 -4
6679dL15m90J02l3J01o3R4O9l29J32K91L3j19K32l52o2J89j48R2Mj93p0J84j35
$$ -4 311 -179 -77 -110 -9 -72 22 91 -238 -106 185 218 99 331 -21 -83 106 -42 50 54 -139 -209 -25 -160
6703a60l3J73L7L3N9j45j4J13J1oK1q8J48k61K42N3m96L16M9L3L1j38k89M20J76
$$ -160 -193 -20 17 50 109 -36 -50 63 74 68 89 1 149 -112 130 183 -313 3 52 85 116 -22 -311 109 285
6728B85k71m0q6Q9QJ49j33O6j88K44J0j6ok3j92m3L83m8J42o32K28j00M21l80
$$ 285 14 -26 -112 -23 -15 134 1 67 -121 123 133 117 111 88 -104 -147 236 188 330 -302 -74 -174 247 -133
6752a33%j44L22K68k98j03K64j44LJ18k52k18J47J46L3k42L39K3J67Q7k19j58
$$ -133 -133 -277 45 313 15 -88 176 32 35 153 -99 -317 -170 -24 9 -233 106 129 296 383 164 6
6774FJ60j9o7l01K54q9k3L45l06L90l69J5O7j43K39j14P8n6n9R4N3l27m2P6J23
$$ 6 166 147 80 -221 33 -56 -79 266 -40 350 -19 -4 63 -80 159 45 123 67 8 102 155 -172 -214 -138 -15
6799a5K40j75pK0KQJ33j3j05j59K11j10K42l59OJ01J54K30k13k43j45j98J99j0
$$ -15 225 50 43 63 65 73 206 193 88 -71 140 30 272 -87 -81 20 174 404 191 -52 -197 -395 -196 -206
6823b06M52l86J15j04K49k40J57rj13J51O9k29k48L28J39k71K52P1j94n43O11
$$ -206 246 -140 -25 -129 120 -120 37 28 -85 66 135 -94 -342 -14 125 -146 106 177 -17 -560 51
6844E1k42l6J28J54j11K16j28j67Q3q0K59k35J48n48N30j22J99r7k1j66K58R5
$$ 51 -191 -227 -99 55 -56 160 32 -135 -52 -132 127 -108 40 -508 22 -100 99 2 -19 -185 73 168
6866A68k48k56M03j35K3P8K92r2m71M17J22n20J26p2K71K4m0k14J25k9j88K47
$$ 168 -80 -336 67 -68 -45 33 325 233 -238 179 301 -219 -93 -165 106 130 90 -124 1 -28 -216 31
6888C1K87j85l03J61J18k5J69n53j07N25j05j4k03J68j45K76m1j54r3L61k38K27
$$ 31 318 133 -170 -9 109 84 253 -300 -407 118 13 -1 -204 -36 -181 95 54 -100 -193 168 -70 157
6910A57J26l67k12K74J49l23M24j51l05P2R8J40j44O7K08l22j4K93n10L64l8L6
$$ 157 283 -84 -296 -22 127 -196 228 77 -228 -156 -58 82 -62 5 213 -109 -123 170 -340 24 -14 22
6932B2L5K20l14k48R7P7n2L25m9m8rK84l32k90L91k35K72Pj67O3J74j08PM3n4
$$ 22 57 277 -37 -285 -188 -111 -163 162 113 65 56 340 8 -282 109 -126 146 153 -14 49 223 115 122 165 111
6957A11n14M64J57l14p4J88j9J6M15n40k2K44j44q1J28J37k71J47M6l11K29J66
$$ 111 -403 61 218 -96 -170 18 -1 15 430 -110 -132 112 -32 -113 15 152 -119 28 74 -237 -8 158
6979A58j19N6O0k32o6M44k83J2j10L24l19K08j71M03k78l4k86q4L96K09j13l90
$$ 158 39 95 155 -77 -143 301 18 30 -80 244 -75 133 -38 365 87 53 -233 -317 79 288 175 -215
7001b15M45o2L9J23l48l85K89J77K74l31L3m49L96N4j84J89L7j12J93j08q1j5
$$ -215 230 168 207 330 -18 -403 -114 63 337 6 39 -410 -14 40 -144 45 82 -30 163 55 -26 -41
7023d1J00j30j07J31j21O6R5R6j96M5o6k3R9J82j69k31L00j6k3k9J7O9j85K05
$$ -41 59 -71 -178 -47 -168 -102 -7 89 -107 -62 -128 -151 -52 130 -39 -270 30 14 -9 -38 -21 48 -137 68
7047F8J90m1j86R8NO5%k31K04o9q9J54k59m3M8K16L3m8j36k88M5K49L12n17J22
$$ 68 258 217 31 129 134 199 199 -32 172 103 14 168 -91 -134 -86 130 163 115 -21 -309 -264 -15 297 -220 -98
7072i8M13m53K61Mq3l8k62L99j25R1n11J6N71q9K62k55l10j27M37j58l52M69L2
$$ -98 315 -138 123 127 44 6 -256 143 18 109 -402 -386 185 96 358 103 -207 -334 103 -55 -407 62 94
7095I4Mn7K26k68Qj78L36R3m11J22J0k06K90J42k05M4r1j1K43o5k35j1M04k71
$$ 94 98 41 267 -1 7 -171 165 258 -153 -31 -21 -227 63 205 0 44 -47 -58 185 120 -115 -126 278 7
7119GM4O9MN6q3k38K52j09R8j69O7j16J00L12l17L69k70P2L9l53M14n29P7J20
$$ 7 51 120 124 180 97 -141 111 2 100 -69 -2 -118 -18 294 -23 346 76 148 187 -166 248 -281 -204 -84
7143h4J6N8j0L7P7J02l38J55K1J87k74j54K82j06K8j57K8j4L17J8k22k72M31k10
$$ -84 -68 -10 -20 17 94 196 -142 13 34 221 -53 -207 75 -31 -3 -160 -132 -146 171 189 -33 -305 126 -84
7167h4L21n6l73K39P3J06j65J93k00l45L92j08J2Q2kl84N09k43J87k28j59K25
$$ -84 237 181 -192 47 120 226 61 254 54 -291 101 -7 5 87 85 -299 210 -33 154 -74 -233 -8
7189hk4Q0j72J39k76J16J88K07k85j67K38k09J14j58L21P9l39K27O5k71M23l24
$$ -8 -32 48 -124 15 -261 -145 43 250 -35 -202 36 -173 -59 -217 104 183 -156 71 136 -135 288 -36
7211c6o7M1K20k78R1M0K66l24j15K41j33J15J32m18RM00j11m14L91Q2l11J45N35
$$ -36 -103 -62 158 -120 -29 11 277 -47 -162 79 -54 61 193 -225 -216 184 73 -341 50 132 -179 -34 501
7234E01k98k29J90l22J68K11r1n68L85l9J37L98o57M6N8J99K94l19R9m5k38O9
$$ 501 203 -26 164 -158 10 221 130 -438 -53 -92 45 443 -214 -168 -110 89 383 64 163 118 -120 -51
7256e1J29l23J48K52m17J93KK66m84L17k46L28JL5j51L57l82K29l04J13l71P25
$$ -51 78 -245 -97 155 -262 -69 -67 199 -285 32 -214 114 115 150 -1 356 -26 203 -101 12 -359 366
7278C66l44q7J49k15M0J66J65k92R9j34K21l34J62o7J61j8j12k16M98j47J42l65
$$ 366 22 -65 84 -131 -91 75 240 -52 47 -87 134 -200 -38 -105 56 38 -74 -290 208 61 203 -162
7300a62L55N7j88O7l78L30O6l36J80j28J86j85L70j81k96L63J55Ql77n6J0J93
$$ -162 193 250 62 129 -249 81 147 -189 -9 -137 49 -136 234 53 -243 120 275 283 -94 -150 -140 53
7322E3Q6k71k9J6K0J96o2J6Pk14K72l8j67J66P1J97l60K14j81q5K76l43K40r2
$$ 53 139 -132 -161 -145 -125 71 9 25 32 -182 90 52 -115 51 122 319 -41 173 -8 -93 183 -160 80 -12
7346a2j90K00J98k6L5q3j38J48j74P9J1j2l5J22L8j49k83N01k66J9j06%O0j43
$$ -12 -202 -2 196 170 205 122 -16 132 -42 37 48 36 1 123 161 12 -271 230 -36 -17 -123 -123 -63 -206
7370b06L60k6j01r1J40LJ49k02R6j38n5J72k10K93j11l61J33K95M0Mk33k90J29
$$ -206 154 128 27 -64 76 79 228 26 122 -16 -71 101 -109 184 73 -288 -155 140 180 184 -49 -339 -210
7393b10K29k68J88J80j22L7k90K51m3j64K73N6l96R2J19J22L6k34k07L14Oq7K75
$$ -210 19 -249 -61 119 -3 34 -256 -5 -48 -212 61 117 -279 -187 -68 54 90 -144 -351 -37 -31 -118 157
7416A57R5m44N77l07j25O9k8K71l82K55K0p1m31N63j51l01L38j22J26Q2j4j57
$$ 157 252 -192 385 78 -47 22 -6 265 -117 138 158 87 -344 219 68 -233 105 -17 109 191 177 20
7438B0k17N2r7L41R2k05j3n7J32o0L68p2j66J57m86K77k58L35p9k3J09j84J22
$$ 20 -197 -145 -242 99 191 -14 -27 -84 48 -12 356 284 118 275 -211 66 -192 143 64 41 150 -34 88
7461H8J3l66K67q3R4k27kJ10J02Pj16J53j63J12j56K43k21O5o7K78J16p58P03
$$ 88 101 -265 2 -81 13 -214 -216 -106 -4 3 -113 40 -123 -11 -167 76 -145 -80 -147 131 247 -511 192
7484A92l24K12j57L01q9k47K90k53j46J36j39K73j10J1m6O6j34N6J05J17k24l32
$$ 192 -132 80 -77 224 135 -112 178 -75 -221 -85 -224 49 -61 -50 -96 -30 -164 -108 -3 114 -110 -442
7506d42O57l55K40j82L3r3J52p7O5R9j98J24j25J76l12K36K77l84J74J76J5k50
$$ -442 215 -140 100 -82 -49 -142 10 -67 -2 97 -101 23 -102 74 -238 -2 275 -109 65 241 256 6
7528FL3J49k88J48l47K10L67r0j64p2k7J47r7j15J58k1o8n5L10p7r9l5K9J28n7
$$ 6 39 188 -100 48 -299 -89 278 188 24 -48 -75 72 -25 -140 18 -3 -71 -126 184 107 8 -27 2 130 73
7553G3j87rk75M19pQ2O1j61p3K77k98P2J00k31J89J79j4K54l30Ok41J15P2k37
$$ 73 -114 -123 -398 21 14 96 157 -4 -77 200 -98 -26 74 -157 32 211 197 451 121 127 -114 1 73 -164
7577a64K46j60K33K1l59K61l62K93j85K1k54M70k43J92J62j49k19J47K24j95R5
$$ -164 82 -78 155 176 -183 78 -284 9 -176 -155 -409 61 -182 10 172 23 -196 -49 175 -20 75
7598G5l66J95J85j69N7j8l6K18n8Q5J50l04N6j88J89j92l8K7M56n27J33P3K6k49
$$ 75 -291 -96 89 -80 -23 -41 -77 141 83 168 318 14 70 -118 71 -121 -159 -132 324 -203 -70 3 29 -220
7622b20M05l08L11j92R3J90j96j0J20j28r1L48J74l72p3k25P9L26q3k50K01l19
$$ -220 185 -123 188 -4 89 279 83 73 193 65 -26 322 496 124 51 -174 -95 231 148 -102 99 -220
7644b20K22j30K20j28N7j70J11O1J6o8K07j77k19L87mj73L59l25K7j16j45L12
$$ -220 2 -128 92 -36 21 -149 -38 23 39 -29 178 1 -218 169 165 -8 351 26 53 -63 -208 104
7666A04l52J63J35q4j14J43L4k5K47k42j08n4J21K82k61j03J03j2J9P5k17J37
$$ 104 -248 -85 50 -34 -148 -5 29 4 251 9 -99 -153 -32 250 -11 -114 -11 -23 -4 71 -146 -9
7688iJ40k43J94m58K25J15K39k53oO7l47O64m09n2M7j2j72L52O6k55J19q6j3J83
$$ -9 131 -112 82 -376 -151 -36 203 -50 -56 11 -336 328 -81 -133 -86 -98 -270 82 148 -107 12 -74 -87 96
7712I6k47moQ6J17ql4RJ19l37L22k3k08j86L46j15k12K66n3J3L34j96p3o0k0j52
$$ 96 -151 -155 -161 -75 42 34 0 9 128 -209 113 90 -118 -304 42 -73 -285 -19 -72 -59 275 79 6 -54 -74 -226
7738b26N14l42J85m1K19l81J63l5j58K61m32K45K43j38k50J7J9K26J68j07j99
$$ -226 288 -54 131 90 309 -72 91 56 -102 159 -273 -28 215 77 -173 -156 -137 89 257 150 -49
7759d9j26J23K6K55j05l13P7N5K25l19j42M58k08j6K60k71J38k29J31L57n92K62
$$ -49 -175 -52 -26 229 124 -189 -112 -57 168 -151 -293 165 -43 -59 201 -70 68 -161 -30 327 -265 -3
7781cj34r1L46q5J81l9k49J39q5K36k90m47O30p1j18j29J49q0J85r0p3J56j76
$$ -3 -137 -228 118 33 214 175 -74 65 -20 216 -74 -521 109 38 -80 -209 -60 -140 45 -45 -118 38 -138
7804a38j07J20J26k74K30q8J10L43m02qJ48J23j60j05j24J11M38l17P7j00J43
$$ -138 -245 -125 1 -273 -43 -131 -21 322 -80 -88 60 183 23 -82 -206 -95 343 26 103 3 146
7825A46q5j30j5J49J15m11L09r4j54K79m1l25K57k2k7l4J26j29J29J09j69N7L6
$$ 146 61 -69 -84 65 180 -231 78 -16 -170 109 68 -257 0 -22 -49 -83 43 -86 43 152 -17 40 76
7848G6Lk14J34q6L59r6r5j40J91k25M0L48n33J67j39L11p4l66M70k26JjL4K75
$$ 76 79 -135 -1 -87 272 176 81 -59 132 -93 -53 295 -238 -71 -210 101 27 -339 131 -95 -94 -95 -61 214
7872B14m39R5n0J85o6o1l8L61k48J76J46l09p1J07L82k04j83o0M5k45K34L51l70
$$ 214 -225 -130 -180 5 -61 -122 -160 201 -47 129 275 -34 -105 2 384 180 -3 -63 -18 -263 -29 322 -48
7895d8Q4j03j36M31m45Q9J59K39j49j03K32l90Q5J70l18L03q2j98P2m5J2K16j05
$$ -48 36 -67 -203 228 -217 -128 31 270 121 18 250 -140 -55 115 -203 100 18 -180 -108 -153 -141 75 -30
7918c0J04l4J74L7k12m95M68l32M05O6j17j00l2K38Ol80O2K84l67L74l1l77J96
$$ -30 74 40 214 251 39 -456 12 -320 85 151 34 -66 -98 140 146 -234 -172 112 -255 119 88 -289 -93
7941i3L37l15Q0jj18J43j9q9K08k37K2M0J85j88L32j69L6j4P9k20j01r5J09O1
$$ -93 244 -71 9 8 -110 33 14 -75 133 -104 -82 -42 143 -45 287 118 154 140 219 -1 -102 -197 -88 -27
7965b7k03J04K61k20J85j69J37j09J24J01MQl13K03j82K25n8J52l46J80k81N14
$$ -27 -230 -126 135 -85 100 -69 68 -41 83 184 188 196 -117 86 -96 129 71 223 -123 57 -224 290
7987B90k16j28j68R9oJ95j11K03m31M62l62j84J88kK3L42l37J18J22k74j09K54
$$ 290 74 -54 -222 -123 -129 66 -45 158 -273 189 -173 -357 -169 -171 -148 194 -143 -25 97 -177 -286 -32
8009c2J02j37l7J05j96M69j73k82K10J20j46jJ25J67l11J74n3j32O5J01j13J1
$$ -32 70 -67 -104 1 -195 274 101 -181 29 149 3 2 127 294 -17 157 104 -28 37 138 25 36
8031C6J16j22NK20j18l83K05L33m13Q2M4J82l04Q9L7q3o1L10j85J96l95L61qj23
$$ 36 152 30 35 255 137 -246 -41 292 -121 -39 5 187 -117 -28 9 -74 -135 175 -10 186 -209 152 144 21
8055B1pn8O3j32l8J17k4q2K79Nk76J30p4O2J0k59L06j8J87P4l56j41M5L18k03
$$ 21 14 -44 19 -113 -151 -34 -58 -140 139 144 -132 -2 -76 -14 -4 -263 43 25 212 286 -70 -211 -166 152 -51
8080e1L3k25J66K73j84k34N00rk49K4n94R00mn05P9L44l15J5PJ21n24M92J5P2
$$ -51 -18 -243 -77 196 12 -222 278 269 20 44 -550 350 346 -159 -80 264 -51 -36 -29 92 -432 60 75 147
8104A47n9r0J75j39JJ69j50j17j1n5n7J55p3K5L09N0m16K59j07L06j47j94J09
$$ 147 88 -2 173 34 35 204 54 -63 -74 -129 -186 -31 -104 -79 230 280 -136 123 16 322 175 -19 90
8127I0L06n28J71J30K9l68J95K1o9J12M8m82L48J81m22K81J6r3j4L47m04J99J51
$$ 90 396 -132 39 169 198 -170 25 46 -23 89 137 -345 3 184 -238 43 59 -34 -48 299 -105 94 245
8150B45n9L1j21n5j49p5j27L61q5N5l2K5L8j52j84mK99o7k7K38l10J01L02k53
$$ 245 186 217 96 41 -108 -183 -310 51 -34 21 -11 14 52 -100 -284 -288 11 -56 -83 155 -155 -54 248 -5
8174el0j11K31k23L52j99j36L86l93K27K6k9k71ML9J89k8
$$ -5 -35 -146 85 -138 214 15 -121 265 -128 99 125 96 -175 -171 -132 57 29
8191B9
$$ Imaginary data points
##PAGE= N=2
##DATA TABLE= (X++(I..I)), XYDATA
0@%%%%%%%%%%%%qJ6j6J6j6J6k4L2l2L9m7N0n8O7p5Q7r9J11j26J42j58J76j98K21
$$ 0 0 0 0 0 0 0 0 0 0 0 0 0 -8 8 -8 8 -8 8 -16 16 -16 23 -24 26 -32 35 -40 47 -52 59 -67 75 -83 93 -105 116
36A16k46K73l01L33l70M10m54N03n57O18o87P65q55R59j081J230j412J640j940
$$ 116 -130 143 -158 175 -195 215 -239 264 -293 325 -362 403 -452 507 -574 656 -756 884 -1056
55a056K351k949L907n697J0150l9275q9347O4617R6800L5273n6117o5737j030
$$ -1056 1295 -1654 2253 -3444 6706 -32569 -121916 -57299 39501 74774 18657 -47080 -48110
68d8110O9172M5736k6152n7803k6870J2891M1579L3069J680k1031k5175k0749
$$ -48110 21062 66798 40646 -17157 -44027 -31136 10443 43512 45192 24161 -1014 -21763
80b1763J0300L8700J3470l9038m2372M795N3720N1591j4477p2388m2271L3068
$$ -21763 -11463 27237 40707 1669 -40703 -35908 17812 69403 54926 -17462 -59733 -26665
92b6665N3309Q590l4395l1784J5255M4492J3342l0130k2655M056O564k788o86
$$ -26665 26644 35234 839 -30945 -15690 28802 42144 12014 -10641 -6585 -21 -2809 -3495
105c495J2077K4999P851l1434l0636J6677L6446L353l5244l3587J3189N4947L0299
$$ -3495 8582 33581 41432 9998 -20638 -3961 32485 35838 594 -32993 -19804 35143 65442
118F5442l4639m9591q687K4116K0867j914k1696j1634J2898J4124K160L016l601
$$ 65442 30803 -18788 -27475 -3359 17508 15594 -6102 -17736 -4838 9286 11446 14462 10861
131A0861k4913k5255M441L3928L4587n764m8157k6509L8217N1864n017n7631m6481
$$ 10861 -14052 -39307 -34866 -938 33649 27885 -20272 -46781 -8564 43300 38283 -19348 -65829
144f5829K1878P5160L9214m2630o1097m186M5673L5465j4280m9411k2292L2419
$$ -65829 -43951 31209 70423 27793 -33304 -37490 8183 43648 29368 -20043 -42335 -9916
156i916M1546Q411j6365k3306j6785K078J5279J1601Q27j2261k1033K822L7600
$$ -9916 31630 40041 23676 370 -16415 -14337 942 12543 13370 1109 -19924 -17102 20498
169B0498K5080k4929n0188k3937L0846N5332J2247m5610l7469K1840M7441J4055
$$ 20498 45578 20649 -29539 -53476 -22630 32702 44949 -661 -38130 -16290 31151 45206
181D5206l4829m6582k589M4281L1473j1982k1222k672R348N234p485j1260M184
$$ 45206 10377 -36205 -38794 5487 36960 24978 3756 1084 10432 15666 8181 -3079 1105
194A105R835p300p810J4785K0796j717k5633k8199k20L0858J9508j8017k4521
$$ 1105 10940 3640 -4170 10615 31411 29694 4061 -24138 -24358 6500 26008 7991 -16530
207a6530L134K0873J3100r157k5025j2731J0249Q734Q5Q402J2102n387j9069j2682
$$ -16530 -13396 7477 20577 11420 -13605 -26336 -16087 -7353 -7268 1134 13236 7849 -11220 -23902
221b3902R286K7354P463l4050l1666K0778N2520K3520l0735n5156j6688M4647
$$ -23902 -14616 12738 20201 -13849 -45515 -24737 27783 51303 20568 -34588 -51276 -6629
233f629M5984j0472m5697k2500K2167M2273J7283k8887l9972r895J6121K2018
$$ -6629 39355 28883 -16814 -39314 -17147 25126 42409 13522 -26450 -36345 -20224 1794
245A794J5280m142k3563j6657P706K3984J9565j3218m5056k4984L2821N3971J4740
$$ 1794 17074 12932 -10631 -27288 -19582 4402 23967 10749 -34307 -59291 -26470 27501 42241
258D2241l6307m7367k996M7534L5253k3665m6757j2027L3175M2151P703l1911
$$ 42241 5934 -41433 -44429 3105 38358 14693 -32064 -44091 -10916 31235 38938 7027
270G027k8391O508J8216M264l506l445j175L003K264J741P637J460j9934k0485
$$ 7027 -21364 -14856 3360 7624 4118 673 -502 2501 4765 6506 14143 15603 -4331 -24816
284b4816N517K4652J5570o469k1973j0389J6985J5821j1187j9471l439R995J2608
$$ -24816 -19299 5353 20923 14454 -7519 -17908 -923 14898 3711 -15760 -19199 -9204 3404
297C404M515n072k44N420p620j7147N57J9754J3957o804k0028o140K5220K6937
$$ 3404 7919 2847 2603 8023 403 -16744 -16187 3567 17524 10720 -9308 -15448 9772 36709
311C6709j3121l9030j6855K1259L4478J1495k4602k8194O266K7572Q980j5748
$$ 36709 23588 -15442 -32297 -11038 23440 34935 10333 -17861 -11595 15977 24957 9209
323I209k2097r809J2445K1154O918o984r588j2122n236J2880J4114m647j7962
$$ 9209 -12888 -22697 -10252 10902 17820 10836 1248 -10874 -16110 -3230 10884 6237 -11725
336a1725j2588R580L1283J7589k4018l8296m557L0308K8364m845l3799j7509K6349
$$ -11725 -24313 -14733 16550 34139 10121 -28175 -32732 -2424 25940 21095 -12704 -30213 -3864
349c864L5886p57l0706k4233L902K5702J6657j1879j7385J060J0640N313j123
$$ -3864 32022 31265 559 -23674 -19772 5930 22587 10708 -6677 -5617 5023 10336 9213
362I213p439r935l327K674O215J1324N012j3346j5414L293J2926N530q466j7334
$$ 9213 1774 -8161 -11488 -8814 -2599 8725 13737 391 -15023 -11730 1196 6726 -1740 -19074
376a9074k707K1883J8850q712j8496o837Q098J0536q71j2155j906J5523R004p774
$$ -19074 -21781 102 18952 10240 -8256 -15093 -6995 3541 2670 -9485 -11391 4132 13136 5362
390E362q259J423O276K229j0954j2159R435K3214M806j6069j5421M5J4447J0520
$$ 5362 -2897 -1474 4802 7031 -3923 -16082 -6647 16567 21373 5304 -10117 -10072 4375 14895
404A4895j1593j9141L85J6459J1888R22r625j3385m362O133O243N242J245j0061
$$ 14895 3302 -15839 -15454 1005 12893 13815 4190 -9195 -13557 -7424 -1181 4061 5306 -4755
418d755j0259R775J9516N834j6154k5672q227K5666L1603k881k9444j8161J2530
$$ -4755 -15014 -5239 14277 20111 3957 -21715 -29942 -4276 27327 24446 -4998 -23159 -10629
431a0629K8626J2117k4197l1499N80K8523K1614l035k0695j7087N170J7204M675
$$ -10629 17997 30114 5917 -25582 -25002 3521 25135 22100 1405 -15682 -10512 6692 11367
444A1367q945r396o567L249J4130J0061m559j4035j3281k018J6092J4811p115
$$ 11367 2422 -6974 -13541 -10292 3838 13899 9340 -4695 -17976 -19994 -3902 10909 3794
457C794j7705l926J2717J5677J626j7907j6576O888J7126M439o302n687J434Q358
$$ 3794 -13911 -17837 -5120 10557 12183 -5724 -22300 -15412 1714 6153 -149 -5836 -4402 3956
471C956K175j0193n680P776N256m517n173K045Q919Q770o424j7033n275J1281
$$ 3956 6131 -4062 -9742 -1966 3290 -1227 -6400 -4355 4564 13334 6910 -10123 -15398 -4117
485d117J0104p16p748p429L396J1759L563p825q063m671k31R324J0551M29p173
$$ -4117 5987 5271 -2477 -9906 -6510 5249 8812 987 -7076 -11747 -11978 -2654 7897 8326 1153
500A153q216k515J0248J3859m793j9315q313J2907K1868J0065j5502k4186j213
$$ 1153 -7063 -9578 670 14529 9736 -9579 -17892 -4985 16883 26948 11446 -12740 -13953
513a3953K2253J3829p642j8885r040J3527K2146L031j7932j4801J30R160J0649
$$ -13953 8300 22129 14487 -4398 -13438 89 22235 25266 7334 -7467 -7337 1823 12472
526A2472k02j0922n337M341O123M863r08j1120j1083L186J1583Q259j090j1257
$$ 12472 12270 1348 -3989 352 6475 11338 10430 -690 -11773 -8587 2996 11255 10165 -1092
540a092q608P869J3798k017j2995q466L883J3661R869p909j2944O96R001L111
$$ -1092 -9700 -1831 11967 9950 -3045 -11511 -7628 6033 15902 7993 -4951 -4255 4746 7857
554G857m924p143k154Q719Q118m655p119R50K794k03l186m776q03P239M713m229
$$ 7857 2933 -4210 -6364 2355 10473 5818 -1301 -351 2443 2240 -946 -5722 -6525 714 5427 1198
570A198m206K52O0R97L17l219k150K403K188L145L966k713r069k599N970O402
$$ 1198 -3008 -2756 -2696 -1699 -1382 -4601 -6751 -4348 -2160 985 4951 2238 -6831 -9430 -3460 2942
586B942K364o270r071L885J5757O363j1016j4544m042J1425J6504R0j6676r565
$$ 2942 5306 -964 -10035 -6150 9607 15970 4954 -9590 -13632 -2207 14297 14387 -2289 -11854
600a1854Q803J3991N776r520j7544m252J4312J2878p40q493r672j359J0495R075
$$ -11854 -3051 10940 16716 7196 -10348 -14600 -288 12590 11850 3357 -6315 -7674 2821 11896
614A1896m439j0991o834J628J2797J2077m891j5152o847N703J2195O225r046j5053
$$ 11896 7457 -3534 -10368 -8740 4057 16134 11243 -3909 -10756 -5053 7142 13367 4321 -10732
628a0732N40J5515J0487l632j2745r510M033J2612L243p891m900P09M557M818
$$ -10732 -10192 5323 15810 12178 -567 -10077 -6044 6568 9811 1920 -2980 -2271 2286 7104
642G104j832p327k412K018n26N95L194O07j655p82k575j734K226J191k372j131
$$ 7104 5272 -2055 -4467 -2449 -2975 -2380 814 1421 -234 -1016 -3591 -5325 -3099 -1908 -4280 -5411
658e411J101k38K591L690j902m498l196j701L958Q287J886q405n680K593Q095
$$ -5411 -4310 -4548 -1957 1733 -169 -4667 -7863 -9564 -5606 2681 4567 -3838 -9518 -6925 1170
673A170O808m476j4266o208J1597J4407K502j0286j3768j555J4966J1283o725
$$ 1170 7978 3502 -10764 -16972 -5375 9032 11534 1248 -12520 -14075 891 12174 5449
686E449j4011p133O606J5233P899r889j4961l303Q381J1216M068r385j2905P41
$$ 5449 -8562 -15695 -9089 6144 14043 4154 -10807 -14110 -5729 5487 9555 170 -12735 -11994
700a1994J2754J0472n88j2506j2868L154J6273Q420n922j1812n638P439J4563
$$ -11994 760 11232 10644 -1862 -14730 -11576 4697 13117 7195 -4617 -10255 -2816 11747
713A1747K476j2543j0755J904R159R125m20j0144n764M546O293J176k693o089
$$ 11747 14223 1680 -9075 -7171 1988 11113 10693 549 -5215 -669 5624 6800 4107 -1982
727a982k661M934N107o12j817j901l428J21L625o69j239O17m60o92K261M85j683
$$ -1982 -4643 291 5398 4786 2969 1068 -2360 -2239 1386 717 -522 95 -365 -1057 1204 1689 6
744FL06n42l179k95M100K598Q82j736n782j786O379N069l072o252m138L300J0722
$$ 6 312 -230 -3409 -3704 396 2994 3876 2140 -3642 -5428 951 6020 2948 -3304 -7442 -4142 6580
761F580M565q589j1282q18P397R177J268j0793r503M741J2115N255n162j1927
$$ 6580 11145 2556 -8726 -9544 -2147 7030 8298 -2495 -11998 -7257 4858 10113 4951 -6976
775f976p809P660J3789L198q727r969k640R093J2767p19j3513r310L532J2102
$$ -6976 -14785 -7125 6664 9862 1135 -8834 -11474 -2381 10386 9667 -3846 -13156 -9624 2478
789B478J0573l170j5263p776R081J2180L292p780j3230k233J2959J1932k477j0805
$$ 2478 13051 9881 -5382 -13158 -4077 8103 11395 3615 -9615 -11848 1111 13043 10566 -239
803b39q520R78J1017P917o014r857k737M851Q031M338o292r433j025N800N252
$$ -239 -8759 -7781 3236 11153 5139 -4718 -7455 -2604 5427 9765 3473 -5960 -6985 -1185 4067
818D067J900l694o805J29O200L111j659l474l414J51M867K579j464q51n06j889
$$ 4067 5967 2273 -4532 -4403 1797 4908 3249 -225 -3639 -3488 1379 3958 2494 1643 1137 -752
834g52K74K237j5L61j00l219j664L762M337o45l495n164k220O669P044j847p491
$$ -752 -478 1759 1744 2105 2005 -1214 -2878 884 5221 4576 1081 -4083 -6303 366 7410 5563 -1928
851a928m816J279Q081O725n030j1567k995N943R993M982p267j2514j621J0148
$$ -1928 -6744 -5465 2616 9341 4311 -7256 -10251 -4308 5685 10667 3400 -9114 -10735 -587
865e87R666n46r347j1269J580J4375R327n717j2238q138N036J4355P369j0183
$$ -587 9079 8533 -814 -12083 -10503 3872 13199 7482 -4756 -12894 -7858 6497 13866 3683
879C683j3559j809R343J2390K506j2780j3027K561J2420Q842k068j1917r464N715
$$ 3683 -9876 -11685 -2342 10048 12554 -226 -13253 -10692 1728 10570 8502 -3415 -12879 -7164
893g164J3218M243o939j0447m303O644J1793J734r274o959l60N983Q332l08q940
$$ -7164 6054 10297 3358 -7089 -11392 -4748 7045 8779 -495 -7454 -7814 -1831 6501 6193 -2747
908b747n094L298N820L870m35o460m426L731M491K95k0k784k954J629L398K20
$$ -2747 -7841 -4543 1277 5147 4712 -1748 -6174 -2443 2048 2343 2323 -461 -3415 -1786 1612 1832
924A832k39q4l350j208K585K371J027k99l562l607K574N537J087k442m613l579
$$ 1832 1593 1509 -1841 -3049 -464 1907 2934 2635 -927 -4534 -1960 3577 4664 2222 -2391 -5970
940e970L639Q508J717o063o361k304N646R677P29r712p447K024R007P682j908
$$ -5970 -2331 6177 7894 1831 -4530 -6834 -1188 8489 9218 -494 -7941 -5917 3090 10772 8864
955H864j2201p405O643J1144M600n489j2061n279J0065J2075O1r777j0573o08
$$ 8864 -3337 -10742 -4099 7045 11645 6156 -5905 -11184 -1119 10956 11017 1240 -9333 -9941
969i941J1592J1668l751j3418p027M177J1351P482o224j3713m203R350J0596J945
$$ -9941 1651 13319 9568 -3850 -10877 -6700 4651 12133 5909 -7804 -12007 -2657 7939 9884
983I884q071j1370j225J0890Q694k262q816p665J748J0645O227n309q548l292
$$ 9884 1813 -9557 -10782 108 8802 6540 -2276 -9941 -8193 2452 8679 3370 -5178 -8470
997h470L683P885L768n917o938l42M385M276K016m337n684P08M757J697n8j281
$$ -8470 -4787 3098 6866 949 -5989 -6331 -1946 2330 4346 9 -5675 -4967 -210 1487 1429 148
1013A48l649m81L376J544k26j78j606k988J449K929J330K54j579m669K5N646K938
$$ 148 -3501 -3982 -606 938 712 534 -1072 -4060 -2611 318 1648 1902 323 -4346 -4321 1325 4263
1030D263j170l253m898L69P463M775l773o221l549K333Q564N136o213r564j217
$$ 4263 3093 -160 -5058 -4689 2774 7549 3776 -2445 -5994 -3661 4903 10039 3826 -5738 -6955
1045f955O386Q470K733q767j0368J593J0256O958j508j0003q452M222J2781N112
$$ -6955 -569 7901 10634 1867 -8501 -6908 3348 10306 8798 -1205 -9657 -5435 7346 12458
1059A2458o765j0257n196O685J2289K905j0130r995j13Q788R862l02j2169q457
$$ 12458 5693 -4564 -9760 -3075 9214 12119 1989 -8006 -8119 669 10531 10229 -1940 -10397
1073a0397M259J0230N922l613j0944o078O758R991J791o169q453k792P616R326
$$ -10397 -6138 4092 10014 6401 -4543 -10621 -3863 6128 7919 1750 -6703 -9495 -1879 7447
1087G447j331q016m974O94N868N892k185p431k285K844L763L209j571n603k296
$$ 7447 6116 -1900 -6874 -6180 -312 5580 3395 -4036 -6321 -3477 286 3495 1924 -3679 -5975
1102e975L290L200N26p3k770k382K112K058O7K25q84k736k29K825K029M76n28
$$ -5975 -2685 515 1041 968 -1802 -4184 -2072 -14 53 278 -606 -3342 -3571 -746 1283 1759 1231
1119A231l816k225L098M211Q86k477m237k294M785O714K0n935n197m32O012P715
$$ 1231 -2585 -4810 -1712 2499 3385 908 -3329 -5623 -838 5876 5896 -39 -5236 -5668 344 8059
1135H059j524q599m672L393P633N181l740j0344l582P348Q269K266o160r678j529
$$ 8059 6535 -2064 -6736 -3343 4290 9471 5731 -4613 -8195 -847 7422 9688 3528 -6150 -7679
1150g679R418Q354j834q608p170Q53J0718Q150n634j0502m311N198R553L976p218
$$ -7679 1739 10093 8259 -349 -7519 -6666 4052 12202 6568 -3934 -8245 -3047 6506 10482 3264
1165C264j0163q69Q272P692L9p867q451J754R133M522k802o731m917K753Q808
$$ 3264 -6899 -7768 504 8196 8235 368 -8083 -6329 2804 7326 4524 -2207 -7124 -4371 4437
1180D437K633n805o207j027L243N988J645n355m237O72K798K930O89m184l582
$$ 4437 7070 1265 -4942 -5969 -2726 3262 4907 -448 -4685 -4013 -1215 1715 2404 -1780 -5362
1195e362J840L090R87K47j463l188L32K296k6K58J015j715j617J408J490J005
$$ -5362 -3522 -432 555 802 -661 -3849 -3517 -1221 -1247 -989 26 -1689 -3306 -1898 -408 597
1211E97Q24k347m103P23M888K457m77l689m263J408O484K612l826n040j957K954
$$ 597 1421 -926 -5029 -4306 582 3039 2562 -1127 -5390 -3982 2502 5114 1288 -3752 -5709 -2755
1227b755P594K631o577o379J40M684O544O51p408o587K565Q123M831j974q980
$$ -2755 4839 7470 893 -5486 -5346 -662 5882 6533 -875 -7462 -4897 3226 8057 6083 -2897
1242b897o389N015J0069K752n385p762k922O843R435l08r290o283J754P447P342
$$ -2897 -9286 -4271 5798 8550 3165 -4597 -7519 -676 8759 8451 -839 -7122 -5368 2079 9421
1257I421k243r371m520M582O898K804m023p968k344O395O369L41m753n511j621
$$ 9421 7178 -2193 -6713 -2131 4767 7571 3548 -4420 -6764 -369 6000 6341 1588 -3923 -5544
1272e544N816N256j902n548k530J134M855L755l392n133r70K517K423J426j625
$$ -5544 272 5528 3626 -1922 -4452 -3318 1537 5292 1900 -3233 -4203 -1686 737 2163 538
1287E38l062r3K964j5q1j70j753n33J378r3P59J487P5k872j010J163J169J869
$$ 538 -2524 -2617 347 332 251 81 -1672 -2205 -827 -920 -161 1326 1401 -1471 -2481 -1318 -149 1720
1305A720o9m095j513L035L313O74k248m119k489M787M525k61l270l510p39M800
$$ 1720 1651 -2444 -3957 -922 2391 3065 817 -3302 -5791 -1004 3521 3260 -10 -3520 -4259 541
1321E41N325k563o290l091K287O316M630l528q140j708N446N827R97n212p666
$$ 541 5866 3303 -2987 -6078 -3791 2525 7155 3627 -4513 -6221 -775 5052 6049 837 -6829
1336f829P97Q732N189k612o459n058K420P676L709n272n903j233L886O944J393
$$ -6829 -6032 2700 7889 5277 -1182 -6240 -3820 3856 7565 2293 -3610 -4843 -957 5987 7380
1351G380o420o650P32N699M532n42n349n388L408O175J681l109m962k984L633
$$ 7380 960 -5690 -4958 741 5273 4731 -618 -6006 -2598 3577 5258 2149 -2813 -5797 -2164
1366b164O538O18m528k952K2K582L423j098m475p62K159J782J262j41k600j066
$$ -2164 4374 4992 464 -2488 -2466 116 3539 2441 -2034 -2796 -637 1145 2407 2266 -334 -1400
1382a400J512K29m70Q43k58j097P84N6m61J213R5j995j525J063J050J461J380
$$ -1400 112 341 -129 714 456 -641 143 199 -262 951 1046 -949 -2474 -1411 -361 1100 2480
1399B480k151l391M13K700J410L30k843l823J414O092J996k354m731l033K389
$$ 2480 329 -3062 -2649 51 1461 1791 -1052 -4875 -3461 2631 4627 2273 -2458 -5491 -3102
1414c102O912J407n432m271k87M723N822m30p594n059L307N864L759j794o772
$$ -3102 3810 5217 -215 -4486 -4773 -50 5772 5342 -2252 -7311 -4004 1860 5619 3825 -2947
1429b947l686N411O007K23m344n769j674N941O486r80n840l733L06N497M621k689
$$ -2947 -6633 -1222 4785 5008 664 -5105 -6779 -838 5648 4668 -1172 -4905 -4599 898 5519 2830
1445B830o758k124L858N291J976l120o296m98M762L059m42k912k925J011M740
$$ 2830 -3928 -6052 -2194 3097 5073 1953 -4343 -4841 -79 2980 2538 -374 -3299 -2288 2452
1460B452K013k507k732j080J41K631J414j541j292R14L37N0P02r93j334O87K44
$$ 2452 4465 1958 -774 -1854 -1713 918 2332 791 -501 413 750 800 1502 509 -825 -138 106
1477A06n17R64J207o23p73o06j158L27K543P05j900j158k47J585K884J7m294k514
$$ 106 -411 553 1760 1137 364 -242 -1400 -1073 1470 2175 275 -883 -1130 455 3339 3356 -938 -3452
1495c452J770L299K314o72m929k177M037L998k05l912l854o90N602M607k003n327
$$ -3452 -1682 1617 3931 3259 -1670 -3847 190 4188 3983 71 -3783 -4473 1129 5736 3733 -1594
1511a594k388J024M640L208l314n701m44L895M145J363m271o259O39N414L162
$$ -1594 -3982 -2958 1682 4890 1576 -4125 -4569 -674 3471 4834 563 -5696 -5057 357 3519
1526C519j435m154l393K046O570J351l884m675r75L324M804Q31m867l512K039
$$ 3519 2084 -2070 -5463 -3417 3153 4504 620 -4055 -5030 -1706 3098 3929 -938 -4450 -2411
1541b411L861J579r71m732k252L670L597L47j627k493j180K308K668j488k160
$$ -2411 1450 3029 2058 -2674 -4926 -1256 2341 2688 1061 -1432 -2612 -304 2364 876 -1284
1556a284o75K49J987K493j476k311j55R59j26P24l96j184R69J792p44j110Q28
$$ -1284 -1959 -1710 277 2770 1294 -1017 -1172 -213 -339 385 -11 -1195 -226 1566 822 -288 540
1573E40o2j79J55q67q10K778J969j594k127n47p8K414J866k999l113J155L397
$$ 540 478 299 454 -413 -1223 1555 3524 1930 -197 -744 -822 1592 3458 459 -2654 -1499 1898
1590A898K116K1l907m675K557M606J308j929l814k284L331N341l3m886l942k15
$$ 1898 4014 4035 128 -4547 -1990 2616 3924 1995 -1819 -4103 -772 4569 4536 -350 -4292 -4507
1606d507L785N232q7o047l264K103M608K792k410o709k345N052N429R77l564n269
$$ -4507 -722 4510 4423 -1624 -4888 -2785 1823 4615 2205 -4504 -6849 -1797 3632 4609 1045 -4224
1622d224j188N125M002j578m642k364P76M885L495k775n010j038J718L203J985
$$ -4224 -5412 -287 3715 2137 -2505 -4869 -4093 792 4287 1512 -3498 -4536 -2818 385 2370
1637B370k164m109L70L400J410j06j716k910j67L168R23l27n00p93j04J136L84
$$ 2370 206 -3903 -3533 -133 1277 1171 -545 -3455 -3622 -454 469 142 -358 -1151 -1255 -119 265
1654B65j250K76M22p24k4J523K70K50N55k039j864J736K130K81n03j758j553K221
$$ 265 -985 -709 -287 -1011 -1035 488 758 1008 1563 -476 -2340 -604 1526 1807 1304 -454 -2007 214
1672B14L550q28l023k587Q4K976M131j017m325j777J546K979K522k224n017j529
$$ 214 3764 2936 -87 -2674 -2590 386 4517 3500 -825 -2602 -1056 1923 4445 2221 -2796 -4325
1688d325M342M318L71k805m833j067N198L415j632m292k317J377N246K943l468
$$ -4325 17 4335 4706 1901 -2932 -3999 1199 4614 2982 -1310 -3627 -2250 2996 5939 2471
1703B471n364j026K722L805J736l845l939R92L976K243j228l666l552K150M441
$$ 2471 -2893 -3919 -1197 2608 4344 499 -3440 -2448 1528 3771 2543 -1123 -4675 -2525 1916
1718A916R51k336k212j238J406L509k99l767j531J594J507K263l24k981j456K333
$$ 1916 2867 531 -1681 -2919 -1513 1996 1697 -2070 -3601 -2007 -500 1763 1439 -1542 -2998 -665
1734f65J185k35o67j512n0K233J117j599l74k5j44L92K43j099M72J377j82l57
$$ -665 520 285 -382 -1894 -1944 289 1406 -193 -567 -592 -736 -344 -101 -1200 -728 649 467 110
1752A10L1n10k61J223qj704lJ912R04O2r25k311k18K887J190j589j571n67J070
$$ 110 141 -369 -630 593 585 -1119 -1122 790 1694 1756 831 -1480 -1698 1189 2379 790 -781 -1348 -278
1771b78L109J199l635l241R52K435K709L76m041k995K788M102R39k041m349k291
$$ -278 2831 4030 395 -2846 -1894 541 3250 3626 -415 -3410 -622 3480 4419 2378 -1971 -4262
1787d262L763N129Nm032l141n52M279L812j819n188k461K550M218L091k439n559
$$ -4262 -499 4630 4635 603 -2538 -3090 1189 5001 3182 -2006 -4467 -1917 2301 5392 2953 -2606
1803b606k127M198L411M20l081m315K17M888L197j478l425l102L92M203K576k555
$$ -2606 -4733 -535 2876 3296 215 -4100 -3883 1005 4202 2724 -701 -3803 -3411 792 3368 813
1819H13l192r2J626K369J362k842k861q2K280J380Q54r97k228J08J694J67m84
$$ 813 -2379 -2471 -845 1524 2886 44 -2817 -2899 -619 761 1615 618 -1610 -1502 192 359 -125
1836a25J2j168n26J395M49L00M05k91k383l17J310P39J217j92k163j223K229K306
$$ -125 -113 -1281 -1807 -412 37 337 742 451 -1932 -2249 -939 -200 1017 825 -1338 -2561 -332 1974
1854A974k02j731k766j088L532L893q35l342k061J81L646L289k064m856j641K322
$$ 1974 1772 41 -2725 -3813 -281 3612 2777 -565 -2626 -2445 1201 4490 2426 -2430 -4071 -1749
1870a749M382K533k994n469p05L557L790M77l613m324P03N472L200k365m264k810
$$ -1749 2633 5166 2172 -3297 -4002 -445 3345 3822 209 -4115 -3412 2060 5260 2895 -1369 -4179
1886d179J014N379K019k822l924j21K132L643Q10m011l821J138L513K291j78l052
$$ -4179 -3165 2214 4233 1411 -2513 -2634 -502 3141 3951 -60 -3881 -2743 770 3061 2883 -169
1902a69k982J838L382k3j688j953r90J934L249o06k374o15J98N81J536o58k011
$$ -169 -3151 -1313 2069 2046 358 -1595 -2585 -651 2598 1992 -382 -997 -799 -218 1318 660 -1351
1919a351J06J467L68Q3J1j061o46Q89M7o40Q66LJ11k8j86j173P18J118p24j115
$$ -1351 -1245 222 590 673 684 -377 -1023 -134 -87 -727 139 142 253 225 39 -1134 -416 702 -22 -1137
1939a137J46P10R00J561j398k148m47J802P26M16j397k129J342L155N86j903k740
$$ -1137 -991 -281 619 2180 782 -1366 -1813 -11 715 1131 -266 -2395 -1053 2102 2688 785 -1955
1956a955j230J937L960k71l187j908J075K399J942q32m466j618K828L382O53j542
$$ -1955 -3185 -1248 2712 2441 -746 -2654 -1579 820 2762 1930 -2536 -4154 -1326 2056 2709 1167
1972A167l479j268L167L384o31l022k673n6M676L494k040m877j416J710L957J821
$$ 1167 -2312 -3580 -413 2971 2340 -682 -3355 -3411 1265 4759 2719 -2158 -3574 -1864 2093 3914
1988C914k889m681K02M298K323L56l446l688P06L849K241j567k391j667J038L612
$$ 3914 1025 -3656 -3454 844 3167 3523 77 -3611 -2905 944 3185 1618 -773 -2440 -1402 2210
2004B210R36k469k259n75J033K511J374j910k215L87J031P38P36j656j548J120
$$ 2210 3146 677 -1582 -2157 -1124 1387 2761 851 -1364 -977 54 792 1528 -128 -1676 -556
2020e56R92L36O03l74j095m86K57k35Q29J209k73k192q5J179J202Q45j407l099
$$ -556 436 772 1375 1001 -94 -580 -323 -558 271 1480 1207 -985 -1070 109 1311 2156 749 -2350
2038b350l51K854K460k51k199k783k41L983K071k051k895j689J019M083K548k522
$$ -2350 -2701 153 2613 2362 163 -2620 -2861 1122 3193 1142 -1753 -3442 -2423 1660 4208 1686
2054A686m414j023K035L263J785l277m133N43L502L234K96l842m588R97N301K279
$$ 1686 -2728 -3751 -1716 1547 3332 55 -4078 -3535 -33 3201 3497 -345 -4933 -3936 1365 3644
2070C644k113l615j879J950M899N98m205k751K98K787K716N60l484k006R44K110
$$ 3644 1531 -2084 -3963 -2013 2886 3484 -721 -3472 -3174 -387 2329 2889 -595 -2601 -1657 453
2086D53J137k82k432j872K035K335L13n72j796j636J851K173jj753o63J0J497
$$ 453 1590 1308 -1124 -2996 -961 1374 1687 1115 -681 -2317 -466 1707 1706 -47 -710 -700 797
2103G97J101p65k041M33Q27K09j51j90M7N00P09j488q32J477N50j60j004q92J07
$$ 797 1898 1133 -908 -475 352 561 410 220 267 767 1476 -12 -844 633 1183 1023 19 -873 -766
2122g66K217J109k001j566K77O32J346K88j335j833J230J341M22J13j822j929
$$ -766 1451 2560 559 -1007 -730 -98 1248 1536 201 -1632 -402 939 1361 1474 -348 -2277
2138b277J371K329N30r32j652j884J795L141J7l175k324Q44K711L061j344m455
$$ -2277 -906 1423 1953 1021 -631 -2515 -720 2421 2438 -737 -3061 -2217 494 3555 2211 -2244
2154b244j342K848K915J75k632l352K36M349K089j297l073j855P56L452J214k129
$$ -2244 -3586 -738 2177 2352 -280 -3632 -3396 953 3042 1745 -1328 -3183 -2427 1025 2239 110
2170A10k221k18J088K448J623k616l119L4K273K283O87k563k964R84L837R65j494
$$ 110 -2111 -2329 -1241 1207 2830 214 -2905 -2871 -598 1685 2372 -191 -3155 -2171 1666 2631 1137
2187A137k996j348J927L625L12k866j107K81J064J680o82j836J37J053K05l6O86
$$ 1137 -1859 -3207 -1280 2345 2657 -209 -1316 -1035 29 1709 1027 -809 -672 381 586 550 1236
2204A236l22q33R0p18K66J675L65j753m43J12R40Q11n0j543j000Q06O45P87R27
$$ 1236 914 81 171 -547 -281 1394 1759 6 -437 -325 615 1426 1376 -167 -1167 -361 284 1071 1998
2223A998q67k089j55J295J295M77j169l327L06L632K297j617l457k494J750M671
$$ 1998 1131 -958 -1113 182 1477 1954 785 -2542 -2236 1396 3693 2076 -1381 -3875 -2125 2546
2239B546J695m157l332K74K862L661n02m180k494J341L222J263o06k850j929J512
$$ 2546 4241 84 -3248 -2974 -112 3549 3047 -1133 -3627 -2286 936 2199 1593 -1257 -3186 -1674
2255a674K906R36j351k644k077J887M005J187k914k577j009K518L498l05m030
$$ -1674 1232 2168 817 -1827 -3904 -2017 1988 3175 261 -2316 -3325 -807 2691 2386 -1644
2270a644k009J720K841J515j516l156l83K240J113k29j470j51L51J164L72j473
$$ -1644 -3653 -1933 908 2423 907 -2249 -2632 -392 721 492 -978 -1129 -778 386 758 -715
2286g15L80M75r26o1M90J023M0J45j275j68R52Q07j282p6K08m1M22K79k0k55N67
$$ -715 -335 140 -786 -847 -357 666 706 851 -424 -592 360 1167 -115 -191 17 -24 398 677 657 402 969
2307I69j380p49J672J436j07k065p91O66K231J093k917k575J375K222J857j036
$$ 969 -411 -1160 512 1948 1841 -224 -1015 -349 1882 2975 58 -2517 -1142 1080 2937 1901
2323A901l382j256K580K905j152j970j764N73K315J989j689j820l95L74J440J085
$$ 1901 -1481 -2737 -157 2748 1596 -374 -2138 -1565 750 2739 1050 -770 -1165 -791 649 1734
2339A734q07k034o17J186J642J424j618k898r53K807K459n46k557k647J455M031
$$ 1734 927 -1107 -1724 -538 1104 2528 910 -1988 -2941 -134 2325 1779 -778 -3425 -1970 2061
2355B061J182l015l514K44K623K894p13l272j130K210J850k83j080j553k08J328
$$ 2061 3243 228 -3286 -3042 -419 2475 1762 -1510 -2640 -430 1420 1137 57 -1496 -1704 -376
2371c76P74p1K5n46j036N9J348P57q20p81j201R19K460M4k047j201Q70R44J045
$$ -376 398 327 352 -194 -1230 -1171 177 934 114 -667 -1868 -949 1511 1555 -492 -1693 -823 121 1166
2390A166j052j151N02J607m79j298O22M93N75m66j724m03K153K125j741k270m51
$$ 1166 114 -1037 -535 1072 593 -705 -83 410 985 519 -1205 -1608 545 2670 929 -1341 -1792
2407a792J248K519J17k655k230J881K781M74j203k183j004J620J869J56j112j051
$$ -1792 -544 1975 2092 -563 -2793 -912 1869 2343 1140 -1043 -2047 -427 1442 1598 486 -565
2423e65j072Q46K432R09j634k374j201J157M109J003l376l642J000L473K377r57
$$ -565 -1637 -791 1641 2550 916 -1458 -2659 -1502 2607 3610 234 -3408 -2408 1065 3442 2485
2439B485m777j985L884L434k48k475k878K21L054J827j904j723j08L84J284R99
$$ 2485 -2292 -4277 -393 3041 2793 318 -2560 -2339 715 2542 638 -1085 -1193 -809 475 1474
2455A474n21j249o73j19K36J956M60k269p49L69J693R54o17k460m62K340J138
$$ 1474 953 -296 -969 -1088 -852 1104 1564 -705 -1454 -1085 608 1562 945 -1515 -1977 363 1501
2472A501j282j165J61R40Q21k14k193M75J886K20j951l04P38J464N24j962k125
$$ 1501 219 -946 -785 155 976 762 -1431 -956 930 1150 -801 -1105 -367 1097 1621 -341 -2466
2489b466J265K396M82j606j430j43K026J503j337j743l07R33L24J032j00j303
$$ -2466 -1201 1195 1677 71 -1359 -1502 524 2027 690 -1053 -1360 -427 -103 929 829 -474
2505d74k35j54N95J319N34k187j418O73K613J320j148l189j450L196L020q13l793
$$ -474 -709 -863 -268 1051 1585 -602 -2020 -1347 1266 2586 1438 -1751 -3201 -5 3015 2202 -1591
2522a591j339J323L515J613l163k828Q25K458J498q61k040j174J685J624l94o92
$$ -1591 -2930 -1607 1908 3521 358 -2470 -1645 813 2311 1450 -590 -1764 -79 1545 1151 459
2538D59n44p85mJ852J46l10q38j155K57K164J130j913k389L42J822K072n08l014
$$ 459 -85 -870 -874 978 1124 814 -24 -1179 -922 1242 2372 459 -1930 -1588 234 2306 1798 -1216
2556a216j272K475K036j142j179j267P72K203N2j939r04J754K20j41q83o11R02
$$ -1216 -2488 -13 2023 881 -298 -1565 -793 1410 1462 -477 -1381 373 593 452 -431 -1042 -140
2573a40J175n94j784O52J282K04o80n33p57J130J111q21q47M69k82J22O06k48
$$ -140 1035 441 -1343 -691 591 795 115 -418 -1175 -45 1066 245 -602 -133 -415 -293 313 65
2591F5j55L04q62p44J593J830j314k309j001J539K856N18k907k833J585L609J024
$$ 65 -90 214 -648 -1392 201 2031 717 -1592 -2593 -1054 1802 2320 -587 -3420 -1835 1774 2798
2608B798k060l045j196L592K703j146k985q52Q05K095J175r10k406l27J394N10
$$ 2798 738 -2307 -3503 89 2792 1646 -1339 -2191 -1386 709 1884 974 -1432 -1759 -365 145
2624A45J195M2j980j465J159J592J276n38k690j251K114L016j26k734j925M14
$$ 145 1340 1382 -598 -2063 -904 688 1964 1426 -1264 -2515 -401 2615 2489 -245 -2170 -1756
2640a756L199J696k624k368Q21J824Q89o28j495n41J461O63j433k56J121O7k05
$$ -1756 1443 3139 515 -1853 -1032 792 1681 1053 -442 -983 478 1141 -292 -548 573 640 435
2657D35p00k47O59J374r71j535J72J277N88m83o21o96O62N36n88m40J123j20r98
$$ 435 -265 -512 147 1521 550 -985 -813 464 1052 569 -52 -748 -86 450 -138 -578 545 425 -573
2676e73k49L48J268M10j406k428R80K954Q04j825k517l87K649K920j412l757p52
$$ -573 -822 -474 794 1204 -202 -2630 -1650 1304 2108 283 -2234 -2621 28 2948 1536 -2221 -2973
2693b973K038K569O25k679j985Q72K241N64j062r11p10L18J190Q38n35m33j166
$$ -2973 -935 1634 2259 -420 -2405 -1533 708 1272 210 -701 -1411 -1093 97 935 400 -33 -1199
2710a199n61J556K319j065k201p44Q37K375J385k615k886J086K544J271q66k707
$$ -1199 -1760 -204 2115 1050 -1151 -1895 -1058 1317 2702 87 -2799 -1713 831 2102 1236 -1471
2726a471r82K496K576j387k113l20Q24J271M29j295r21R15P70n83P1L36l10Oj98
$$ -1471 -2453 43 2619 1232 -881 -1201 -377 894 1323 28 -893 22 792 209 280 616 306 312 114
2745A14k74P58Q91j259r24K21J222j89R7r54k99J185O96j411o74R29Q76m44q86
$$ 114 -160 598 1489 230 -694 -473 749 560 657 -297 -596 589 1285 -126 -800 129 1005 561 -325
2764c25n70P35J966q11k213r38K213J358N2j991j578J098K537L47k327j242M04
$$ -325 -895 -160 1806 995 -1218 -2156 57 1415 1467 -524 -2102 -1004 1533 1880 -447 -1689 -1285
2781a285J315J301o18k181kJ089Q35K86k14j338o96N79J102R82j69j415j805J036
$$ -1285 30 1331 713 -1468 -1470 -381 454 740 526 -812 -1508 -929 173 1155 986 -429 -2234 -1198
2799a198K676N06j562k342j95K317K653j444l127p07J437K290R86k428k077L63
$$ -1198 1478 1984 422 -1920 -2115 202 2855 1411 -1716 -2423 -986 1304 2290 -138 -2215 -1852
2815a852K280J201j003r91r54O09J083M40o49m0l20o65J101Q59j46j256l56k92
$$ -1852 428 1629 626 -365 -1319 -710 373 813 164 124 -196 -861 240 1099 953 -303 -659 -951
2833i51J314J312r13j563k56J319P49l36r09n41R48J081j234o00Q33L08L60p90
$$ -951 363 1675 762 -801 -1057 262 1011 675 -234 -775 173 1254 20 -580 253 561 921 131
2851A31j083K30J932K73j827q59Q77J264J012r57k295j09J691J432r08r53j273
$$ 131 -952 -722 1210 1483 -344 -1203 -326 938 1950 993 -1302 -1411 280 1712 804 -149 -1422
2868a422M01J496N26o88n38l09l09J055J311m47j519j134L00J628J837j261k565
$$ -1422 -1021 475 1001 313 -225 -534 -843 212 1523 1076 -443 -1577 -1277 351 2188 927 -1638
2885a638o96J977K179q6k315k018P37L384N61k067j675n33J495K301l09k172r25
$$ -1638 -2334 -357 1822 1736 -579 -2597 -1860 1524 2085 18 -1657 -2190 -695 1606 1297 -875 -1800
2902a800J246O93K98N13j538o27R28L34M87K39q86j226M06J549j34j72q86p35
$$ -1800 -554 139 437 950 -588 -1215 -287 47 534 773 -113 -1339 -933 616 482 310 -576 -1311
2920a311J199J409l46j535m84Q35N29P76j199j014R55R14o04m49K5N37M34q9p57
$$ -1311 -112 1297 951 -584 -1068 -233 296 1072 -127 -1141 -186 728 124 -325 -300 237 671 582 -175
2939a75j155J368J208q70o84m09J97J286J82j255n40Q50K23K29j6r54j45N64K59
$$ -175 -1330 38 1246 376 -308 -717 -520 766 948 -307 -847 3 226 455 439 -515 -660 -96 163
2958A63L16J10l28j214OJ538O25m90r30j341P19K394K90k181j487M51J599J903
$$ 163 479 589 261 -953 -947 591 1216 726 -204 -1545 -826 1568 1858 -323 -1810 -1359 240 2143
2976B143j084k478m48J768J488M6j529j441q8K051J206j042j283l98j94J719J048
$$ 2143 1059 -1419 -1867 -99 1389 1435 -94 -1535 -1623 428 1634 592 -691 -1089 -1283 436 1484
2993A484j013r26o49R0J300J415q92k117m01J446J119K79j158j753M15K103O12
$$ 1484 471 -455 -1104 -1014 286 1701 809 -1308 -1709 -263 856 1135 -23 -1776 -1361 742 1354
3010A354j217j059k60Q16J644o93r49l65P03j2L2Qm57J93O51q06l3R35K6k07l77
$$ 1354 137 -922 -1182 -366 1278 585 -364 -729 -26 -38 -6 2 -455 -262 389 -417 -450 485 511 304 -73
3031g3j87j28P30K40o42n16J90J16J48O14j03o01r1j14N41O41P5j256p55R15J198
$$ -73 -260 -388 342 582 -60 -576 -386 -270 -122 492 389 -212 -303 -417 124 765 840 -416 -1171 -256 942
3052I42N66o58k210k64J959J456p62j652j380J129K073N97j590j558K36J064J353
$$ 942 1508 850 -1360 -1624 335 1791 1029 -623 -2003 -874 1199 1796 206 -1352 -1116 -52 1301
3069A301J29j468j271N46J108O35Q5q47j715M56J810J29j62j022j332Q50K171
$$ 1301 1430 -38 -1309 -763 345 980 1065 218 -1497 -1041 769 898 736 -286 -1618 -768 1403
3086A403L2j298j131jJ165J371lk207o24R74J326J9o81j143P8J427J47q52J9N3
$$ 1403 1435 137 -994 -995 170 1541 1538 -669 -1293 -319 1007 1026 345 -798 -720 707 854 2 21 74
3106G4m92M78K73n18k12J66r7q5P18p8n98N37k21j67J44M71n24M2N86p91m74Q75
$$ 74 -418 60 333 -185 -397 -231 -328 -413 305 227 -371 166 -55 -222 -78 393 -131 -89 497 -294 -768 107
3128A07o7k57L62p42k66J146L22p36o21Q3K46J395L74j652j347J229J416K02n54
$$ 107 40 -217 145 -597 -863 283 605 -131 -752 -669 -423 972 1346 -306 -1653 -424 992 1194 640
3147F40j579p01J328J809n81j072n58n35J332J314p58j285l00K82R71J179l39
$$ 640 -939 -1640 -312 1497 916 -156 -714 -1249 83 1397 639 -646 -946 -664 307 1486 1147
3164A147k120j47R67J034M91r19j665k84K107J048o34j236r38K37J932Q44j876
$$ 1147 -973 -1120 -153 881 1372 453 -1212 -1496 611 1659 1025 -211 -1149 -912 1020 1864 -12
3181a2j084M20M35J017M24j133p78M78L05O49R7r36p12N75O05M2J5n34m66P8J062
$$ -12 -1096 -676 -241 776 1200 67 -711 -233 72 721 818 -118 -830 -255 350 392 407 -127 -593 -515 547
3202E47k8m59k0j84j57O30J87r57J13O16m21m7K44l51K69M92m50p87Q06M90k93
$$ 547 519 60 40 -144 -301 329 516 -441 -328 288 -133 -180 64 -287 -18 474 24 -763 43 533 240
3223B40l42o24q3J278Q37q00j347J4M27P78P17j161j175j66J406N16L16j018j345
$$ 240 -102 -726 -809 469 1306 506 -841 -827 -400 378 1095 -66 -1241 -1407 -1 515 831 -187 -1532
3242a532N54J558M70n54r56p92J49J563P89j071j304k2Q23J812M3j670j133L82
$$ -1532 -978 580 1050 496 -460 -1252 -1103 460 1249 178 -1126 -1148 -325 1487 1530 -140 -1273 -891
3260h91J433Q42n35j365r48R40J680n34p27l01n00R48J091o5j155l15j85P60O22
$$ -891 542 1384 849 -516 -1464 -524 1156 622 -105 -406 -906 42 1133 1068 -87 -402 -587 173 795
3279G95pj202q1K32Q24K3j37p78k93J278k67k31N5o75L57Q45m4p14m32O60j06
$$ 795 788 -414 -495 -263 561 584 447 -331 -624 654 387 156 211 -464 -107 738 694 -20 -452 208 102
3300A02k31M34m36j38J041l39j019L80n8L46N85p65p40M20Q17j8k25l15n36j7
$$ 102 -129 305 -131 -269 772 433 -586 -206 -264 82 667 -98 -838 -418 399 381 156 -159 -695 -712
3320g12J155K45r68l50Q5J77R91J97j262o44O06O63M88l5j475o27J338O32R0m84
$$ -712 443 688 -280 -630 -545 -368 623 820 -442 -1086 -480 183 671 636 -839 -1466 -128 504 594 110
3340A10j174l90J678J204q32j232k73M4J292Q07q13j295l0R33O24N99r70j360
$$ 110 -1064 -1454 224 1428 596 -636 -909 -865 427 1234 421 -874 -904 29 653 1252 282 -1078
3358a078L77J186K19o7q83o70N39J322qj085o60M0O15J096J74j300m35M05N11
$$ -1078 -701 485 704 637 -246 -916 -377 945 937 -148 -808 -768 -153 943 1117 -183 -618 -213 298
3377B98N61l29p89o43P80J027m07o2p59j7K00O16k91m09K53K35n09N19k03l57
$$ 298 859 530 -259 -902 -122 905 498 436 -323 -340 -140 476 185 -224 29 264 -245 274 71 -286
3397b86O87J35p83j14L76R1J84Kp96j77Q89L88o10Q6m84m91J309K71n50q11l3
$$ -286 401 536 -247 -361 15 106 290 292 -504 -681 208 596 -14 72 -412 -903 406 677 127 -684 -717
3418g17J14R64P70j214r98M07O67Q76L5j140j363N42J824L28m47j275l69J60J807
$$ -717 -603 361 1131 -83 -1081 -674 -7 869 904 -236 -1599 -1057 767 1095 648 -627 -996 -836 971
3437I71J28r62q28l96O11J658j5j767l31M38Q58O17m78j094l21P34R88j09l92
$$ 971 1099 137 -691 -1087 -476 1182 1167 -600 -931 -493 365 982 504 -590 -911 -177 811 702 310
3456C10r41m61R11J161n24n17l90N6N68N66n43q43J68L35K22M57m87k88l19R84
$$ 310 -631 -1092 -181 980 456 -61 -451 -395 173 739 196 -647 -479 -144 78 535 48 -240 -559 425
3476D25mo08K65j31q4N15k08l21L55M21o71J42k52j82O02M38p14m77L08l17P47
$$ 425 421 -187 78 -53 -137 378 170 -151 204 625 -46 96 -156 -338 264 702 -12 -489 -181 -498 249
3497B49M57p80m51J73O62J18k7j12j351Q17Q76j29k56r65o5O30J116k32j342n7
$$ 249 706 -74 -525 -352 310 428 401 289 -1062 -245 631 502 246 -719 -784 -154 962 730 -612 -669
3517f69N28M56M46k37j355k99J314N00l5m34j218o2J449Q53j017n93m77J41J380
$$ -669 -141 315 761 524 -831 -1130 184 684 649 215 -1003 -1065 384 1237 220 -373 -850 -709 671
3536F71L78j066j135L89Q62N08N6r06j184J079P36L94p41p05L3M02R72Lr97l17
$$ 671 1049 -17 -1152 -763 99 607 663 -243 -1427 -348 388 782 41 -664 -631 -229 743 746 -251 -568
3556e68K13M59O78l74j093K03M08Q4O84k43o52l15N74J04j32J15k97l15O87M76
$$ -568 -355 104 782 408 -685 -482 -74 10 694 451 -201 -516 58 162 30 145 -152 -467 220 696
3576F96q18K8L35l63j27O9l02P16J98l43p30L55M76j51K86m37m78L04Q13R7j22
$$ 696 -122 -94 241 -122 -249 -180 -482 234 432 89 -641 -286 190 39 325 -112 -590 -286 527 624 502
3597E02m35j009N21Q76L54j006j45l54K98J394j9j129p97M26O03O39J99j267n06
$$ 502 67 -942 -421 455 809 -197 -342 -696 -398 996 977 -152 -949 -523 80 719 918 -349 -855
3616h55M90J257lL0j433r53J102J073M29j386m19m09Q28J254m50r57n69O66O88
$$ -855 -365 892 889 919 -514 -1467 -365 708 1137 -249 -668 -1077 -249 1005 555 -402 -971 -305 383
3635C83M70j96j376j30P19L69l1J64r11l09J189M73l83m94k08j95L36O27l79n51
$$ 383 853 657 -719 -849 -130 239 208 372 -539 -848 341 814 431 -63 -271 -466 -130 497 118 -433
3655d33L19N0jL13l93j52M40K19q79M41K16l39K01K27o27K48L63l8l32K76k81
$$ -433 -114 -64 -65 248 -145 -297 143 362 -517 -76 140 -199 2 229 -398 -150 213 175 -157 119 -162
3676a62j41O55N3n30j89M9J11K80L89m37p61P06kK51K15p76o43R88O63j68n93
$$ -162 -303 352 405 -125 -314 -265 -154 126 515 78 -683 23 21 272 487 -289 -932 56 719 551 -42
3697d2m95j44M99R80j80j250j45L45Q74O99p95j179J0Q59O62l13k00q98L98R75
$$ -42 -537 -681 -182 798 618 -632 -777 -432 442 1141 346 -833 -823 36 698 385 185 -713 -315 660
3717F60L12q46o07j84L76J103K42j032o93O64j16P36J3q35o91P17N01j85J36o65
$$ 660 972 126 -481 -665 -289 814 1056 24 -669 -5 -121 615 628 -207 -898 -181 320 135 271 -394
3737c94k59P70M85l82m32oQ9K78K90o27Jj51K88k06L12J50o38p3R92l84j76J94
$$ -394 -653 117 602 220 -212 -218 -129 149 439 -188 -187 -338 -50 -256 56 206 -432 -505 487 103 -73 121
3759A21p47K95M76l01l11L63J32k76J40M94o80K74J02l53m6r2J08M48K87m59q19
$$ 121 -626 -331 145 -156 -467 -104 28 -248 -108 386 -294 -20 82 -271 -317 -409 -301 147 434 -25 -844
3780h44O08N04k5K1n91m90L95R55K58p36n93j55M84P70K35j097l75M55L48P49
$$ -844 -236 268 243 264 -327 -817 -422 533 791 55 -538 -693 -209 561 796 -301 -676 -221 127 876
3800H76k01j251o31J143Q98J33l31j168k67J007N38j50o02n50l77R63J196p70
$$ 876 675 -576 -1207 -64 834 967 636 -532 -799 208 746 596 -6 -556 -933 30 1226 456
3818D56q80j51K32L01P08m01q53l29Q28N65j98r1n67k01J062m04k88M30k00m61
$$ 456 -424 -575 -343 -42 666 265 -588 -917 -89 476 278 187 -380 -581 481 77 -211 219 19 -442
3838d42O02L23m40r6J36j63pl6j76L89M50l79o73M33R8K36j7l20o45M41M58p3
$$ -442 160 483 43 -53 83 -80 -87 -123 -299 90 540 161 -512 -79 19 255 238 -82 -727 -286 172 99
3860I9n2m37Lk19J154k04n39l18J98L7Q30j34q86m85O52O60L33n84p85j1Q47P03
$$ 99 47 -390 -387 -606 548 344 -195 -513 -315 -278 552 418 -468 -953 -301 359 692 108 -677 -688 159 862
3882H62l71k64p50P3P83O90p22o32l48O05P39K16o65p81J04P74J20K47n12r77
$$ 862 491 227 -523 -450 333 1023 301 -331 -679 -74 665 881 216 -565 -461 313 433 680 168 -809
3902h09K77R18J69n44J16p90L41J076k94m23o52N78L13M10l97m81j68L37L35N7
$$ -809 -532 386 555 11 127 -663 -322 754 460 37 -615 -37 276 686 289 -192 -360 -23 312 369
3922C69m30n70N34M60J17l51k16kOL40J41m73k67L32J50k4rl29J71p5L52j72o3
$$ 369 -61 -631 -97 363 480 129 -87 -89 -83 257 398 -75 -342 -10 140 116 107 -222 -51 -126 226 54 -9
3945iL5k3K22j50n7k78L36K98j88ql45R3N06M5o56j38J21q5O38rk79o38L27N58
$$ -9 26 3 225 75 18 -260 76 374 186 178 -167 -74 432 477 -179 -317 -196 -281 357 348 69 -569 -242 316
3969C16K04j64n03q33R31O63j45n32n58r0P81N80m0j030l38M96L50P98o34r60
$$ 316 520 356 -147 -980 -49 614 469 -63 -621 -711 70 650 610 -420 -758 -262 88 886 252 -708
3989g08j83P35N14J74k90r97nJ034L62j15p14l97P9O07P10m56o24j53J57N17L87
$$ -708 -891 -156 358 532 242 -755 -760 274 636 521 -193 -590 -511 96 806 350 -274 -427 -270 247 634
4010F34k20j150L26L96K53L57p15m60O42M30k75k81K52p09L48K45mk91M36l54
$$ 634 414 -736 -410 -14 239 596 -119 -579 63 493 218 -63 189 -520 -172 73 69 -222 214 -140
4030a40k17M34n6k14K61J99k70m11L85J08m25N69n85RM61M77j2l57m55r4K12Q24
$$ -140 -357 77 21 -193 68 267 -3 -414 -29 79 -346 223 -362 -353 108 585 573 216 -239 -333 -121 703
4052G03j84r98oJ53K17J009m78j033p5N41M09K65n20q70J02R30M82l38o62l40
$$ 703 519 -479 -485 -332 -115 894 416 -617 -692 -151 258 523 3 -867 -765 165 647 309 -353 -693
4072f93K18Q72K71o98l19j22J68N41N66r49m76K69M63L57l63M6o93J15Q32k2m11
$$ -693 -475 397 668 -30 -349 -471 -303 238 804 -145 -621 -352 111 468 105 151 -542 -427 405 383 -28
4093b8k4o73O29M17J07p93J03n8J26M30J22p76o4P06R6k24n1n37K71M77k44M0
$$ -28 -52 -725 -96 321 428 -365 -262 -320 -194 236 358 -418 -482 224 320 96 45 -492 -221 256 12 52
4115E2N2q6o0K83L6m93J54L78k18m2J82j72k48L90o0k00j34j8M34j06K62n43j00
$$ 52 104 18 -42 241 277 -216 -62 316 98 56 238 66 -182 208 148 -52 -186 -204 230 124 386 -157 -257
4138b57P41l14L4j17n48L32N69j47o06J60p9K23N63j91m69r16J055K63Q2j53l74
$$ -257 484 170 204 87 -461 -129 440 293 -313 -153 -232 -9 554 363 -106 -1022 33 296 378 225 -149
4159a49k50M15L66j84j13l46l81P12J289q22j113K86l08Q51N43p67q75L13P50
$$ -149 -399 16 382 198 85 -261 -642 70 1359 537 -576 -290 -598 253 796 29 -846 -533 217
4178B17M07O5m60j052K36N84L42k59l34k57mQ89J58o58p9j90N6O25K62m52n34
$$ 217 624 689 229 -823 -587 -3 339 80 -254 -511 -515 374 532 -126 -205 -395 -339 286 548 96 -438
4199d38L25L53k3J91m34m15K67L50K43m60j8l04L85N1m74M27M13l64k60K18r5
$$ -438 -113 240 217 408 -26 -441 -174 176 419 -41 -59 -363 22 73 -401 26 439 75 -185 33 -62
4220f2j42L85n9p09J27J31L41l4J82l77l58N88K91k52n9m44j99P90M45l53r67
$$ -62 -204 181 122 -587 -460 -329 12 -22 160 -217 -575 13 304 52 -7 -451 -650 140 585 232 -735
4241g35N25p9P71J73n61p59M6N69M17K44n22n81L64N60O7j83l70m92K5J193q2
$$ -735 -210 -289 482 655 94 -665 -619 -50 367 611 89 -492 -128 432 499 316 -54 -546 -521 672 590
4262E90l32q84N5L66O03J75o70k37J43N25k06J41m94m56N85M48R1o26j49l56Q10
$$ 590 258 -626 -571 -205 398 573 -97 -334 -191 334 128 269 -225 -681 -96 352 443 -183 -332 -688 122
4283A22L16l23m85L58Q5j2J31j94k30J85K06J01O1k99L6M8M5J22m39K52k56L50
$$ 122 438 115 -370 -12 73 61 192 -2 -232 -47 159 260 321 22 58 106 151 273 -166 86 -170 180
4305A80M0k01k96Q6L94k52N8M8m06N96J86m87M2J9j42j6M83k06k16j10P26k82
$$ 180 220 19 -277 -191 203 -49 9 57 -349 247 433 -54 -12 7 -135 -151 332 126 -90 -200 526 244
4327B44J43j21p95L27J052m16o82p5L58M2O23k99q61j07J79P07L20l61o95l27
$$ 244 387 266 -529 -202 850 434 -248 -323 35 77 700 401 -460 -567 -388 319 639 278 -417 -744
4347g44J014J99j67m84j71j09Q89Q7o37j65L0Q0M63N20q34m21J95N47M4K0l87
$$ -744 270 469 302 -182 -353 -462 427 514 -123 -288 -258 -178 285 805 -29 -450 -255 292 336 356 -31
4368c1n53K20P42o0m03j49n50K29J107j09n33k48k4P9Q13m1j050K65N2J70J49
$$ -31 -584 -364 378 318 -85 -234 -784 -555 552 443 -90 -338 -362 -283 530 489 -561 -296 -244 -74 75
4389G5J23j02m44L62Lq8J12l77K45k2K29k54J38O5k64j75K20L9K56N59l99m84
$$ 75 198 96 -348 14 17 -71 41 -336 -91 -113 116 -138 0 65 -199 -374 -154 -115 141 700 301 -183
4411a83k35M43p2L63n6p20M4O50o2J84m49m77j68Q46M81m20n39R5O3N89K52o22
$$ -183 -418 25 -47 316 260 -460 -416 234 172 356 -93 -570 -738 108 589 169 -370 -275 -212 377 629 7
4433Gm46l6K46K33P34p42p19O74L60L81n67n88j53N37R13j28p40l62j50N41N30
$$ 7 -439 -475 -229 4 738 -4 -723 -49 311 692 125 -463 -616 -79 834 706 -34 -396 -546 -5 525
4454E25m11n90J01J77l51O09M9k09l72L17M89l16q0k38k48Q89j41m56l9K86j48
$$ 525 114 -476 -375 -198 -549 60 109 -100 -472 -155 334 18 -62 -300 -548 341 200 -256 -295 -9 -157
4475a57J54J36l66r5M24K1Q9k97j63k9J98J69k58l40N98M8JM6j86m80N73N6l94
$$ -157 -3 133 -233 -328 96 117 206 -91 -254 -283 -85 84 -174 -514 84 132 133 179 -7 -487 86 142 -252
4498b52L97l06Q9K58M4k32n27O53l89L9N93l79m04K41l9Q0K13j28p41O27O90l43
$$ -252 145 -161 -72 186 230 -2 -529 124 -265 -226 367 -12 -416 -175 -214 -134 79 -49 -790 -163 527 184
4520A84l93J60k39M44M82p07j64j91N64J48qN8q30n1R30j55Pm65k51K05P26k09
$$ 184 -209 -49 -288 156 638 -69 -233 -424 140 288 280 338 -492 -543 387 232 239 -226 -477 -272 454 245
4542B45m94j57R7K95M27J0o82l65O44Q5j52M18n65k66K84M67l0N7l63k26J99M16
$$ 245 -249 -406 -309 -14 413 423 -259 -624 20 105 -47 371 -194 -460 -176 291 261 318 -45 -271 -72 344
4564C44l24j22o1J1J62M83m24k98M04k79J62J76j25k37J30Q1J83m03K65r7n9L16
$$ 344 20 -102 -163 -152 10 493 69 -229 175 -104 58 234 109 -128 2 83 266 -137 128 31 -28 288
4586B88l29l02N03P2l69P3J08n4N3L55n09j86K16k20L19N23n82n79L01Q16k94
$$ 288 -41 -343 160 232 -137 -64 44 -10 43 398 -111 -297 -81 -301 18 541 -41 -620 -319 497 203
4607B03J73n36j43j7P73J48o54l28k23M77N63J77j199j16K75L34N39M1o67l53
$$ 203 376 -160 -303 -320 453 601 -53 -381 -604 -127 436 613 -586 -702 -427 -93 446 487 -180 -533
4627e33M08L23P0j24l06j97K39P14m68k30k31j25K94O74k02o67p7O11Q4K41J21
$$ -533 -125 198 268 144 -162 -359 -120 594 126 -104 -335 -460 -166 508 306 -361 -438 173 257 498 619
4648F19r12r5M28N8r9J97m51L05K06m8l70J15j97K22j89K55l74M56N2n54L15o3
$$ 619 -293 -388 40 98 -1 196 -255 50 256 208 -162 -47 -244 -22 -211 44 -330 126 178 -376 -61 -124
4670a24J62k27M54k50k08o5M24n2k33P1k33m0K34K61j41j84p0p8N11O1q7m10j7
$$ -124 38 -189 265 15 -193 -258 166 114 -119 -48 -281 -321 -87 174 33 -151 -221 -299 212 273 186 -224 -241
4693b41L54J87L1o57j2J23N63m7k10k09k75M86j7j26k51R2j06N30M4l86l71L80
$$ -241 113 300 331 -326 -338 -215 348 301 91 -118 -393 93 76 -50 -301 -209 -315 215 259 -127 -498 -118
4715a18PR3J11j78m53M46L57J92j96k03m26K38K35O4m34J08j42J43O42m88l05
$$ -118 -111 -18 93 -85 -538 -92 265 457 261 58 -368 -130 105 169 -265 -157 -299 -156 486 -2 -307
4736c07p4M10J73K83m32n21l5P24N02o47l68K15k68L39L14k30j09K00p19K38N68
$$ -307 -381 29 202 485 53 -468 -503 221 723 76 -292 -77 -345 -6 308 78 -31 169 -550 -312 256
4757B56n20J50J92Jl17L39J75n96M08J63j88n8j7j53L32l57N2l04L59O38l98k67
$$ 256 -264 -114 78 79 -238 101 276 -320 88 251 63 5 -12 -165 167 -190 -138 -442 -83 555 157 -110
4779a10j8M5K58M17n83k51NK8M27L27j186J36N16N98n65M7m49K31o2L00K30n30
$$ -110 -128 -83 175 592 9 -242 -237 -209 218 545 -641 -505 11 609 44 91 -358 -127 -189 111 341 -189
4801a89L64o67K25O76r3l87j27Q1J66J78M07j082n2P58J00J4J74j002J50N78K30
$$ -189 175 -492 -267 409 316 -71 -198 -117 49 227 634 -448 -500 258 358 372 546 -456 -306 272 502
4822E02k33k83k14r3O62K46m86m54M70k40J62K57p7m43r6M61j58j98L65n35L67
$$ 502 269 -14 -228 -321 341 587 101 -353 117 -123 39 296 219 -224 -320 141 -17 -215 150 -385 -18
4843a8K76l94L0J14J22j64J00PJ7j53J78j18K10k57l10L45M73r23J92O5L49L03
$$ -18 258 -136 -106 8 130 -34 66 73 90 -63 115 -3 207 -50 -360 -15 458 -465 -273 -208 141 444
4865D44J6n12k32J96K82j80j3j24o0K94J10Rl95J39nL43m5j00m24L28p3K82n7
$$ 444 460 -52 -284 -88 194 14 1 -123 -183 111 221 230 -165 -26 -31 312 267 167 -257 71 -2 280 223
4888B23Q1n66j04O12J41j58l52k04K7N94J46n54n28M19o6M28K51n00l84M96M60
$$ 223 304 -262 -366 246 387 229 -123 -327 -300 294 440 -114 -642 -223 -289 139 390 -110 -494 2 462
4909D62n10J03J5m29J73M39k32j82K05k36K01J86K6l34J11k84K25K72J80m10k28
$$ 462 -48 55 70 -359 -186 253 21 -161 44 -192 9 195 221 -113 -2 -286 -61 211 391 -19 -247
4930b47L93j7N7l63o1k3N95k05j44k1J84m7J58k3n56%M35r2r6j18o8K63K06l39
$$ -247 146 129 186 -177 -238 -261 334 129 -15 -36 148 101 259 236 -320 -320 115 23 -73 -191 -259 4 210 -129
4954a29m18N92J6N4q2J08n29K89J64j82J08L44m23l6M45nn00j4j47M43j29M38
$$ -129 -547 45 61 115 33 141 -388 -99 65 -117 -9 335 -88 -124 321 316 -184 -198 -345 98 -31 407
4976D07n79j89M22L01j07J52p34l25O89K77J62m43n43K47L29K99r3m62J69r0L20
$$ 407 -172 -361 61 362 255 407 -327 -652 37 314 476 33 -510 -263 66 365 272 -190 -21 -111 209
4997B09J20k32n35J92Q3M73j87J91m94j27J38N26l06k68k2m6M89K47l96l45J89
$$ 209 329 97 -438 -246 -163 310 123 314 -180 -307 -169 357 51 -217 -239 -285 204 451 55 -290 -101
5018a01J54J5l6k83j40N87j31n0o1o2o7K98l7k68J33R4j93L06l38OK7K80p1k72
$$ -101 53 68 32 -251 -391 196 65 15 -46 -108 -175 123 86 -182 -49 45 -148 158 -180 -174 -147 133 62 -210
5042b10P9K44K53k54J08m61J78R7L9L01k91o3k07K12K22q7n2j60l47K32P37o08
$$ -210 -131 113 366 112 220 -241 -63 34 73 374 83 20 -187 25 247 160 108 -52 -399 -167 570 -38
5064c8m27J21L23K93j2L7r00J60O43J10n8k71n32L96O46k43k59j91K20j94L52
$$ -38 -465 -344 -21 272 260 297 -603 -443 200 310 252 -19 -551 -155 491 248 -11 -202 18 -176 176
5085A76j59k7k1k75P2L06K50l52o02N24L1M7J81l40L4L34K04m46m0r2r2M83K51
$$ 176 17 -10 -31 -306 -234 72 322 -30 -632 -108 -77 -30 151 -189 -155 179 383 -63 -103 -195 -287 196 447
5108D47n27l45L77p7M13j26l98j08L55J18oj21j9m3R8m1m4K92j23L4l47L65k89
$$ 447 -80 -425 -48 -125 288 162 -236 -344 11 129 123 2 -17 -60 38 -3 -47 245 122 156 -191 174 -115
5131a15K00p7K21k27K45l2l34P8L52j55n39j8O87j03J30o9k66k2M22%j43n40k74
$$ -115 85 8 229 2 247 215 -119 -41 311 156 -383 -401 286 183 313 244 -22 -44 378 378 235 -305 -579
5154e79O56K92l33j67NJ77K29K27k49o53M78J05l65M62Q3o50k0L03J56Oq1m37
$$ -579 77 369 36 -131 -126 51 280 507 258 -395 83 188 -177 285 368 -282 -302 1 157 163 82 -355
$$ [...]
8191a28
##END NTUPLES=NMR FID
##END=
